##TITLE=1H_IPACAT-33-3
 CDCl3
 64 sc, 
 4.10.2023
##JCAMPDX= 6.0         $$ Bruker NMR JCAMP-DX V2.0
##DATA TYPE= NMR FID
##DATA CLASS= NTUPLES
##ORIGIN= UXNMR, Bruker Analytische Messtechnik GmbH
##OWNER= root
$$ XWIN-NMR		Version 3.5
$$ Wed Oct  4 15:14:58 2023 Russian Standard Time (UT+4h)  she@DPX200
##.OBSERVE FREQUENCY= 200.13135
##.OBSERVE NUCLEUS= ^1H
##.DELAY= (6, 6)
##.ACQUISITION MODE= SIMULTANEOUS
##.ACQUISITION SCHEME= undefined
##.AVERAGES= 64
##.DIGITISER RES= 18
##SPECTROMETER/DATA SYSTEM= spect
##.PULSE SEQUENCE= zg30
##.SOLVENT NAME= D2O
##.SHIFT REFERENCE= (INTERNAL, D2O, 0, 15.7039)
##AUDIT TRAIL= $$ (NUMBER, WHEN, WHO, WHERE, WHAT)
$$ ##TITLE= Audit trail, XWIN-NMR		Version 3.5
$$ ##JCAMPDX= 5.01
$$ ##ORIGIN= Bruker BioSpin GmbH
$$ ##OWNER= she
$$ F:/spectra/data/she/nmr/H-F/1/audita.txt
$$ ##AUDIT TRAIL=  $$ (NUMBER, WHEN, WHO, WHERE, WHAT)
(   1,<2023-10-04 15:11:07.23 +0400>,<she>,<DPX200>,
      <continue with go, POWCHK disabled, PULCHK disabled
       configuration hash MD5:
       00 E9 B6 7A A2 85 ED C7 34 08 36 98 17 FE 4E 26
       data hash MD5: 16K
       24 C0 83 BF D0 5A AF 33 88 39 33 DB 47 44 9A C1>)
$$ ##END=
$$ 
$$ hash MD5
$$ C7 C5 E1 87 38 8F 75 B5 32 95 DD C6 57 BB B2 40
##$RELAX= 
##$RELAX= 
##$RELAX= 
##$RELAX= 
##$RELAX= 
##$RELAX= 
$$ Bruker specific parameters
$$ --------------------------
##$DU= <F:/spectra>
##$EXPNO= 1
##$NAME= <H-F>
##$PROCNO= 1
##$TYPE= <nmr>
##$USER= <she>
##$AMP= (0..31)
100 100 100 100 100 100 100 100 100 100 100 100 100 100 100 100 100 100 
100 100 100 100 100 100 100 100 100 100 100 100 100 100 
##$AQSEQ= 0
##$AQ_mod= 1
##$AUNM= <au_zg>
##$AUTOPOS= <>
##$BF1= 200.13
##$BF2= 200.13
##$BF3= 200.13
##$BF4= 200.13
##$BF5= 200.13
##$BF6= 200.13
##$BF7= 200.13
##$BF8= 200.13
##$BYTORDA= 1
##$CFDGTYP= 0
##$CFRGTYP= 5
##$CHEMSTR= <none>
##$CNST= (0..31)
1 1 145 1 1 1 1 1 1 1 1 1 1 1 1 1 1 1 1 1 1 1 1 1 1 1 1 1 1 1 1 1 
##$CPDPRG= <>
##$CPDPRG1= <>
##$CPDPRG2= <>
##$CPDPRG3= <>
##$CPDPRG4= <mlev>
##$CPDPRG5= <mlev>
##$CPDPRG6= <mlev>
##$CPDPRG7= <mlev>
##$CPDPRG8= <mlev>
##$CPDPRGB= <>
##$CPDPRGT= <>
##$D= (0..31)
0 1.2 0 0 0 0 0 0 0 0.06 0 0.03 0 0 0 0 0.0002 0 0 0 0 0 0 0 0 0 0 0 0 
0 0 0 
##$DATE= 1696417636
##$DBL= (0..7)
120 120 120 120 120 120 120 120 
##$DBP= (0..7)
150 150 150 150 150 150 150 150 
##$DBP07= 0
##$DBPNAM0= <>
##$DBPNAM1= <>
##$DBPNAM2= <>
##$DBPNAM3= <>
##$DBPNAM4= <>
##$DBPNAM5= <>
##$DBPNAM6= <>
##$DBPNAM7= <>
##$DBPOAL= (0..7)
0.5 0.5 0.5 0.5 0.5 0.5 0.5 0.5 
##$DBPOFFS= (0..7)
0 0 0 0 0 0 0 0 
##$DE= 6
##$DECBNUC= <off>
##$DECIM= 32
##$DECNUC= <off>
##$DECSTAT= 4
##$DIGMOD= 1
##$DIGTYP= 9
##$DL= (0..7)
0 120 120 120 120 120 120 120 
##$DP= (0..7)
150 150 150 150 150 150 150 150 
##$DP07= 0
##$DPNAME0= <>
##$DPNAME1= <>
##$DPNAME2= <>
##$DPNAME3= <>
##$DPNAME4= <>
##$DPNAME5= <>
##$DPNAME6= <>
##$DPNAME7= <>
##$DPOAL= (0..7)
0.5 0.5 0.5 0.5 0.5 0.5 0.5 0.5 
##$DPOFFS= (0..7)
0 0 0 0 0 0 0 0 
##$DQDMODE= 0
##$DR= 18
##$DS= 0
##$DSLIST= <SSSSSSSSSSSSSSS>
$$ [...]
##$SUBNAM2= <"">
##$SUBNAM3= <"">
##$SUBNAM4= <"">
##$SUBNAM5= <"">
##$SUBNAM6= <"">
##$SUBNAM7= <"">
##$SUBNAM8= <"">
##$SUBNAM9= <"">
##$SW= 18.05172834244
##$SWIBOX= (0..15)
0 0 2 0 0 0 0 0 0 0 0 0 0 0 0 0 
##$SW_h= 3612.71676300578
##$TD= 16384
##$TD0= 1
##$TE= 0
##$TE2= 300
##$TE3= 300
##$TEG= 300
##$TL= (0..7)
0 120 120 120 120 120 120 120 
##$TP= (0..7)
150 150 150 150 150 150 150 150 
##$TP07= 0
##$TPNAME0= <>
##$TPNAME1= <>
##$TPNAME2= <>
##$TPNAME3= <>
##$TPNAME4= <>
##$TPNAME5= <>
##$TPNAME6= <>
##$TPNAME7= <>
##$TPOAL= (0..7)
0.5 0.5 0.5 0.5 0.5 0.5 0.5 0.5 
##$TPOFFS= (0..7)
0 0 0 0 0 0 0 0 
##$TUNHIN= 0
##$TUNHOUT= 0
##$TUNXOUT= 0
##$USERA1= <user>
##$USERA2= <user>
##$USERA3= <user>
##$USERA4= <user>
##$USERA5= <user>
##$V9= 5
##$VALIST= <valist>
##$VCLIST= <CCCCCCCCCCCCCCC>
##$VD= 0
##$VDLIST= <DDDDDDDDDDDDDDD>
##$VPLIST= <PPPPPPPPPPPPPPP>
##$VTLIST= <TTTTTTTTTTTTTTT>
##$WBST= 1024
##$WBSW= 4
##$XGAIN= (0..3)
0 0 0 0 
##$XL= 0
##$YL= 0
##$YMAX_a= 369248
##$YMIN_a= -459566
##$ZGOPTNS= <>
##$ZL1= 120
##$ZL2= 120
##$ZL3= 120
##$ZL4= 120
##$ABSF1= 10
##$ABSF2= 0
##$ABSG= 5
##$ABSL= 3
##$ALPHA= 0
##$AQORDER= 0
##$ASSFAC= 0
##$ASSFACI= 0
##$ASSFACX= 0
##$ASSWID= 0
##$AUNMP= <proc_1d>
##$AZFE= 0.1
##$AZFW= 0.1
##$BCFW= 1
##$BC_mod= 2
##$BYTORDP= 1
##$COROFFS= 0
##$CY= 11.3945322036743
##$DATMOD= 1
##$DC= 2
##$DFILT= <>
##$DTYPP= 0
##$F1P= 15.7292609196834
##$F2P= 12.9074282941183
##$FCOR= 0.5
##$FTSIZE= 0
##$FT_mod= 4
##$GAMMA= 1
##$GB= 0.15
##$INTBC= 1
##$INTSCL= 1
##$ISEN= 128
##$LB= 0.24
##$LEV0= 0
##$LPBIN= 0
##$MAXI= 10000
##$MC2= 0
##$MEAN= 0
##$ME_mod= 0
##$MI= 1.114404
##$NCOEF= 0
##$NC_proc= 0
##$NLEV= 6
##$NOISF1= 3.799351
##$NOISF2= 2.8
##$NSP= 1
##$NTH_PI= 0
##$NZP= 0
##$OFFSET= 15.70392
##$PC= 1
##$PHC0= -21706.67
##$PHC1= 8.25271
##$PH_mod= 1
##$PKNL= yes
##$PPARMOD= 0
##$PSCAL= 0
##$PSIGN= 0
##$REVERSE= no
##$SF= 200.130013532006
##$SI= 16384
##$SIGF1= 3
##$SIGF2= 2
##$SINO= 400
##$SIOLD= 16384
##$SREGLST= <1H.CDCl3>
##$SSB= 0
##$STSI= 0
##$STSR= 0
##$SW_p= 3612.71676300578
##$SYMM= 0
##$S_DEV= 0
##$TDeff= 0
##$TDoff= 0
##$TI= <>
##$TILT= no
##$TM1= 0
##$TM2= 0
##$TOPLEV= 0
##$USERP1= <user>
##$USERP2= <user>
##$USERP3= <user>
##$USERP4= <user>
##$USERP5= <user>
##$WDW= 1
##$XDIM= 8192
##$YMAX_p= 0
##$YMIN_p= 0
$$ End of Bruker specific parameters
$$ ---------------------------------
##NTUPLES= NMR FID
##VAR_NAME=  TIME,          FID/REAL,        FID/IMAG
##SYMBOL=    X,             R,               I
##VAR_TYPE=  INDEPENDENT,   DEPENDENT,       DEPENDENT
##VAR_FORM=  AFFN,          ASDF,            ASDF
##VAR_DIM=   8192,          8192,            8192
##UNITS=     SECONDS,       ARBITRARY UNITS, ARBITRARY UNITS
##FACTOR=    0.0002768,     1,               1
##FIRST=     0,             0,               0
##LAST=      2.2672688,     0,               0
##MIN=       0,             -459566,         0
##MAX=       2.2672688,     369248,          0
$$ Real data points
##PAGE= N=1
##DATA TABLE= (X++(R..R)), XYDATA
$$ [...]
2521D02M38k197N80K392j163j355M93J481P26k690J103K097n84j754l73J925o9
2538A452j548m17J657q78j554J41J693l02j728J69J616M09k650K53K086l19j806
2555a726J424J518j6j776L80J247l1j244K72J025L36j948P11J054j92j137n04
2572f07J532p5r86j232K063p75j074q8J274M22j433m62R19P15n49l80J030K18
2590E12j323L05J160N62j284j57Q65N72o85n83J563o94j472K20N73K74L5q04M9
2609c12O93j619K43J290k03j242K19O56K90q12m18P46N49o6m01J039m09m00K2
2628a35J65N05m05N39L25l06R0j078K18J91M4m27j05R11o23q66O86l83J34L6M04
2649h0l55j00m01R79j80L9N35r75Q84l92Q16M93q47O25j93Q4q64K47K27p64n65
$$ y = [402, 840, -1357, -777, 1615, 452, -903, -410, 1071, 1797, -893, 210, 2307, 1723, -31, -404, 1521, 1452, -96, -513, 1144, 266, -1288, -1147, 546, 244, -1484, -1315, 301, 710, -1940, -1687, 399, 80, -1726, -302, 1216, 1200, -576, -196, 1051, 1020, -224, 48, 1073, 1409, -539, 172, 1226, 1034, -103, -607, 925, 850, -136, -1368, 695, -80, -1154, -1242, 32, 454, -979, -1441, -522, 193, -356, -736, 294, 512, -811, -506, 654, 1216, -68, -225, 640, 1212, 527, -56, 1507, 813, -659, -439, 134, 408, 443, -361, -312, 381, -1238, -995, 295, 92, -1150, -931, -275, 15, -797, -1215, -469, 80, 14, -387, 652, 243, -157, -135, 30, 535, 130, 669, 994, 688, 778, -300, -82, 109, 153, -274, -379, 532, -91, -957, -271, -654, -520, -484, -80, -435, -535, -936, 43, -137, -98, 437, -538, 346, -46, 770, 1263, 416, 1041, 848, 932, 68, 315, 542, -222, -787]
2670g87N54J95N05q28J82Ll49l30j97J358j191n21R83J31m9L8N9R3K3J131j101
2691i8L15q0N71j65l9N51o56l07M81j150O26M12l35O94j900K03J156K86j249k28
2711i12P50N14j475O88J50J82j355R92J015l31n57O17Lm79m16J261J050m93j693
2730d89N63O13p31q33P46N81j113Kj8J078n96l74k93J189j188l97P97P91k89j098
2750a059P50J565m01j558J077N75O32k279O63J281m69j740M46K090m10j820K71
2767c86N98O2j918J063J786j167j694P76J624j349m23J042M50l54j350J039J648
2784A447j170j279R39J617j226q62P78J334r95j259J511J09p17j253J065J312
2800A351p55q74L01P0n39j166R51J215p03j407J291Q50p3q54k04J428j408q75
$$ y = [-787, -233, -38, 467, -361, -179, -176, -525, -855, -1052, 306, -885, -1406, -423, -292, -341, -303, -244, -151, -128, 1003, -98, 217, 137, 708, 543, 504, 1055, 399, 92, 573, -577, 49, 461, 126, 820, -1080, -877, 279, 565, -684, -912, -162, 352, -1123, -435, -285, -103, -1458, -466, 549, 218, -339, 278, 281, -198, -614, 647, 1697, 1204, -489, 74, 687, -44, -877, -131, 450, -663, -661, -679, 399, -197, -571, -864, 325, -863, -1260, -463, 328, 39, -1059, -309, 1256, 855, -703, 374, 949, 1581, -698, -35, 1246, 777, -963, -517, 1573, 1163, -657, -386, 212, 274, -1644, -581, 1205, 38, -1656, -880, 744, -605, -1028, 14, 464, 110, -1240, -201, 1447, 277, -1002, -63, 1554, 328, -534, 244, 1578, 583, -676, 835, 944, 227, -1026, 39, 1351, 596, -278, 23, 93, -446, -1612, -661, 554, -149, -1556, -265, 585, 512, -342, -546, 882, -526, -1401]
2818a401N05J951K58j663k13J934m38j785Q01J120q35j201R01J613j490j127J006
2835f4O56q74j164O37J599j121j004J153N40l81p20N0P64N21j173J214N18j48
2853A003j681L23J571p04k53k03Q55O2r71k40J029J10k112R43L94N67k330L61
2871a276J662j66j422L5J945q57p75J19K017o40j698M82J544n28j586R60J418
2888A234o65j138O42N62qp05J76P98k34j094P00J468j372j389L62J037j80j471
2906a277J37J464o2j421K83J073P00j390j53J558l15o31L08N25l48n89J79J409
2924A450l27j776M34M34N23j592J55Q67N69j297p74J092j85n9p17J658j20j337
2942a002Q54J300p47p26k17J562m76p87L57J451j086m68L02k52m17Q25p45O38
$$ y = [-1401, -896, 1055, 1313, -350, -563, 1371, 933, -852, -51, 1069, 234, -967, -66, 1547, 57, -1070, -64, 592, -282, -1446, -809, 790, -331, -1335, -182, 358, -23, -743, -693, 71, 592, -581, 633, 1151, 1003, -678, -355, 1216, 512, 259, 56, 911, 973, 2, -238, 791, 901, -1211, -268, 126, 693, -1637, -1276, 386, 220, -1202, -1167, 778, -79, -854, -735, 1282, 642, -1056, -574, 970, 442, -1144, -184, 1234, 569, -569, 73, 635, 627, -78, 98, 896, 662, -432, 268, 1736, 364, -1025, -663, 374, 194, -1277, -1140, 324, 262, -1159, -876, 197, 897, -493, -646, 912, 597, -34, 274, 799, 451, -138, 41, 1450, 1123, -653, -219, 215, 738, -854, -699, 168, 737, -560, -1334, -242, -427, -486, -1203, 455, 335, -1002, -148, 1152, 405, -321, -538, 1024, 548, -239, 118, 1569, 483, 15, 317, 65, -352, 473, -272, 366]
2960C66M92r18p08J056o42k82N53m16k35P20j45J24l85k85M36j58L73Q4R64n67
2980D27m65r7j51J33R68k29j308J311k40l33J82N24r33L02m9M27m09n99k67O71
3000a35O1l20J29m00R39k98k23N3N20n2m94K7P66o99M33N09r95N23N57p72J35
3021B64o6N60q75k76K97j28J032j350j8L70m35M7J5J060j486j78Q76Q5p87N0Q97
3042d6q34M62P13l15Q38n26K68P13n81l95m0q25P61k55m14N78M59m84l42J09R57
3063H01o55j040O51R93r11j174O80L90K05o03N89O20l3r15J207l54m28p44P98
3082G7P17n0r06N18L36j87r23L59M13L67j146J14K1n83l87Q30J012m40q57m36
3102a151J427r48o14J308O66j090M8M27P11o05q40J155j8r8r37K23J841j638l59
$$ y = [366, 858, -60, -768, 288, -354, -636, -83, -499, -734, -14, -159, -35, -420, -705, -269, -427, -54, 30, 994, 427, -38, -135, -286, -153, 815, 586, -722, 589, 349, 16, 198, 722, -211, 91, 42, 469, 60, -539, -806, -135, -74, -394, -265, -665, 274, -24, -247, -194, 326, 274, -220, -193, 573, -126, 307, 816, -179, 344, 901, 129, 264, 198, 758, -117, -393, -96, -224, 808, -542, -560, -190, -625, -578, -563, 497, -989, -1167, -291, -206, -993, -943, -46, -880, -418, 295, -20, 818, 292, 560, 1273, 692, 297, 257, -568, 193, -62, -476, 102, 561, 77, -265, -156, 801, 146, -894, -243, 750, -161, -1335, -655, -265, -60, -663, -74, 546, 513, -402, 805, 451, 23, -721, 77, 794, 744, -162, 356, 692, 505, -418, -59, 354, 721, -425, -311, -290, -873, -1260, -430, 582, 142, -715, -1151, 276, -672, -1286, 22, 688, -402, -354, 73, 784, 179, -661, 494, 476, 378, -559, -336, 1505, -133, -492]
3121d92Q96N63n72j503P24J289r58p81P8M15J031j011R19q69N79q43Q53M42j040
3140b80j30L88P87m54o33M35M70k27r99Q25Q80p08j122M13K109j494r50K45J022
3159E77o75j025Q70J320j214j427J190J482j143j001M54J596r05p61O96J147j128
3176E3l47Q32M59p56k97P67n5n37r54J393J13k99j810R21Q93l31q44L30J367j579
3196f81j87P01Q80n63j134K63Q80M43j283R16R03l42j475J475k22j02r55J71J208
3215H96q11j71J685r48q87j149N08J271m96m88p33J837n42p68j35J149l39q44
3233i65N07J269j133J30n97J300k78m85N21J06j5m63l21J695o29j022M64L06R9
3252D89l20j22N70m70p45J66J37R2K52p55M40M92j746Q28J041k1o44O89M56n76
$$ y = [-492, 404, 967, 395, -1108, -384, 905, -53, -834, -756, -341, 690, -321, 598, -271, 308, -535, 318, 760, -280, -410, -22, 765, 311, -322, 113, 583, 356, -643, 182, 1062, 354, -768, -355, 1754, 260, -690, -445, 577, -98, -1123, -253, 1067, -147, -1574, -384, 1098, -45, -1046, -592, 1004, 99, -662, 34, 1181, 53, -294, 538, 997, 241, -56, 711, 656, 119, -835, 558, 671, 372, -1438, -517, 376, 45, -799, -469, 898, -681, -868, -167, 713, 150, -984, -721, 159, 602, -681, 235, 1138, 796, -679, 796, 574, 472, -483, -312, 896, 85, -86, 1599, 651, -236, -1385, -877, 394, -102, -590, -1323, 514, -28, -796, -931, 218, -121, -965, -458, 811, -322, -192, -789, 511, 233, -252, 269, 375, 360, -103, -424, 1271, 642, -380, 84, 390, 489, 169, 47, 617, 147, -598, -432, -295, -203, 49, -706, -266, 226, -1520, -692, 349, 328, -316, 373, 829, 253]
3272B53j26n23P24M93j578J848N9r31l34J34O78n37l36Q62M5r44k54j04R11o89
3292c49R3O8J49K21j64K30m22Q84p8q60N48N60j046M79L28m98J7l27Q45o86N20
3313E12p83K49k9n8k05L3j11L7N4m00qn83P76m10N8L91n3R78l51j76P01K85p21
3336A86m59J60J71K92n96J57M49j30k22M25R5k99J69k03l89K35q3n82n4L24j28
3357d82R60j090q6J058j95p35J84L04Q7j017R12K3l28Q95l43K56K87k25k00J83
3377D48n4K51o91o83Q99n61J91J31k90N76q79O5M99j68o61J433r68o6k5K76Q0
3398a97j2j51M60N35n42p39L39K89Q24j184L40P08K76j407L36M68m95l60J42N79
3418B09M3m77L70k87q1l72M00N92r78K07K13rl2n1L35J194p36m47N65M94r87k92
$$ y = [253, 127, -396, 328, 821, -757, 1091, 1150, 219, -115, 19, 697, 160, -176, 686, 731, -213, -467, -571, 340, -349, -256, -188, -39, 182, 18, 248, -174, 710, 632, -228, 320, 880, -166, 313, 641, 143, 160, -167, 678, -8, 512, -271, -22, -51, -109, -314, -281, -392, -355, -301, -701, -709, -1292, -516, -926, -868, -477, -530, 448, 97, -79, 622, 907, 186, -273, -113, 58, 350, -246, -89, 360, 230, 8, 433, 528, 229, 398, 195, -194, 41, -42, -624, -678, -354, -482, 478, -612, -698, 360, 165, -570, -386, -82, 5, -1012, -100, -77, -405, 490, 147, 403, 690, 465, 265, 448, 394, 645, -46, -729, 170, -391, -200, -69, -359, 217, -662, -597, -98, -266, -927, 506, -462, -528, -553, -277, -197, -209, -360, 100, 635, 93, -646, -307, -18, 806, -378, -38, 670, 946, -461, -125, 343, -152, -512, -370, 209, 252, -225, 145, -142, -223, -595, -195, 397, -581, -374, -161, -170, -202, -253, 82, 1276, 540, 93, 658, 1152, 165, -127]
3440a27R0R42k34n38j02L88m51k88N50Rl06j03j35M53j51n71M50LK39n64R25J77
3462F56r4o32m12N17J48J89l45M56K5r70K97R71o30o07J58J192j232Q8J77K72
3482B24l28l71j54J142o58p94K81M80K50p86P71J94L82q62J47R62j001L3M77P12
3502A101j007j87Q18j35j27j184O31J339j228j247P63R47j353L65k02J444r72
3519b34q77J165k00o29j55L26Q68r18J23Q89M95o06m82O54O45r54m87J577J56
3538A356q86j394J023L99j151n56J562n18l37q77J072N28n67m82j30J088L0j146
3556i86R61J68P9l3j062J473m9r05O42J76j07o47R91K35n92L38q97J113p40j116
3576i58N48R80j159L57l91L25K61j078J082j7L35m35m19J263j426K65L56K93j74
$$ y = [-127, -37, 905, 671, 133, 31, 419, -32, -320, 230, 239, -67, -170, -305, 148, -3, -574, -124, -121, 118, -446, 479, 656, 562, -70, -482, 35, 183, 372, 27, 483, 508, -462, -165, 806, 176, -431, -273, 919, -313, -225, -48, 224, -104, -475, -629, 513, -145, -939, -658, -178, 72, -714, 57, 251, 633, -229, -82, 880, -121, -88, 389, 1101, 94, -93, 725, 590, 463, -721, -90, 1249, 21, -1226, -463, 484, -869, -504, -706, 738, -234, -1111, 54, -146, -775, -930, -604, 264, -654, -531, 358, 853, 247, -235, 419, 1064, 110, -377, 1200, 1356, 470, -924, 99, 498, -653, -1209, 353, -165, -502, -1379, -307, 221, -346, -828, -958, 130, 160, -986, -25, 143, 222, 189, -873, 600, 551, -354, 288, 464, 357, -290, 701, 936, 344, 682, -215, 898, 158, -958, -410, 570, -589, -232, -623, -298, -37, -1115, -33, -50, 285, -150, -569, 694, -732, -467, -111, 182, 8]
3595Hp83J391p64R00j565N83J092o14o46p3J074l31k93J44O9n32k74N28M81q95
3615e00J66J31P11j1j253O41J73r57P19R13j40q01o60J113L59k8o29L01P56r13
3635I1n54P44J39O03k263J307M04P7r24N94m04j19o12Q01K43l21N0j000R98N67
3655D21j44m4m45Q25j093R88o13R56j0j150J255j109J91L22L18m47n25Q65k66
3674B95Q1p73j23L59R2j35n65P24L60r02K87r1J82j1K96l90N53L02j35p95O05
3695B16k68P04j3l03P1o90L86j37n77J111J08O2r15Q62l99o71J87L87l30l1l18
3716e58J34P12l70N4J16k41N21m96N97q24k58P18K01K94m56M03J15o73J21J76
3736B86n90N0P61o71R94j929R69o13K71o2k22J525l92r45j40K82M59L6o16J031
$$ y = [8, -775, 616, -148, 752, -813, -230, 862, 248, -398, -471, 603, 272, -21, 123, 192, -340, -614, -86, 395, -500, -334, -203, 508, 497, -756, -115, 58, -899, -180, 733, 593, -208, -868, 245, 604, 576, -53, 248, 1004, 91, -463, 281, 420, 1023, -1240, 67, 471, 548, -376, 218, -186, -305, -917, -116, 127, -194, -144, -1144, -146, 421, 277, 233, -212, 613, -480, 508, -105, 851, 841, -309, 946, -163, 28, 350, 668, 221, -304, 561, 295, 376, -397, -520, -161, -69, -204, -769, -45, 315, -587, -300, -391, -209, -220, 76, -314, 239, 541, 406, -389, 216, -52, 652, 639, 336, 407, -283, 103, -34, -611, 500, 608, 670, -245, 617, 218, -453, -266, 121, -209, -240, -558, -424, 288, -82, -28, 88, -153, 368, -128, 469, -355, -613, 105, 306, 600, 144, 547, 662, -11, 110, 286, -304, -254, 507, -164, 830, -1099, -130, -743, -472, -534, -756, 769, 377, -568, -708, -426, 33, 69, -547, 484]
3756D84j59k54q56J074J12q98K54J91P38n73K72n85L08Q9q71J018K45j634P13
3775c32k02J41N74n71M14k71m2J25j70O07j47l46K39K83J68j298J052N07p41k46
3795b56Q22j80j38J01l35J91j035J030l98Q47j182k4L09J41k63N0k12M85o02N2
3815e97M46J071j601K30n7O55o4q94J090K44n39q6M61J075j266n24K97M29l30
3834D0l58K85J82k47q36J021p0k63o9M9Q33j600O35O95O5m22r89J155M74l25j147
3855h92J454O36q01J40m36P27p01j33P45M12j224p04P96L42m34q78J541m53p36
3874e99q4L61Q86r67K74p4P73o33k86L40L74j99o44P78Kl12n15Q62m0j71j60L60
3896C26L21j323j00R84L72q74k85j91L32L71o30L16N41n87n29O99J134r85pn0
$$ y = [484, 325, 71, -785, 289, 401, -497, -243, -52, 686, 113, 385, -200, 108, 197, -674, 344, 589, -1045, -332, -534, -393, 181, -390, 24, -247, -289, -164, -334, 273, 126, -220, 19, 302, 470, -828, 224, 731, -10, -256, 566, 386, 248, 349, 14, 205, -830, 200, -198, 649, -533, -557, -248, -107, -370, -320, -532, -47, -649, -597, -151, 920, -681, -451, -508, 147, 83, -811, 279, 523, -16, -102, 359, 1434, 168, -356, -59, 370, 40, -318, -33, 149, -98, -934, 87, 17, -246, -315, -266, 567, -1033, -398, 297, 362, -60, -1049, 106, 580, 255, -892, 562, 1198, 397, 537, 101, 828, 127, -6, 739, 1151, -73, -777, 19, 361, -73, -951, 590, 137, -599, -683, -322, 564, -403, -129, -203, 570, -63, -349, -9, 365, 166, -478, 300, 302, -10, -525, 337, 297, 126, -34, 326, 647, -676, -776, 208, 580, -294, -579, -770, -438, -67, -697, -381, 160, -427, -956, -257, 877, -108, -115, -165]
3916a65K01k07L9k19J07j25L21L53K19p14J22n40J080O05k343J267J018q50n27
3935c58j06M13m57K33k15J269o10j621J714k89J73J26L53Lj43r42N69N03o50q13
3955h48L16J117n66l96P40L16k1q01r0N5k10J37K68j48M59q70P0Q28m9L9j73N28
3977G01r08K16k70P45l94m40O06N97q33J27L23J11J60p50k25N64M8j68l71N84
3997D23l84m13k67P95j95n18M35L62k45o11J146k51q7o52M6R33R1p84J59J37O39
4018G59p73mP93j119n29M19J100q25L22j51L32k66L06J44n04k31k15Q22m54n85
4038f59P63m90Q20m49k3k56K75J73k94Q11l92J09r57K40M38j11j94K81L04o02
4058b13n06O33K02q30K06Q30j48m43o3O95o66o28P07M52n72M92p02P83n51J59
$$ y = [-165, 36, -171, -132, -351, -244, -369, -48, 305, 524, -190, -68, -608, 472, 1077, -1266, 1, 1019, 169, -358, -464, -51, -508, -275, -490, 779, 169, -1452, 262, -27, 146, 272, 625, 628, 485, -457, 112, 615, -35, -848, -532, 585, 19, -377, 363, 679, 658, -143, -233, -178, -388, -251, 17, -131, 328, -542, -472, 356, 307, 346, 173, 701, -207, 9, -261, 484, 90, -350, 256, 853, 20, 147, 470, 581, 741, -9, -234, 330, 378, 210, -161, 423, 39, -374, -641, 154, -41, -559, -124, 238, -7, -618, 528, 277, 190, -462, -416, 517, 608, -176, -17, 120, 759, -14, -18, 775, -344, -873, -454, 646, -179, 143, -8, 324, 58, 364, 508, 4, -227, -442, 380, -74, -659, 104, -386, 434, -15, -38, -294, -19, 154, -140, 671, 279, 388, -569, -329, 109, -2, -196, 85, 389, -213, -719, -86, 116, -714, -508, 322, 174, -269, -332, 363, -303, -931, -224, 228, -344, 148, -554, 229, -322, -163]
4078a63M23O5k60j08L12K46rk24k07l1J07l9p39P21o01l6j62J082o00l57J49L95
4100c6q59K63N79n0k89o39J193M53r50Q1L03O74l77j119J099J25n69Q3J99K85
4120D49p50k19N60O26p69n23O00j64p4L67j177J203o49R51q1L28j155r3M64J44
4140C8j97j37M64k04o97L82K87R32p74j75O28r10Q1K58j00O32q54l37N07R18o46
4161I6r5L26o97m94o3Q34K78j7n18Q12N67p40j009J508k24j77o65O47K3q98M49
4182e7R8J72m55p0J274k76o61m05M0R78L7j327R87K25j322m42P3J551n84J21n37
4203e80O49p64L63N29R49j120j35O53KMj66M81j07j67r12M19N69j010l34J048
4223C71j08l70o54J158J98j193m08J227L62o64Pj53K0k65n69J057M09k66j136
$$ y = [-163, 260, 325, 65, -43, 269, 515, 506, 282, 75, 44, 151, 112, -627, 94, -507, -543, -705, 377, -223, -580, -431, -36, -895, -632, -53, -103, -392, -1031, 162, 615, -335, -254, 49, 723, 346, -773, 326, 451, -118, -35, 164, 449, -301, -520, 40, 666, -103, -626, -26, -190, -264, 103, -1074, 129, -520, 431, 350, 678, -477, -570, -106, 38, -159, -296, 168, -36, -733, -351, -64, 868, 94, -81, 547, -363, -282, -24, -124, 508, -346, -683, -176, 742, 96, 1, 327, -370, -864, -927, -93, 185, 168, -350, 462, 1029, 289, -720, 788, 564, 387, -278, 369, 392, -506, -57, 41, 213, -242, -312, 962, 686, 25, -380, -340, 638, 675, -652, 335, 560, -762, -1204, -1131, 420, -164, -43, -580, 69, -695, -332, 197, 1146, 26, -109, 544, 546, 550, 384, 865, 758, 591, -321, 98, 667, -343, -677, 371, 263, -107, -761, 397, 595, -598, -1006, 221, 583, -81, -74, -227, -207, -472, -1041, 16, 425, 159, -977]
4242i77Q25N89p21L55J67J92n09m02J20J04K1J44j93J96L52j124J030o24k54P44
4262C5m92J104r90j62J01P7L21o14O04P91o24o06O85j65L05R3m34O85j027N42
4282B29q92P90j69O37m34P52r38p90O68Q00q15p16J144m34l17L69L31K59q03J70
4302a59j25K74L58o07R54n41n77P30N78L8j106j93Q00J2k09n21P03M01j163K54
4322i9K6l78O43n1n52L93K82n60J10k92O28j153J323l60L15q14J33q9O03l20N20
4343C08j80N44m89M27n12n62N02M03j28l12p51O83J50o96M08k62J00M22r74K53
4363f66M98j08k1O44j14l97M43j82J1j57l01R86q51J45Q26k13j9q12O71L77j030
4384b70J88R84r19M24j754J474m90Q82n7j080M10k00P23J16l33j70O53r97J494
$$ y = [-977, -152, 437, -284, 71, 238, 430, -79, -481, -361, -257, -236, -92, -285, -89, 263, -861, 169, -455, -709, 35, -457, 647, -343, -505, -404, -327, -6, -620, -16, 775, 151, -455, 230, 65, 370, 463, 29, 714, -313, 229, -663, 127, -42, 595, 161, 913, -25, -815, -147, 653, -162, -878, 266, -168, -485, -116, 215, 474, -329, -159, -284, -10, 348, -259, 695, 154, -423, 307, 885, 923, -183, -376, 424, 436, 227, -294, 409, 810, -353, -99, -73, -451, 192, 141, -411, -18, 264, -296, -186, -478, 150, -1003, 320, -40, 275, -539, -406, -495, 108, -212, 308, 128, 672, 183, 610, 98, -464, 38, 441, 313, 1, -750, -67, 83, -613, -205, -467, -367, 55, -919, -666, -168, -276, -297, 347, 233, -164, 279, 97, 108, -49, -350, 636, -215, -70, 756, 543, 524, -288, 383, 760, -270, -82, 902, -17, 407, -1347, 127, -363, 519, 462, -618, -208, -408, 315, 431, 98, -72, 581, -416, 1078]
4403A078j013O05r3K86q89J66p60Q01N91j167P15j65p7J54M8j310O55k23J119
4422E21j202J81M32l19J56L37o19J05N48o15P62L65m4j069N20p70O42l1M25n64
4442b39N28J83l08m52O45l03n81j57M77K98j079Q76m1L50k6R25j032l31m10P10
4462C3K51J63n25N43n80J78NN10K42j214P15k67K96o64R47%p31l61Q7L93o8r81
4484a028J389J31o8o20j33O28n13K91o17N97M24p01K63K69M8K80m43J03P39j413
4504c74N3O59K87r39J57O18n86J38l51L57N42k21j431J361k40o98k75K57J066
4523C80m55m8P43Q8j437O3O76K92M07q92O00k44J00q05Q96j0J25n39M89o15j66
4544c52k22L46k1J8J42n54Q14k21j000J051L14l03l53O36K58j350J010p3P48o78
$$ y = [1078, 65, 670, 577, 863, -26, 140, -620, 181, 772, -395, 320, 155, 78, 232, 280, -1030, -375, -598, 521, -681, -500, -68, -387, -231, 106, -513, -408, 140, -475, 287, 652, 608, -461, 59, -711, -69, -100, 325, -239, 289, 472, 164, -288, 357, 54, -527, -684, -207, 91, -988, -112, -153, 197, 171, 1096, 64, -267, -677, 33, 284, 447, -78, 465, -115, 63, 68, 578, 820, -394, 321, 54, 350, -314, 633, 633, -98, -459, -372, 21, -47, -1028, 361, 492, 424, -196, -329, 299, -214, 77, -540, 57, 481, -220, 43, 312, 360, 640, 197, 300, 1039, -374, -321, 338, 625, -314, -157, 461, -125, 13, -338, 19, 561, 340, -1091, 270, 30, -668, -943, -686, 380, -75, -123, 620, 708, -729, -666, 10, 302, 709, -183, 417, 173, 273, -532, 364, 354, 479, -60, 429, -186, -352, -574, -228, -249, -231, -89, -643, 171, -50, -1050, 1, 315, 12, -341, 295, 553, -797, 213, 140, 888, 210]
4564B10j000P97N1J19k41P45l29l13n73P80K59j149N20K50n93Q54p89J93o3k88
4584e60j27N40k3PJ25rN33n37L18j77K22j44o59J242m40m64J16N03j88O0n47K32
4606B3m43K43L30j9J40p8l81L08O39j030o16N25M49j44o36O31j87L08j113M55
4626e96Q35l40k05J37L29j05m61L6J433p95p86Q64J29p69L4M14J46k14n22J01
4646c35L01k16l23M40K2j14r6M49k5n81J74L07L15p16Q27m47j21j51M54l87O14
4667C91O3O27j174Q69p40M22o42J4r2m35Q96o2l39o3L94L50l83RJ15m18M06m64
4689b56Q6Q73j92p80R60l23K62q49R81j51p18N42R5k79J31l43N4J68o36m52K98
4710e29Q85j79o70R07o15m05M94J78l2j69J61o93J043o55L00k94M72k9k02N47
$$ y = [210, -790, 7, 58, 177, -64, 681, 352, 39, -534, 246, 505, -644, -124, 126, -467, 387, -402, -209, -272, -560, -687, -147, -170, -163, -38, -47, 486, -51, 267, 90, 312, 168, -491, 751, 311, -153, -37, 466, 278, 338, -209, 23, -420, -177, 153, 134, 274, 196, -185, 123, 762, -268, -884, -359, 90, -54, -690, -59, -246, 62, -1051, -596, 239, -101, -306, -169, 160, 55, -406, -370, 1063, 268, -518, 346, 475, -294, -260, 154, 300, 86, -436, -335, -34, -250, -573, -133, -111, -225, -321, 128, 103, -478, -304, 3, 318, -398, 429, -18, -139, -290, 164, -223, 391, 454, 1081, -93, 776, 36, 458, -184, -170, -262, -697, 199, 137, -202, -265, 129, 479, 96, 105, 220, -198, 208, -256, -170, 703, 511, -269, 691, 368, 630, -219, 762, 611, -107, 435, 530, 251, 382, 39, 93, 261, -375, -827, -529, 356, 177, -493, 414, -201, -606, -112, 66, 34, -135, 26, -667, 376, -279, 21, -273, 199, 170, -32, 515]
4730E15n50j16M45j31L94m78N29k2m24o12L58L86j68k93j48k66L78Jk00l75L54
4751d23J18L13j06l77M77N43m51%k34M35N26Jo08j86J28j10j47p7L71mn94K53
4773a52q9n25N71OP8q24J330L85p51n04J76O42r0k81m28L67mP38k61m1M53k17
4795E79j858Q18J645p02o85L83j84p82L99L06R8k24M64k75N96q27p4M60l45N19
4815C11l08J94l4L48r08R20J1o95k42P12P0N04n23o67P80r74N00m25O91l06K7
4836a4L83m47k71N41k70L80k31n61J251o71m0p92Q91J15l02j182K372j287qn30
4856f73Q07K32k22m85O20P47q61k28N54j21m95J22j66N00p08j72P60n76m06N53
4876b18M34L44n28l83J07j01m00N78M0N29m56k51J44L79K06M8J83l43p08K10L24
$$ y = [515, -35, -151, 294, 163, 557, 79, 608, 586, 162, -450, -92, 294, 126, -167, -315, -581, -203, -202, -402, -777, -423, -305, 8, -98, -475, 2, 545, 94, 94, -140, 295, 821, 822, 214, 28, 156, 46, -101, -178, 193, 189, -405, -152, -241, -766, -195, -189, -111, -935, 395, 780, 29, -475, -299, 343, 253, -28, -456, -89, -93, 645, 384, 343, 796, 579, -1279, -461, 1184, 482, -203, 180, -4, -786, -387, -81, 17, -207, 257, -18, 578, -249, -323, 137, -208, 311, 3, 197, 163, 511, -397, 523, 534, -161, -403, 309, 379, 883, 360, -307, 473, -501, -1, -426, 265, -41, -14, 369, -78, -349, 192, -78, 302, 71, -490, 761, 90, 50, -742, 149, 264, -38, -1220, 1152, -135, -143, -673, 134, 366, 144, -341, 279, 1026, 165, -63, 491, 370, -125, -3, -169, 331, -377, -549, 211, -365, -771, -218, 216, 560, 32, -351, -244, -345, -745, -167, -127, 402, -54, -305, -161, 218, 424, 472, 655, 312, -396, -186, 138]
4897A38j32l67j03R82l19o14M5K95L93j066K4Q37N21j072J114q77K32m23n1J340
4917H97m04J94r42M0P81l88k53q19J548k69o43P05J32n80m73J08M07k13o09L47
4937d34P75r9l36nL99l32n42J414p08l3o49j63Q18j43K04J76K67j023j98O56j44
4958a00j06N10L6K0L5k01K05k78m86M81l85Q99q95K59L49N72j414L23j31J67l60
4979e00k91J85Q47q9p35K99N91k07l89L25L86M82r72o6K2L29r3P0m65k5m85Q91
5001A10o9k65j71O33m09J30k90M46k73k14k59L67P01m34Q62j380M01Q29n63k17
5021f5P08j047m12Q58K99j48M1m77Q48j155J44P94m11J43l55n39M44P51j058J185
5041E48J19j310R71n09j32L93j92J22j2M53k87l54j00O92L43o59k22n76O53O50
$$ y = [138, 6, -361, -464, 518, 199, -415, -370, -75, 318, -748, -724, 113, 634, -438, 676, -201, 31, -392, -443, 897, 493, 687, -255, -215, 566, 178, -75, -894, 654, 385, -258, 447, 579, -1, -474, -366, 41, -172, -781, -434, 341, 242, -94, -99, 300, -32, -574, 840, 132, 99, -550, -713, 105, -38, 166, 342, 609, -414, -612, 44, -100, -206, 304, 340, 360, 395, 194, 399, 121, -365, 116, -269, 630, -265, -6, 343, 915, -499, -176, -307, -140, -500, -791, -606, 241, 152, -583, -284, 307, 100, -289, 36, 422, 904, -68, -134, -112, 217, 124, 194, -271, -296, -781, 110, 41, -224, -395, 238, -171, -41, -331, 115, -158, -372, -631, -264, 437, 3, 865, -515, -114, 715, 152, -65, 643, -404, -816, 42, 341, 193, 234, -243, 605, -550, -406, 388, -23, 120, -235, -774, -330, 421, -637, 548, 667, -643, 328, -181, -313, 80, -112, 10, -2, 451, 164, -190, -290, 402, 745, 86, -136, -712, -59, 591]
5061E91j200P39n30O59j33p23K62J91l39J001j192Q81l69p7P12l54j65l14L14
5080d6N50l51n3l46L13K68n60L28J65m26P30k70n16L38k75l4o97J074K9k72L29
5101B78p28K38J27l1Q4J80m75L24P11o30j045R82l5O64o66l59m16K76R95j26J26
5122D74p47J273j389L94r6N25m42J02l92Q71q66j80J041o05N34p87l22R26o55
5141c41L13m39J49M7J90K35k1P28kj72J24Q2r40J55ml84K55O27o98K49k88n62
5163f97J266M02p60l4M64q09L82o45J097k24p27K60k5J2n36J18R70l06J4l88o5
5184b31Q42r38l1N5P86Mj009O45L65j35o9p09N66m32K88k44j15K15K8j06K88j74
5206a11o92J122l53M61K02K60n82l44L76K45l09p28J0O27L2j30K97J84j84j020
$$ y = [591, -609, 130, -400, 259, 126, -597, -335, -144, -483, 518, -674, 207, -162, -239, 473, 119, -46, -360, -46, 504, 153, 100, -246, 67, 335, -225, 103, 268, -158, 572, 302, -214, 124, -151, -185, -882, 192, 221, -51, 278, -450, -212, -85, -116, -32, 148, -327, -3, 708, 78, -967, 15, -20, 644, -22, -381, -797, -521, 474, 348, 474, -273, 1000, -389, 5, -91, 434, -8, 94, -298, 573, -293, -473, 568, -37, 497, -290, -612, 314, -341, -28, -467, -318, -271, -81, 154, 133, 861, 859, 687, 811, 893, -47, 108, 104, -280, -25, 602, -96, 153, -135, -697, 569, 971, 211, 177, 641, -168, 214, -431, 666, 442, -285, -25, -50, -38, -574, -456, 514, 208, 222, -166, -231, 611, -327, -358, -303, 483, 487, -522, 123, 488, 353, 284, -425, 141, -291, -3, -247, -362, -147, -119, -225, 63, -111, -803, 319, -34, 427, 629, 889, 307, -37, 339, 584, 275, -453, -443, 184, 216, 86, 383, 567, 383, -637]
5226f37K08P35O81k178Q58k19R89p86L41L66n13k41j18M45O99j154L35N62l22
5245E1m10q0J02J313r38j03L82K4j81r30J418j96j122N58J62K44%l30O77n63m92
5266d14Q4J22q9O51p4j43j83K24o32O92N71j215J82P95o6n02o81Q35L24p78p3
5287c70J57N02n36n16J078m96l88l0P18J55l87k8m27J52P4L84L35m1j360J207
5307A83O23j147j77L08N26l6m43R8j6k65P35j24J36qk17r08Q38R2l62L12l89j25
5329c66J22L91k31K02J40m00pJ42J25k90O91o12L59k43O68j20r5k15m27O75k21
5350B88q25Q51n88j35n1R6L41o61L11j46R94q68J19l62N30r9R78q12N0K55M07
5371F73l73q1p2M77j68K1o29j02P59K29j83q29M09J60p76J35l10M90o75M95L80
$$ y = [-637, -429, 306, 987, -1191, -333, -552, 437, -349, -8, 358, -155, -396, -514, -69, 630, -524, -189, 373, 51, -359, -439, -337, 976, 38, -65, 317, 341, 160, -770, 648, 452, -670, -112, 50, 294, 294, -36, 641, 78, -414, -330, -208, -297, 354, 280, 137, -46, 178, -454, 238, 809, -406, -224, 571, 505, 3, -678, 157, 481, -297, -370, -213, 289, -247, -763, 315, -181, -569, -599, 119, 274, -113, -141, -568, -416, -342, 42, 377, 336, -1024, 183, 806, -341, -518, -210, 316, 280, -163, -65, -81, -346, 389, 265, 401, 393, 176, -732, 106, 198, -164, 148, -241, -366, -244, 147, -84, 118, 258, -142, -149, -7, 118, -172, 519, -93, 266, 23, 691, 571, 476, 261, -166, 509, 288, -537, 314, -274, -409, -460, -364, -23, -684, -373, -519, 475, -393, -274, -636, -106, -205, 773, -39, 11, 266, 673, 300, 219, 147, 624, 456, 477, -152, -254, 505, 734, 551, -278, 131, 291, -485, -350, -660, -170, -845, -350, 30]
5392C0k09J69K21L44j1r43M07N14l37k48j2q3M60J45j70L80r30Q03n61K46J04
5413C19l52m62J63L10k44L72O6j75m26Q52J40j20q16R83j55p67J20M06n28L53
5433C9k39M31m23N12L97p01O57k41p66K25L15l33J5k24N61q0P7k10l84N94p10
5454d88j17N52J2o21L32O6J0R1P2j55M06l05J095l66j152N72J47K97m30N41j066
5475e07Q06L95p09R67l68m48J04l80J63Q5n4l50O97k95o24J24N96J60m12N79m61
5496F8m49O66L19j094M99J01k02K92o04K98N61k31l33m94R58j34l47J76l05J9
5516b36n61O47K00j82O5j55K09K31o3j058L44J206j439N55JK35M74q56O30Q22
5536A069j697Q40J37k58J75J03n98L04K62m49K8k3j26M58%l41n76R08M33j460
$$ y = [30, -179, -10, 211, 555, 544, -399, 8, 522, 185, -63, -75, -158, 302, 447, 277, 657, -273, 530, -31, 215, 319, -33, -495, -332, -22, -266, 106, 172, -3, -429, 423, 563, 443, -373, 610, 455, -312, -192, 214, -314, 39, -200, 231, -192, 320, 717, 16, 673, 432, -334, -109, 206, -127, -112, -336, 225, 145, 222, 12, -372, 222, -488, -605, -53, -41, -662, -330, -264, -254, -163, -91, -246, 160, -145, 950, 584, -568, 4, 151, 448, 18, 559, -507, 299, 694, -15, 952, 584, 136, 240, -140, 23, 108, 54, -296, 401, 106, -518, -394, 202, 362, -50, 529, 68, -381, 285, 604, -490, 9, 110, -92, 200, -404, -106, 455, 224, -109, -603, 355, 221, -126, 50, -255, -236, -797, -150, 50, -132, -67, -222, -13, 218, 155, -903, -559, 647, -792, -237, -236, -1, 473, -383, 247, 1069, -628, 212, 349, 91, 266, 369, -229, 75, 337, -112, -84, -107, -233, 225, 225, -116, -692, 216, 649, -811]
5556h11P96m11J85M31k35p8j41P77j209K24R65m69L42k25j56M25mk18K54r3M7
5577C96k40j126L51j21Q55n65K34j15m63M74M57J38o43k36Q69k38k67L23K35o28
5597c10L27J79q1q94M65J136l19m37j76P37m77k48M40J74K1l17q20M59K96j90
5617c5O0N14n49k30k86Q70M57j254J93Q5P11l73k34J65N01r39lL66j77N79K66
5638F87k20m95O96q28m26R92j21o23N76p7o64P58j55j53l88M90l5o98J415m38
5658B93q24R79m24O21j64n43o13K75M38L5m60J12L44R1k77Qm08K13O8l62O47j04
5680e5m32k66Q72o71M82m70L36O91o01j34M95m90N52r48K67O58j64k0o8o55M74
5701a47L38m81J054j037Q24p80Q74j145N84r11Q26J81m24N72k17l53j05J159j028
$$ y = [-811, -15, -426, -241, 190, -45, -123, -264, 513, -696, -472, 493, 24, 366, 141, -15, 410, 406, 188, 442, 349, 396, 156, -970, -619, -740, 115, -450, -216, -331, -794, -320, 137, 275, -368, -604, 265, 27, -240, 83, 318, -310, 17, 196, 115, -779, -314, 822, 503, 66, -110, 627, 150, -98, 342, 516, 537, 220, -600, -141, 155, -35, 25, 539, -10, -240, -526, 344, 801, -453, -260, -175, 536, 163, -71, 94, 595, -344, -347, 19, -158, 421, 687, 467, -28, 668, -160, -586, 406, 285, -338, 238, 161, -503, 255, 100, -53, -441, 49, 14, -684, 731, 293, -531, 448, 24, 645, 481, -62, -675, -400, 38, 73, -387, -275, 69, 160, -117, -109, -517, -304, -236, -598, 49, -55, -487, -753, 119, -552, -70, -540, -204, 487, -114, -248, 247, -243, 309, -639, -372, 286, 122, 102, 34, -621, -147, 191, -290, 764, -273, 551, -229, 645, -500, 84, -827, -1, 180, -244, 328, 111, -242, -347, 812, -216]
5720b16K15o2K9J67m54K34K76p0m1n07J138j031k48J115r35N61j53L55n44J22
5740d9p16P91k72J13j48O77n68J50L16R8j8j3m67k97L16J1K42p05R77m71m70M82
5762b1L5j18P55j281L88K00j40k36N33p98L91O60k76k66o12Q85j59K49j42L75
5782D22p10p8L18j60O80m93k43J73J18M48r5K03n39J2m89Q58j25k06j5l91Q06
5803D94n10L82q19Q42l49m93O55l8k23P13K24r21ll42J09P98o18k55J05q5J51
5824a83K02m69N44P5o71J422q34p4rO32lj41l72P7J1K08m75O3l9q2p56R34K31
5847B91n10Q70j067N70j70k45O74l02O65k93M3k32n31j44J205o13j14K23o25L11
5867Fk35l8N46p86P38N7j081M64K5J11j2K65L10o52Q15K42n19m83L21j80J30M52
$$ y = [-216, -1, -63, -34, 133, -321, -87, 189, 119, 78, -429, 709, -322, -570, 545, -390, 171, 18, 373, -171, -49, -765, 26, -246, -133, -281, 396, -172, -22, 294, 392, 374, 361, -106, -403, -87, -76, 166, -539, 438, -33, -503, -21, 14, -104, 651, -630, -242, -42, -182, -418, 115, -683, -292, 368, 92, -174, -786, 99, -60, 189, 47, 422, -288, -366, -48, -208, 472, -21, -264, -91, 27, 475, 380, 583, 44, 56, -433, 425, 300, 94, 79, -312, 494, -16, 366, -453, 389, 40, -453, 202, 164, -59, 654, 878, -43, -46, -388, -279, 519, -99, -354, -249, -334, -183, 19, -450, 94, 169, -502, 920, 86, 12, 3, 635, 632, 491, 119, 196, 207, 415, -60, 3, -36, -118, -874, 60, 291, -219, 651, -416, 154, -16, -261, 413, 111, 776, 483, 526, 294, -237, -381, 824, 211, 97, 320, -305, 6, -229, -267, 279, -507, 231, 288, -793, -329, -304, -193, -205, 60, 370, -282, 533, 775, 256, -227, 94, -86, 44, 496]
5889D96k5k61k05k38M3N50M17j255O83O5p0m42Q95j457L94J39n7R03j521J011
5909F5k65j36j71P83n98O27p41P73m76n18L00k34R67ll47J99j89l86P02l87L1
5930dj13l59N73K15m60P92j080K21Q1KR93m84k92k08j9M92o09m46K01N04m73N21
5952D8l63L07k09J68K12o11M11j36L95m92N0J69l29L03p9K09N88n18m66M22p87
5973g08P21L14m53J22l1K47l53M07l64M81l69m93O06Q67j151J62j81m45L11J76
5993a34J53k35k46O01J38L90j52j132L22L73o1n75l56Q50J29K17o05M81m9p1L84
6014D22j94P36j359l67K03L77r1O93J14r06M22P00j065M52M35n73j05k00K89O47
6034F30p19n28Q07k06L27n60L11n50j46J014k51m37L53K5J90l85P3N04m93l76
$$ y = [496, 471, 210, 5, -233, -190, 360, 777, -478, 205, 270, 200, -242, 653, -804, -410, -271, -328, 575, -946, 65, -200, -336, -507, 276, -322, 305, -436, 337, -139, -657, -357, -591, 376, 373, 26, 225, 36, -350, 352, -35, -4, -117, -476, 97, 312, -148, 644, -436, -215, -134, -132, 861, 377, 85, -123, -142, 350, -259, -705, -504, 0, -473, 48, -315, -8, -217, -49, 163, -448, -37, -173, 222, -270, -220, -51, -380, -77, -156, 53, 641, 123, -343, 79, -708, 13, 327, -126, -4, -35, 212, -141, 266, -98, 383, 14, -479, 127, 994, -157, 5, -176, -621, -310, -134, 19, -216, -462, 139, 277, 667, 515, -617, -295, 78, 17, -558, -914, -64, 65, 282, -323, 158, 109, 38, 422, 228, 964, -395, -762, -559, -182, -273, 420, 534, -372, 50, 750, -315, 137, 572, -1, -106, -306, -17, 630, -89, -617, 190, -16, 311, -249, 62, -488, -634, 380, 129, -308, 45, 70, 260, -125, -52, 452, -41, -417]
6054d17P08l43j35p2j28N78k86j86L6p8j60P65J81k51j95n95O31j66M77j81M5
6075B28o20K34P09l2n24n44N28O2j81k96Q89j79n40P65R8m38j99k59lMK5K37k71
6098c07K76m78J106k02l1j89m43L80o72K07P58j043M37M00l21J063r53J81k83
6117a14Q77m90n14Q2M79l65J62n32q8j86Q08r74O97L0k13K65m93O54n66L9O71
6138B29m85l4M63n37M19k25j45M74k48j7M91N3k20o87P59j1O2k9l31J85j91L90
6160C65Mo27J14L46j77k66J19J38N31p19k76Q43o34N20m98L40m0j82K79m48M40
6181A72K30p02M3O77l75q0j99K86n04K41K81K80p12L75J52J7L88n29M9J31k90
6202f9j95j24m78M41K83j95O89k09q65M38P46k02q39l54J743j70p05j91M24M69
$$ y = [-417, 291, -52, -187, -259, -387, 191, -95, -281, -245, -323, -483, 282, 463, 212, 17, -578, 53, -113, 364, 183, 228, -392, -158, 551, 519, -5, -549, -21, 41, -140, -436, 453, 274, -266, 499, 597, 159, -40, -299, -302, -298, -273, -36, -307, -31, -509, 597, 395, 364, 175, -268, 112, -560, -353, 405, -638, -201, 199, -122, 941, -12, 169, -114, 763, 273, -241, -159, 320, -45, 117, -415, -503, -689, 119, -855, -158, -128, -341, -76, -569, 85, -481, -442, 229, -256, -290, 173, -364, 55, -170, -315, 159, -89, -106, 385, 438, 218, -469, 290, 279, 341, 312, -19, 166, -25, 365, 369, -258, -144, 202, 25, -241, -122, 16, 547, -172, -448, 395, -239, 281, -217, 123, 83, -99, 180, -268, 172, 402, -300, -257, 420, 45, -35, -234, 52, -452, -211, 70, 350, -362, 13, 165, 182, 570, 41, 90, 221, -69, -264, -388, -866, -425, -142, -337, 352, 143, -722, -284, 462, 260, -579, -933, 810, 640, -65, -256, 168, 637]
6222F37n84k45L44j39M4k87L39o56l36R89k08nK91L31j085J280q05k83M66M6l3
6243A01l09k66P56k31k02J00Q62j384M36K71k50K65l36k12M95j95p8L99k15j16
6263a09r9jk28M12K68R0l33k16m51Q78p72N11p1k63P04j100O41q1m34L96l12M28
6285a42p6J14Q47q19k3J63J13K66m63K64j74L0m46j36L88P5L70n37m35K42L12
6306f7k0m2M94J09m49O6l13K79O2n16Q63p04K15K71l62M01m09N96p6o8j069P54
6328A5q1o34M42j02L58j45K11m33O6O14r52KP71m19K16K85l10p82R75J58j31J47
6350B71o47n21N15O63l31P8r4Mm90O24On7j35M54m00N5J13k09J56J87k41J34j15
6373B0k03Q43j284O03M83Jq89j90P98j63L14j22j2m62L47J32j0m68L86k31N42
$$ y = [637, 53, -192, 152, 13, 57, -230, 109, -547, -883, 106, -102, -107, 184, 515, -570, 710, -95, -378, 88, 134, 101, -208, -474, 282, 51, -151, -51, 811, -573, -137, 134, -116, 149, -187, -399, 96, -99, -177, 222, 7, -109, -208, -209, -437, -25, 243, 333, 0, -216, -667, 211, -561, -50, -121, -384, 320, -780, -139, -220, -654, -258, -570, -142, -218, -104, 743, -76, -99, 64, 177, 443, -20, 244, 70, 100, -346, -482, -94, -19, 351, -186, -621, -379, -67, -87, -129, 365, 474, 25, 91, -222, 57, 119, -397, 466, -238, -23, 248, -114, 287, -122, 474, 398, 330, -739, 15, -66, -700, -258, -360, -2, -147, 64, -369, -303, 311, -641, -639, 132, -287, -71, 214, -96, -878, 97, 255, 124, 271, -376, -897, -382, 281, -50, 28, -66, -62, -552, 72, 78, 21, -114, 340, -60, -5, 108, -101, 55, 242, 1, 135, 20, -183, 660, -624, -21, 462, 463, -426, -616, 182, 19, 333, 211, 199, -263, 84, 216, 206, -262, 124, -107, 435]
6394D35j261N79J87m6N19p79R80j67o52K66M47l96l27K26J05N54l02k60o8O01
6414F41o05n10P24K06K94j019L08m31J37N03l32L49r22O38r3j38j89Q20ok30l64
6435b19L40o82K35L97k39O29m07N40q08L79j95q06K34q6R04N40r16J96o78O26
6455a6L29p85M7k29R98o63L30o7k04L76l40J13m84L30j3R6N69N30r16N35p00J20
6477d4N92o63P61q74L49n35N65M09j321N89J84j38J14M76p5n45l9k69Q92p85P29
6498C72m11k87P19p86l39J192l13l70J036j114j25J28K42m07J162p28L18p94N00
6517eM3K85m38N09r53M67N41l29K27l46J1L3n47k35J132n26K61q22O58O3j01J05
6539C3M45p69k89K1O89M76l49o23k54N14R2M55p25L04k05L7J91m11pl71R88Oq39
$$ y = [435, -826, -247, -60, -106, 413, -366, 614, 447, -205, 61, 508, 112, -215, 11, 116, 670, 368, 108, 40, 641, 36, -474, 250, 456, 750, -269, 39, -392, -255, 248, -84, 265, -657, -19, -112, -250, -439, 381, 375, 145, -219, 121, -561, -326, 71, -168, 461, 54, 594, -214, 165, -30, -836, -602, -688, 216, 756, -160, 36, -642, -16, 313, -472, -425, -654, 344, -319, 11, -56, -260, 116, -224, -111, -595, -265, -278, -182, 387, 917, 1, 536, -164, -44, 548, -115, 646, -228, 121, -414, 151, 560, -761, -172, 12, -126, -12, 464, 389, -156, -195, -464, 428, -357, 372, -39, -326, 393, -393, -732, 460, 147, -223, 813, -301, -426, -298, -56, -463, 699, -29, 289, -505, -5, 38, 323, -115, 394, -559, -92, 449, 120, 347, 1, 12, 45, -502, -737, 395, -131, 130, -692, -34, 29, -72, 33, 478, -291, -580, -559, 130, 606, 257, -366, -620, -106, -14, 441, -284, 20, -185, -148, 43, -368, -375, -746, 242, 248, -591]
6562e91O13N6k42j07M55K1l94L81P75q12L1m08k26M06r9J26J03m53j20L28j57
6583c14L07K50j074J972j565L74N33o05N81n01J20k80K82k57R01p15M32k68k62
6602h9j59L7M2r4J10O99p34l85M83J123m97q83l6L07J71K11o79O29Kj54Q0k29
6624d5j04N99j185M65L7j73L49L54n2m45L96J59k35J55j63k79J14O0M50n67j24
6645b34n62Q55k55M61l25pr4l9R10r13M0N46R9n41J034j230J232p99Q99j605Q92
6666C64l77K9J24k54N85l31n22L00l40O71K31p87L45k61J76p0K43j05l53J10q9
6687c11M74r6p88J078R03j213l62N16o83J295j215R90k55m92M40Pn77N24j050
6706h15R22o10K94L59l10l84Q0M40Q8K81m51K0KJ057r08l73k14M97q2KM52K31
$$ y = [-591, 22, 78, -164, -271, 184, 205, -189, 192, 967, 155, 186, -222, -448, -42, -141, -15, 88, -365, -485, -157, -314, -7, 243, -831, 1141, -424, -50, 483, -122, 459, -42, 78, -202, 80, -177, 724, 9, 441, 173, -89, -248, -211, -169, -263, -153, 546, -188, -573, -90, 1033, 536, -347, -383, -76, 95, 306, -373, 256, 258, 104, 184, -45, -149, 450, -735, -270, -233, -406, -57, 297, 245, -200, 196, 355, 120, 275, 112, -167, -53, 7, 457, -110, -234, -796, 59, -196, 265, -60, -67, -161, -200, 710, -203, -163, 383, 482, -59, 975, -255, 977, 178, 1077, -528, 364, -13, 16, 140, -114, 471, 140, -382, -82, -422, 249, 480, -307, 38, -223, -47, -117, 126, 21, -332, -222, -311, 163, 67, -721, 357, 1260, 47, -315, 201, -482, 813, -402, 588, 333, -159, 281, 288, -289, 235, -815, 107, -503, -209, 150, -160, -544, -464, -24, 64, 345, -106, -86, -84, 973, 65, -308, -522, -25, -107, -105, 347, 578]
6728E78o88J082m16l34L5m44J35O72p8o17J10J80j77m53N38J19o00kM6O4K33l93
6750d10Q41p35O32O0j028P58L04m53j22J70O7J3k58K55o31J51MN82K9J12l46N62
6772E57m72n3K67k86O04n8p71k16Q6J153j204l07R11m75L1n47P98P18p92j53l09
6793e18L36j83j57M68l7M7J57l40k18N73k49p64Q13L46k58j155M60O89k07k70
6813d67K52k58J189o06M12p76RM23l00M02q8J48m75J58j75k4K29q3J25l07N5J68
6835A1L70j00P6k8n42J39k73L99o39J454j313N51l68p48M22N24l56m1O9N49k67
6856a11m90J075n27N76m32k73Q55p57O48p61O59m63k50o5M08K1o6r5N73j88p6
6877B61q10o14J115l91L29Q95j112J62Q40p48m24K30M39J01M59j058J12K92L99
$$ y = [578, -110, 972, 556, 222, 257, -187, -52, 620, 542, -75, 35, 215, 38, -415, 123, 242, -358, -360, -314, -250, -17, -410, 431, -304, 328, 388, -640, 118, 422, -31, -153, 17, 84, 97, -161, 94, -537, -386, -382, 200, 229, 341, -5, 557, 85, 32, 299, 13, 617, 559, -212, -428, -342, 811, -393, -700, 211, -264, -233, -780, 18, 736, -56, -209, -518, -182, -365, -522, -54, -91, -44, 113, -227, -445, 128, -121, -885, -72, 274, 16, -1139, -679, 10, -197, -467, -215, -473, 716, 110, 522, -254, -245, 178, -122, 280, 192, 340, -135, 23, -152, -176, 53, -30, 95, -212, -157, 11, 381, 281, 357, 329, -213, -74, -347, 52, -587, 867, -446, 105, -263, -1011, -589, -65, -421, -462, -393, 156, -111, -601, 474, -53, 523, 91, -182, 673, -84, 564, -197, 462, -1, -251, -316, 92, 113, 47, -48, 525, 337, 261, -549, -1163, -48, -439, -110, 785, -327, -165, 675, -73, -497, -267, 172, 273, 732, -326, -214, 78, 477]
6896D77q23k58J96O04J60q2r76M02N5k33M90n60M14N57n59M1m80L92K08m31L26
6917h0O9J94J47n82L56m18L2L19m1j88L01k9m26M07K71o38J123n62j35o70N82
6938C2L71o50j82K07K60n85L43M19l78J06N07n79O51o66j58J5NO97l45J15n9j41
6960a5J94L04j34P10j988R21j10K4q7o85P39O24n81K28k63J090j488M51L96k75
6980E5p04P11K35j66j86M4l01l4J71L93l3n6L30k93l82N18j46K5k73K59o40P82
7002C09q57P23r58J039m94N83N18q79M84q54M48m40M60Q10j323o5L41M51j326
7021a030L73J231Oq33r3K63j35k1Q49o69m20P49k07l41J14J49p9K53o36Q38k43
7042A18m52P31q72R05n63J1l47m05J002J57k30o07R80l71k32l36P73J95n48RJ33
$$ y = [477, -346, -604, -408, 196, 356, 274, -702, -300, -245, -478, 12, -548, -134, 423, -136, -95, -575, -183, 25, -406, -80, -11, 183, 330, -252, 104, -314, -282, 37, -4, -192, 109, 80, -346, 61, 332, -306, 817, 255, 120, -550, 32, 403, -247, -429, -222, 38, -547, -204, 215, -163, -57, 450, -129, 522, -144, -302, -287, -282, 415, 70, 185, 126, -15, 179, 483, 349, 1059, -929, -8, -118, -94, -181, -866, -127, 497, -84, 144, -119, 971, -517, -66, 330, 55, -649, 62, 297, 131, -55, -11, -312, -346, -175, 218, 185, 129, 459, 166, -216, 302, 156, 181, -92, 167, -473, 309, -548, 175, -783, 256, -238, 345, 863, -16, 468, -386, 62, -378, 82, 892, -431, -496, -155, 296, -1030, -657, 574, 580, -253, -346, -83, -218, -239, 610, -59, -479, 270, 63, -278, -164, -15, -94, 159, -477, 361, 118, -334, 397, -475, 430, -133, -122, -469, -874, 128, 285, 55, -552, 428, 57, -175, -511, 262, 457, -91, -82, 51]
7063E1qp5J046j265N2M59Q2K2m38N1n09L87k68J11L38m74R15q09o0Q93l50n02
7085c51O5q8R87p37N4M9l0K21L88q42K95N65q35J05j85P14m40q9J04O6j03M84
7107C97o15rO40j52l92J22o43R41l06L50L37j290R46j509P26Q17o14R8R28o06
7127A66j90K52n1k21J00m82M81L56L76q38l83P01l54J12n08Q77n62o40P62J53
7147A07p97L25M85O49j60J12o36K96q8q58P75J25n20N39r81N31L84m71M09n58
7167c32L28j23M20L3l99K61j15k98K43o43N46K78n22K42K27n16l46K88P44l06
7187A0n09O01J84k64k4q32n0k1J534q39M15K62o6j09l44k90J38L90o57N65q2j09
7209i7M40J02o08k99N16l27k33O24m47N67l64M19J62L22j097k34J448j231O05
$$ y = [51, 43, -32, 1014, -251, -199, 260, 342, 364, -74, -23, -532, -145, -413, -302, 36, -438, 477, -332, -392, 501, 151, -351, -286, -374, 613, -124, -70, -21, -51, 170, 558, -284, 11, 576, -259, -154, -339, 375, -65, -154, -50, 16, -87, 397, -218, -227, 413, 261, -131, -9, -652, 289, -17, 333, 670, -620, 326, -1183, -457, 360, -254, -156, 772, 166, -24, 228, 177, -44, 56, -426, 55, 411, 787, -51, -434, 267, -87, 25, -483, 394, -168, -808, -46, 107, -690, -365, 120, 769, 609, 721, 85, 381, 293, -565, 210, 335, -185, 354, -627, -96, 288, -183, 226, -332, -4, -127, 293, 326, -73, 188, 73, -225, 18, -625, -79, 199, -323, -81, 146, -370, -716, -428, 316, 10, -499, 102, 286, 22, -2, -834, -884, -905, 629, -210, 205, 467, 401, 292, -52, -342, -204, 186, -471, 94, 12, -97, 343, 445, -163, -462, 54, -273, -506, 118, -329, 238, -126, 293, 455, 777, -320, -554, 894, -337, 268]
7228B68n86O49j023O30l2j45N67k47J56m68P65n84L21l50J26p8j97J50O37p62
7248b03l57J001k21j76j76P7J92r76J850j248Q79r80L78K1K41O1k02M46q50n32
7268g75P77n31O67J31l90K78P1J31j0K32q62n55P54j68k31N53j70N75j064N38
7288d9J65k52J98j95lO06p04j52J20Q11l07p75P15P37p08l41M04j71K14j44k5
7309A44n31L73N8L1j64J44j08o70J108p93P78j67k78L39j46J89n84N40q04L49
7329a92k82L48O3l57o5L94l37l21P43m44M81k60L01j81N49j20J0k81l07k65L36
7350a87l7N8l84J99P15r45K59Q05k13k55j16O4N9n35K73J73J46o00M29M69K48
7371F25j139L18N11J36j95o79Q24p07J43J31k99O95K52j381R36j04l95J028r39
$$ y = [268, -318, 331, -692, -62, -94, -239, 328, 81, 237, -231, 534, -50, 271, -79, 47, -31, -228, -78, 559, -203, -560, 441, 220, 44, -132, -55, 137, -839, 1011, -237, 642, -338, 40, 61, 302, 363, 161, 607, -243, -775, 2, -529, 138, 269, -121, 157, 228, 359, 349, 581, -281, -836, -82, -250, -481, 72, -98, 477, -587, -49, 116, -136, 62, -133, -136, 470, -234, -386, -266, 545, 238, -537, 178, 915, 207, -134, 270, 99, 313, 169, 144, -387, -14, 44, 75, -89, 55, -53, -723, 385, -408, 370, 203, -75, 264, 118, 307, -277, 263, -541, -192, -474, -126, -63, -420, -485, -91, -428, -749, -6, -450, 31, -229, 72, -109, 440, 320, 330, 49, -258, -523, -187, -224, -166, -550, -351, 364, -581, -322, 483, 270, 15, -101, -37, 22, -513, -240, -67, 79, -521, -92, 377, 625, -514, -196, 315, 451, 256, -423, 401, -306, -163, -32, -331, 364, 616, -765, 171, 67, -328, 700, -239]
7390b39l53R95j22o10M55P5o04P8L37k03k50K11N51j96M85o05j96M82L30K11r62
7411a30K08M9k44M83p52o0M85L47l17J06l61N42m18K48k2l91O92p50M91j32K37
7432C11o82KO75m69J0K46n09L24J88L74J64r34m80J323l55j126Q66j45N19j31
7452A71o13N53l55L79k50R31j027N55J77p13K38o47J072r37M79M62k78k83j6L15
7472B13l65O64r06L91O2O66n23k22L3K59j004J05O21L73m73M37k59K88J0K83q54
7493b01O3o3o7L87J50j38n55J254o60K41l38N72j076M32K99l03j32J48L24r02
7513e65N58L2k56K8J2L97O29o90p19J91J00M69j76N4K81p62Q16r50m21L90L36
7534b46k6N0J22m66O38J6k09M7K3Qj62K08J79m23j62Q40n00K35n06l56M73N58
$$ y = [-239, -592, 403, 281, -329, 126, 201, -403, -325, 12, -191, -441, -230, 321, 125, 610, 5, -191, 291, 621, 832, -130, 78, 127, -117, 366, -386, -446, 39, 386, 69, 175, -186, 356, -62, 186, 164, -227, 465, -285, 206, 74, 311, -371, -369, 306, -163, -153, 93, -416, -92, 96, 470, 634, -300, -780, 543, 188, -938, -72, -217, 302, 171, -442, 111, -244, 135, -115, 816, -211, 344, 521, -192, 46, -601, 471, -466, 13, 475, 197, -86, -102, 213, -152, 512, -394, -3, 59, 725, 202, -20, 13, 272, -732, -627, -6, 367, -106, 331, 72, 360, 370, 653, -201, -138, -201, -268, 119, 269, 131, -424, 830, 170, 411, 73, 645, -431, 1, 300, -3, -135, 13, 337, -565, -7, 25, -231, -203, -191, 206, 835, 145, -574, -383, -283, 186, 10, 64, 345, -417, 399, -551, -972, -582, -246, -272, -222, -100, -566, 72, 88, -121, -74, -51, -43, -205, 3, 182, -241, -403, 437, -63, 172, -334, -690, -217, 341]
7556C41M58n89N43j354K10K10l82Q77n69M78q9l3m26M50k46p57J078M4m6j38k73
7577b13o17J194n30J96n42K81O79k07l69P02o97j91P27K25q56J05k29O46m79K83
7597A08M64l87J32Q5j78M87m31o0j72R8l4j82J98m33N51l63Q91j394M51K32k0
7618D3N74j167L5P90l37L04r06O03K63L24j09n40R4J91J27m49j34M01O65j174
7638d02m72J023J92j72K13j85j4P0M24m12l30P91o50m39K16P33m97l29K05K62
7658B27P14o56K39j8J08q99l08J095K5k87L84j476J013j15j28O51m01n05O6M08
7678A37j005Q50l76k75R21p5l03J11o41O09k23J33n0k66Q76k75k65%L02o83M20
7699g8K36j64j34j90O05n79N28K89m38J80Pp66O47J53j56J13l82J61K10M02p33
$$ y = [341, 799, 210, 753, -601, -391, -181, -563, 314, -255, 223, 134, 101, -325, 125, -121, -878, 200, 244, 198, 60, -213, -830, 364, -166, 30, -512, -231, 448, 241, -128, 574, -123, -314, 413, 638, -218, -113, -342, 304, -175, 108, 572, 185, 317, 402, 224, 711, 280, 220, 48, 146, 112, -70, 128, -305, 246, -117, 774, -620, -169, 63, 43, 617, -550, -515, 275, -62, 242, -664, -61, 202, 526, 417, -123, -29, 162, 289, -160, -294, 107, 772, -402, -874, 149, 341, 169, 382, 197, 183, 253, 677, 265, -65, 726, 76, -363, -147, 586, 89, -240, -35, 227, 941, 285, 524, 506, 614, -285, -593, 502, 527, 240, 624, -852, 161, 46, -82, 569, 168, -337, -271, 137, -868, -18, -394, -669, 252, 177, -126, -15, -656, -47, -270, -137, -187, -453, 423, 148, -117, -117, 185, -498, -78, 158, -6, -140, -330, 275, -304, 224, 513, 75, 255, 262, -504, 143, 296, 140, 253, -129, 32, 242, 644, -89]
7720h9L52n11P93k57k2q20J28L17k76j96M97k55J089r74P7M33K46L81j216J62
7740a41j6J84O39j251M38K12j6k63M21m63l9P14j02Pm93m79J081l38o3l86K10
7761a44N91o49P83K57p12M99j119O33K76m36O02n49L23rl40l92Q62j13K92r54
7781b99j58M96Q84k62j347n6O61L67M74j066M81n28N79p7N16o48p23M37J301j142
7801a10P10m19o34O64l32K67N90p16L18q07j5J097p81J23p98N63j27K91jL74P8
7822C35J94L3j49J28m57l00M73J84p33k90O09q47N35J82J03p77L48L06M17j16
7842A78l46k98K72Q39m56k71j17M37L17l59K39m45n54K53J048j029k47O57n55
7861d37J577m12k20m00j75Q9K48m7n91O51j06q38Q85L84p68L60o82m19P20j32
$$ y = [-89, 263, -248, 545, 288, 266, -554, -426, -109, -385, -581, -84, -339, 750, -224, -147, 286, 532, 913, -303, -141, -157, 27, 666, -585, -147, 65, 49, -214, 207, -256, -295, 419, 317, 324, -169, -648, 433, 95, 32, -354, -144, 447, -202, 581, 838, 126, 625, -494, 139, 415, -21, 581, 32, 355, 346, 6, -386, 476, 363, 655, -299, -457, 39, 923, 661, -686, -742, -81, 286, 760, -306, 175, -353, 226, 149, 665, 17, -706, -269, 1032, -110, 600, 181, -453, 211, -121, 146, 736, 20, 338, -469, -484, 613, -168, -45, -843, -280, -407, -116, -117, 257, 335, 529, 562, 413, 541, 84, -216, 257, 441, -292, -582, 27, -820, -285, -103, 0, -777, -429, -123, 294, 178, -168, -466, -194, 645, 189, -82, -199, 238, 555, 196, 435, -10, -564, -311, 737, -292, -539, 118, -437, 1140, 728, 508, 108, -67, 22, 270, 223, -368, 283, 177, -661, 224, 608, -160, 200, -482, -901, -181, -313]
7881c13P65n07j07P6J94l37k79J97q4R06j9l20l02m6J95o64J398K27j071J40J47
7902A96J63r1n19M39o42O16m22l06J086q84j10N1Q06n92J22k8r7m30R05p8K43
7923D28k44k62Q59p89j17J31J09O5k5M55j539J366l95K65m33L36m20M21j016L41
7943d64K53J34JJ07N7k57l39N0Q20N90j148Q70J66n08n03L71L00j047J150m06
7963A97j93j32Q18l7r80J94K66L74j81j48L73m15j39n11M72j2K79M10j275J82
7983d58l08J362k53O6o78J94L93j012K89J54K63n02M92J46j41r8J054r00k95K10
8003b2k59L61k68r70J505L9J13m35M19o9p67J16M18n60N07j25o5M58j213J057
8023B40m59n07O05J13j2K60J83k8m74j64P01p45K01N6J97n30L39M07j94m78K89
$$ y = [-313, 452, -55, -162, -86, 108, -229, -508, -311, -395, 511, 492, 172, -130, -176, 19, -645, 753, 980, -91, 49, 196, 359, 268, -251, 188, -454, 162, -260, -566, 520, -364, -474, -423, 383, -209, -87, -115, -212, -642, 263, 185, 428, 184, -78, 781, -8, -125, 6, 115, 180, 155, 610, -929, 437, 42, 307, -126, 210, -210, 211, -805, -464, -211, -77, -76, 31, 88, -169, -508, -458, 362, 952, -196, 674, 840, 332, -171, 200, 500, -547, 603, 197, 4, -128, 690, 653, -327, -133, 133, 507, 326, 178, 551, 136, -3, -514, -42, -54, 225, 635, -640, -458, -766, 596, 343, 409, -269, -75, 318, -694, -405, -251, 12, -490, 2, 148, 7, -91, 963, 63, -232, -22, -281, 80, -188, -1158, 347, 386, 499, 64, 483, 414, -353, -237, 181, -379, 128, 3, -62, 396, -817, 240, -219, -726, -121, -8, -20, 240, 423, 395, -79, -243, 458, -287, -86, -30, 167, -363, -24, 383, 189, -289, 0]
8044@K73n59N80k10J97J77j69m53J9O49j56k26o2N58o46n52O96l18N4J30n51N31
8066c8r2J71R5J24l60J66N63j512K92K11PN56n59R84m49J54j98j79m80Q84k28
8087A12k93R5j29N18J19m45j29m47M01O61o01K07n8N43j080R16kP9o68l17L10
8108b08N15jl6O21j370L87k23L76l10L29k31j84K6M00L9n33J086n16k16k36O26
8129C41l40l62n7P84o03L64J11p71J148k46J91j95m52p8K29l60M82l82L46K31
8149C81n28J64K84k18j7k85L29M40l65n45l4J138o76k40kO00j87j22l06O34m73
8170b8M23k54n27k14L78L49k49Mm63L98M99j6m69K31k31M26M22l83p24P01J35
$$ y = [0, 273, -286, 294, 84, 281, 458, 289, -164, -145, 504, 348, 122, 60, 618, -28, -580, 116, -202, -148, -18, -569, -38, -130, 41, 136, 260, -100, 66, 629, -883, -591, -380, -373, 183, -376, 608, 159, 313, 115, -64, -544, 340, 112, -181, -86, -215, 303, 422, -23, -152, -599, -198, 463, -138, 69, 11, 554, -526, 390, 388, 467, -201, -518, -208, 307, 306, 270, 891, -479, -92, -315, 61, -249, 80, -151, -335, -309, 91, 130, -403, 683, 167, -49, -285, 341, 1, -361, -418, 366, -237, 127, 238, -533, 615, 369, 560, 365, -87, -165, 64, -296, 186, -196, 150, 381, -147, 17, 301, 83, 66, -219, 110, 550, 185, -360, -394, 744, 68, -172, -174, 426, 239, 117, -189, 445, -28, 395, 141, -386, -600, -222, 127, -122, -118, -581, -183, 316, 300, -169, 62, -169, 257, 679, 296, -428, 273, 408]
8191D08
$$ Imaginary data points
##PAGE= N=2
##DATA TABLE= (X++(I..I)), XYDATA
0@%%%%%%%%%%%%%%%%J9q3J28j28J28j28J83k47K56k77L41l89M53n26N91p05Q10
33D26q93R96j127J283j454J618j806K013k231K483k756L049l367L718m105M531
49B378m994N499o055O666p354Q128q991R964j1077J2364j3872J5664j7837K0540
63A1023k4008K8644l5187M5229o2730J02003l80934J81694N03514m18410j72379
74b21541K89936J38957l53633o5894L04051J40594k97406j37511K44411J81181
84B23145k24090j31606J96813J00962k24346o2677K24212P2494k30662r2193J66560
95A8612R4911j20316o8678P4635L4709r5027n0371J16257J09294j17857j56421
106a60252J01159J67832r5836j22445J30831R4604j61483p4041J82772R4988j58549
$$ y = [0, 0, 0, 0, 0, 0, 0, 0, 0, 0, 0, 0, 0, 0, 0, 0, 0, 19, -64, 64, -64, 64, -64, 119, -128, 128, -149, 192, -197, 256, -270, 321, -384, 426, -467, 529, -598, 685, -769, 849, -957, 1056, -1175, 1308, -1448, 1601, -1766, 1952, -2153, 2378, -2616, 2883, -3172, 3494, -3860, 4268, -4723, 5241, -5836, 6528, -7344, 8320, -9517, 11023, -12985, 15659, -19528, 25701, -37029, 64974, -315960, -134266, 369248, -49162, -221541, 68395, 207352, -146281, -212175, 91876, 232470, -64936, -202447, 41964, 223145, -945, -132551, 64262, 165224, -59122, -121799, 102413, 174907, -55755, -147948, 18612, 113523, -6793, -75471, -836, 33873, -61154, -111525, 4732, 114026, -3831, -160252, -59093, 108739, 12903, -109542, 21289, 115893, -45590, -119631, 63141, 158129, -420]
117d20j07889J16364J07594r1023q3006J02702N8103j52730p2538J73105Q3298
128A33560j59382q4409J10843L6356r1499L250R3805j6204r7800K175Q2419J9142
140C2256m4810j5755K1618J4593j154L006J2887l3k2122j1188K7829L2061m601
153D4587l8462l3689J7034M2492p671l1002J6891M420o3535o730Q4142J4118q3393
166d0798j7767N9392K953m5233J9303N2512j9995o3139J7069P9357M332p3022
178b5036l499O4403l013n0886K7728N7343m1068o9796K9994O7514j5636n3134
190a5086q65K6429q610k5889P242L2910n634n2193j0430N9101K0973n4791j9429
203d6272M9315J0011m1644R176N2644m185n7455n664O5715K7021n5233k7219N3672
$$ y = [-420, -108309, 8055, 115649, 24626, -58380, 44322, 102425, -50305, -122843, 50262, 133560, -25822, -110231, 612, 36968, -54531, -51281, 42524, 26320, -71480, -69305, 13114, 32256, -12554, -28309, -6691, 7902, 6748, 9754, 22641, 22608, 486, -10702, 17127, 49188, 44587, 6125, -27564, -10530, 31962, 24291, -6711, 10180, 14600, -48935, -55665, 28477, 42595, -40798, -58565, 827, 3780, -41453, -22150, 30362, 10367, -52772, -35703, 43654, 47986, -25036, -28535, 35868, 32855, -18031, 9697, 67040, 25972, -43824, -13830, 53684, 38048, -15086, -15951, 10478, 1868, -24021, -16779, 16131, 10497, -41696, -52126, 6975, 27948, -26843, -46272, 3043, 13054, -28590, -19414, 33230, 29045, -28410, -34074, 31641, 58662, 3429, -23790, 29882]
216B9882J1935o4899K651Q3185j3669r7469R296Q5148j8680p3910K4395N9016
228C6881m0082o0963M1572O3574l9598o4431L2020O3239k5453n1006L7189M7991
240D0933m4733m2577N9901M8706n3519m0448M6245K7994l9476j2617L6903O618
252C3930l9900j7854L2112K3364k8502l3135J9645K3522k6150k0531L2154J6155
264A4810m0689j5822M1196J8723l0834j3597K6847J3727k3195n743L3883J4230
276C3536l7039j7293M2715K0380m1438j3871M2503L6m8449P616M6581j5678n0439
289c0840J2347L9532j6969l6179J5560L1250k1284l4061K2884L9941k1391l9761
301c8971K3908M0892k5069k9690L5600K8491l6992k1215M0687K1084l3504j6729
$$ y = [29882, 41817, -23082, -20431, 62754, 49085, -48384, -39088, 46060, 27380, -46530, -22135, 36881, -3201, -64164, -22592, 40982, 1384, -63047, -31027, 32212, 6759, -44247, -7058, 40933, -3800, -46377, 13524, 62230, 8711, -31737, 14508, 42502, 3026, -9591, 27312, 33930, -5970, -23824, 8288, 31652, 3150, -29985, -10340, 13182, -12968, -33499, -1345, 14810, -25879, -41701, -505, 18218, -12616, -26213, 634, 14361, -8834, -14577, 19306, 33536, -3503, -20796, 21919, 42299, 861, -13010, 29493, 29529, -18920, -11304, 35277, 19599, -30840, -18493, 21039, 4070, -32109, -16549, 14701, -6583, -40644, -17760, 22181, 790, -38971, -15063, 25829, 760, -28930, 6670, 35161, -1831, -23046, 17641, 38725, 5221, -11508]
313a1508K8102J3717k7886j4167K5163J3516l0952k2080K8693K0226l2776k1968
325c1920K9552J4165l2055j1601L2905Q764l0052p364K8872J4017k1696j2075
337a8488K5737J6552k5489j3003L2793J6410l4002j5826L6460J2733l5264j0335
349a1722L0112L236l0880o855K5768L426k7925j0463K4428R932k6136j2137K8407
362h09R000l0073m469L4047N646k8240j462K7143M249j8082j877J7759P671j4567
376E936r164J6800J2589j9482j5941J7634J3124k1591j3223J6747P746j9871j0698
389a9394J3979R876j1793j5252P097J8851n802j8958R229K3848j0106k2628J7218
402c835K5283j3298j9932J5254J8523r650j5734Q097J7203p134k1469M737K4436
$$ y = [-11508, 16594, 30311, 2425, -11742, 13421, 26937, -4015, -26095, 2598, 22824, -9952, -31920, -2368, 11797, -20258, -31859, 1046, 9810, -20242, -27606, 1266, 15283, -6413, -18488, 7249, 23801, -1688, -14691, 18102, 34512, 510, -15316, 21144, 33877, -1387, -11722, 18390, 21626, -9254, -16109, 9659, 13085, -14840, -25303, -875, 9057, -17079, -29216, -809, 8191, -21882, -26351, 7696, 13342, -14898, -16360, 10783, 15032, -3050, -4927, 12832, 20503, 5936, -3228, 13572, 26161, 6679, -9262, 8372, 21496, -95, -13318, 3429, 11175, -8696, -19394, -5415, 4461, -7332, -22584, -15487, 3364, -2438, -21396, -12167, 11681, 1575, -21053, -3835, 21448, 8150, -11782, 3472, 21995, 12345, -3389, 4708, 21911, 14777, -6692, -1955, 22481]
415B2481q249l0817M918K7418j0764k8603J1942K3802j6944k4625J3744K5078
427I381r327k3952P928K6261l990k6559Q279L3762m824l5567J1265L8507q718
440B2446l8681J1269L6965j1632l4987J1589L2279j3539l8844P436L8597o773
452A6125m2131K567L9790r766m2231J1982M4705j4273m2041J5111M0644j2018
464H464l4084J3246L6439j1181l0473J3720L4376j3044l5143J3865L7348j1932
476B1601l6317J1026L0596j6636l3120J8574L0885j9452l5937J1528L1236j1780
488B204l0459J1197L1159j3619l2775J4666L6808j2555l4853J5816L8129j1839
500A3879l1959J3649L1194j2525k9923J5649L3317j2529l6567P790L1790q926
$$ y = [22481, 14232, -16585, -11667, 15751, 4987, -23616, -11674, 12128, -4816, -29441, -15697, 9381, 54, -23898, -15970, 10291, 6301, -20258, -11979, 21783, 16959, -18608, -7343, 31164, 22446, -16235, -4966, 31999, 20367, -14620, -3031, 29248, 15709, -23135, -15699, 22898, 16125, -26006, -23439, 16351, 6585, -35646, -23664, 21041, 6768, -35273, -20162, 20482, 8464, -25620, -12374, 24065, 12884, -17589, -3869, 30507, 17463, -17680, -3815, 33533, 21601, -14716, -3690, 26906, 10270, -22850, -4276, 26609, 7157, -28780, -17252, 13984, 2204, -28255, -17058, 14101, 482, -32293, -17627, 19181, 6626, -28227, -12411, 25718, 13879, -18080, -4431, 26763, 14238, -15685, -36, 33281, 20752, -15815, -8025, 23765, 14839]
512A4839l0077J1468K4821j8657k7309J4047K3163j3953k0551J1494J4462q951
524e204j2262Q822J2637p584j1279J2560J5232o490j3794O556J0972l393k943
537C830Q667K520j1201m663N554L968K34m101o460l60K660o432k422P892M94j3020
553a2840m29J2281j174r298k44O939K642J018l54J917J350j477l667P663J1035
568A5362m098q317O23K945k22N30J405k722j358m659m601M401P016q126j3436
583a5257Q204J1664r253j2003J0526O458j1445l055J5804O724j2065q449R815
596b332J0838m299m275Q656O175j4098o028J7553P145j6472n674J1475p14j2034
610d084K602P979n117j1683J598R884J30j0683m415O785K274k019Q67O673o67
$$ y = [14839, -15238, -3770, 21051, 2394, -24915, -10868, 12295, -1658, -22209, -10715, 3747, -5204, -17466, -8644, 3993, -3591, -14870, -2310, 12922, 6432, -7362, -806, 10166, 6773, 3830, 12497, 15017, 3816, -847, 4707, 8675, 8909, 4808, -1652, -2012, 648, -5784, -8206, -314, 180, -12840, -13269, -988, -2162, -11460, -11704, -4765, -2123, -1105, -1459, 458, 1808, 331, -3336, 4327, 15362, 11264, 2947, 3570, 6515, 6293, 6823, 8228, 5506, 4148, -511, -5112, -711, 6305, -1821, -15257, -7053, 4611, -4642, -16645, -6119, 339, -11106, -14161, 1643, 8367, -3698, -12147, -2332, 8506, 4207, -68, 8588, 14763, 665, -5363, 12190, 19335, 2863, -2811, 8664, 7950, -4084, -1482, 6497, 1380, -10303, -8705, 1179, 1309, -9374, -13789, -7004, -4730, -6749, -5882, 791, 124]
625A24r108r71J1728Q382m700n480K817M254k194j742O127M760q010r017O338
640C308J0261q326j3383O193P744p952p087P661K281r406o955P670J1790n542
654a743r188L869N562l099j823J0113M689p567l385M247O474J045k760k820K270
669E884K459l101k469L369Q36r590l342P905M799j0102q611N593N454o907k594
684a0417R120L736j2474p840J5136J2677j1066r714J3245R218j3961m910J9809
697A2559N214j9490m366J8167N984j6497p834J2183O870j5007p065J5345O066
710A2129k2020r870J8971J0472j8385r006J6269O233j7737m240K1345P534j9242
723g547q314J9430J2296j5640j1155J9026J1514j9626j0775K3017J2144k5675
$$ y = [124, -8984, -9955, 1773, 10155, 5455, -25, 2792, 7046, 4852, 3110, 9237, 13997, 5987, -3030, 3308, 13569, 5243, -8140, -1947, 5797, -2155, -9242, -1581, 700, -8706, -15661, -7991, 3799, -1743, -10931, -7062, -1500, -4599, -6422, 3691, 8380, 813, -2572, 1675, 8149, 9194, 6434, 3614, 5884, 8343, 5242, 2773, 6142, 6978, -2612, -5954, 1951, 6750, -3352, -11963, -6370, -916, -7823, -10417, -1297, 2439, -10035, -17875, -2739, 9938, -1128, -10842, 2403, 11621, -2340, -7250, 12559, 17773, -1717, -6083, 12084, 18068, 1571, -6263, 5920, 12790, -2217, -9282, 6063, 12129, -9891, -19761, -790, 9682, -8703, -17709, -1440, 4793, -12944, -17184, 4161, 11695, -7547, -15861, 3569, 15865, 225, -10930, 8096, 19610, -16, -10791, 12226, 24370, -1305]
735a305j2188K3418J0237k4038r514K0689M793k3735p347K3529Q292k5248j0226
748b2643K2919R554k1556q079K4829P209k5273m150K7122N751k2191m453K2399
761A1438N487j8854l742J8918M337k1088m983K1175N036k2510p305J9107M227
774A1243k1211l414J7581L248k1392k685J8013N011j6421n534J6465N844j3148
787f400n152J6184P555j5894n277J8486O016j5582m873J5673L797j4315l519J2383
801I082M000j4058o482J0821N769j3201q340J1642M491j1741m706J1536L984j1711
815h914k990J0400N009p037m962P804O950m835o029P813P939o497o844O365Q886
830A3058p088q265N069O382n376q102L825O312m722r047K065Q963m260j0434M485
$$ y = [-1305, -13493, 9925, 20162, -3876, -13390, 7299, 12092, -11643, -18990, 4539, 12831, -12417, -22643, 276, 9830, -11726, -19805, 5024, 12233, -13040, -17190, 9932, 15683, -6508, -10961, 11438, 16925, -1929, -5671, 13247, 17584, -3504, -8487, 12688, 17724, -4786, -12091, 7016, 11243, -9968, -13382, 4199, 7447, -13945, -16630, 1383, 6394, -10027, -15561, 904, 6748, -6400, -11552, 4632, 12187, -3707, -8984, 9502, 15518, -64, -4937, 10736, 14533, 218, -3301, 9082, 13082, -976, -7458, 3363, 9132, -4069, -12409, -767, 3724, -8017, -12723, -1187, 2797, -8914, -11904, -1504, 3505, -3532, -8494, -690, 6260, 1425, -4604, 3209, 11148, 4651, -2193, 4172, 13058, 5970, -2295, 2774, 9156, 3780, -4322, -497, 5815, 1093, -7954, -5889, 3074, -1186, -11620, -7135]
845g135R567m749r694O124R575m678q166N998R586k915p627L974J0309l381q116
860a328L371R987m357j0290L602R161m501j0334M271O926n282q715K107P275l008
875a115q217J119P871J2r107J473R917p61r014L667R658j579p798K891J0139k375
891F781p338K025P972j772p592J454O105l15j0226Q01Q474m553r138L884N739
906B301n841o283N548M646n738m231O284L964m258j790M856K922k703j873N045
921B849L991m667q80M566J927n679L89L417q86l827l23J789j513k591o6J444j856
938a916j977R08k17j070j149P22J944o79o90K733J485j206j259M795K140l680
954H84l30M313K003l870j810M338K329o353k783N717K011q000l612O986K073r495
$$ y = [-7135, 2432, -2317, -12011, -5887, 3688, -990, -9156, -3158, 6428, 3513, -4114, -140, 10169, 6788, -1328, 2043, 12030, 7673, -2617, 985, 10146, 5645, -4689, -418, 6508, 1226, -7489, -5382, 1893, -1115, -9332, -8213, -342, -330, -9437, -7964, 1953, 1192, -7822, -4155, 5503, 3924, -3874, -983, 9156, 6781, -557, 1468, 9440, 7668, 76, 1530, 7635, 7320, -2906, -2105, 6369, 1816, -7322, -3438, 2301, -3540, -9823, -4275, 371, -5367, -9598, -3314, 650, -3608, -5398, -542, 2380, -323, -2196, 2849, 6840, 2173, 1293, 5859, 7786, 2107, 2496, 5913, 5027, 1200, 877, 2666, 1153, -1438, -1504, -60, -1916, -3893, -2985, -3202, -4272, -5421, -4699, -2755, -3434, -4124, -1391, 94, -1112, -2371, 2424, 4564, 884, 554, 4867, 6870, 3000, 1190, 5528, 7857, 1504, -1279, 4438, 6449, -1551, -5163, 1823, 3896, -5599]
970e599k414Q604J219j1374p99J1480N86r974O02J1099J66j1318K829J1892l91
985F608j0582K500J0902k085r819L911R570n325r600N353Q656n346j0872K856
999c273Q606l198r735K586P237l536q928K778J0095j763r401J746Q558l61p428
1014f017K361R915l56r210j93J1561J971j1719j777J3608N50j3108k10J1782j310
1029G848j5296J301J4513m148j3139R10J1458k683j1115L444J0880l593j0963
1042a0583J805J2751p49j0609L634J0745k772q350M450Q464l513o590K755O809
1056H247q18o924j962O003J174o490k825P283J494j0584m174R391N233j0177m683
1071i812Q949L530j0966j552J0622O306j2358m999J2766P866j2566n520J3929
$$ y = [-5599, -8013, 591, 1810, -9564, -10363, 1117, 1703, -8271, -7669, 3430, 3596, -7722, -4893, 6999, 6608, -3974, -1474, 9428, 7343, -2476, 1435, 11005, 5680, -3920, 1433, 10089, 4743, -6129, -3273, 5333, 2135, -7600, -5014, 2223, -1313, -10241, -7463, 2632, 869, -8532, -6786, 1772, 1411, -6017, -3656, 6259, 5903, -3307, -3500, 8061, 10032, -1687, -3464, 10144, 10694, -2414, -2624, 9158, 7848, -7448, -6147, 8366, 4218, -8921, -8011, 3447, 764, -10351, -6907, 3973, 380, -10583, -8778, 3973, 3224, -7385, -3751, 6994, 4222, -4128, 322, 8786, 5273, -1317, 1438, 8247, 7429, 505, -1457, 4546, 5720, -770, -3595, 3688, 5182, -5402, -9576, -185, 5048, -5129, -9812, -863, 2667, -8299, -9851, 771, 7077, -5281, -10280, 2486, 10352, -2214, -7734, 6195]
1084F195O057j3900l677J5822K640j6851l015J4566K404j2074l983J0351j2j2091
1098g568m62J0914J661j1304l734R929L508q988l091J0089K982p839k665Q236
1112A668N135p396n363P798Q886o229p967O645P475r312q513J1443R904j2703
1126A471j1243R241J0044j1270r285J1925O892j3353j0008J5262Q124j4142q103
1139a4445J4738P658j2565n701J4169M841j2965k869J4523M836j2600m650J1103
1152F073L517j0313q95R036J351j1694l397R435M013q124n305M359L840n384n016
1167h504O067M716n788o736O979R054n487r151N794R274n735o556R463P674j0371
1182F93q055J0126R542q273q111Q067M443r358m256Q410N339j2137n028Q898M032
$$ y = [6195, 12252, -1648, -5325, 10497, 13137, -3714, -6729, 7837, 10241, -1833, -5816, 4535, 4523, -7568, -8030, 2884, 4545, -6759, -10493, -564, 2944, -6044, -9135, 954, 3936, -3903, -6568, 1668, 6803, -593, -5956, 1842, 10728, 4499, -3468, 3177, 10652, 1340, -7173, 4270, 14174, 1471, -9772, -531, 9513, -1757, -11042, 883, 7775, -5578, -15586, -324, 7800, -6342, -14445, 293, 7951, -4614, -10315, 3854, 8695, -4270, -7139, 7384, 12220, -380, -5030, 6073, 9590, -723, -1618, 7418, 8769, -2925, -6322, 3113, 7126, -998, -6303, -1944, 1896, -3488, -8504, -2437, 2279, -3509, -10245, -3266, 5788, 301, -8850, -3056, 6218, 483, -6073, 3390, 11064, 693, -7362, 2764, 12306, 4033, -4078, 3989, 8432, -926, -5182, 3228, 8567, -3570, -8598, 300, 4332]
1197D332r371l098Q263N89q075J015Q608j46p445m87P254J388l044P04K318k30
1213B575k117J42L226J723k194k956J005K198p35k288k89J460j732l465R46M198
1229A697k372m939M11O120j728n052K343M321l226k720N378M303l650m012L417
1244B91L918k591j92K997m92l617J69L640J78l928r5Q56n85j743J698K78k499
1261a717k711K201J178k665J332m77k14j227K561K578k896j11K472P54j100K323
1277B281J879r54k784O35K048O8j061J056J0k810m37J542M87k509j260J03N64
1294a142l42K6J79k409O82N61Q74m97J314k28j008Q8L434J636k626j48K236J615
1312D245k542j38L789j442m349P76M320j220n133Q13L112l517k958K530K786l031
$$ y = [4332, -5039, -8137, 126, 715, -7360, -6345, 2263, 2117, -5328, -5815, 1439, 2827, -217, 487, 2805, 2575, 458, 600, 3826, 5549, 3355, 399, 1404, 3602, 2867, 579, 290, 1750, 18, -3447, -2501, 1697, -675, -5614, -5203, 917, -811, -5863, -3520, 801, -2425, -5145, 233, 4536, 886, -3126, 291, 4209, 1618, 1426, 4423, 3931, 314, 483, 4123, 4301, 373, 278, 1134, 549, -1194, 504, 782, -1717, -4428, -2227, -1049, -3714, -2382, -2859, -3073, -4300, -1739, 839, -2057, -2168, 304, 1058, -42, 2281, 4160, 3206, 422, 1057, 3105, 3173, 2112, 3168, 3178, 368, -69, 1473, 1960, -549, -1809, -1706, -1142, -1484, -1458, -1279, -3688, -3006, -2445, -1571, -2068, -754, -982, -1990, -1902, 1532, 3168, 542, 394, 2630, 4245, 1703, 1565, 5354, 3912, -437, 339, 4659, 3439, -1694, -881, 2231, -1286, -4244, -1714, 1072, -1959]
1328a959k607J409L233j802k074J710J897l92k420J488L469M2l630J192L560R33
1344D049k948R00K503m80l545l27L301J186n628k121N486J83n519j901O291r77
1360D53o194J94O625O12p238k73O907N16n430P13O531O54o803K54P975mp114j
1378a623P652j56p622P83O797j218p375m02P405q85p795j020O720P29p844M7P049
1395A242l32p499k51Q982L55o986k82Q649Q58p320p36Q749O21q570R0Q331K088
1412G989r404j931R466L13r796q55Q516N60j0313n19R061n91r158K54P785L74
1428A751r113J111R281o39p955L24R407M68p938J62Q778Q82r116Q28Q303K08q843
1445b101p24Q248J286r164n68O599O08q848n36P239M03p806j494Q692N56p466
$$ y = [-1959, -4566, -3157, 76, -1726, -3800, -2090, -193, -585, -3005, -1517, 1952, 1994, -1636, -444, 3116, 4049, 1101, 2001, 4504, 4024, 479, 152, 3453, 4639, -989, -3110, 2376, 2559, -2960, -4861, 1430, 453, -5741, -5547, 1078, 1690, -5548, -5821, 1086, 1602, -3828, -3115, 3416, 4070, -2733, -2479, 5496, 5492, -1622, -1623, 6029, 5873, -1749, -966, 5831, 4613, -2762, -3164, 4241, 3356, -4439, -5459, 1261, 1990, -5854, -5807, 1242, 910, -6589, -6840, 2142, 2497, -4489, -4771, 3878, 4736, -2584, -3320, 5429, 6050, -2520, -2430, 5901, 7989, -1415, -3346, 6120, 6433, -3363, -4218, 4298, 4858, -5455, -5974, 3087, 2496, -6662, -6408, 1377, 1751, -7362, -6251, 3030, 2391, -5564, -5240, 4167, 4635, -3303, -3141, 5637, 6519, -2597, -1769, 6534, 6742, -2101, -2825, 5423, 6709, -2455, -3023, 3576, 4184, -4664, -5200, 2039, 2442, -5364, -6858, 1834, 2390, -5076]
1461e076j891Q168K057p396q10P176K919p244j664P621K234o967r50O409J476
1476F062o373j958O490J224p032k004O386J133o161k475O128J034o624j588N866
1491A08J831n720j653N764J508n352q72N979K122n209j828O097K939m589l484
1506b359N270L173n489j956M701K570n613l920N414J869n240l135M371K683m529
1521b190l866M083M072m664l540M904M076m704l393N258L891m120k664M394L176
1536D713l658k982M583K729l117l312L130K544l495l373L154L098m674l277K959
1551i78K387l510k552K746K385j899l149L127K574k324k367K086M006k393k619
1566b480K781L672k999k544L724L382l735k932K707K592l002k502K226J562k827
$$ y = [-5076, -6967, 1201, 3258, -4138, -4948, 2228, 5147, -2097, -3761, 3860, 6094, -873, -1823, 4586, 6062, -311, -2269, 4221, 5445, -1587, -3591, 2795, 3928, -2233, -4708, 1420, 2454, -4170, -5758, 108, 1939, -3781, -5434, 330, 1838, -3514, -4386, 1593, 3715, -1494, -3322, 2775, 5714, 1125, -2359, 2911, 6084, 595, -1361, 3340, 5910, 297, -3623, 1791, 3660, -1580, -4715, -344, 2339, -2190, -6056, -1973, 2099, -2565, -6105, -1201, 2875, -1829, -5222, 36, 3927, -193, -2857, 1537, 4713, 1055, -1927, 2656, 5385, 2268, -1044, 2086, 4630, 1135, -2238, 916, 4014, -660, -3937, -978, 1409, -2101, -4653, -1907, 478, -1421, -4570, -1443, 1131, -1193, -3560, -1474, 2532, 139, -2480, 301, 3973, 974, -1570, 2154, 5536, 1801, -1131, 1576, 4168, 1166, -1336, 890, 2452, -375]
1581c75k406K687J170l566k115K903K493l319m90J156J459j438l80K126J282j410
1597b23j066K124P54p59O86J391l65j384K88J630j393r91k28o0M52j444j52K61
1615d79r32q67K88J505p92m32K91J46j65L18O37J71p6n95M45J618J70j92J169
1634B228j06n79q19J526Q93l045q43K284N50l126l8K567j589k727L08L492j431
1651d55l015L10K929n94k858K463K653j748k645J135M237q46k557J207L277j131
1667B362l004K308K117k210l157K916J863k031j583L75J140k465n02J685R80j840
1683a046k361L77L322o67j740k20K538k95k214Q87M265J86n188P22M444L94l123
1700B81l17L033J69m259J483M580j778o024J128N099j931m718N83M451l285l405
$$ y = [-375, -2781, -94, 1076, -2490, -4605, -1702, 791, -2528, -3018, -1862, -403, -1841, -2221, -95, 1187, -223, -1289, 835, 1589, 830, 1516, 2907, 2542, 1158, 1446, 3076, 1683, 692, 464, 404, 856, -588, -740, -479, -1411, -2278, -1990, -485, -1277, -1709, -1418, -1272, -1437, -1119, -482, -311, -387, -982, -537, 1081, 1251, 1059, 2228, 2122, 1543, 724, 2250, 3143, 98, -745, 1539, 2089, -1037, -1075, 1492, -97, -2824, -2516, 976, -455, -3470, -3160, -231, -825, -3683, -1220, 1433, -315, -2960, -1825, 2412, 1566, -991, 216, 3493, 2362, -642, 1666, 3783, 1573, -1584, 1332, 3195, 1164, -419, -44, 1096, -1369, -1871, -186, 794, -1046, -3407, -3030, 292, -375, -2115, -2335, 203, -92, -2306, -1419, 2846, 3032, -2156, -1434, 3010, 3404, 281, -36, 2997, 3166, -1093, 390, 4970, 3192, -2832, -1704, 3395, 1464, -3254, -2671, 1780, -1505, -4910]
1716d910K613M609k962l150J360L918q81l937J989K955j183k442K556K862j544
1731A853k316M92K851O37l485M00K293l84l055n31L807m07m400j185L774P27l710
1748b639j751M718Q93n506k72O295R62n803n7N490J216n655K92N804p0n959O32
1765a410O507k74o528O99M814k06n790J008N196k325n104M01M767k67n054L6M143
1782F13l85l465K05M335q3m552K57N209R13l977j141M465J192l642j525N885J042
1799E346n363k261N250J807n557k730N242J469n761q55N388Q15o602k071P268
1814A385O72n478j246O138O78o108R1O519j42n118K49N515Q93n371lN452j18m994
1832i86K62M416M5m920j670M172R67l935j291L932M59m720o52M121J419l806j954
$$ y = [-4910, -2297, 2312, -650, -3800, -2440, 1478, 597, -3340, -1351, 1604, 421, -2021, 535, 3397, 1853, -463, 29, 2880, 3517, 32, 432, 2725, 2341, -714, -1245, 2562, 2155, -2245, -3430, 344, 1071, -2639, -4390, 328, 1221, -4285, -4557, 1738, 2700, -3103, -3160, 2330, 3546, -2109, -1817, 3987, 3917, -2042, -1410, 5097, 4823, -1705, -1006, 3808, 3602, -2188, -1180, 4016, 1691, -3413, -3012, 1755, 1488, -3566, -3530, 613, 228, -3237, -3032, 1303, 1220, -3332, -3075, 2134, 3047, -930, -2071, 2394, 3586, -56, -1581, 4304, 5346, -17, -2278, 2972, 4779, -778, -3508, 1734, 3203, -2558, -3413, 1975, 2790, -3812, -5883, 1385, 2057, -3421, -4667, 1471, 2149, -3959, -3868, 2651, 2509, -2609, -2360, 3155, 4048, -1323, -1326, 4126, 4008, -986, -724, 3692, 3737, -1183, -2853, 1319, 2286, -1649, -2940, 992, 1451, -3269, -3921, 200, 1619, -2187, -4141]
1849d141L570L053m485j149L651K125m423n07M402K780n391j424M332J632l963
1864F2j740L894J707m929j145M081M85m320j301L500J138m211k80L130j03l000
1880c032o30M136J53k173j302L476L55j701n24K758J010k902n5K635R01k624j043
1897e62J291K284k004k092J857J231k698j405J621J654k598j571J683J450j973
1912a832o46K065J038j756j395L072J242j718j349J996J211r75j754K599R37j922
1928H13k5Q64P57k101l30O79M00j810k83J105P47k084q11J030K61l30p86N04Q19
1947e81l86o86J273J125p60k50J302O4J58n59J050m96k80q18J568N5J9j413k5
1966C60P98j004j068J072n46r17k95J288l05k07j29O11l30q96J279K03j18m47
$$ y = [-4141, -571, 2482, -2003, -3152, 499, 2624, -1799, -2306, 2096, 4876, -515, -1939, 2393, 4025, 62, -1678, 2216, 3923, -1006, -2151, 1930, 2415, -1905, -3206, 294, 1432, -2779, -3059, 71, -32, -3032, -3662, 474, 627, -1546, -2848, 628, 983, -718, -1242, 1516, 2526, -376, -431, 2204, 3105, 481, -562, 729, 3013, 1009, -1083, 774, 2005, -693, -2098, -477, 1177, -1421, -2992, -1309, 141, -1832, -2478, -413, 625, -1131, -2526, 546, 1788, 70, -1279, 717, 1928, 953, -801, 1798, 2735, 813, 788, 1652, 2409, 308, -22, 657, 1057, -753, -1036, 69, 816, -1268, -2079, -1049, -788, -1118, -1904, -1400, -581, -967, -1653, -380, 745, -15, -265, 1037, 1101, 1259, 700, 1750, 1254, 974, 156, 1724, 1779, 1798, 385, 360, 1158, 154, -914, 158, -388, -1305, -1600, -312, -617, -824, -953, -342, -672, -1568, -289, -86, -204, -651]
1984f51K46Q90P9o68J409j35o17L2Q77j50j307P95L56l33j483J471o1r96r11J32
2004a025R02r12p77Q38M11k41m04J51R24p26l03N44J645j039j50Q92J017k5q89
2023H33q6J088k39j784K87J588n75j714RJ571L6k853J069K189j423k535K20K633
2041C14J80k906N24K909o90k342L97L204q95j301j02L047k06k548L97K993j516
2058A459j905L67K476j344k202J483J040k87k585O27J330k68k139K45K467n86
2074A78k917J121J955L9k285J49L155j98k887O95L850m58l277K1M360m04l849
2091g52J11L588r79l873J539L046j593l372l25M494r77m120Q14K745j7l781R31
2108b521M023p53l448J132L443j048k444M66L079J77l799J461L279n99k963K57
$$ y = [-651, -405, 485, 564, -104, 1305, 1170, 553, 585, 1462, 1312, 5, 800, 1156, 823, -660, 811, 750, -246, -1157, -1025, -123, -1035, -1812, -974, -563, -804, -1208, -1057, -133, -859, -1162, -618, 1027, -12, -162, 730, 1747, 1722, 833, 747, 1835, 1596, -188, 99, 1687, 1112, -602, -593, 978, 1014, -1839, -770, 1419, -4, -2539, -2319, 314, 494, -2412, -1888, 1021, 331, -2011, -1614, 1590, 695, -606, -708, 2339, 2133, -415, -18, 2975, 1459, -446, -79, 2397, 1053, -1149, 334, 1374, 1087, -1498, -871, 459, 191, -1948, -1703, 764, 178, -2739, -1618, 337, 376, -1909, -1760, 1395, 1197, -1690, -995, 2855, 2397, -880, -859, 3501, 3097, -752, -641, 2947, 1968, -1905, -366, 2680, 1087, -2285, -2610, 1884, 907, -3213, -2399, 346, 329, -3452, -2521, 1502, 749, -2699, -1567, 1876, 828, -1616, -1150, 1929, 2106, -1693, -232, 3047, 2448, -515, -258]
2124b58K630q50k114M41J409K1k404o35K378Q3k730o94K951P17l493k99L277O7
2142D97k632j03L664O97l890J82L915L61m216P10L096k65k052q92L773m52l821
2159a428L06L049o28l557L44L297p62l099K35K452J20k193k82K838j7k570N86
2176a309K042N72k189N62K304M11k333q06K916P58k894j603L501K05k696j002
2192a561K655R21l296j419L461N15l006n42K730K56k279j611L021J111l266P70
2208a540K730M24l167L5L239M48k675p10L635p77j792M09J373R0j184j425J994
2225A107N57k212j388J314J569j282k116J850P37r41j763K259P20j490j736L197
2241C82M03q06r45J445J865k046j624K719N97j852l7O26J462k402r27J938N67
$$ y = [-258, 2372, 1522, -592, -151, 1258, 1279, -1125, -1760, 618, 701, -2029, -2723, 228, 945, -2548, -2847, 430, 497, -2135, -2238, 1426, 2123, -1767, -1585, 2330, 2691, -1525, -815, 2281, 2016, -36, -928, 2845, 2393, -1428, -1122, 1927, 1299, -2258, -1914, 1383, 621, -2478, -2243, 209, 329, -1864, -2146, 692, 675, -1895, -1309, 733, 1305, -884, -322, 1982, 2393, 60, -746, 2170, 2928, 34, -1569, 1932, 2137, -559, -1561, 1094, 2015, -1281, -2700, 761, 1276, -1730, -2272, 458, 714, -1565, -3176, -155, 956, -2310, -1540, 1190, 1614, -1553, -1518, 1721, 2169, -506, -1216, 2419, 1642, -150, 259, 1632, 1722, 538, -887, 1107, 1664, -548, -1936, -622, 947, -335, -2451, -601, 136, -805, -2568, -309, 411, -1079, -2815, 382, 785, -21, -966, 479, 2344, 298, -1326, 1393, 1990, 138, 101, 727, 2189, -213, -1140, 798, 1365]
2258A365j868p04J527P17k485J93J143Oj316K23J017L40j350l2J771j40r25k80
2276g98P78j74L51O50N07Qp71K20P8k6m26j116Q84M01r89k4j14O95j078n42R94
2297d92J31l38l50M98j10n9J31P77l24j68p3J247l2o04l92O77O59j058Q33Q76
2317A829j118j57m7L53p57p32O75K21j215M49J030q35j119N67J34j56p36P32J185
2336C03j054l24J167J225j455k70N62O13n69n03J268J5r51K14K16O62r20L03j30
2355C72K55q57p43L34K82J75j138M39M62l7n26k76J424m20o20l8R84L32r76J241
2375F69J81J0r99P05J291n63k197K089K93n34j192k22J287p57q51L24Q54o32k069
2394b313J923J101j697k08K56J669j385m31Q6K096j400m60P13J096J8k184J909
$$ y = [1365, -503, -1207, 320, 1037, -1448, -1255, -112, -106, -1422, -1199, -182, 158, -1192, -1224, 547, 407, -518, -798, -20, -194, 157, 807, 1314, 1322, 551, 771, 849, 823, 397, -719, 165, 566, -423, -447, -561, 134, -944, -1486, -492, -361, -699, -1049, -551, -661, -720, -589, 188, -136, -304, -377, 870, 838, 234, -158, 519, 1178, 120, 953, 1829, 711, 554, 507, 860, 103, -629, 46, 267, -948, -499, 531, -304, -1423, -856, -722, -878, -1614, -882, 303, -751, -1075, 92, 1317, -138, -408, 154, 767, 198, -305, 963, 978, 27, 241, 457, 1119, 199, 502, 372, 627, -230, -973, -639, -357, -182, -1320, -881, -419, -456, -982, -1258, 166, -254, -874, -912, 72, 404, -572, 669, 850, 860, -139, 566, 1857, 1294, -903, 1186, 1479, 945, -247, -469, 818, 61, -790, -466, 388, -244, -2313, -390, 711, -986, -1194, -938, 731, -654, -1085, -999, 1097, -303, -763, -50, 1046, 1064, -1120, 789]
2411G89J066j068j709J507J690r59k201P81J553r72j715R9J660O3k642M50K129
2428E21J24k115N04J705m65k048O71K138j185l01n3K248k39j535J31K086q04k072
2446f89M24J589n85j565J135N38r38j358O96J755k35k291M3K132r70j436j10K388
2464E23q54j699J155J836l93k147O80K370j12k643J331J900l45k102K15K204k32
2481A687k306KK293q85k501N32K731k58l115Q36J738J21l333L81L163p05j846
2498a465N34K183j96k502M44K492o26j251L31J328M95k990J254J993j46k111p15
2515i48K484K28k767M64J558q19j876O4K645l24k176n55K722n61j896N11K618
2532A372j53k117m1J584R70k082j79K160n0j603J43J612J9k149mK047o20j585
$$ y = [789, 1855, 787, -922, 585, 2275, 1316, -885, -104, 1449, 477, -1238, -1139, 521, 584, -2058, -1608, 521, 645, -1470, -966, 739, 274, -1774, -1103, 1035, -150, -451, -504, 1744, 1505, -30, 101, 2187, 1383, -689, -265, 1324, 739, -826, 309, 847, -91, -1449, -753, 1002, 767, -1524, -1481, 651, -319, -1755, -1865, 523, -331, -2030, -875, 961, 568, -1579, -899, 1471, 1359, -1284, 47, 1947, 1602, -500, -285, 1919, 1687, -619, -617, 1676, 791, -1710, -1178, 1553, 1295, -1820, -984, 754, 875, -2458, -2077, 1086, 381, -1465, -931, 1252, 1056, -1446, -1002, 1490, 864, -387, -56, 1272, 1767, -1223, 31, 2024, 1878, -233, -948, 1536, 1764, -1003, -539, 1019, 200, -1676, -1612, 1033, 709, -1467, -2022, 700, 139, -1757, -1246, 1372, 1219, -898, -939, 645, 1615, -467, -646, 1514, 1464, -139, 4, 1616, 1635, -514, -518, 1529, 909, -676]
2550f76n55J875j1j620m48K039p06j247k35J808l26q60j57R33N41o22O0O74R10
2569A377k283J353j43Q59p56j70J039k16j236o7M55P63j622R1O37Q14j437q4R80
2588C54l52j353k7J401L52q73n66J139K38k91r37J266j65L65m64J84P28j025J16
2607I0Q32m1q49k75O06J86l48r4P54k31j150O2k97L92k15k91P28j04j097K76R73
2628i3p5l38J80L65L44n27N87N73l88q09K21J336p00M98j477N39M28j50j287J540
2648G67j078k49k66J495j338n93P62r4M72r26P27P61m18j258J462l86L55l96J201
2667A000m70k67O99J50Mp02m69M01K4n07M89L64r42r1m54R07L91j006j33K24k98
2688f86J39J46N34o09L62MO20l41o66L83M75M12K34p46R04n75n98K19j09M61k13
$$ y = [-676, -1231, 644, 633, -987, -1435, 604, -102, -1349, -1584, 224, -102, -962, -1119, -186, 355, -267, -207, 467, 1377, -906, 447, 304, 1163, 407, 237, 1276, 1060, -176, -243, 212, 975, -647, -556, 81, 895, -542, -626, 354, 2, -1351, -1378, 23, 375, -498, -1064, 75, 313, 22, -915, 351, 186, 551, 87, 271, 999, -26, 90, 922, 881, 32, -243, 363, 549, 201, 107, 861, 630, -520, -458, -755, -363, -578, -869, -141, -245, -1342, -1066, -93, -168, -506, -326, 39, 383, -144, 443, 1016, 628, -181, 40, 1376, 676, 1174, -303, 236, 664, 514, -773, 767, -311, -560, -826, 669, -669, -1262, -500, -594, -122, -1048, -321, 440, 22, -1236, 226, -160, 195, -201, 1000, 530, 263, 962, 1112, 1116, 414, -55, 346, 370, -137, 352, 716, -226, -317, -771, 136, 527, -479, -612, -388, -686, -547, -401, 133, -476, -114, -110, 510, 169, -497, -114, 361, 773, 1007, 261, 1165, 590, -8, 211, 102, 563, 350]
2709C50o10J045p70r60N14R46p32j408J163O86J00j651Q40L24j1p69M91J433p03
2728B78m06Q9O82J72q93O07N37j422q48J537N63n93Q9o72P06k02o77J43j10K38
2748a82j638J504P00q18o54k7O34L06q23N1J779m68l55OQ74n88n28P05O26o13
2768D91o40P90J453j986p21R11J175j077j409L56R34k77j294O45O91r52m86R42
2786d54J836j645n13J53J000k10j496J874O61m39k050O24J602M51k046Q58O90
2803H96m78m25l35O71J04j257L46J229l63j228K80J026j013n23j19K639p56k716
2821b022J143J875J47j963J94J741k69j254k03K207o99k257J746J219n02k671
2837a568R47J408q85n68J80K031k034j050N17J355n27j541J082P12r6j167M88
$$ y = [350, -260, 785, 15, -945, -431, 515, -217, -1625, -462, 224, 324, -1327, -487, -163, -174, -943, -452, 981, 278, -128, -39, 643, 815, -78, 529, 1066, -356, -1204, 333, 896, 303, 392, -280, 426, 224, -453, -310, -420, -182, -1820, -316, 384, -434, -1088, -1115, -481, -175, -998, -947, 832, 364, 9, 15, 889, 301, -227, 478, 1104, 491, -149, 641, 2094, 108, -613, 298, 1473, 396, -1013, -657, 277, 0, -1294, -649, 42, -910, -1396, -454, 1382, -263, -776, -623, 377, 167, -1329, 545, 1206, 767, -1283, -659, 943, 1394, -652, 206, 896, 418, -7, -342, 329, 433, -824, -478, 751, 388, -840, -560, 466, -547, -1070, -1189, 1450, 694, -2022, -879, 996, 1143, -820, -626, 1115, 846, -408, -611, 1596, 897, -1360, 386, 1605, 1103, -1568, -621, 787, -98, -666, -486, 1545, -489, -1539, -1022, 333, -194, -1735, -653, 59, -37, -1204, -716]
2854g16J150L37j511K05J558l86j398R64J041k27j479J046J019l86j420j79J018
2871F36l42j375K7K165o39j455r8J899l64j931M20J775q25j345N76J447k93o86
2889d08r4J396l96o26J89J709j368J97L01L48r42l48o46J641l86j572K48Q38O27
2908G08k137J516K82K7j926J230q2J91k52M2O73K60j112L1J336k83q25J77R54
2927H10m56o43j59J167l77l39l83J768k91j067m70Q99k33q46k35M67O58j688J010
2946d08M80L56q51L58j1j1r58M29J367q24n3j92J195n25J24o13J400o00j94l00
2966A69O86q74j14K89M35j399O63j69L21J72j014M37O17N6j532L10J535o08R4
2985G4r44O56O74j64j33K15j34k06J21J24K41q18M40np7k0m43OQ7j53j94J88j44
$$ y = [-716, 434, 771, -740, -535, 1023, 637, -761, 203, 1244, 1017, -462, 584, 1603, 1217, -203, -382, 636, 294, -1081, -1054, 1111, 472, -983, -1081, 818, 454, -1477, -1057, 718, -107, -1452, -876, 571, 278, -408, -502, 894, 498, -128, 61, 1770, 402, 599, 900, 1248, 306, -42, -688, 953, 567, -1005, -757, 81, 708, -1429, 87, 369, 396, -1530, -300, -382, -191, -443, -401, 272, 532, -580, -549, 787, 504, -321, -144, 810, 354, -289, -448, 719, 342, 3, -380, 1388, 1097, 30, -440, 459, 226, -620, -855, -388, 270, -1418, -408, 72, 428, -423, -65, -76, -87, -1045, -616, 751, -73, -126, -318, 877, 352, 476, -137, 1263, 663, 469, 169, 855, -19, -133, 156, 591, -808, -145, -314, 7, 179, -835, -398, 219, 275, -1257, -947, 588, -20, 74, -870, -214, 460, 296, 163, 378, 244, 38, 159, 283, 524, -294, 146, 141, 64, 44, -399, -393, -306, -459, -653, -465, -609]
3008f09L63j15P5p21O91M8L95n47J00K42n81J163k32j57l90M24L06O6m54R9J33
3029B99N43p33o1mL55n77O7k99K16J07j254R17Q03o70K48K4n69R32j066O59R7
3050C4k87O68n24J15L40j266J492J01l44n55M82K20n67j20K38N39p08l4q3K49
3070a0k72o94R17J99l85k7oL55j88o96P23N24m97o00O76Q56j422K80k53J553r69
3091F4m87N02Q36o10o44K46Q20r99k24j9J173r46r38J175K51r0r27K11N54M9j251
3112a254J002O99o01l3P02M2j39r28J235K5q14j26k13J454j230p54J537L85j446
3131d57l41J84J204j364Q3J86N85j32r54N36O66K06j044M54J35o8r38P30J408
3150A079j452O4M77J213r86m28k52P59M16j103L39J250j276p05J5J392j38j453
$$ y = [-609, -246, -361, -286, -1007, -316, -268, 127, -420, -320, -78, -659, 504, 272, 115, -275, 149, 455, 521, 67, 166, 299, 842, 109, 48, 44, 399, -178, -111, -410, -194, -87, -1341, -424, 379, -291, -43, -19, -588, 344, -722, -63, 34, -253, 415, -109, 6, 346, -920, 572, 673, 329, -226, 256, 476, -91, -211, 27, 566, -142, -176, -259, -10, -282, -976, -59, 140, -245, -272, -278, 77, -111, -807, -84, 440, -57, -657, 19, 875, -547, -267, -520, 1033, 64, -423, 79, 915, 305, -339, -93, 727, -272, -496, -515, 658, -288, -1226, -51, 200, 110, -817, -606, -52, -3, -1254, -252, 447, -154, -187, 515, 557, 418, -510, 725, 750, -64, -190, -403, 1051, -179, -933, 604, 989, -457, -798, -614, 590, -774, -691, -505, 80, -52, -1006, -470, 196, 402, -642, -188, -53, -121, -1059, -329, 1079, -373, -309, 168, 1381, 395, -33, -285, 474, 890, -213, 126, 1376, 100, -605, -590, 802, 664, -789]
3168g89Q37M23r56p11J046L12m83n83K18J056l93j144J259L88r04K49k3J709j151
3187C60j111J231M01k32n72k81J112q75p65R51N46m55r53K13J510n44j224O6J190
3206E68n69j000M59J258o96m50L06P31L3m98l85N44M6j416J103Q02j64j326P79
3225A25m1R65q56K73N9p61n2N4R22l34j185O08Q02p34l11L27K89l44M89n17O68
3246D46%j141K98J017K13m64n71P97M37j526M24J283o36j86l85r3K19q04M2R47
3266C17m42n60N34J073p23m40r04J626j36m87j94J378n69j291R37K63k33o9j3
3285F7N12l82l71M36L43l36k90n0J08j60K48o61R80o02l42LJ264p78j70o93P16
3306a58k05j73K05N11j36j9L17Q13l29p84J25J8J00o1Q3n4J37l83M85k22l25k74
$$ y = [-789, 48, 471, -485, -1196, -150, 162, -321, -904, -686, 370, -23, -1167, 92, 480, -424, -175, -198, 1511, 360, -751, 480, 881, 649, 77, -204, 908, 33, -732, 219, 765, 310, -643, -430, 1080, 536, -688, -622, 568, -1, -1001, -542, 716, 20, -430, -124, 607, 640, 142, -243, 301, 347, -1069, 34, 836, 672, -654, 125, 84, 1049, 193, 466, 525, -236, -288, -234, 688, 354, -831, -223, 579, -155, -466, -139, 150, -194, 295, -222, 446, 446, -695, -397, 620, 833, 369, -202, 595, 1032, -494, -70, 1213, 577, 391, 6, -87, 132, -672, -630, 317, -125, -685, -151, 922, 199, -241, -1145, 481, 345, -142, -336, 1042, 473, -818, 119, 382, 149, 80, 67, 579, 197, -174, 262, 605, 269, -21, -71, 37, -123, 125, -536, 444, -158, -500, -497, 767, -11, -181, -874, -158, -363, -536, -331, 180, 44, 25, 342, 1155, 826, 42, 167, 185, 285, 224, 307, 253, 390, 7, 492, 270, -55, -329]
3328c29j28j2M41j45L25l64J46m12J99M52p36L09J60J58j40N83p32l2k07L41J246
3349A123p81o57J117q68m11O40K2k18j31m09k03P97Jk7M19r11j31M78L92j87p62
3370g07O2Q83k16M73o44m50O14k23J168j670J432r30N23M40p14K42P8O86m27q03
3390a83j41N38l9L14r08N96j40k92K17o74J016q54k35O26M93k40n53N95K6k61
3410i9k50J437o53l83J14n35O43j61m4j81P98n41j79J72l28K8j02r70J421K67
3430D54j083p9Q09n09J49J081J6m9j232N52J297j544o01Q55R65j127l74O70P10
3449I60o19p51J53J445r70r31L24P93q72O4J327q50o68l07L73J100j474p8J060
3468G9P30j571N45M07J100j469j74M51Q31j124m81J000K58m60p8M85j46l61n16
$$ y = [-329, -457, -469, -28, -173, 152, -212, -66, -478, -279, 173, -563, -254, -94, 64, -76, 507, -225, -257, -464, -123, 1123, 342, -315, 802, -66, -477, 163, 185, -33, -164, -573, -776, 21, 22, -5, 414, -497, -628, -150, 242, 55, -707, -645, 238, 22, 495, -149, -599, 15, -208, 960, -710, 722, -208, 315, 755, 41, 283, 361, 1047, 620, -183, -324, 214, 175, 489, -419, 177, 37, -255, -38, -712, 304, -550, -785, -159, 334, 94, -459, 136, 162, -99, -349, 1088, 435, 52, 166, -369, 274, 113, 69, -112, 686, 145, -34, 138, -190, -162, -264, -1234, 187, 454, -629, -708, 101, -408, -259, 822, 838, 789, -443, 109, 1406, -138, -739, 116, 1081, -46, -420, 250, 960, 341, -410, -257, 1188, 218, -713, -389, 404, -468, -404, 923, 73, -595, -902, -529, 571, -903, -981, 79, 809, -762, -217, 190, 1290, -179, -353, 98, 929, -195, -676, 324, 582, 122, 44, 529, 383, 22, -494]
3487d94R18o34R4o22j5J200j100R7JR73j217k5M15r7O70j495J797k35p1k49L67
3508B78J013m28n58p59J346q65o01P06K76L6j487J104N6o47kP34n20r7O2k39R60
3529C68j022L50k23J562r50q66J34R07K49r64O10M03o02n3L56M36l00q08O73K48
3549E08m26r1M91L05o03j458L18J123m17m84N2Q78J030k248J127j91p3j52k14
3568e25P99n16n98O43J731j213j000J020K3o58L06M21N56j137n72O33j0N89q91
3587c99J46N11r14J51M54J55j7j141Q22Q18j125R01L3K77p93N2lN29O3o34O66
3608E52k45O11r40m1L23J15k34n8J13J68j046R93M91n25j553J712j43n66l37M23
3628a87L94o82N28n39J356k5j345O85j53J80j176Q92J223j361m02J062l67l97
$$ y = [-494, 424, -210, -116, -738, -753, 447, -653, -556, -555, 418, -799, -824, -409, -506, 164, -1331, 466, 231, 160, -89, 278, 1291, 863, 305, -454, 892, 27, -574, 132, 408, 444, -1043, 61, 117, -530, -532, 202, -318, -415, -353, -592, 368, -654, -304, -527, 1035, 85, -781, -647, 260, 509, -455, 155, 558, -44, -97, 259, 695, 395, -413, 260, 508, 82, -9, 482, 787, 184, -1274, -956, 167, -250, -734, -682, 196, 1226, -1022, 105, -86, -159, -311, -525, 274, -242, -840, -197, 1534, 321, -679, 341, 364, -294, 12, 433, 989, -148, -720, -87, -97, 492, -399, -253, 258, -656, -505, -51, 104, 87, -1054, -232, 586, -539, 362, 395, 672, -121, -69, -72, 457, 520, -114, 552, 307, 918, -22, -63, 260, 375, 141, 83, 196, 364, -682, 311, 802, 277, -1276, 436, 293, -273, -610, -187, 207, -475, 53, -486, 870, 845, -500, 185, 32, 212, -964, -72, 1151, -210, -612, 450, 83, -314]
3646c14m72N11Q47m32l22j09kq2j48J59N31m2N1J37l37j0j22O74j57k98j7l41
3668b95J054q62j0K02L06j84K25M7L26o82j82o8N98j234L43L34p7m3m21Q68p80
3689e35l76P61N39p35l2J71Q44j493J464o91Q83n08k80j39M61N1l35N37n13O22
3709F96o65M51J20j003N96l06N82o41m99N17j67Q31j462J077p01P80o99O64j02
3728F9J08O7p50J30O41O19r20k64O09p34N34p3j68M50l64O61n19p12M82N45q70
3749d59K74l63J371j182Q9j5Q17q60J37M97l04n39L09J027o02K63n10l15J114
3768G49j29r19K64O40p20J08J07O2o91L51k62K04j64l30O25j41q8q94J801k31
3788C42k91j152R88L67j30m19L41R99j186l82L54J25Q4n26J500m4o53Q5l98O09
$$ y = [-314, -786, -275, 572, 140, -182, -291, -293, -375, -523, -364, 167, 125, 176, 313, -24, -34, -156, 518, 361, 63, 46, -295, 759, -103, -113, 89, 395, 211, 436, 483, 809, 127, -55, -123, 475, -759, -416, -82, -159, -202, -623, 245, -535, -911, -150, 389, -346, -378, -207, 637, -856, 608, -83, 800, 292, 12, -127, 334, 385, 50, 587, 74, 696, 31, 482, 602, -401, 195, -111, 471, -170, -669, -152, -319, 512, -950, 127, -574, 206, -493, 171, 69, 177, 244, -506, -376, 265, 884, -36, -300, 309, -425, 109, 36, -132, 318, -46, 615, 96, -616, -134, 411, -459, -185, -548, 823, -359, -270, -285, 532, -328, -191, 306, 2, -537, -228, 799, 197, 460, -50, -365, 749, 620, -299, -35, 605, -115, -7, 100, 162, -529, -178, -440, -236, -400, -730, -105, -246, -334, -1228, 573, 342, 51, -1101, -113, 254, 124, -295, 46, 1045, -141, -523, -169, -44, 40, -486, 1014, 970, 317, 402, 4, 613]
3808F13J36k58j032P88o85l08J286j68n80j5o2O94l04p61P74p11O62r72J110L38
3828E45p88o90J587j73j22r74N74P24m32N84q65Q94p44r34O09K84n09P4J90J366
3848A200j615m02J49Q36k26o55j02J197p10j161J516K21m71n97O42P76N86j114
3866G0N55j81k31r04P86O61n06p88j8Q49L28j014j4J324j090J87k37K40j68j66
3886c17L20M1K65j274L24J761j177j06N25R46j125n24J058L17p69o46N40Q3o08
3905c66o8K00O71n42m81J015r9n44M3J23L08j13k78k45Q19m4j023P40n78Q40P11
3926A089j218R68l16q98l77J885j228j24N22j57j50P1m8M02r80m38N03L86l62
3945d70l98N74P13j168N01jj26j56L1J496r42l10l51O17O32j75q7N0m84J72j24
$$ y = [613, 749, 491, -541, 247, -438, -746, 540, 372, -208, -223, -285, 409, 105, -656, 118, -593, 69, -903, 207, 545, -243, -933, 654, 481, 359, -615, -41, 683, 251, 835, -30, 864, 120, -814, -205, 79, -430, -356, -166, 1200, -415, -817, -668, 168, -58, -713, -815, 382, -328, -1489, 27, 248, -223, -820, -178, 598, 1184, 70, 625, 444, 213, -691, 95, 756, 250, -538, -556, 293, 621, -393, -407, 917, -173, 14, -223, 17, -151, -317, 3, 44, 309, -965, -641, 1120, -57, -163, 362, 1308, 183, -341, 717, 1034, 265, -381, 159, 242, -366, -434, -234, 437, -105, -586, 429, 330, -214, -171, -48, 260, 147, -131, -376, 443, 399, -624, 116, -462, 378, 1089, -129, 839, 523, -375, -752, 1133, -95, -219, 303, 146, -4, 67, 19, 421, -559, -997, -494, -108, -470, -868, -294, 419, -749, -248, -249, -375, -531, -500, 996, 54, -256, -607, 10, 642, 467, 380, 430, -54, 118, -6]
3966fn08J009m84n08Q32j07l88m70l36N87K64l62j07N05L62n30J74k15L99Q1o32
3987d40j71N72J72o8j30L63q03j3N48l18Q71l98J87p27K23J82J00p78Q99n18m57
4008g04J151k63m23M28m62J1n4k54N78n8M15l99j89M91k57L91l91J37J96M42o27
4029A59p15J467l09m67l91K35L62o50J01N78l11l62o2O95m6p21k80K57L60m45
4049e45p2O91L80r53O91m51O25n07kP92Q7o27n21M64j0M48n84N68n08J22r88N78
4071c22L37m13n95M04J053n18m65j02n5M08N05m00L26K48M67l06k73q30M23m45
4091e53Q06l73K29M72q54N01l10M06j070P57M4j80m74j10N94K65m16j037J489
4110A86k07k71n6O31o56J8Jm12L63L36j82K74J53K5m7R97r52m41J276j059J330
$$ y = [-6, -514, 495, 11, -497, 335, 228, -160, -630, -966, -379, -115, -477, -584, -79, 283, -247, -73, -288, 111, 192, -440, -611, -39, 133, 65, -65, 298, -505, -518, 30, -288, 583, 185, 372, -355, -132, 50, 150, -628, 271, -247, -704, 447, 184, -239, 189, -273, -262, -316, -570, 8, -50, 365, -34, -223, 268, 11, 402, 11, 148, 344, 786, 159, -556, 911, 602, 135, -256, -21, 341, -309, -208, 370, 59, -303, -365, 330, 284, -437, -717, -460, -100, -545, -617, 74, 454, -499, 192, -259, 366, -141, -143, 649, 736, 109, -412, 52, 42, 490, -94, 474, -34, 88, -900, -322, 15, -398, -993, -589, 464, -54, -519, -621, -676, -268, 237, -163, 163, 411, 878, 572, 299, -531, -108, -553, 253, -120, 109, 581, -273, 228, -82, 324, -746, 11, 55, -125, -599, -709, -115, 150, -266, -1303, 186, -21, -292, -348, 283, -373, -355, -354, -766, -403, -67, -249, 25, 178, 203, 156, 1153, 201, -240, 1036, -23, 1307]
4131A307j495k39K51K09p58N26J60J32l46n47M88P2o24J37R86K43j134N59L08
4150B35j67J35m0j7Q51m46j072J54J140o76q36Q79L47M4q95N8J48M16j006P03
4170d5J39l50k32O94Pk85l88M14O04r43K93j22O49l70j40L85Q0n58%P5P59l8r42
4193c14P26q6k50o20L76R26p51j327P70M61n89k20M52k36n1J060o10L81N79j333
4213f56Q29j52l36L07J23Q73q18n33P58J86J2q19J219j073N18j163P45P32o43
4232A09r89R17L83m26m50k24J161o82p37O73L16p34m71J517k02m82j19N63L29
4251D52l72K48q2J067j359N1M80n94r8m65J115k6p02K57m89M61K76p09J090r42
4271c41l46r0Q74M32j209L4M06j27P07m33O12R7q51j6l4M68l0o27J230l4p43n18
$$ y = [1307, -188, -427, -176, 33, -725, -199, -39, 93, -253, -800, -312, -240, -864, -727, 259, 502, -632, -73, 235, 68, 203, 163, 146, 997, 551, -521, -367, 773, 97, -739, 140, 487, 531, -364, -306, -158, 258, -748, -45, 94, -256, -488, 206, 213, -72, -460, -46, 558, -385, -92, -214, 435, 65, -75, 310, 390, -168, -168, -93, 666, 628, -314, 412, 326, 76, -544, -168, 758, 7, -1320, -550, -89, -678, -898, -446, -682, -733, 327, -283, 98, 677, -656, 173, 21, -315, -8, 115, 988, 170, -363, 395, 581, 593, -226, 993, -80, 438, -725, 20, 752, 109, -880, 37, 420, -6, -456, -680, 481, -201, -938, -265, 51, -683, -1154, 363, 161, -321, -440, 123, 452, 80, 328, 246, 1313, -46, 5, 485, -109, -207, -672, 443, 417, -285, -28, -517, -56, 220, -489, 601, -341, -687, -777, 97, 529, -680, -646, -240, -367, 340, -93, 519, 616, -235, -251, -285, 183, 153, -474, 756, 722, -21, -539]
4293e39M86R4o2m05l3J139j167M71J77m23K97r1k98P74n17Q3N69j35N1j025J421
4314H67o54J87l23M66j21m90J04k94J063j198K39K92o6j50j86q32Q24K57J18L
4334A06L47p15j79j19O69n77J31N84mn56J31M77k26M85r91Q98L49j106N87K25
4354E16o79K68l90M74j90M98l49k52K46J05l1J3r86P87p27O22M44m51J40L89j255
4375h08O94o20P51O6J79mL1L10k30q7q07Q17n59N46K59l41m43Q50m09O2m73J8
4397a98N22n88J4m84J059o47o7J32Q53r03K95q77J864o86j050J076q27M81k5M28
4417C72j30j059P89N34p09Q44p20K65K09p8k17q7L0l61J57L6P62k20o09N1O44
4438E03m22q09N24L21O97o06L27p64J73k91Q75o88L04m00k26O31o0j197J095J37
$$ y = [-539, -53, 41, -21, -426, -459, 680, -487, -16, 161, -262, 35, -56, -354, 420, -97, -14, 555, 420, 471, -554, 867, 213, 400, 77, 543, 422, -68, 36, -258, 805, -393, -154, 138, 72, -78, -264, -1096, -272, -15, 103, 106, 453, -262, -441, -560, 109, -468, -337, 247, 243, -313, -182, 295, 69, 554, -437, 461, 810, -296, 291, 516, -163, 105, -285, 189, -1, 497, 148, -104, 142, 247, 216, 229, -757, 30, -697, -75, 369, -82, 58, 447, -808, -114, -734, 17, 83, 262, 258, 289, 599, 369, 282, -525, 292, -267, 279, 538, 197, -246, 604, 195, 257, -216, -198, 324, -264, -250, -734, 325, -322, -389, -257, 596, -307, -12, -889, 975, 289, -761, 315, -512, -31, -56, 372, 242, -817, -28, 506, -203, 641, -79, 186, 395, 317, 100, 13, 43, -318, -161, -125, 637, 417, -192, -141, 503, 81, -728, -204, 117, 814, 208, 535, -229, -56, -347, 528, -160, 144, -256, -482, 149, 89, -1108, -13, 124]
4458A24j10l12l9R87j237K07M60K51m34k31rJ72N10n24o5L03M34l83J01m2l57
4479a94Q5K8R68j082K36J69L99p44n7L18N36r69L24O39n81J27n17J20N23l97o1
4500a30j27J066p75m44M2O38N45j036j17Q79k80n43L10R1L58j10L40n68J38q28
4520e51Q93P15j462l38P30l62k47M81k77P74l0j060Q57M27q87M35M01K61j388
4539f28O04k71J199j514M32N23k1J86q68J0O73j14q05J69Q92l34n10M79M77n98
4559a9m58O11J1n68o75J131O64p43l45M91J36Q5q47O36k04K46J05j41J030q28
4579C18l59m8M55r15J83K17L02o2n24L42N58j91j048k2P83o36P05M2P21o27p82
4600e88J195l75l41k78O50M14p92P62j075R00j41p80J445r34l56m11P47l90O43
$$ y = [124, 14, -298, -337, 650, -587, -380, 80, 331, -103, -334, -343, -171, 339, -185, -250, 53, 487, 104, 205, 163, -194, -109, -81, 887, -195, 41, 210, 609, -135, -192, 126, 662, -307, 17, 656, 75, 202, -315, -195, 328, -69, -130, -257, 809, 34, -410, -368, 270, 815, -221, -338, 541, 261, -282, 28, 119, 477, 367, 707, 139, 277, -551, 342, 1057, -405, -743, -13, -375, -622, -141, -418, 356, 326, -734, 123, 550, -337, 98, 499, 760, -628, -24, -295, 904, -610, -178, 345, 324, 510, -358, -348, 325, 211, -594, -425, 467, 133, -377, 102, 579, -19, -477, 134, 145, -423, -1098, 33, 697, -46, -391, 100, 236, 321, -526, 110, -94, 152, 257, 116, 1146, 318, -41, -89, 366, -549, -366, -149, 153, 91, -433, -91, 467, 276, -772, -794, -11, -647, 58, 100, 821, 194, -588, 607, 232, -109, -387, 263, 677, -115, 647, -428, 472, 331, -449, 996, 62, -294, -705, 42, -348, 295]
4619B95l7n28N21r16l9R57M60j515P31k29P64l13l54K11J1l21n61J621l54j24
4639B80q90J139k90Q4j045J494J04j189N26n99R43m82M65o6l15J27m38k33N86
4658B01m48l12M69O22j354N02P76q10N07o83J172m17o43N15o7N77l0k50J34j018
4678e57K07N13L47j65r58P29K78K24k93J0j64Om30N0J29O36p81n4l61Q28jj053
4700h60M66R08l26l84j8O10n49K08J08j09O85r84N22k73N23p81P4P71L03j703
4720h09O23J97n98K8nN82J56m36j10r5O33Q7p26J61J248p72P11n94k25m53L12
4741h5n5P95p47R80p90n57J99P26m82n86M48m80J95j147J597R9j4j2%n31M3J47
4763b57M45l73j29J051j85l02o1j38k26O8j24K95K25o84J202j014K08j21n80l8
$$ y = [295, 258, -270, 251, -665, -704, 253, 713, -802, -71, -300, 464, 151, -203, 8, 19, -302, -863, 758, 404, 280, -610, 529, 239, 323, -722, 772, 876, -313, 213, -386, 557, 75, 540, 474, 159, 286, -152, -385, 201, -247, -559, -90, 532, -822, -320, 456, -354, 153, -530, 642, 225, -418, 97, 30, 607, 577, 327, 461, -557, -350, 163, 510, 345, -613, 116, 394, 618, 325, 335, 171, 177, -253, -203, -74, 562, -219, -273, -634, 194, 193, -860, -394, 514, 188, -196, -214, 396, -153, 55, 163, 54, 739, -245, 277, 4, 527, -254, -180, 591, 894, -809, -186, 11, -587, -559, -564, 18, 174, -262, -372, -467, 166, 253, -473, -312, 936, 164, 875, 281, 56, -397, -85, -140, 655, -92, 888, 98, -459, -260, 466, -16, -602, -154, -634, -439, -1586, 11, 110, 96, 84, 84, -447, -404, -257, 188, -185, -314, 737, 552, 250, 189, 51, -175, -107, -231, 64, 289, -395, 807, -207, 1, -120, -700, -738]
4783g38J571j464J137j045P74n29j61L25p5R35j255J172j196O37N94n03J54n03
4801a70K18J81K38K47o96K32K46l31L36o05L87O14q68l34J53M33n33j46K73n29
4821f54K83J93k02O43l10m27P19M88r89L12J00P09o73m84O90k64l36p4Q59m11
4841A72n02L61J67P1l65M35M28n14n27r2L99J061q68q49J263j34n98p7Q27q43
4861a85L05m33J096j55r69J16R09n49k63k89J67N78m34K41j30O41j013k46J306
4880F93j244M92J99l05P74j47n80Q75j097J06jK40R63p34k58O48L12o43j014Q99
4900A78J83J86j209J146J00j339O16P92j266J010K05j665J663j481J342o0j1p81
4918c91k63O78j64K24l17J32K65n93n76O56M12j03k44N42l00L81O19q08K31Q7
$$ y = [-738, 833, -631, 506, -539, 235, -294, -455, -130, -205, 730, -525, 647, -549, 88, 682, 179, 333, -170, 48, 229, 467, 714, 18, 250, 496, 165, 501, -104, 283, 897, 29, -305, -152, 281, -252, -398, -125, -654, -371, -178, -380, 263, -47, -474, 245, 733, -256, 56, 156, 865, 192, -292, 398, 134, -202, -276, 583, 172, -330, 31, 198, 269, -96, 339, 767, 253, -274, -366, 33, 1094, 226, -623, 640, 506, -92, -169, 658, -185, 120, -313, 783, 628, -341, -225, 684, 135, -128, -417, -250, 328, -106, 135, 5, 646, -367, -613, 693, -551, -59, 140, -165, 609, 462, -118, 757, -340, -234, -235, 5, 968, 234, -24, 624, 936, 293, -721, 178, 361, 547, -662, 484, 584, -755, -139, 653, -613, 397, 602, -1063, 600, -881, 461, 401, 390, -391, -654, 24, -140, 84, -233, -101, 164, -429, -1005, -349, 63, -40, -284, 258, -42, 339, 958, 150, 381, 468]
4938D68q32P78J08q67K76L80j49M9r60J287j72r23O68O87l50j88n50L65K08l82
4958i9J51K67J69k11p53M03R67j056kQ80j20q33J02N12o03j96M68q91P85O10l42
4979B08n47L21l46R0Q28k31n10M65n1P35j186l03O69O63n23l05J64J68m42K2J83
5000G2l37N41k59M80m00m85L4N61L30O07j595Q50n01P00j258K31M28N93r09o26
5020i43J196J1M2o36L02L13j036N20O25l25j46O32p10j43K33K62n73l2l22o5Q12
5041A7p34j39Q92kk49o18O14OM69l17l30L36q5P29j559Q63L31l31M18k13j26L72
$$ y = [468, -364, 414, 522, -345, -69, 311, 162, 211, -749, 538, 366, -557, 111, 798, 448, 260, -290, 75, 283, -99, 52, 319, 488, 277, -476, -73, 894, -162, -164, 716, 596, -237, -135, 377, -226, -422, 46, -845, -60, 550, 208, -339, -18, -364, -274, 554, 323, -187, 278, 227, 962, -224, -527, 142, 805, 282, -23, 141, 309, -133, -111, 72, -265, 276, 17, 497, 97, -388, -354, 207, 537, 1144, -451, 399, -102, 598, -660, -429, -1, 592, -317, -943, 253, 264, 306, -330, -28, 285, -751, -231, 394, 69, -77, 555, -155, -298, -65, 197, -376, -408, -730, -795, 17, -717, -856, 36, 34, -215, -833, -219, -213, 256, -61, -391, -55, -140, 589, -970, -107, 224, -107, 311, 98, -28, 344]
$$ [...]
8191i4
##END NTUPLES=NMR FID
##END=
