##TITLE=1H_IPACAT-33-2
 CDCl3
 8 sc, 
 4.10.2023
##JCAMPDX= 6.0         $$ Bruker NMR JCAMP-DX V2.0
##DATA TYPE= NMR FID
##DATA CLASS= NTUPLES
##ORIGIN= UXNMR, Bruker Analytische Messtechnik GmbH
##OWNER= root
$$ XWIN-NMR		Version 3.5
$$ Wed Oct  4 13:48:10 2023 Russian Standard Time (UT+4h)  she@DPX200
##.OBSERVE FREQUENCY= 200.13135
##.OBSERVE NUCLEUS= ^1H
##.DELAY= (6, 6)
##.ACQUISITION MODE= SIMULTANEOUS
##.ACQUISITION SCHEME= undefined
##.AVERAGES= 8
##.DIGITISER RES= 18
##SPECTROMETER/DATA SYSTEM= spect
##.PULSE SEQUENCE= zg30
##.SOLVENT NAME= D2O
##.SHIFT REFERENCE= (INTERNAL, D2O, 0, 15.7039)
##AUDIT TRAIL= $$ (NUMBER, WHEN, WHO, WHERE, WHAT)
$$ ##TITLE= Audit trail, XWIN-NMR		Version 3.5
$$ ##JCAMPDX= 5.01
$$ ##ORIGIN= Bruker BioSpin GmbH
$$ ##OWNER= she
$$ F:/spectra/data/she/nmr/H-F/1/audita.txt
$$ ##AUDIT TRAIL=  $$ (NUMBER, WHEN, WHO, WHERE, WHAT)
(   1,<2023-10-04 13:46:45.42 +0400>,<she>,<DPX200>,
      <created by zg, POWCHK disabled, PULCHK disabled
       configuration hash MD5:
       00 E9 B6 7A A2 85 ED C7 34 08 36 98 17 FE 4E 26
       data hash MD5: 16K
       69 D2 D6 43 E0 44 E8 9F 93 C2 CF 22 CE C6 2C 78>)
$$ ##END=
$$ 
$$ hash MD5
$$ B2 D2 1F 83 71 EF 19 26 85 9B 96 9F 06 C1 66 BD
##$RELAX= 
##$RELAX= 
##$RELAX= 
##$RELAX= 
##$RELAX= 
##$RELAX= 
$$ Bruker specific parameters
$$ --------------------------
##$DU= <F:/spectra>
##$EXPNO= 1
##$NAME= <H-F>
##$PROCNO= 1
##$TYPE= <nmr>
##$USER= <she>
##$AMP= (0..31)
100 100 100 100 100 100 100 100 100 100 100 100 100 100 100 100 100 100 
100 100 100 100 100 100 100 100 100 100 100 100 100 100 
##$AQSEQ= 0
##$AQ_mod= 1
##$AUNM= <au_zg>
##$AUTOPOS= <>
##$BF1= 200.13
##$BF2= 200.13
##$BF3= 200.13
##$BF4= 200.13
##$BF5= 200.13
##$BF6= 200.13
##$BF7= 200.13
##$BF8= 200.13
##$BYTORDA= 1
##$CFDGTYP= 0
##$CFRGTYP= 5
##$CHEMSTR= <none>
##$CNST= (0..31)
1 1 145 1 1 1 1 1 1 1 1 1 1 1 1 1 1 1 1 1 1 1 1 1 1 1 1 1 1 1 1 1 
##$CPDPRG= <>
##$CPDPRG1= <>
##$CPDPRG2= <>
##$CPDPRG3= <>
##$CPDPRG4= <mlev>
##$CPDPRG5= <mlev>
##$CPDPRG6= <mlev>
##$CPDPRG7= <mlev>
##$CPDPRG8= <mlev>
##$CPDPRGB= <>
##$CPDPRGT= <>
##$D= (0..31)
0 1.2 0 0 0 0 0 0 0 0.06 0 0.03 0 0 0 0 0.0002 0 0 0 0 0 0 0 0 0 0 0 0 
0 0 0 
##$DATE= 1696412804
##$DBL= (0..7)
120 120 120 120 120 120 120 120 
##$DBP= (0..7)
150 150 150 150 150 150 150 150 
##$DBP07= 0
##$DBPNAM0= <>
##$DBPNAM1= <>
##$DBPNAM2= <>
##$DBPNAM3= <>
##$DBPNAM4= <>
##$DBPNAM5= <>
##$DBPNAM6= <>
##$DBPNAM7= <>
##$DBPOAL= (0..7)
0.5 0.5 0.5 0.5 0.5 0.5 0.5 0.5 
##$DBPOFFS= (0..7)
0 0 0 0 0 0 0 0 
##$DE= 6
##$DECBNUC= <off>
##$DECIM= 32
##$DECNUC= <off>
##$DECSTAT= 4
##$DIGMOD= 1
##$DIGTYP= 9
##$DL= (0..7)
0 120 120 120 120 120 120 120 
##$DP= (0..7)
150 150 150 150 150 150 150 150 
##$DP07= 0
##$DPNAME0= <>
##$DPNAME1= <>
##$DPNAME2= <>
##$DPNAME3= <>
##$DPNAME4= <>
##$DPNAME5= <>
##$DPNAME6= <>
##$DPNAME7= <>
##$DPOAL= (0..7)
0.5 0.5 0.5 0.5 0.5 0.5 0.5 0.5 
##$DPOFFS= (0..7)
0 0 0 0 0 0 0 0 
##$DQDMODE= 0
##$DR= 18
##$DS= 0
##$DSLIST= <SSSSSSSSSSSSSSS>
$$ [...]
##$SUBNAM2= <"">
##$SUBNAM3= <"">
##$SUBNAM4= <"">
##$SUBNAM5= <"">
##$SUBNAM6= <"">
##$SUBNAM7= <"">
##$SUBNAM8= <"">
##$SUBNAM9= <"">
##$SW= 18.05172834244
##$SWIBOX= (0..15)
0 0 2 0 0 0 0 0 0 0 0 0 0 0 0 0 
##$SW_h= 3612.71676300578
##$TD= 16384
##$TD0= 1
##$TE= 0
##$TE2= 300
##$TE3= 300
##$TEG= 300
##$TL= (0..7)
0 120 120 120 120 120 120 120 
##$TP= (0..7)
150 150 150 150 150 150 150 150 
##$TP07= 0
##$TPNAME0= <>
##$TPNAME1= <>
##$TPNAME2= <>
##$TPNAME3= <>
##$TPNAME4= <>
##$TPNAME5= <>
##$TPNAME6= <>
##$TPNAME7= <>
##$TPOAL= (0..7)
0.5 0.5 0.5 0.5 0.5 0.5 0.5 0.5 
##$TPOFFS= (0..7)
0 0 0 0 0 0 0 0 
##$TUNHIN= 0
##$TUNHOUT= 0
##$TUNXOUT= 0
##$USERA1= <user>
##$USERA2= <user>
##$USERA3= <user>
##$USERA4= <user>
##$USERA5= <user>
##$V9= 5
##$VALIST= <valist>
##$VCLIST= <CCCCCCCCCCCCCCC>
##$VD= 0
##$VDLIST= <DDDDDDDDDDDDDDD>
##$VPLIST= <PPPPPPPPPPPPPPP>
##$VTLIST= <TTTTTTTTTTTTTTT>
##$WBST= 1024
##$WBSW= 4
##$XGAIN= (0..3)
0 0 0 0 
##$XL= 0
##$YL= 0
##$YMAX_a= 19785
##$YMIN_a= -26447
##$ZGOPTNS= <>
##$ZL1= 120
##$ZL2= 120
##$ZL3= 120
##$ZL4= 120
##$ABSF1= 10
##$ABSF2= 0
##$ABSG= 5
##$ABSL= 3
##$ALPHA= 0
##$AQORDER= 0
##$ASSFAC= 0
##$ASSFACI= 0
##$ASSFACX= 0
##$ASSWID= 0
##$AUNMP= <proc_1d>
##$AZFE= 0.1
##$AZFW= 0.1
##$BCFW= 1
##$BC_mod= 2
##$BYTORDP= 1
##$COROFFS= 0
##$CY= 11.3945322036743
##$DATMOD= 1
##$DC= 2
##$DFILT= <>
##$DTYPP= 0
##$F1P= 15.7292609196834
##$F2P= 12.9074282941183
##$FCOR= 0.5
##$FTSIZE= 0
##$FT_mod= 4
##$GAMMA= 1
##$GB= 0.15
##$INTBC= 1
##$INTSCL= 1
##$ISEN= 128
##$LB= 0.24
##$LEV0= 0
##$LPBIN= 0
##$MAXI= 10000
##$MC2= 0
##$MEAN= 0
##$ME_mod= 0
##$MI= 1.114404
##$NCOEF= 0
##$NC_proc= 0
##$NLEV= 6
##$NOISF1= 3.799351
##$NOISF2= 2.8
##$NSP= 1
##$NTH_PI= 0
##$NZP= 0
##$OFFSET= 15.70392
##$PC= 1
##$PHC0= -21710.25
##$PHC1= 12.65271
##$PH_mod= 1
##$PKNL= yes
##$PPARMOD= 0
##$PSCAL= 0
##$PSIGN= 0
##$REVERSE= no
##$SF= 200.130013532006
##$SI= 16384
##$SIGF1= 3
##$SIGF2= 2
##$SINO= 400
##$SIOLD= 16384
##$SREGLST= <1H.CDCl3>
##$SSB= 0
##$STSI= 0
##$STSR= 0
##$SW_p= 3612.71676300578
##$SYMM= 0
##$S_DEV= 0
##$TDeff= 0
##$TDoff= 0
##$TI= <>
##$TILT= no
##$TM1= 0
##$TM2= 0
##$TOPLEV= 0
##$USERP1= <user>
##$USERP2= <user>
##$USERP3= <user>
##$USERP4= <user>
##$USERP5= <user>
##$WDW= 1
##$XDIM= 8192
##$YMAX_p= 0
##$YMIN_p= 0
$$ End of Bruker specific parameters
$$ ---------------------------------
##NTUPLES= NMR FID
##VAR_NAME=  TIME,          FID/REAL,        FID/IMAG
##SYMBOL=    X,             R,               I
##VAR_TYPE=  INDEPENDENT,   DEPENDENT,       DEPENDENT
##VAR_FORM=  AFFN,          ASDF,            ASDF
##VAR_DIM=   8192,          8192,            8192
##UNITS=     SECONDS,       ARBITRARY UNITS, ARBITRARY UNITS
##FACTOR=    0.0002768,     1,               1
##FIRST=     0,             0,               0
##LAST=      2.2672688,     0,               0
##MIN=       0,             -26447,          0
##MAX=       2.2672688,     19785,           0
$$ Real data points
##PAGE= N=1
##DATA TABLE= (X++(R..R)), XYDATA
$$ plain form
0 0 0 0 0 0 0 0 0 0 0 0 0 0 0 0 0 0 0 0 0 0 0 0 0 0 0 0 0 -1 1 -2 4 -6 7 -7 7 -7 9 -9 10 -12 13 -15 16 -17 19 -20 22 -26
48 -26 28 -31 34 -37 40 -47 50 -56 65 -71 80 -92 104 -121 143 -174 217 -286 401 -644 1328 -5680
70 -5680 -25030 4637 16797 -4731 -5370 9957 5738 -1656 515 3204 7384 6583 -4264 -3752 8858
85 8858 4564 -8267 -2167 6633 -2201 -8975 -563 2929 -4207 -6266 -2476 -1702 -1653 -1109 -3754 -1813
101 -1813 3026 -1322 -4713 5244 7322 -4256 -1633 9137 3772 -2742 5054 6120 -1215 619 3474
116 3474 711 1963 1479 -4228 -1435 3456 -3592 -5476 1914 -949 -8179 -2192 2816 -3218 -4472
131 -4472 421 -772 -3120 453 2173 -300 764 2433 570 1867 4808 2189 -130 3284 3649
146 3649 -140 1504 3540 -789 -1792 1413 -433 -2209 211 -1782 -4622 -1021 -382 -4615 -2113
$$ packed form
0@%%%%%%%%%%%%%%%%%%%%%%%%%%%jKlOj0J3j4J4j4J6j8J9k2K5k8L1l3L6l9M2m8
48b6N4n9O5p1P7q7R7j06J21j36J51j72J96k25K64l17L91n03O87j045J972p008
70e680j9350K9667J2160k1528o39J5327m219p394K171K689M180q01j0847N12J2610
85H858m294j2831O100Q800q834o774Q412L492p136k059L790P74M9N44k645J941
101a813M839m348l391R957K078j1578K623J0770n365o514P796J066p335J834K855
116C474k763J252m84n707K793M891p048j884P390k863p230N987N008o034j254
131d472M893j193k348L573J720k473J064J669j863J297K941k619k319L414L65
146C649l789J644K036m329j003L205j846j776K420j993k840L601O39m233K502
$$ plain form
161 -2113 1284 -4089 -4256 2372 930 -3078 561 2481 -994 410 3490 1945 1286 2778 1281 1569
177 1569 3886 1669 -517 2106 2096 -2123 -559 2697 -739 -4088 -775 73 -3003 -2294 -176 -2508
193 -2508 -2977 -636 -1311 -1518 1009 -716 -2242 1295 2966 -791 806 3884 953 -366 3187 3383
209 3383 534 1481 1809 150 1173 1677 -904 -569 744 -1904 -3413 552 93 -4691 -2418 575
225 575 -2336 -3317 179 24 -2203 -623 616 207 1204 1042 -270 1634 3248 578 1020 3856 2070
242 2070 -851 1825 3492 -254 -505 1492 -135 -1914 -304 -638 -2230 -1417 -1353 -3095 -1301 -186
258 -186 -2552 -2620 604 -443 -2190 145 1748 -521 141 2197 1330 974 2437 1303 1027 2581 1686
275 1686 -12 1692 2250 -1139 -808 1770 -172 -2653 -159 -134 -2666 -2047 -443 -2124 -2370 -794 -1824
$$ packed form
161b113L397n373j67O628j442m008L639J920l475J404L080j545o59J492j497K88
177A569K317k217k186K623j0m219J564L256l436l349L313Q48l076P09K118k332
193b508m69K341o75k07K527j725j526L537J671l757J597L078k931j319L553J96
209C383k849R47L28j659J023N04k581L35J313k648j509L965m59m784K273K993
225E75k911r81L496j55k227J580J239m09R97j62j312J904J614k670M42K836j786
242B070k921K676J667l746k51J997j627j779J610l34j592Q13O4j742J794J115
258a86k366o8L224j047j747K335J603k269O62K056q67l56J463j134k76J554q95
275A686j698J704N58l389L31K578j942k481K494K5k532O19J604j681k46J576j030
$$ plain form
292 -1824 -1343 330 -766 -1460 1004 1134 -683 610 2873 761 199 2245 2309 571 1704 2278 258
309 258 649 1529 -65 -206 910 -878 -2020 -147 -650 -2312 -1737 -189 -2147 -2424 -499 -859 -1532
326 -1532 -58 -32 -946 548 1368 11 765 2032 915 330 2493 1904 -49 1464 2142 220 274 1587
344 1587 125 -1105 136 -325 -1645 -611 -723 -2411 -1509 -320 -1642 -2006 46 -773 -1915 493
360 493 546 -608 158 1664 213 648 2406 1315 898 2016 2049 268 1297 2068 62 -86 1026 -329
378 -329 -1367 192 -367 -1728 -1279 -546 -1850 -1753 -525 -1564 -1660 -365 -892 -1481 291 820 -724 132
396 132 1631 635 561 2082 1612 298 1544 2222 449 933 1597 -251 -253 927 -347 -1369 -15 -495
414 -495 -2007 -1376 -479 -1978 -2104 -600 -986 -1995 151 -56 -1265 -21 571 -342 405 1600 692 590
$$ packed form
292a824M81J673j096o94K464J30j817J293K263k112n62K046O4j738J133N74k020
309B58L91Q80j594j41J116j788j142J873n03j662N75J548j958k77J925l60o73
326a532J474K6r14J494Q20j357P54J267j117n85K163n89j953J513O78j922N4J313
344A587j462j230J241m61j320J034j12j688R02J189j322l64K052q19j142K408
360D93N3j154P66J506j451M35J758j091m17J118L3j781J029P71k006j48J112j355
378c29j038J559n59j361M49P33j304R7J228j039r6J295n27n89J772N29j544Q56
396A32J499r96p4J521m70j314J246O78j773M84O64j848kJ180j274j022J354m80
414d95j512O31Q97j499j26J504l86j009K146k07j209J244N92r13P47J195r08j02
$$ plain form
432 590 1977 1673 440 1642 1920 387 495 1376 485 -536 275 -85 -1158 -378 -537 -1642 -1370 -608
450 -608 -1893 -1799 -226 -855 -1968 -262 349 -953 -326 1135 238 413 1638 1043 656 1885 1429 648
468 648 1270 1605 304 713 1434 183 -725 171 -36 -1409 -950 -755 -1458 -1837 -896 -1260 -1443 -593 -948
487 -948 -1575 -8 507 -698 -158 1308 315 254 1626 1462 275 1348 1830 981 1098 1564 447 320
505 320 806 -81 -869 276 -389 -1597 -879 -190 -1812 -1579 -773 -1282 -1538 -527 -513 -953 -361 328 -211
524 -211 462 1559 411 434 1484 1410 616 1420 2047 797 656 1311 441 3 576 68 -1136 -546 -279
543 -279 -1520 -947 -77 -1420 -1961 -536 -676 -1628 -483 -154 -743 -341 767 381 173 1276 934 318
561 318 1719 1449 702 1242 1483 243 406 1023 196 -245 164 -46 -1000 -292 -318 -1343 -1363 -656 -1307 -1396
$$ packed form
432E90J387l04j233J202K78j533J08Q81q91j021Q11l60j073P80j59j105K72P62
450f08j285R4J573o29j113J706O11j302O27J461q97J75J225n95l87J229m56p81
468F48O22L35j301M09P21j251r08Q96k07j373M59J95p03l79R41l64j83Q50l55
487i48o27J567N15j205N40J466r93o1J372j64j187J073M82q49J17M66j117j27
505C20M86q87p88J145o65j208P18O89j622K33Q06n09k56J011J4m40N92O89n39
524b11O73J097j148K3J050p4p94Q04O27j250j41O55q70m38N73n08j204N90K67
543b79j241N73Q70j343n41J425j40r52J145L29n89M02J108l86k08J103l42o16
561C18J401k70p47N40K41j240J63O17q27m41M09k10r54P08k6j025k0P07o51q9
$$ plain form
581 -1396 -698 -625 -1374 -704 143 -471 -257 539 636 298 897 1109 909 1243 1221 711 1113 1480 353 327 1294
602 1294 163 -832 36 144 -985 -968 -674 -1466 -1661 -628 -1213 -1218 -835 -844 -1258 -136 368 -406 -169 825
622 825 393 395 1104 1417 687 1108 1205 908 911 1120 388 -4 792 273 -820 -45 151 -1423 -1020 -297 -1037
643 -1037 -1667 -777 -639 -1568 -774 -479 -811 -455 -165 -286 211 842 554 735 1182 1120 255 1247 1558 377
663 377 204 954 472 105 579 85 -471 -323 -329 -1191 -775 -737 -989 -1283 -693 -556 -1219 -494 -205 -781 -495
684 -495 589 610 365 800 705 544 1190 1606 560 1054 1383 440 228 916 825 -355 53 229 -835 -544
704 -544 -403 -793 -1144 -666 -1052 -1223 -356 -801 -1301 -568 81 -386 -228 473 228 102 811 887 585 1165 1302
725 1302 826 851 1306 546 81 773 314 -673 58 67 -861 -982 -281 -777 -1402 -1040 -864 -932 -792 -650 -831
$$ packed form
581a396O98P3p49O70Q47o14K14P96R7l38N99K12k00L34k2n10M02L67j127k6R67
602A294j131r95Q68J08j129J7K94p92j95J033n85nL83rm14J122N04p74K37R94
622H25m32KP09L13p30M21R7k97LK09p32l92P96n19j093P75J96j574M03P23p40
643a037o30Q90J38r29P94K95l32L56K90j21M97O31k88J81M47o2q65R92L11j181
663C77j73P50m82l67M74m94n56J48oq62M16L8k52k94N90J37o63P25K89n76K86
684d95J084K1k45M35r5j61O46M16j046M94L29r43k12O88r1j180M08J76j064K91
704e44J41l90l51M78l86j71Q67m45n00P33O49m67J58P01k45j26P09P6l02N80J37
725A302m76K5M55p60m65O92m59r87P31Rr28j21P01m96o25L62J76o8J40J42j81
$$ plain form
746 -831 -93 31 -453 -243 839 350 121 1253 1272 186 772 1487 947 611 792 746 282 280 303 -214 -143
767 -143 -233 -887 -935 -507 -1089 -1330 -609 -485 -1493 -651 40 -500 -663 149 -5 58 593 393 150 864 1145
788 1145 521 1160 1553 548 412 1250 764 17 -38 424 -170 -662 -369 -981 -767 -397 -1115 -866 -482 -773
808 -773 -1176 -432 -11 -505 -483 392 283 -125 605 1017 405 595 959 705 1106 1179 403 316 1031 407 -19
829 -19 -55 380 -394 -635 -271 -640 -876 -448 -501 -1061 -773 -546 -909 -589 -102 -322 -432 401 378 -42 848 1146
851 1146 583 825 1163 1044 551 816 714 377 626 355 -16 32 -146 -580 -592 -521 -772 -1218 -550 -573 -1184
872 -1184 -745 -661 -768 -570 -36 -346 -235 559 393 351 773 961 579 868 836 644 647 908 652 256 292 322
894 322 -186 -340 -508 -694 -866 -577 -720 -1033 -550 -778 -1069 -595 -165 -767 -603 185 -7 -78 457 617 328
$$ packed form
746h31P38J24m84K10J082m89k29J132J9j086N86P15n40l36J81m6m64kK3n17P1
767a43r0o54m8M28n82k41P21J24j008Q42O91n40j63Q12j54O3N35k00k43P14K81
788A145o24O39L93j005j36Q38m86p47n5M62n94m92K93o12K14L70p18K49L84k91
808g73m03P44M21m94K2Q75j09m08P30M12o12J90L64k54M01P3p76q7P15o24m26
829a9l6M35p74k41L64l69k36M28n3n60K88K27l63L20M87k20j10Q33k3m20Q90K98
851A146n63K42L38j19m93K65j02l37K49k71l71M8j78m34j2P1k51m46O68k3o11
872a184M39Q4j07J98N34l10J11P94j66m2M22J88l82K89l2j92LK61k56l96L6L0
894C22n08j54j68j86j72K89j43l13M83k28k91M74M30o02J64P88j92p1N35J60k89
$$ plain form
915 328 609 816 560 762 836 533 684 662 551 -6 435 92 -431 -390 -254 -399 -1062 -649 -669 -1100 -653 -582
937 -582 -811 -593 -249 -549 -246 52 -71 206 497 540 502 517 859 491 367 622 750 316 621 412 122
958 122 170 -4 -455 -402 -200 -830 -868 -464 -626 -895 -660 -228 -763 -658 -227 -288 -322 -27 258 408 699 689
980 689 567 576 919 564 822 963 517 463 639 527 -122 1 174 -251 -690 -465 -570 -784 -707 -650 -893 -577
1002 -577 -612 -711 -501 -201 -199 -316 131 302 245 332 907 441 409 899 668 534 810 556 121 386 165 -255
1024 -255 -161 -73 -414 -867 -370 -406 -951 -953 -532 -658 -671 -425 -486 -266 -105 21 181 412 421 198 583 893 328
1047 328 705 1049 725 416 649 606 241 161 217 -153 -316 -113 -487 -388 -203 -881 -914 -529 -633 -698 -766 -158
1069 -158 -734 -213 -259 106 117 295 411 329 772 1046 525 689 790 472 224 680 658 -120 -130 360 -197 -568
$$ packed form
915C28K81K07k56K02P4l03J51k2j11n57M41l43n23M1J36j45o63M13k0m31M47P1
937e82k29K18L44l00L03K98j23K77K91M3l8J5L42l68j24K55J28m34L05k09k90
958A22M8j74m51N3K02o30l8M04j62k69K35M32n35J05M31o1l4K95K85J50K91j0
980F89j22RL43l55K58J41m46n4J76j12o49J23J73m25m39K25j05k14P7N7k43L16
1002e77l5r9K10L00Kj17M47J71n7Q7N75m66l2M90k31j34K76k54m35K65k21m20
1024b55R4Q8l41m53M97l6n45kM21j26j3K46o1K20J61J26J60K31Rk23L85L10n65
1047C28L77L44l24l09K33m3l65q0N6l70j63K03l74R9J85o78l3L85j04o5o8O08
1069a58n76N21m6L65J1J78J16q2M43K74n21J64J01l18k48M56k2p78j0M90n57l71
$$ plain form
1091 -568 -721 -610 -359 -723 -662 -868 -489 -791 -856 -114 -243 -261 -189 -41 272 173 523 754 583 583 372 683
1113 683 699 694 512 272 473 407 63 -160 79 -298 -359 -359 -491 -984 -712 -714 -717 -566 -575 -652 -456 -289 -491 -208 561
1138 561 478 10 684 894 408 607 1108 861 358 526 666 476 268 -83 -33 -170 45 -283 -459 -396 -641
1159 -641 -833 -488 -493 -849 -683 -484 -391 -517 -89 50 -183 233 140 62 583 1036 564 341 746 768 135 451
1181 451 551 157 -166 222 -4 -119 -148 -180 -577 -225 -786 -580 -476 -612 -670 -480 -246 -609 -443 52 44 49
1203 49 268 667 307 359 775 681 616 782 740 327 516 176 386 -158 161 197 -466 -316 -239 -654 -469 -482 -829
1226 -829 -749 -332 -600 -434 -129 -150 -305 110 108 -53 21 603 338 482 550 542 551 902 717 454 168 435 373 -10
1250 -10 -185 -102 -196 -270 -716 -595 -491 -371 -632 -769 -131 -312 -716 -504 196 -307 173 295 118 128 186 202
$$ packed form
1091e68j53J11K51l64O1k06L79l02o5P42j29j8P2J48L13r9L50K31j71%k11L11
1113F83J6nj82k40K01o6l44k23K39l77o1%j32m93K72klJ51rp7J96J67k02K83P69
1138E61q3m68O74K10m86J99N01k47n03J68J40j90k08l51N0j37K15l28j76O3k45
1159f41j92L45nl56J66J99R3j26M28J39k33M16r3p8N21M53m72k23M05K2o33L16
1181D51J00l94l23L88k26j15k9l2l97L52n61K06J04j36n8J90K34l63J66M95qN
1203D9K19L99l60N2M16r4o5J66m2m13J89l40K10n44L19L6o63J50P7m15J85j3l47
1226h29Q0M17k68J66L05k1j55M15kj61P4N82k65J44O8qRL51j85k63k86K67o2l83
1250a0j75Q3r4p4m46J21J04J20k61j37O38j81m04K12P00n03M80J22j77J0N8J6
$$ plain form
1272 202 602 704 422 481 281 534 170 68 230 32 -151 257 -226 -148 -318 -452 -728 -583 -488 -460 -370 -486
1294 -486 -551 -317 -43 36 -126 222 323 529 428 487 929 377 293 721 693 466 561 546 384 320 60 -149 100
1317 100 -438 -782 -388 -526 -516 -751 -439 -522 -781 -583 -284 -427 -291 9 115 1 636 377 428 565 344
1338 344 506 612 553 167 561 515 420 161 -45 -23 -59 -344 -320 -488 -460 -428 -809 -540 -309 -550 -472 -521 -379
1361 -379 -176 -139 414 223 199 454 255 479 320 722 672 719 548 234 344 386 -8 1 511 -53 -468 -299
1383 -299 -495 -626 -339 -233 -482 -630 -509 -289 -337 -138 -138 24 135 114 72 -100 473 358 394 505 582 504 421
1406 421 593 260 160 274 18 -21 176 -29 -285 -109 -431 -576 -668 -203 -225 -551 -345 -335 -522 -222 -86
1427 -86 -48 222 292 119 278 389 572 113 747 689 336 200 663 381 261 -158 -78 -73 -168 19 -419 -189 -448
$$ packed form
1272B02M00J02k82N9k00K53l64j02J62j98j83M08m83P8j70j34k76J45R5K8R0j16
1294d86o5K34K74P9j62L48J01K06j01N9M42n52q4M28k8k27R5j5j62o4k60k09K49
1317A00n38l44L94j38J0k35L12q3k59J98K99j43J36L00J06j14O35k59N1J37k21
1338C44J62J06n9l86L94m6r5k59k06K2l6k85K4j68K8L2l81K69K31k41P8m9J42
1361c79K03L7N53j91k4K55j99K24j59M02n0M7j71l14J10M2l94RN10n64m15J69
1383b99j96j31K87J06k49j48J21K20m8J99%J62J11k1m2j72N73j15L6J11P7p8q3
1406D21J72l33j00J14k56l9J97k05k56J76l22j45r2M65k2l26K06J0j87L00J36
1427h6L8K70P0j73J59J11J83m59O34n8l53j36M63k82j20m19Q0Nr5J87m38K30k59
$$ plain form
1450 -448 -623 -244 -324 -761 -386 -315 -259 -249 -245 292 3 30 580 168 544 447 449 690 500 722 -22 416 808
1473 808 61 49 163 41 -127 -183 -282 -283 -306 -363 -548 -294 -529 -663 -491 25 -472 -95 -164 74 -28 108 437
1496 437 224 497 517 373 288 444 548 212 423 358 117 38 109 -119 -398 -89 -512 -367 -405 -545 -524 -863
1518 -863 -557 -441 -348 -199 -120 71 -96 167 74 323 357 144 212 392 752 449 412 349 438 406 419 67 93 -187
1542 -187 -106 -395 -304 -220 -353 -393 -427 -655 -606 -390 -188 -345 -252 -244 162 148 279 123 129 144 595 418 640 851
1566 851 158 174 535 333 373 313 123 -80 -2 -87 -411 -173 -229 -605 -685 -472 -233 -465 -369 -285 -346 -128 118
1589 118 -21 41 112 358 262 352 371 141 385 588 410 253 194 230 231 55 -126 -131 91 -112 -480 -335 -284 -504
1613 -504 -569 -313 -376 -346 -233 -213 -192 29 58 25 -31 125 167 433 317 506 250 655 252 376 448 410 212 102
$$ packed form
1450d48j75L79q0m37L75P1N6J0MN37k89K7N50m12L76r7KK41j90K22p44M38L92
1473H08p47j2J14j22j68n6r9jk3n7j85K54k35j34J72N16m97L77o9K38j02J36L29
1496D37k13K73K0j44q5J56J04l36K11o5k41p9P1k28k79L09m23J45l8j40K1l39
1518h63L06J16R3J49P9J91j67K63r3K49L4k13O8J80L60l03l7o3Q9l2J3l52K6k80
1542a87Q1k89R1Q4j33m0l4k28M9K16K02j57R3QM06j4J31j56OJ5M51j77K22K11
1566H51o93J6L61k02M0o0j90k03P8q5l24K38n6l76q0K13K39k32R6Q4o1K18K46
1589A18j39O2P1K46r6R0J9k30K44K03j78j57n9L6Jj76j81nK22k03l68J45N1k20
1613e04o5K56o3L0J13K0K1K21K9l3n6J56M2K66j16J89k56M05m03J24P2l8j98j10
$$ plain form
1637 102 201 45 -272 -244 -353 -447 -450 -234 -359 -280 -464 -370 -451 -353 -172 -155 -372 113 47 74 450 540 283 414
1661 414 326 577 655 139 374 123 341 68 77 292 178 -124 -228 -407 -653 -527 -365 -754 -421 -435 -245 -347
1683 -347 11 -145 67 -106 148 155 184 440 446 456 174 358 265 482 138 521 247 267 19 0 -22 3 -384 -138
1707 -138 -440 -407 -746 -414 -141 -75 -566 -41 -122 -32 -123 -256 8 -138 164 196 272 251 378 429 453 117 170 502
1731 502 77 155 -17 -156 -77 148 -179 -326 -217 -175 -348 -314 -299 -194 -184 -626 -131 -151 -120 226 240 -44 274
1754 274 353 274 278 504 886 489 92 213 181 220 365 -153 383 229 -150 -150 141 -537 -546 -519 -167 -467 -387 -585
1778 -585 -292 -281 -342 64 -49 205 200 53 321 397 138 586 266 500 288 215 385 441 -32 13 -55 -87 162
1801 162 -244 -346 -78 -359 -162 -313 -314 -579 -88 -248 -348 -561 -265 -236 -119 120 57 95 85 382 249 410
$$ packed form
1637A02R9j56l17K8j09r4lK16j25P9j84R4q1R8J81J7k17M85o6K7L76R0k57J31
1661D14q8K51P8n16K35k51K18k73RK15j14l02j04j79k46J26J62l89L33j4J90j02
1683c47L58j56K12j73K54PK9K56OJ0k82J84r3K17l44L83k74K0k48j9k2K5l87K46
1707a38l02L3l39L32K73O6m91N25q1R0r1j33K64j46L02L2P6k1J27N1K4l36N3L32
1731E02m25P8j72j39P9K25l27j47J09M2j73L4J5J05J0m42M95k0L1L46J4k84L18
1754B74P9p9MK26L82l97l97J21l2L9J45n18N36j54l79%K91o78rK7L52l00Q0j98
1778e85K93J1o1M06j13K54nj47K68P6k59M48l20K34k12p3J70N6m73M5o8l2K49
1801A62m06j02K68k81J97j51jk65M91j60j00k13K96K9J17K39o3L8j0K97j33J61
$$ plain form
1823 410 560 265 258 474 256 241 115 236 -265 -102 -231 -237 -233 -176 -488 -507 -424 -404 -506 -566 -364 -468 -268 13
1847 13 137 -149 154 43 -28 280 428 231 690 387 104 335 250 369 215 259 436 -185 -298 -138 -352
1868 -352 -313 -316 -292 -123 -310 -89 -299 -213 -191 -353 90 162 103 118 103 441 -37 481 378 341 246 237 414 411 222
1893 222 391 239 99 50 -178 -77 -364 -189 -253 -264 -303 -408 -306 -264 -77 -181 -285 -112 -133 -100 -42 248 57
1916 57 424 54 331 294 407 134 601 43 224 210 166 248 281 -134 -47 -302 -242 -341 -336 -225 -376 -542 -300 -217
1940 -217 -187 -70 -95 -213 -10 204 -38 126 198 324 162 534 474 541 288 463 164 156 280 -66 14 112 -25
1963 -25 -82 -169 -394 -135 -407 -229 -350 -119 -184 -136 -41 38 -180 -223 123 169 162 24 27 396 328 338 485 290 298 373
1989 373 265 274 -47 264 -100 28 -52 71 -321 -216 -131 -432 -344 -268 -303 -468 -72 -273 -66 34 192 179 53
$$ packed form
1823D10J50k95pK16k18j5j26J21n01J63j29oMN7l12j9Q3K0j02o0K02j04K00K81
1847A3J24k86L03j11p1L08J48j97M59l03k83K31q5J19j54M4J77o21j13J60k14
1868c52L9lK4J69j87K21k10Q6K2j62M43P2n9J5j5L38m78N18j03l7r5rJ77lj89
1893B22J69j52j40m9k28J01k87J75o4j1l9j05J02M2J87j04j04J73k1L3N8K90j91
1916E7L67l70K77l7J13k73M67n58J81j4m4Q2L3m15Q7k55O0r9NJ11j51j66K42Q3
1940b17L0J17k5j18K03K14k42J64P2J26j62L72o0O7k53J75k99qJ24l46Q0R8j37
1963b5n7q7k25K59k72J78j21K31o5M8R5P9k18m3L46M6pj38LL69o8J0J47j95QP5
1989C73j08Rl21L11l64J28q0J23l92J05Q5l01Q8P6l5j65L96k01K07J00J58j3j26
$$ plain form
2012 53 200 231 183 358 321 132 358 195 474 371 205 93 264 152 35 -301 -416 -152 -443 -401 -170 -226
2034 -226 -394 44 -426 -192 -71 31 -302 40 300 16 166 193 240 374 296 395 297 362 314 85 266 59
2056 59 261 88 86 -150 -4 -29 -163 -252 -399 -511 -547 -271 -432 136 -185 -201 3 -271 113 45 379 291 188
2079 188 116 576 314 278 197 194 334 126 255 13 138 -138 -171 -129 -93 -50 -75 -452 -135 -358 -296 -174 -298 -228
2103 -228 -49 -59 -219 -46 -170 31 393 178 315 80 156 49 91 243 258 240 52 128 58 42 -39 -156 -201
2126 -201 -310 -216 -415 -211 -62 -399 -125 -207 -137 -99 106 -55 -140 32 -203 98 393 25 224 376 302 119
2148 119 116 368 82 438 -30 -22 -88 -55 -164 -145 -189 -318 -354 -405 -345 -197 -469 -353 -247 -248 -114 78 95 -343 -41
2173 -41 94 171 100 260 475 337 444 226 143 209 324 226 207 -150 19 -149 -38 104 -150 -229 -95 -92 -532
$$ packed form
2012E3J47L1m8J75l7j89K26j63K79j03j66j12J71j12j17l36j15K64k91M2K31n6
2034b26j68M38m70K34J21J02l33L42K60k84J50K7M7J34p8R9r8O5m8k29J81k07
2056E9K02j73kk36J46k5j34q9j47j12l6K76j61N68l21j6K04k74L84o8L34q8j03
2079A88p2M60k62l6q1lJ40k08J29k42J25k76l3M2L6M3k5l77L17k23O2J22j24P0
2103b28J79j0j60J73j24K01L62k15J37k35P6j07M2J52J5j8j88P6p0j6q1j17m5
2126b01j09R4j99K04J49l37K74q2P0L8K05j61q5J72k35L01K95l68J99J52p4j83
2148A19lK52k86L56m68Qo6L3j09J9m4j29l6n1O0J48k72J16J06jJ34J92J7m38L02
2173d1J35P7p1J60K15j38J07k18q3O6J15r8j9l57J69j68J11J42k54p9J34Lm40
$$ plain form
2196 -532 -343 -247 103 -489 -336 -6 -86 -104 142 337 201 311 82 495 345 101 142 233 261 -35 286 257
2218 257 -22 -2 114 -293 36 -172 -43 -126 -428 -453 -130 -159 -242 -95 -412 -101 -107 46 -84 101 212 371
2240 371 81 551 256 262 106 101 162 361 226 269 510 34 63 76 13 -212 -191 -330 -305 -374 -312 -72 -199 74
2264 74 -275 154 -221 -132 -17 112 340 19 -60 275 165 323 205 267 308 140 143 52 125 -30 -29 -85 -131 -145 -416
2289 -416 -355 -282 -239 -331 130 -368 -317 -248 48 -83 120 37 105 167 59 611 122 291 156 388 254 365 73
2312 73 142 422 -100 64 235 -216 110 -142 -337 -122 -351 -308 -325 -236 -80 -248 -174 -141 -193 -168 -26 -140 54
2335 54 -156 332 80 276 372 331 184 139 35 61 166 -139 -102 -60 -188 -120 -265 -248 -200 -387 -313 41 -451 -327
2359 -327 -196 79 -192 270 -119 -198 179 263 269 189 347 338 139 98 191 147 98 159 -132 224 -34 22 -182 -309
$$ packed form
2196e32J89R6L50n92J53L30q0j8K46J95j36J10k29M13j50k44M1R1K8k96L21k9
2218B57k79K0J16m07L29k08J29q3l02k5L23k9q3J47l17L11oJ53j30J85J11J59
2240C71k90M70k95Oj56nO1J99j35M3K41m76K9J3o3k25K1j39K5o9O2K40j27K73
2264G4l49M29l75Q9J15J29K28l21p9L35j10J58j18O2M1j68Lr1P3j55Jn6m6j4k71
2289d16O1P3M3r2M61m98N1O9K96j31K03q3O8O2j08N52m89J69j35K32j34J11k92
2312G3O9K80n22J64J71m51L26k52j95K15k29M3j7Q9J56j68P4L3n2K5J42j14J94
2335E4k10M88k52J96R6m1j47m5j04K6J05l05L7M2j28O8j45J7M8j87P4L54m92J24
2359c27J31K75k71M62l89p9L77Q4Oq0J58rj99m1R3m4m9O1k91L56k58N6k04j27
$$ plain form
2383 -309 -303 -199 -206 -198 -397 -301 -138 -244 -425 -142 -184 -191 -141 -12 52 72 301 45 111 116 480 241 191 242 214 403
2409 403 363 -15 113 123 -101 -221 -55 37 -283 -156 -304 -89 -8 -40 -187 -319 -173 -97 -156 -34 -38 -30 347 189
2433 189 -9 135 200 316 22 95 149 401 85 172 -41 46 70 0 -262 59 -135 -333 -93 -27 -208 -277 -252
2456 -252 -185 -49 -80 -230 50 -4 -55 -257 223 221 116 -21 459 431 480 179 233 256 55 -55 79 101 38 -81
2480 -81 -96 -168 -71 -267 -234 -141 -315 -314 -108 -158 130 -103 -146 -116 164 33 -96 308 125 87 121 364 456 17 172
2505 172 31 113 80 120 -45 -51 -55 116 111 -135 -214 -299 -21 -457 -107 -333 -373 -35 -154 -80 -30 -229 -155 12 54
2530 54 138 175 167 84 99 274 174 173 116 -152 203 95 -250 -138 -106 -32 -192 -285 35 61 -98 -270 -221 -235 -293 -50
2556 -50 -145 -105 -84 15 101 210 153 276 311 259 210 306 276 139 148 57 97 199 171 -216 -184 -103 -166 -195 -49 -251 -228
$$ packed form
2383c09OJ04pQj99R6J63j06j81K83m2pN0J29O4K0K29k56O6NL64k39n0N1k8J89
2409D03m0l78J28J0k24j20J66R2l20J27j48K15Q1l2j47j32J46P6n9J22mQL77j58
2433A89j98J44O5J16k94P3N4K52l16Q7k13Q7K4p0k62L21j94j98K40O6j81o9K5
2456b52O7J36l1j50K80n4n1k02M80kj05j37M80k8M9l01N4K3k01j10J34K2o3j19
2480h1j5p2R7j96L3R3j74JK06n0K88k33m3L0K80j31j29M04j83l8L4K43R2m39J55
2505A72j41Q2l3M0j65omJ71nk46p9q5K78m36L50k26m0L38j19P4N0j99P4J67M2
2530E4Q4L7qq3J5J75j00jn7k68L55j08l45J12L2P4j60r3L20K6j59j72M9j4n8K43
2556e0r5M0K1R9Q6J09n7J23L5n2m9R6l0j37Rr1M0J02k8l87L2Q1o3k9J46k02K3
$$ plain form
2583 -228 19 -47 -135 -120 0 -71 -103 -180 -48 -103 -44 -8 -60 -75 237 104 177 94 131 -64 -30 126 208 90 112 -8
2609 -8 -186 217 -171 -307 -273 -196 -35 -365 98 -50 -66 -59 37 -150 -155 216 102 169 -120 144 -37 432 379 413
2633 413 -26 170 217 8 251 10 -3 -219 -44 148 -298 -100 -176 46 -253 -88 -111 -152 -94 -61 -35 -146 96
2656 96 -98 72 36 105 140 20 92 372 156 325 -86 103 216 23 -90 -47 35 105 42 66 -82 -255 -151
2679 -151 -153 96 -201 -139 -43 -57 39 190 -233 -94 -41 -26 126 72 224 245 16 547 323 210 206 246 57 -39 172
2704 172 -98 -79 2 150 -139 -257 -117 -162 -63 -217 -334 -165 -61 -40 -24 172 -68 110 257 192 56 147 -97
2727 -97 28 180 37 68 183 -123 -131 -122 113 -385 -118 276 100 -182 -144 -133 -216 -11 -424 -330 -207 -121 -187 -116
2751 -116 -28 -113 -375 187 157 -135 17 197 220 169 244 -95 194 31 73 -69 -133 -23 316 21 1 -125 -130 -277
$$ packed form
2583b28K47o6q8J5J20p1l2p7J32n5N9L6n2j5L12j33P3q3L7j95L4J56Q2j18K2j20
2609hj78M03l88j36L4P7J61l30M63j48j6PR6j87nL71j14O7k89K64j81M69n3L4
2633D13m39J96M7k09K43k41j3k16J75J92m46J98p6K22k99J65k3m1N8L3K6j11K42
2656I6j94J70l6O9L5j20P2K80k16J69m11J89J13j93j13M3Q2P0o3K4j48j73J04
2679a51kK49k97O2R6j4R6J51m23J39N3J5J52n4J52K1k29N31k24j13mM0j89r6K11
2704A72k70J9Q1J48k89j18J40m5R9j54j17J69J04K1J6J96k40J78J47o5j36R1k44
2727i7J25J52j43L1J15l06qRK35m98K67L94j76k82L8J1q3K05m13R4J23Q6o6P1
2751a16Q8q5k62N62l0k92J52J80K3n1P5l39K89j63M2j42o4J10L39k95k0j26nj47
$$ plain form
2775 -277 -260 -228 -189 -324 16 -317 -143 -156 -109 248 151 0 17 179 -44 187 56 262 218 193 547 334 236
2798 236 -47 69 -42 -96 -226 -48 -35 -404 -255 -192 -282 -142 -66 -447 -367 30 -165 46 68 -206 132 167 287
2821 287 44 -23 314 419 -52 170 238 151 159 -91 57 236 -182 -14 94 74 139 12 -6 -177 -136 -281 -69
2844 -69 -238 -136 -153 -322 0 -233 131 9 -5 45 213 27 8 150 334 227 16 159 28 -215 62 84
2866 84 72 -201 -168 -83 -442 -70 85 -189 -17 -8 -176 -98 -153 236 205 -130 57 -34 -151 -94 36 69 116 118 15
2891 15 380 290 -10 119 312 196 -49 -66 293 -255 -166 -118 34 -305 -153 -342 -32 -7 -61 -140 -243 -77 149
2914 149 -100 -61 56 348 78 118 78 -44 -77 125 -38 83 -134 228 -9 119 -8 -245 -120 -102 -113 -126
2936 -126 -68 -99 -269 18 -127 -224 -24 -230 191 -80 -101 232 -25 15 -100 -101 134 123 -254 95 281 -211 -26
$$ packed form
2775b77J7L2L9j35L40l33J74j3M7L57r7j51J7J62k23K31j31K06m4k5L54k13r8
2798B36k83J16j11n4j30J78J3l69J49O3r0J40P6l81Q0L97j95K11K2k74L38L5J20
2821B87k43o7L37J05m71K22O8q7Qk50J48J79m18J68J08k0O5j27j8j71M1j45K12
2844f9j69J02j7j69L22k33L64j22j4N0J68j86j9J42J84j07k11J43j31k43K77K2
2866H4j2k73L3Q5l59L72J55k74J72Rj68P8n5L89l1l35J87r1j17N7J30L3M7Kj03
2891A5L65r0l00J29J93j16k45j7L59n48Q9M8J52l39J52j89L10K5n4p9j03J66K26
2914A49k49L9J17K92k70M0m0j22l3K02j63J21k17L62k37J28j27k37J25J8j1j3
2936a26N8l1j70K87j45r7K00k06M21k71k1L33k57M0j15jK35j1l77L49J86m92J85
$$ plain form
2959 -26 85 72 1 -9 108 29 -8 -137 -204 -171 -203 -241 -313 -25 -240 -293 -283 -223 -49 15 -49 -221 118 131 15 100
2985 100 421 -6 286 59 233 32 42 79 38 17 12 66 -36 -38 58 -186 43 -46 0 7 -266 70 -146 238 139
3010 139 -55 250 68 208 -79 -1 166 322 291 298 218 -26 144 -57 -41 -102 182 196 -175 265 -36 92 54
3033 54 -105 52 -193 -275 -106 -36 -348 -138 113 68 189 -76 31 24 137 362 238 165 76 204 283 73 163
3056 163 -65 294 140 3 -158 214 175 -79 0 -345 -144 -166 46 6 -144 102 -99 -179 146 31 74 100
3078 100 195 14 22 118 -30 129 151 -22 264 -45 62 -6 -81 54 -86 -40 194 -111 -35 -178 -1 -352 -264
3101 -264 -235 -181 -50 -161 -63 -122 -127 -307 -54 142 39 50 249 133 102 10 -357 34 158 61 -50 64 -123
3124 -123 -51 280 -43 -390 -75 154 -23 -135 114 -20 -163 -174 -195 -171 -42 59 222 -208 213 -64 130
$$ packed form
2959b6J11j3p1j0J17p9l7j29o7L3l2l8p2K88k15n3J0O0J74O4o4j72L39J3j16Q5
2985A00L21m27K92k27J74k01J0L7m1k1nN4j02kR6k44K29q9M6Pk73L36k16L84r9
3010A39j94L05j82J40k87P8J67J56l1Pq0k44J70k01J6o1K84J4l71M40l01J28l8
3033E4j59J57k45q2J69P0l12K10K51m5J21k65J07pJ13K25j24p3q9J28P9k10R0
3056A63k28L59j54j37j61L72l9k54P9l45K01k2K12m0j50K46k01q0L25j15M3K6
3078A00R5j81QR6j48J59K2j73K86l09J07o8p5J35j40M6K34l05P6j43J77l51Q8
3101b64K9N4J31j11R8n9nj80K53J96j03J1J99j16l1r2l67L91J24r7j11J14j87
3124a23P2L31l23l47L15K29j77j12K49j34j43j1k1K4J29J01J63m30M21k77J94
$$ plain form
3145 130 35 133 -58 121 68 60 342 -39 15 89 26 -27 -47 133 267 -81 -259 45 -256 -119 -231 -117 -127 -232
3169 -232 20 48 -257 129 -200 -53 171 -88 199 162 74 140 148 31 84 178 71 10 140 -31 36 -10 198 138
3193 138 52 20 -210 -134 -242 -118 -199 -72 -376 2 -14 -24 111 -47 115 35 118 -91 196 264 79 -340 118
3216 118 195 35 108 85 5 -31 -190 -21 -58 83 -401 -67 -97 -71 -237 -177 -235 22 30 -50 -74 -190 122 87 35
3241 35 88 79 183 18 12 315 298 261 -81 72 -45 -141 -101 -35 -157 80 -51 -158 -132 -190 19 -48 -12 5 -192
3266 -192 -229 -116 -5 -72 -55 -40 305 216 170 175 -90 108 -65 55 84 34 254 201 383 155 111 -427 77 -11
3290 -11 77 27 199 -45 -83 -287 -69 -111 -213 24 -34 -99 11 -113 -118 89 33 21 256 57 108 -42 261 -52
3314 -52 141 27 -10 -124 -140 33 -260 -149 -59 37 -39 -276 -124 -211 -428 -296 -59 -252 -188 -26 4 -307 68
$$ packed form
3145A30r5R8j91J79n3qK82l81N4P4o3n3k0J80J34l48j78L04l01J37j12J14j0j05
3169b32K52K8l05L86l29J47K24k59K87l7q8O6Qj17N3R4j07o1J30j71O7m6K08o0
3193A38q6l2k30P6j08J24q1J27l04L78j6j0J35j58J62q0Q3k09K87O8j85m19M58
3216A18P7j60P3k3q0l6j59J69l7J41m84L34l0K6j66O0n8K57Qq0k4j16L12l5n2
3241C5N3rJ04j65oL03j7l7l42J53j17r6M0O6j22K37j31j07K6n8K09o7L6J7j97
3266a92l7J13J11o7J7J5L45q9m6Nk65J98j73J20K9n0K20n3J82k28m4n38N04q8
3290a1Q8n0J72k44l8k04K18m2j02K37n8o5J10j24nK07n6j2K35j99N1j50L03l13
3314e2J93j14l7j14j6J73k93J11R0R6p6k37J52q7k17J32K37j93O4J62L0l11L75
$$ plain form
3337 68 82 -18 129 13 255 293 -43 112 65 117 33 -324 -169 -163 -18 -63 -107 72 89 5 -22 -59 -256 86 27
3362 27 -353 -204 -60 -34 67 175 -317 -62 166 343 155 147 -52 41 59 50 243 87 87 82 -157 -126 -162 29 265
3387 265 -174 -167 -64 -328 30 -70 -418 -36 -99 -23 59 -97 52 89 -131 75 -116 -223 137 210 -45 34 121
3410 121 14 19 -4 235 -139 49 -199 -104 -60 -98 -228 32 221 72 -108 -24 -282 -67 -292 -120 24 21 -114
3433 -114 163 -155 333 226 171 137 -30 26 142 -78 237 74 -34 0 -110 54 14 -163 66 -139 42 -41
3455 -41 -135 -106 -97 158 51 -133 -319 99 -26 123 -262 149 -135 94 170 21 -80 124 103 124 123 -104 -82 57
3479 57 -146 83 -242 -172 15 13 -184 -166 42 -123 -42 -73 -24 -91 151 92 153 -82 -13 -147 -61 -61 -44 79 75 63
3505 63 87 -87 1 -31 124 10 -10 -13 -18 -134 2 -140 16 24 79 -109 -74 -318 185 129 -1 -301 -36 -143 125
$$ packed form
3337F8J4j00J47j16K42L8l36J55m7N2q4l57J55OJ45m5m4J79J7q4k7l7j97L42n9
3362B7l80J49J44K6J01J08m92K55K28J77j88qj99R3J8rJ93j56%nk39L1l6J91K36
3387B65m39PJ03k64L58j00l48L82o3P6Q2j56J49L7k20K06j91j07L60P3k55P9Q7
3410A21j07Nk3K39l74J88k48R5M4l8j30K60J89j49j80Q4k58K15k25J72J44lj35
3433a14K77l18M88j07n5l4j67N6J16k20L15j63j08L4j10J64m0j77K29k05J81q3
3455d1r4K9RK55j07j84j86M18j25J49l85M11k84K29P6j49j01K04k1K1jk27K2J39
3479E7k03K29l25P0J87kj97J8K08j65Q1l1M9o7K42n9O1k35O9j34Q6%J7J23mj2
3505F3K4j74Q8l2J55j14k0lnj16J36j42J56QN5j88L5k44N03n6j30l00K65j07K68
$$ plain form
3530 125 -52 -110 257 94 -118 -171 210 32 -49 180 91 229 236 106 -272 26 -65 -107 -141 -232 -94 125 -50
3553 -50 -13 34 -322 -191 -250 19 -111 181 113 242 -11 78 164 -83 51 -36 -158 -37 60 23 81 125 211 122 -218
3578 -218 -85 -261 -356 -208 127 -162 -77 262 -95 -208 -73 -75 41 -224 6 78 -89 -39 -64 123 22 403
3600 403 -30 363 -20 139 70 170 10 118 130 118 -167 -29 -39 -101 14 -73 -17 -255 -61 11 -130 -31 218
3623 218 -96 -21 74 -148 -9 -28 152 145 25 248 -9 198 125 -58 298 20 71 -218 241 -49 -25 49 -52
3646 -52 48 -184 47 10 76 -294 399 47 -63 223 -51 234 62 30 27 111 233 146 39 111 131 126 66 8 229
3671 229 101 178 117 87 -140 -6 -107 -73 75 -198 -229 -214 -59 -17 -36 37 -72 60 -26 -80 -52 40 -139 88
3695 88 96 10 7 15 200 62 186 207 287 -22 -1 -135 59 -149 -90 115 155 -2 -86 -240 -268 31 103 -38 -361
$$ packed form
3530A25j77n8L67j63k12n3L81j78q1K29q9J38Pj30l78K98r1m2l4r1J38K19j75
3553e0L7M7l56J31n9K69j30K92o8J29k53Q9Q6k47J34q7j22J21R7l7N8M4Q6q9l40
3578b18J33j76r5J48L35k89Q5L39l57j13J35kJ16k65K30P2j67N0k5J87j01L81
3600D03m33L93l83J59o9J00j60J08J2j2k85J38j0o2J15q7N6k38J94P2j41R9K49
3623B18l14P5R5k22J39j9J80pj20K23k57K07p3j83L56k78N1k89M59k90K4P4j01
3646e2J00k32K31l7O6l70O93l52j10K86k74K85j72l2lQ4J22q7j07P2K0no0n8K21
3671B29j28P7o1l0k27J34j01L4J48k73l1J5J55M2j9P3j09J32q6n4K8R2j79K27
3695H8Qq6lQJ85j38J24K1Q0l09K1j34J94k08N9K05M0j57q4j54k8K99P2j41l23
$$ plain form
3720 -361 -97 -36 97 -70 276 -55 239 -130 65 165 156 -14 6 43 169 134 34 -359 -79 -10 -140 -240
3742 -240 -162 -6 118 69 99 -7 -184 -160 184 -78 -94 151 -187 -92 104 61 -88 96 -11 -66 69 -77 269
3765 269 -43 -10 1 -177 173 -89 -131 -19 -47 -207 -274 -107 100 -269 -73 -176 -81 -238 -57 -89 145 -97
3787 -97 -372 133 188 -218 76 167 -73 81 141 340 356 -5 47 33 56 -17 213 -52 60 142 31 183 -180
3810 -180 89 -137 69 32 -151 1 78 -260 99 -117 270 246 242 131 238 199 -76 17 102 -61 55 116 60
3833 60 28 -41 74 -214 -161 -152 63 -119 150 -166 67 -145 1 -79 -104 9 -27 65 55 -158 61 115 209 30
3857 30 226 -122 211 -6 -197 -115 114 401 73 -257 -65 62 -20 53 95 -46 -264 -62 -67 -342 -232 -185 -144
3880 -144 -118 -124 25 106 -3 188 145 207 -303 -173 -13 32 122 141 -13 271 20 54 -14 -268 308 19 32 -49
$$ packed form
3720c61K64O1J33j67L46l31K94l69J95J00rj70K0L7J26l5j00l93K80O9j30j00
3742b40P8J56J24m9L0j06j77K4L44k62j6K45l38R5J96m3j49J84j07n5J35j46L46
3765B69l12L3J1j78L50k62m2J12k8j60o7J67K07l69J96j03R5j57J81l2K34k42
3787i7k75N05N5m06K94R1k40J54O0J99J6l61N2j4K3p3K30k65J12Q2j11J52l63
3810a80K69k26K06l7j83J52P7l38L59k16L87k4mj11J07l9k75R3Q5j63J16O1n6
3833F0l2o9J15k88N3RK15j82K69l16K33k12J46q0k5J13l6R2j0k13K19N4R4j79
3857C0J96l48L33k17j91Q2K29K87l28l30J92J27q2P3M2j41k18K02nk75J10M7M1
3880a44K6oJ49Q1j09J91m3O2n10J30J60M5R0J9j54K84k51L4o8k54N76k89J3q1
$$ plain form
3904 -49 200 -72 201 -176 120 -130 -188 137 -215 -107 -5 -103 -3 41 160 141 18 -3 99 -2 55 274
3926 274 326 169 24 -54 0 174 28 149 32 61 33 -204 35 -40 -58 -32 -162 -23 70 -150 54 165 -38
3949 -38 6 52 65 -244 -74 -17 79 77 303 78 125 271 -310 -5 -106 213 -358 -18 46 108 -97 62 -100 30
3973 30 -247 -306 -147 94 -59 -126 -127 194 64 48 -28 -45 53 225 149 96 -34 -7 140 247 123 141 147 187 33
3998 33 -161 -17 23 97 -176 -229 -265 -94 -28 -64 -45 -38 6 195 -157 -218 -25 -168 170 -60 -149 43 89 60 -108
4023 -108 221 96 11 95 290 208 423 118 77 59 202 143 -133 -121 118 -49 30 52 -217 131 -184 -30 18
4046 18 85 128 196 -17 -58 46 52 106 -117 -102 164 148 195 183 117 -21 -56 144 47 -108 144 122 -106 -176 -301 -106
4072 -106 33 223 50 238 -211 -4 -245 -112 19 82 -63 -167 82 -16 31 -92 65 36 -22 1 167 52
$$ packed form
3904d9K49k72K73l77K96k50n8L25l52J08J02r8J00M4J19j9j23k1J02j01N7K19
3926B74N2j57j45p8N4J74j46J21j17K9k8k37K39p5j8K6j30J39R3k20K04J11k03
3949c8M4M6J3l09J70N7R6kK26k25M7J46n81L05j01L19n71L40O4O2k05J59j62J30
3973C0k77n9J59K41j53o7jL21j30j6p6j7R8J72p6n3j30K7J47J07j24J8OM0j54
3998C3j94J44M0P4k73n3l6J71O6l6J9PM4J89l52o1J93j43L38k30q9J92M6k9j68
4023a08L29j25q5Q4J95q2K15l05m1j8J43n9k76J2K39j67P9K2k69L48l15J54M8
4046A8O7M3O8k13m1J04ON4k23J5K66j6M7j2o6j38l5K00r7j55K52k2k28p0j25J95
4072a06J39J90j73J88m49K07k41J33J31O3j45j04K49r8M7j23J57k9n8K3J66j15
$$ plain form
4094 52 67 38 25 46 -94 -98 115 187 75 -198 -209 -26 -21 114 62 -51 -58 4 171 -167 212 -170 5 -259 -73
4119 -73 107 162 -121 115 -25 285 41 -121 -87 10 57 -194 8 -179 112 -221 -273 -23 -82 7 -95 -25 27
4142 27 86 223 -252 48 114 -198 -8 228 60 5 -120 121 85 84 150 219 -180 78 130 -221 54 -53 -220
4165 -220 -155 81 -35 -138 -216 -245 -31 -214 41 79 12 -18 -178 37 14 -60 105 -37 316 76 104 54 -24 124
4189 124 150 186 94 -88 -201 -234 153 -123 46 52 22 92 98 67 -169 -84 102 71 -4 128 33 80 21 114 76 127 98
4216 98 13 -59 -28 35 59 -78 -109 -205 20 139 -93 -17 -203 -172 -37 225 -62 -84 107 -2 -71 167 -190 7
4240 7 -107 239 -58 -101 -17 -26 255 171 -136 -209 301 3 -167 46 191 80 -150 53 98 -73 175 -103 -149
4263 -149 7 -74 369 -30 79 -133 39 -50 -134 -9 358 89 -200 10 -12 155 64 -149 208 -21 -123 40
$$ packed form
4094E2J5k9j3K1j40mK13P2j12k73j1J83NJ35n2j13pO2J67l38L79l82J75k64J86
4119g3J80N5k83K36j40L10k44j62L4R7M7k51K02j87K91l33n2K50n9Q9j02P0N2
4142B7N9J37m75L00O6l12J90K36j68n5j25K41l6jO6O9l99K58N2l51K75j07j67
4165b20O5K36j16j03p8k9K14j83K55L8o7l0j60K15k3p4J65j42L53k40K8n0p8J48
4189A24K6L6r2j82j13l3L87k76J69Ol0P0Ol1k36Q5J86l1p5J32r5M7n9R3l8N1k9
4216I8q5p2L1O3K4j37l1r6K25J19k32P6j86L1J35K62k87k2J91j09o9K38l57J97
4240Gj14L46k97m3Q4rK81q4l07p3N10k98j70K13J45j11k30K03M5j71K48k78m6
4263a49J56q1M43l99J09k12J72q9q4J25L67k69k89K10k2J67r1k13L57k29j02J63
$$ plain form
4285 40 125 95 66 7 -104 -131 -126 89 46 -67 69 64 43 -191 -52 35 9 -74 -94 -133 -164 150 119 -159 24 101 147
4312 147 -39 106 66 142 -6 121 38 217 -94 -78 24 284 148 -87 -101 10 104 101 29 188 -238 -122 -108
4335 -108 318 56 -87 232 -18 59 -130 187 178 57 1 138 -72 -98 95 84 39 23 88 262 138 51 210
4358 210 -103 -267 -14 100 -58 -92 -91 -183 -36 286 32 188 61 -107 101 -119 -217 247 211 -95 188 325
4380 325 15 -305 -55 159 138 24 107 -123 -54 101 62 28 -272 35 36 86 49 -12 209 4 -90 193 -16 167
4404 167 -42 -470 59 149 -263 -40 -119 -78 104 -119 125 9 -102 87 -24 -19 -109 19 -8 -81 59 -74 -92
4427 -92 -61 -13 -216 50 141 -214 -45 -65 -223 -5 99 -20 290 41 -54 42 94 -60 68 176 189 90 394
4450 394 -90 -132 145 -48 -223 -68 -225 -297 134 -110 21 132 11 2 -173 -83 -80 56 -82 60 130 275 -37
$$ packed form
4285D0Q5l0k9n9j11k7NK15m3j13J36nk1k34J39Q7k6q3k0l9l1L14l1k78J83P7M6
4312A47j86J45m0P6j48J27q3J79l11J6J02K60j36k35j4J11R4lp2J59m26J16J4
4335a08M26k62j43L19k50P7j89L17rj21n6J37k10k6J93j1m5j6O5J74j24q7J59
4358B10l13j64K53J14j58l4Jr2J47L22k54J56j27j68K08k20r8M64l6l06K83J37
4380C25l10l20K50K14k1j14Q3k30O9J55l9l4l00L07JN0l7o1K21k05r4K83k09J83
4404A67k09m28N29R0m12K23p9M1J82k23K44j16j11J89j11Nr0J28k7p3J40j33j8
4427i2L1M8k03K66R1l55J69k0j58K18J04j19L10k49r5R6N2j54J28J08J3r9L04
4450C94m84m2K77j93j75J55j57p2M31k44J31J11j21rj75R0LJ36j38J42P0J45l12
$$ plain form
4473 -37 -28 93 -79 20 72 135 -179 132 -33 -201 -237 127 -95 130 -33 -252 16 -69 -130 -77 31 252 184 -151
4497 -151 57 44 -6 143 18 -73 -311 240 29 79 245 45 -132 -148 210 100 -60 153 86 -150 -210 -99
4519 -99 -2 -66 149 55 -50 97 143 -272 160 -31 1 -152 31 197 -53 -34 -362 -147 95 -160 -90 -77 81
4542 81 274 -83 -283 -11 181 -82 6 45 -86 174 -25 -54 213 19 84 -222 79 19 59 -146 264 137
4564 137 -15 56 -149 17 -89 97 -138 138 -203 -41 198 -125 77 169 -25 -263 24 28 -357 219 -115
4585 -115 -9 161 -9 53 53 81 37 152 63 49 231 2 162 -77 -67 -337 -116 -119 -198 -161 41 103 24 -122 0
4610 0 -167 -46 38 122 -28 177 74 -23 14 -39 219 -29 103 7 60 -30 70 72 67 -247 115 -26 -51 100 120
4635 120 168 152 -18 195 -2 108 65 13 147 -210 200 28 -276 -5 -331 -153 -50 11 -162 -26 -55 -54 92
$$ packed form
4473c7RJ21j72R9N2O3l14L11j65j68l6L64k22K25j63k19K68q5o1N3J08K21o8l35
4497a51K08j3n0J49j25r1k38N51k11N0J66k00j77j6L58j10j60K13o7k36o0J11
4519i9R7o4K15r4j05J47M6m15M32j91L2j53J83J66k50J9l28K15K42k55P0J3J58
4542H1J93l57k00K72J92k63Q8L9j31K60j99k9K67j94O5l06L01o0M0k05M10j27
4564A37j52P1k05J66j06J86k35K76l41J62K39l23K02R2j94k38K87Ml85N76l34
4585a15J06J70j70O2%K8m4J15q9j4J82k29J60k39J0k70K21lp9L7K02O2p9j46J22
4610@j67J21Q4Q4j50K05j03r7L7n3K58k48J32r6N3r0J00Knl14L62j41k5J51K0
4635A20M8j6j70K13j97J10m3n2J34l57M10j72l04K71l26J78J03O1j73J36k9JJ46
$$ plain form
4658 92 -81 284 120 -73 38 239 11 24 138 97 77 -4 111 -232 -28 -193 -33 130 15 31 -103 -23
4680 -23 -81 67 202 -37 -336 -25 -105 260 -122 43 55 -257 -124 -135 -155 23 110 -131 80 -15 19 -12 -225
4703 -225 119 -55 -116 156 -127 122 -125 -62 -84 -32 14 -152 -171 -69 -210 282 -37 62 149 20 236 113 61
4726 61 -65 -26 87 -99 115 5 36 -207 -140 61 -128 -57 129 93 -84 196 47 -174 -110 41 -220 -17
4748 -17 -49 112 -86 -22 -28 -58 59 -74 40 -173 268 -266 -69 -142 -162 -108 -93 -312 -135 38 -82 119 -16
4771 -16 120 112 -58 39 114 33 -186 -115 108 236 107 -79 92 136 -161 60 139 -86 -112 -323 79 -18 10 13 89
4796 89 96 141 269 -11 -109 96 59 70 -128 73 -22 199 -164 -51 -109 -43 6 122 133 171 -236 214 62 50 -86
4821 -86 132 99 13 39 -140 -168 -142 -117 -189 85 307 -12 43 57 104 325 -170 309 191 121 20 199 -27 -88
$$ packed form
4658I2j73L65j64j93J11K01k28J3J14m1k0q1J15l43K04j65J60J63j15J6j34Q0
4680b3n8J48J35k39k99L11q0L65l82J65J2l12J33j1k0J78Q7k41K11r5L4l1k13
4703b25L44j74o1K72k83K49k47O3k2N2M6j66j9J02j41M92l19R9Q7j29K16j23n2
4726F1j26L9J13j86K14j10L1k43O7K01j89P1J86l6j77K80j49k21O4J51k61K03
4748a7l2J61j98O4ol0J17j33J14k13M41n34J97p3k0N4J5k19J77J73j20K01j35
4771a6J36qj70R7P5q1k19P1K23J28j29j86J71M4k97K21P9k25k6k11M02r7K8LP6
4796H9PM5J28k80r8K05l7J1j98K01r5K21l63J13n8O6M9J16J1L8m07M50j52j2j36
4821h6K18l3q6K6j79k8K6K5p2K74K22l19N5J4M7K21m95M79j18p0j01J79k26o1
$$ plain form
4845 -88 16 -69 -2 -77 -203 -169 -389 -97 -98 -21 -96 -120 -112 -52 189 -156 -73 144 119 161 -123 -75 13 92 -19 88
4871 88 -31 1 -218 -5 -30 104 118 -68 166 -26 -379 75 -29 -103 -4 98 -78 -11 11 263 -88 -77 122
4894 122 5 -105 8 -201 -125 142 -288 290 -170 -35 -120 38 -76 23 39 111 -14 26 106 347 25 153
4916 153 48 155 -3 -137 87 75 102 181 379 144 93 -140 -203 -345 237 -11 -170 60 109 -83 395 72
4938 72 77 186 -135 78 39 39 -112 204 -105 -68 -51 -216 192 178 88 -6 208 111 202 -27 61 -18 69 100 -42 99
4964 99 169 199 -49 -25 -139 -219 -52 120 114 159 20 -24 -58 -15 35 320 -64 63 148 16 32 -161 119 53 -15
4989 -15 -306 -101 98 28 19 -42 191 7 94 94 81 123 -120 -46 207 135 91 -78 35 -73 249 23 -160 169
5013 169 -209 -63 73 84 54 39 -59 -262 55 -147 -28 12 135 1 189 32 5 131 29 93 116 20 -164
$$ packed form
4845h8J04q5O7p5j26L4k20K92jP7p5k4QO0K41l45Q3K17k5M2k84M8Q8P9j11J07
4871H8j19L2k19K13k5J34J4j86K34j92l53M54j04p4R9J02j76O7K2K52l51J1J99
4894A22j17j10J13k09P6K67m30N78m60J35q5J58j14R9J6P2j25M0Q0K41l22J28
4916A53j05J07j58j34K24j2K7P9J98k35n1k33o3j42N82k48j59K30M9j92M78l23
4938G2NJ09l21K13l9%j51L16l09L7J7j65M08j4r0r4K14r7R1k29Q8p9Q7L1j42J41
4964I9P0L0k48K4j14q0J67J72oM5j39m4l4M3N0K85l84J27Q5j32J6j93K80o6o8
4989a5k91K05J99p0ro1K33j84Q7%j3M2k43P4K53p2m4j69J13j08L22k26j83L29
5013A69l78J46J36J1l0j5r8k03L17k02J19M0J23j34J88j57k7J26j02O4K3r6j84
$$ plain form
5036 -164 38 -46 49 189 -345 -70 59 -81 -21 167 130 -248 -7 162 -14 82 145 190 -98 10 106 202 -205
5059 -205 70 -30 -116 -162 -5 -180 149 -9 -68 6 129 76 -96 174 -104 -196 52 -46 -339 -67 350 -156
5081 -156 221 -114 100 6 -182 161 195 191 -155 83 -47 -29 -128 -172 -201 186 -84 204 128 -271 -56 136 -5
5104 -5 -240 150 -99 -29 -8 -58 186 54 -2 -131 -100 267 -203 -114 -19 -26 -71 -82 -166 -20 191 5 20 -9 118
5129 118 129 -15 -30 159 -50 -152 28 -62 195 187 -183 10 -59 -30 -65 68 186 -35 168 209 124 -108 8
5152 8 -118 -243 226 163 -190 90 218 235 -108 -34 153 -153 324 -16 236 -56 -72 189 -151 -7 -23 -48 72
5175 72 260 8 183 -76 -196 70 -24 -15 144 133 -185 -8 27 -55 -169 4 -97 43 -223 238 45 41 -231
5198 -231 41 -25 76 -186 71 37 -221 175 112 -89 -94 -38 29 -10 49 32 58 165 160 55 61 42 -28 -160 -192 221
$$ packed form
5036a64K02q4R5J40n34K75J29j40O0J88l7l78K41J69j76R6O3M5k88J08R6R6m07
5059b05K75j00q6m6J57j75L29j58n9P4J23n3j72K70k78r2K48r8k93K72M17n06
5081a56L77l35K14r4j88L43L4ml46K38j30J8r9m4k9L87k70K88p6l99K15J92j41
5104ek35L90k49P0K1n0K44j32n6j29L1L67m70Q9R5pm5j1q4J46K11j86J5k9J27
5129A18J1j44j5J89k09j02J80r0K57ql70J93o9K9l5J33J18k21K03M1q5k32J16
5152Hj26j25M69o3l53K80J28J7l43P4J87l06M77l40K52k92j6K61l40J44j6k5J20
5175G2J88k52J75k59j20K66r4RJ59j1l18J77L5q2j14J73j01J40k66M61j93mk72
5198b31K72o6J01k62K57l4k58L96o3k01nN6O7l9N9j7K6J07nj05Oj9p0j32l2M13
$$ plain form
5224 221 271 -11 62 -115 163 60 -27 -80 -83 -167 -3 158 -6 65 -26 -82 -264 207 5 -91 141 -178 -165 92
5248 92 -70 190 66 -304 78 -23 -51 18 -134 -10 113 -30 66 35 173 139 -70 158 -39 -5 32 -16 87
5271 87 -266 20 292 -16 48 116 -56 -103 142 145 -124 -313 -90 -41 -78 65 -36 -4 -125 48 -10 -95 -88 62
5295 62 330 -120 246 132 -62 33 121 145 21 9 41 23 265 -101 -122 -8 262 -172 109 109 -20 176 -218
5318 -218 8 -17 -8 -80 -210 -257 -31 123 195 11 31 -195 -77 327 402 2 -90 88 0 0 223 -132 34 -63
5342 -63 -119 62 -115 127 -126 -13 -182 -284 -48 -201 44 -115 93 -116 -22 -95 -29 62 84 -226 -341 89
5364 89 36 -63 -211 -24 -67 -342 -92 204 101 -106 -213 69 84 -79 -53 125 71 -183 10 164 -20 63 244
5387 244 93 32 159 101 -204 34 -202 31 -73 166 201 -84 -110 307 -52 103 167 51 83 -4 -120 180
$$ packed form
5224B21N0k82P3j77K78j03q7n3lq4J64J61j64P1r1n6j82M71k02r6K32l19J3K57
5248I2j62K60j24l70L82j01k8O9j52J24J23j43R6l1J38l4k09K28j97L4L7m8J03
5271H7l53K86K72l08O4O8j72m7K45Lk69j89K23M9l7J43j01L2j21J73n8q5PJ50
5295F2K68m50L66j14j94R5Q8K4j24j2L2j8K42l66k1J14K70m34K81%j29J96l94
5318b18K26k5Rp2j30m7K26J54P2j84K0k26J18M04P5m00r2J78q8%K23l55J66r7
5342f3n6J81j77K42k53J13j69j02K36j53K45j59K08k09R4p3O6R1K2l10j15M30
5364H9n3r9j48J87m3k75K50K96j03k07j07K82J5j63K6J78n4k54J93J54j84Q3J81
5387B44j51o1J27n8l05K38k36K33j04K39L5k85k6M17l59J55O4j16L2q7j16L00
$$ plain form
5409 180 -27 128 207 -20 25 -133 34 121 -14 21 -7 17 -97 -109 -2 -47 152 -259 73 -14 49 66 92 44
5433 44 23 -29 116 165 -157 -71 -64 49 63 -161 -125 -37 189 -6 32 -292 353 -74 -107 -26 -84 -30 -50 -141 -127 -151
5459 -151 -101 -118 198 12 -164 -110 -89 56 -133 -178 -52 -141 -229 326 102 128 14 -104 -171 30 145 -246 134
5482 134 -41 26 -159 -35 30 -6 -179 301 103 -37 28 -160 89 -97 104 205 19 -80 8 -62 -19 91 156
5505 156 -211 26 -48 -176 142 -91 -72 -92 141 -58 21 157 58 -272 183 -164 -44 -165 -29 268 -3 -137
5527 -137 20 -104 -162 187 43 112 -202 174 67 -105 21 41 357 -122 -71 72 -80 81 -37 -164 222
5548 222 46 18 -7 40 32 -16 253 0 310 -50 32 16 -204 -40 83 36 116 -35 389 -16 -158 91 272
5571 272 74 -243 -3 6 94 140 148 8 -102 -21 342 245 -27 47 -29 -39 -30 -66 -115 -55 260 -140 -106 40 192 -54
$$ packed form
5409A80k07J55P9k27M5j58J67Q7j35L5k8K4j14j2J07m5J99m11L32q7O3J7K6m8
5433D4k1n2J45M9l22Q6PJ13J4k24L6Q8K26j95L8l24O45m27l3Q1n8N4k0r1J4k4
5459a51N0j7L16j86j76N4K1J45j89m5J26q9q8N55k24K6j14j18o7K01J15l91L80
5482A34j75O7j85J24O5l6j73M80j98j40O5j88K49j86K01J01j86r9Q8p0M3J10O5
5505A56l67K37p4j28L18k33J9k0K33j99P9J36r9l30M55l47J20j21J36K97k71j34
5527a37J57j24n8L49j44O9l14L76j07j72J26K0L16m79N1J43j52J61j18j27L86
5548B22j76k8k5M7qm8K69k53L10l60Q2j6k20J64J23m7Q0j51M24m05j42K49J81
5571B72j98l17K40RQ8M6Qj40j10Q1L63r7k72P4p6j0Rl6m9O0L15m00L4J46J52k46
$$ plain form
5597 -54 -140 -93 -200 123 79 43 -60 -192 275 -153 -114 -278 35 74 -215 77 27 -75 312 190 72 33 -47
5620 -47 175 -221 28 132 -24 226 128 -54 -330 -58 -136 -342 146 -145 98 -176 6 4 -118 -110 71 -147
5642 -147 21 -46 65 73 44 -2 -4 150 -76 146 57 39 -355 185 98 -35 -74 245 -61 156 -1 140 11 -81
5666 -81 -55 136 -84 57 168 -112 95 57 -49 155 159 157 -52 274 -24 -184 100 202 -149 -2 218 155 192
5689 192 54 126 -39 -277 -44 104 8 168 -132 199 -125 -199 -242 86 183 142 43 -131 48 364 -18 0 -119
5712 -119 -70 -182 -137 33 -51 58 142 -60 -217 -189 -39 31 67 -119 -83 -156 28 -28 190 -206 135 38 65 259
5736 259 23 -129 74 -243 14 10 -57 28 124 162 76 -13 95 44 -194 -5 137 53 -45 87 164 -9 -78 -93 8
5761 8 -80 97 -226 107 35 -123 124 -118 109 117 -102 44 -195 -77 -241 -3 264 -171 -115 -53 -23 -261 -26
$$ packed form
5597e4q6M7j07L23m4l6j03j32M67m28L9j64L13L9k89K92n0j02L87j22j18l9q0
5620d7K22l96K49J04j56K50r8j82k76K72p8k06M88k91K43k74J82kj22QJ81k18
5642a47J68o7J11Qk9m6kJ54k26K22q9j8l94N40q7j33l9L19l06K17j57J41j29r2
5666h1K6J91k20J41J11k80K07l8j06K04Mkk09L26k98j60K84J02l51J47K20o3L7
5689A92j38P2j65k38K33J48r6J60l00L31l24p4m3L28R7m1r9j74J79L16l82J8j19
5712a19M9j12M5J70q4J09Q4k02j57K8J50P0L6j86L6p3J84n6K18l96L41r7K7J94
5736B59k36j52K03l17K57mo7Q5R6L8q6q9J08n1k38J89J42q4r8J32P7j73o9j5J01
5761Hq8J77l23L33p2j58K47k42K27Qk19J46k39J18j64K38K67m35N6O2L0k38K35
$$ plain form
5784 -26 73 106 -94 -125 118 -105 40 32 87 -129 -191 -68 -61 24 299 -200 205 -35 -36 -129 20 -81 29 37 -104
5809 -104 96 21 -98 54 -164 -66 -116 -164 83 -53 185 -40 -251 -183 -50 161 -39 -52 -42 -16 -46 -324 189
5832 189 -79 140 145 -349 -137 74 27 84 -37 31 43 12 61 -125 -19 -93 -15 -7 74 179 -126 -172 173 -251 31
5857 31 11 -180 -252 -25 130 136 4 -100 73 168 11 175 -111 -142 -29 0 141 -171 -1 -234 -63 45 -142
5880 -142 -98 -43 133 -76 27 -17 -1 150 -52 18 72 -45 -71 -188 63 132 1 -271 3 9 -255 -63 -170
5903 -170 -112 -74 -226 64 130 -258 -68 -257 -20 61 -44 -57 -182 -152 -38 100 112 -200 -102 142 24 -62 29
5926 29 85 54 -100 -176 124 -12 150 -222 -261 167 36 -129 -141 -71 -25 120 21 -71 65 16 54 27 90 -39 72
5951 72 -111 -88 -80 69 -25 146 31 -143 4 -19 -12 16 13 135 22 46 -224 172 153 -238 -4 123 -130 188
$$ packed form
5784b6R9L3k00l1K43k23J45qN5k16o2J23PQ5K75m99M05k40jr3J49j01J10Qj41
5809a04K00p5j19J52k18R8n0m8K47j36K38k25k11O8J33K11k00j3J0K6l0k78N13
5832A89k68K19Nm94K12K11m7N7j21O8J2l1M9j86J06p4P8QQ1J05l05m6L45m24K82
5857C1k0j91p2K27J55Oj32j04J73R5j57J64k86l1J13K9J41l12J70k33J71J08j87
5880a42M4N5J76k09J03m4J6J51k02P0N4j17k6j17K51O9j31k72K74Ok64J92j07
5903a70N8L8j52K90O6l88J90j89K37Q1j05j3j25L0J14J38J2l12R8K44j18q6R1
5926B9N6l1j54p6L00j36J62l72l9M28j31j65j2P0M6J45r9r2J36m9L8k7O3j29J11
5951G2j83K3QJ49r4J71j15j74J47k3PK8lJ22j13K4k70L96j9l91K34J27k53L18
$$ plain form
5975 188 -74 -50 302 -180 -47 -198 67 120 170 -28 -105 -7 33 -4 114 -132 170 -45 91 -192 -41 218
5997 218 -61 -21 -126 -82 35 -5 -68 40 37 -46 -81 106 -166 -44 100 14 112 -180 37 361 68 43 105 -62
6021 -62 -31 7 -120 -325 -177 -44 -148 66 44 -44 -49 135 163 -5 73 -42 58 -144 8 -93 -113 72 -62
6044 -62 102 152 85 -5 -26 -103 42 -106 180 -138 -275 154 112 -162 27 142 83 -64 -164 111 -61 116 -22
6067 -22 65 184 232 -83 -133 163 118 -24 -15 -2 26 -65 -47 60 249 -80 61 174 -184 141 -130 199 135 -85
6091 -85 85 62 -29 138 -53 -8 10 -12 199 -46 -70 97 16 225 101 -141 -24 85 20 -58 -81 -81 108 131 21
6116 21 242 20 79 97 138 -31 -64 67 -225 221 -136 213 5 -228 -168 0 -41 313 12 -3 93 -106 -35
6139 -35 -42 52 -67 185 -29 -36 34 110 -281 -56 119 -41 -145 171 181 -246 -87 -128 156 -266 245 123 -120
$$ packed form
5975A88k62K4L52m82J33j51K65N3N0j98p7R8M0l7J18k46L02k15J36k83J51K59
5997B18k79M0j05M4J17m0o3J08lq3l5J87k72J22J44q6R8k92K17L24k93k5O2j67
6021f2L1L8j27k05J48J33j04K14k2q8nJ84K8j68P8j15J00k02J52j01k0J85j34
6044f2J64N0o7r0k1p7J45j48K86l18j37M29m2k74J89J15n9j47j00K75j72J77j38
6067b2Q7J19M8l15n0K96m5j42RJ3K8r1J8J07J89l29J41J13l58L25k71L29o4k20
6091h5J70k3r1J67j91M5J8k2K11k45k4J67q1K09j24k42J17J09o5p8k3%J89K3j10
6116B1K21k22N9J8M1j69l3J31k92M46l57L49k08k33O0J68m1L54l01j5R6j99P1
6139c5pR4j19K52k14pP0P6l91K25J75j60j04L16J0m27J59m1K84m22N11j22k43
$$ plain form
6162 -120 -54 -76 32 31 81 57 216 -128 -2 -57 88 -20 -177 26 -275 204 -16 -29 53 66 117 254 -58 92
6186 92 152 -140 44 187 -3 182 -102 -107 188 -6 -42 -52 -280 40 -99 52 44 -234 17 -78 -40 -50 -56 -216
6210 -216 -155 28 210 98 152 -48 -119 65 -12 -100 103 67 4 198 -76 -147 -10 -167 12 55 72 129 -19 -61
6234 -61 135 -94 147 -119 141 -15 0 90 -89 60 -19 -237 -277 -17 84 63 -118 -2 -152 -36 -97 -3 -3
6257 -3 -75 -9 24 -61 -51 32 -179 -28 -88 -15 -97 51 168 -32 153 -156 152 61 128 168 0 155 -94 24 62
6282 62 -100 199 -72 78 22 141 -167 -93 -278 53 -170 126 89 194 219 -245 195 119 42 -117 96 -142
6304 -142 23 -200 122 -42 -75 246 -11 -250 151 -109 -118 -87 -37 150 -213 -43 -73 253 385 72 226 50
6326 50 84 10 73 -79 -144 245 1 -132 129 -99 29 75 -219 49 -35 -100 -96 65 -5 -3 157 230 -116 19 -29
$$ packed form
6162a20O6k2J08jN0k4J59l44J26n5J45j08j57K03l01M79k20j3Q2J3N1J37l12J50
6186I2O0k92J84J43j90J85k84nK95j94l6j0k28L20j39J51qk78K51r5L8j0oj60
6210b16O1J83J82j12N4k00p1J84p7q8K03l6o3J94k74p1J37j57J79M3J7N7j48m2
6234f1J96k29K41k66K60j56J5R0j79J49p9k18m0K60J01k1j81J16j50J16o1R4%
6257cp2O6L3q5J0Q3k11J51o0P3q2J48J17k00J85l09L08r1O7M0j68J55k49J18L8
6282F2j62K99k71J50n6J19l08P4j85L31k23K96l7J05K5m64M40p6p7j59K13k38
6304a42J65k23L22j64l3L21k57k39M01k60rL1N0J87l63J70l0L26J32l13J54j76
6326E0L4p4O3j52o5L89k44j33K61k28J28M6k94K68q4o5MJ61p0KJ60P3l46J35m8
$$ plain form
6351 -29 218 111 -110 -59 102 14 28 10 -224 -142 75 -136 -148 -64 215 138 -42 80 -59 -61 -242 165 -53 228
6375 228 -298 114 -61 -199 -86 -3 -71 -33 161 -69 203 221 133 53 254 32 238 76 270 167 -164 170
6397 170 -11 -81 -37 -209 174 -191 -48 -40 78 13 -32 -131 101 -59 -13 69 -197 -91 21 -103 -34 202 -47
6420 -47 -45 176 -198 -159 -54 -116 -152 12 45 20 152 -62 117 -15 29 1 32 -19 54 264 172 -136 29 -42 -5
6445 -5 4 200 -193 161 6 -25 46 -250 -33 -124 -198 -204 -145 -77 -162 -87 -68 81 168 -114 -107 -191 213 -38 -31 3 -175
6472 -175 -19 84 38 155 -46 300 78 -26 61 -159 -145 123 -363 23 74 -54 88 349 -173 -262 -176 -9
6494 -9 -113 93 47 -307 55 -88 -12 222 -91 193 217 182 11 -41 66 107 49 -48 1 126 -285 153 161 -276
6518 -276 105 -139 -236 15 272 -17 40 -68 -31 -10 -130 152 198 -1 175 -57 -159 297 -62 -124 27 7
$$ packed form
6351b9K47j07k21N1J61q8J4j8k34Q2K17k11j2Q4K79p7j80J22j39kj81M07k18K81
6375B28n26M12j75j38J13Q3o8L8J94k30K72J8q8q0K01k22K06j62J94j03l31L34
6397A70j81p0M4j72L83l65J43QJ18o5m5r9K32j60M6Q2k66J06J12j24O9K36k49
6420d7KK21l74L9J05o2l6J64L3k5J32k14J79j32M4k8L1n1P3K10r2l08J65p1L7
6445eRJ96l93L54j55l1P1k96K17r1p4oN9O8q5P5J9J49Q7k82Pq4M04k51PL4j78
6472a75J56J03m6J17k01L46k22j04Q7k20J4K68m86L86N1j28J42K61n22q9Q6J67
6494ij04K06m6l54L62j43P6K34l13K84K4l5j71n2J07M1n8r7M9J25m11M38Qm37
6518b76L81k44r7K51K57k89N7j08L7K1j20K82M6j99J76k32j02M56l59o2J51k0
$$ plain form
6540 7 106 195 127 226 -120 -106 -64 -68 163 -141 29 44 135 223 -138 -25 135 -109 -202 184 -135 198 -62 -269 44
6565 44 62 7 -82 -87 82 37 17 296 -23 -147 279 79 -201 -4 -105 -131 -36 -49 -101 171 44 77 148 48 163
6590 163 -49 230 55 -202 -112 101 -46 -57 63 38 -122 184 148 -242 183 -93 278 192 27 -292 124 175
6612 175 110 -155 19 218 46 108 8 -2 -393 40 -87 31 134 -283 -85 -141 -111 67 -152 -93 72 2
6634 2 82 118 294 2 -23 -27 -43 146 246 8 227 108 304 -151 -11 115 198 -78 106 56 353 60 59 125
6658 125 45 -29 280 -104 -61 26 -5 -73 32 110 -60 -27 -92 109 -147 -110 -128 107 0 26 -155 -64 -46 -71 99
6683 99 -106 113 -65 -35 98 -13 -48 -204 -134 249 -102 -1 53 -158 -73 21 57 -15 32 -194 -8 -67 -63 -93 -83
6708 -83 -175 -8 2 31 -64 -116 -83 -141 -50 -55 -217 2 -118 -206 65 123 171 184 -143 -72 35 -78 86 -126 52
$$ packed form
6540GR9Q9o8R9l46J4M2mK31l04J70J5R1Q8l61J13J60k44r3L86l19L33k60k07L13
6565D4J8n5q9nJ69m5k0K79l19j24M26k00k80J97j01k6R5j3n2K72j27L3P1j00J15
6590A63k12K79j75k57R0K13j47j1J20k5j60L06l6l90M25k76L71q6j65l19M16N1
6612A75o5k65J74J99j72O2j00j0l91M33j27J18J03m17J98n6L0J78k19N9J65p0
6634BQ0L6J76k92k5mj6J89J00k38K19j19J96m55J40J26Q3k76J84n0K97k93jO6
6658A25q0p4L09l84M3Q7l1o8J05P8j70L3o5K01k56L7j8K35j07K6j81R1J8k5J70
6683I9k05K19j78L0J33j11l5j56P0L83l51J01N4k11Q5R4L6p2M7k26J86n9Ml0J0
6708h3r2J67J0K9r5n2L3n8R1nj62K19j20q8K71N8M8J3l27P1J07j13J64k12J78
$$ plain form
6733 52 132 118 -45 -22 -9 31 -246 19 -54 -4 -67 -162 -160 108 -230 -78 -29 82 75 232 177 36 -43 124 109 33
6759 33 59 -144 -97 152 32 17 -187 59 50 139 263 -118 -294 2 79 70 -134 48 -129 196 -241 -86 -76 37
6783 37 99 12 72 -127 23 118 -54 4 57 -78 65 -238 -137 -8 179 22 -139 181 -176 114 18 176 -93
6806 -93 -415 -42 22 -5 -88 16 41 -81 -100 -131 96 127 -344 -49 -106 108 296 -345 -174 0 -107 -89 -126 79
6830 79 38 -29 48 -28 -53 218 1 82 114 -195 -80 89 87 7 70 -80 186 -57 -92 -37 -238 -69 -138 331 56
6855 56 52 -91 139 136 -106 55 269 -76 -107 -53 36 -111 -64 94 -237 -175 -60 -131 -41 -65 111 -167 27 -97
6879 -97 -348 3 -1 75 83 -83 36 45 80 -80 84 188 -88 -94 -83 41 -41 -172 210 -67 -169 61 94 258 -66
6904 -66 -96 -162 -116 111 68 -31 -183 201 110 26 85 -271 -54 -120 -198 -33 -204 -51 -165 -35 -2 -18 -157 -97 -83
$$ packed form
6733E2Q0j4j63K3J3M0k77K65p3N0o3r5KK68l38J52M9J11pJ57n5j41p9J67j5p6
6759C3K6k03M7K49j20j5k04K46rQ9J24l81j76K96P7rk04J82j77L25m37J55J0J13
6783C7O2q7O0j99J50R5j72N8N3j35J43l03J01J29J87j57j61L20l57K90r6J58k69
6806i3l22L73O4k7q3J04K5j22j9l1K27L1m71K95n7K14J88o41J71J74j07J8l7K05
6830G9m1o7P7p6k5K71k17Q1L2l09J15J69kq0O3j50K66k43l5N5k01J69o9M69k75
6855E6mj43K30lk42J61K14l45l1N4Q9j47M7J58l31O2J15p1R0k4J76k78J94j24
6879i7k51L51mP6Qj66J19RL5j60J64J04k76oJ1J24q2j31L82k77j02K30L3J64l24
6904f6l0o6M6K27m3r9j52L84r1q4N9l56K17o6p8J65j71J53j14J30L3j6j39O0J4
$$ plain form
6929 -83 55 226 124 -206 -116 -152 2 -87 33 -10 105 -153 4 -32 32 -83 -78 62 3 -229 -107 29 -69 -151
6953 -151 15 199 -20 -151 -85 -42 -96 -173 -8 131 -126 -38 163 58 109 18 -136 -40 40 52 -67 81 119 228
6977 228 69 -25 17 314 -228 231 -18 -45 -165 -7 52 -108 -290 -129 -21 336 340 -124 -159 -139 264 332 -51
7000 -51 58 100 292 -16 23 -64 -155 -210 -15 67 -35 51 103 -30 -108 -92 -83 69 -73 35 -110 18 -86 65
7024 65 56 -195 9 70 -16 282 -29 -92 4 66 -31 237 -85 -53 195 -83 -266 51 116 3 109 111 39 93 150
7049 150 -1 71 -36 -89 130 -56 156 9 -18 -57 -45 85 -65 1 137 157 199 -6 -73 127 -63 -177 16
7072 16 193 -7 -190 -138 64 321 125 -33 25 92 84 -87 -196 -42 67 -218 56 -4 -157 -30 -231 -162 -40
7095 -40 154 -118 -74 129 -59 112 -204 -195 -66 -136 -68 -103 -256 -204 -32 3 186 53 158 -195 -230 125 -55
$$ packed form
6929h3J38J71j02l30R0l6J54q9J20m3J15k58J57l6O4j15NJ40n9k32J22J36r8q2
6953a51J66J84k19j31O6M3n4p7J65J39k57Q8K01j05N1r1j54R6Q0J2j19J48L8J09
6977B28j59r4M2K97n42M59k49k7j20J58N9j60j82J61J08L57Mm64l5K0M03O8l83
7000e1J09M2J92l08L9q7r1n5J95Q2j02Q6N2j33p8J6RJ52j42J08j45J28j04J51
7024F5rk51K04O1q6K98l11o3R6O2r7K68l22L2K48k78j83L17O5j13J06Kp2N4N7
7049A50j51P2j07n3K19j86K12j47k7l9J2J30j50O6J36K0M2k05o7K00j90j14J93
7072A6J77k00j83N2K02K57j96j58N8O7qj71j09J54J09k85K74o0j53J27k01O9J22
7095d0J94k72M4K03j88J71l16RJ29p0O8l5j53N2J72L5J83j33J05l53l5L55j80
$$ plain form
7118 -55 153 -133 -214 23 -52 5 -105 -57 -68 -28 59 -39 -97 72 269 74 27 -95 109 17 2 217 77 -3 -164
7143 -164 -53 -339 -14 -303 -61 -14 115 110 -195 -143 -172 77 164 163 -113 163 -32 -19 -68 156 -62 -101 -201 85
7167 85 101 -3 -177 107 -157 -67 34 257 -99 25 186 -108 -114 -142 25 -114 -80 -265 19 -103 -24 27 220
7190 220 -134 -142 118 153 -50 112 267 32 183 140 -26 210 -204 -80 -139 -106 83 -179 14 140 26 237
7212 237 217 113 -136 -31 -21 39 89 83 334 -145 -191 -109 45 -366 -27 57 -92 -55 90 -85 49 98 -283 -95
7236 -95 -23 50 22 134 56 -28 39 116 171 133 -31 -133 326 25 151 -64 -20 210 -165 264 30 76 -39 -132
7260 -132 131 -32 -78 -77 -256 -21 33 -12 -308 69 33 -5 115 -60 97 113 -85 150 107 -164 85 9 -72 83
7284 83 -27 2 -34 192 255 51 -31 41 257 -256 42 102 174 -190 174 40 -117 -75 -59 195 -29 134 208 208
$$ packed form
7118e5K08k86q1K37p5N7j10M8j1M0Q7r8n8J69J97j95m7j22K04r2j5K15j40q0j61
7143a64J11k86L25k89K42M7J29nl05N2k9K49Q7jk76K76j95J3m9K24k18l9j00K86
7167H5J6j04j74K84k64R0J01K23l56J24J61k94ok8J67j39L4j85K84j22P9N1J93
7190B20l54qK60L5k03J62J55k35J51m3j66K36m14J24n9L3J89k62J93J26j14K11
7212B37k0j04k49J05J0O0N0oK51m79m6Q2J54m11L39Q4j49L7J45j75J34M9l81J88
7236i5P2P3k8J12p8q4O7P7N5l8j64j02M59l01J26k15M4K30l75M29k34M6j15r3
7260a32K63j63m6Jj79K35N4m5k96L77l6l8J20j75J57J6j98K35m3k71K49p6q1J55
7284H3j10K9l6K26O3k04q2P2K16n13K98O0P2l64L64j34j57M2J6K54k24J63P4%
$$ plain form
7308 208 255 -149 157 -5 -312 -189 57 51 -173 35 -45 -85 -6 -135 -109 -118 100 118 131 -3 102 315 134 -169
7332 -169 -119 -202 53 75 -59 -106 -12 -83 112 14 114 -10 -36 48 -54 128 -116 24 -94 -112 169 -153 125
7355 125 128 94 94 258 197 43 -16 -101 230 -132 -271 -32 -56 -6 -126 -34 -93 82 134 -43 247 -79 1 39 -89
7380 -89 -6 -35 185 -50 -23 -111 -237 33 52 -37 -37 -200 2 -103 6 226 -86 -94 -223 47 -212 -89 124 35
7404 35 -110 -16 -20 86 -41 -96 16 71 63 186 -131 -57 40 11 -197 -103 216 -39 -39 37 -35 65 48 -62 44 -108
7430 -108 144 -22 -119 56 80 -153 -62 15 -121 20 39 -94 62 137 -10 -3 -118 -58 199 117 128 -3 245 -36
7454 -36 -81 193 -20 84 180 11 179 129 -15 201 141 -257 86 -302 -150 15 -131 122 -195 -36 -265 103
7476 103 -83 -91 -113 -4 144 -218 142 -132 -45 169 -242 117 38 142 257 197 80 216 17 -164 -8 197
$$ packed form
7308B08M7m04L06j62l07J23K46ok24K08q0m0P9j29K6rK18J8J3j34J05K13j81l03
7332a69N0q3K55K2j34m7R4p1J95r8J00j24k6Q4j02J82k44J40j18j8K81l22K78
7355A25Ll4%J64o1j54n9q5L31l62j39K39k4N0j20R2n9J75N2j77K90l26Q0L8j28
7380h9Q3k9K20k35K7q8j26K70J9q9%j63K02j05J09K20l12qj29K70k59J23K13q9
7404C5j45R4mJ06j27n5J12N5qJ23l17P4R7k9k08R4L19k55%P6p2J00j7j10J06j52
7430a08K52j66r7J75K4k33R1P7j36J41J9j33J56P5j47Pj15O0K57q2J1j31K48k81
7454c6m5K74k13J04R6j69J68n0j44K16o0l98L43l88J52J65j46K53l17J59k29L68
7476A03j86qk2J09J48l62L60k74Q7K14m11L59p9J04J15o0j17J36j99j81J56K05
$$ plain form
7498 197 227 56 40 123 150 -90 150 -104 93 -4 -169 -210 -140 168 18 -122 47 -12 81 -14 41 -7 -241 -179
7522 -179 51 108 108 -200 228 179 68 106 -36 111 -89 50 -120 64 16 -84 -94 -65 -56 -106 96 -113 83 24
7546 24 -116 -139 -105 106 89 25 285 30 150 192 3 -63 32 -33 51 -239 76 -71 8 120 -116 19 -196 93
7570 93 -36 74 -67 -7 52 -103 -234 32 -11 65 -18 141 77 -43 21 272 12 225 -107 99 192 42 18
7593 18 123 158 -74 -109 -243 485 -69 -92 -149 98 21 -188 -107 101 -185 -168 113 -113 -40 -156 25 -77 228
7616 228 22 86 -14 83 -323 -139 4 -124 -70 -63 -145 52 156 72 -70 -110 -165 -77 31 -30 35 227 -17 11
7640 11 -73 -84 193 6 4 -196 -133 -176 25 5 8 174 -283 124 -69 -79 -167 141 -97 111 -20 -227 168 -186
7664 -186 29 -216 66 202 -87 -156 -12 -1 -78 -90 -125 -244 165 -27 406 -156 -104 -61 -134 187 14 53 -6
$$ packed form
7498A97L0j71j6Q3K7k40K40k54J97r7j65m1P0L08j50j40J69n9R3r5N5m8k34O2
7522a79K30N7%l08M28m9j11L8j42J47k00J39j70J84m8j00j0K9Rn0K02k09J96n9
7546B4j40k3L4K11j7o4K60k55J20M2j89o6R5o5Q4k90L15j47P9J12k36J35k15K89
7570I3j29J10j41O0N9j55j31K66m3P6q3J59o4j20O4K51k60K13l32K06R3j50k4
7593A8J05L5k32l5j34P28n54k3n7K47p7k09Q1K08k86J7K81k26P3j16J81j02L05
7616B28k06O4j00R7m06J84J43j28N4Pq2J97J04q4j42m0n5Q8J08o1O5J92k44K8
7640A1q4j1K77j87kk00O3m3K01k0LJ66m57M07j93j0q8L08k38K08j31k07L95l54
7664a86K15k45K82J36k89o9J44J1p7j2l5j19M09j92M33n62N2M3p3L21j73L9n9
$$ plain form
7687 -6 -24 82 63 -85 -139 -210 -1 151 79 248 48 -62 54 122 52 123 -27 192 -73 150 -112 -62 -95 68
7711 68 99 -187 276 219 132 -237 0 -191 -131 -15 -6 109 -142 163 -43 -99 -142 -124 -2 105 132 -29 100 181
7735 181 170 -217 3 106 232 297 34 91 45 -164 -13 -34 -27 -106 69 -258 112 361 50 -53 -33 49 -17 -339
7759 -339 -112 -168 -49 -253 136 -25 71 -120 12 -100 -53 202 95 -227 -388 -20 65 -28 307 -249 -46 172
7781 172 -413 128 -209 -80 -66 11 201 -102 165 -98 93 -94 66 245 122 94 -21 -127 321 -102 -33
7802 -33 -6 -25 150 17 -65 108 9 -134 96 -126 -5 81 46 9 76 3 289 120 41 -128 74 -33 -88 46
7826 46 -141 -63 39 205 74 56 -31 62 134 37 -12 39 -66 75 -105 68 135 -55 134 57 50 12 197 83 -103
7851 -103 110 130 -33 -142 -39 -91 33 -116 40 259 -69 121 -135 105 327 81 -21 -150 56 10 79
$$ packed form
7687fj8J06j9j48n4p1K09J52p2J69k00j10J16O8p0P1j50K19k65K23k62N0l3J63
7711F8L1k86M63n7q7l69K37j91O0J16RJ15k51L05k06n6m3J8J22J07K7j61J29Q1
7735A81j1l87K20J03J26O5k63N7m6k09J51k1Pp9J75l27L70K49l11j03K0Q2o6l22
7759c39K27n6J19k04L89j61R6j91J32j12M7K55j07l22j61L68Q5r3L35n56K03K18
7781A72n85N41l37J29J4P7J90l03K67k63J91j87J60J79j23k8j15j06M48m23O9
7802c3K7j9J75j33q2J73r9j43K30k22J21Q6l5l7O7p3K86j69p9j69K02j07n5J34
7826D6j87P8J02J66j31j8q7R3P2r7m9N1j05J41j80J73O7j90J89p7pl8J85j14j86
7851a03K13K0j63j09J03n2J24j49J56K19l28J90k56K40K22k46j02j29K06m6O9
$$ plain form
7872 79 -136 64 -93 259 198 -62 -31 5 1 194 81 -122 -143 103 -69 -26 86 48 -175 31 6 -71 -116 -228
7896 -228 -12 -31 67 -63 119 -103 107 21 241 -174 40 158 -113 -3 210 -87 235 -158 3 -235 -208
7917 -208 22 -138 -46 -126 -29 122 -3 -41 -279 -92 69 -109 -2 73 77 60 220 57 124 -99 -112 55 -157
7940 -157 -109 162 -286 -4 -40 -267 -160 -42 35 -21 162 -58 -74 -78 68 60 -37 -6 -27 47 123 -195 -167 -67 4
7965 4 -149 -7 18 -172 -123 26 -104 97 -80 62 -228 -170 -81 -31 -199 74 -55 70 212 -58 83 -251
7987 -251 148 -194 -8 -118 -31 -104 -9 -38 17 18 13 59 -90 74 79 -128 64 173 169 113 -48 -103 199 -33 57 95
8013 95 -21 58 193 25 -79 -189 -76 -109 -95 -131 98 237 13 231 -110 69 220 -40 22 158 5 39
8035 39 -162 86 -159 95 -21 243 -42 -281 -89 -96 -138 60 259 -30 121 -8 -313 -47 277 -33 93
$$ packed form
7872G9k15K00j57L52o1k60L1L6mJ93j13k03k1K46j72M3J12l8k23K06k5p7m5j12
7896b28K16j9R8j30J82k22K10q6K20m15K14J18k71J10K13k97L22l93J61k38K7
7917b08K30j60R2q0R7J51j25l8k38J87J61j78J07P5Mj7J60j63O7k23j3J67k12
7940a57M8K71m48K82l6k27J07J18P7n6J83k20j6mJ46qr7L1k1P4P6l18K8J00P1
7965Dj53J42K5j90M9J49j30K01j77J42k90N8Q9N0j68K73j29J25J42k70J41l34
7987b51L99l42J86j10Q7p3R5k9N5JnM6j49J64Nk07J92J09mn6j61n5L02k32R0L8
8013I5j16P9J35j68j04j10J13l3J4l6K29J39k24K18l41J79J51k60O2J36j53L4
8035C9k01K48k45K54j16K64k85k39J92pm2J98J99k89J51j29l05K66L24l10J26
$$ plain form
8056 93 -7 47 21 -3 160 -125 -74 26 96 -125 -27 -88 -139 -60 -95 17 51 -1 -138 237 137 6 25 276 -344
8081 -344 -15 42 -98 215 31 -16 -70 -206 -60 -37 186 114 15 5 -189 169 38 2 16 -47 60 -18 264 85
8105 85 -87 58 -314 67 -162 -29 -6 92 4 67 89 -89 15 64 -351 -40 -282 -123 -114 -81 -25 7 -9 -198
8129 -198 65 57 160 21 -83 -7 -160 -46 206 -135 131 37 428 165 14 -137 -77 4 14 -175 1 49 27
8152 27 34 19 -83 33 -16 -145 -51 -97 5 -16 97 106 73 -162 -18 -126 -172 226 405 -172 13 21 120 -58 101
8177 101 31 2 -105 75 35 281 9 64 -85 -255 -2 270 -5 127
$$ packed form
8056I3j00N4k6k4J63k85N1J00P0k21R8o1n1P9l5J12L4n2j37L75j00j31J9K51o20
8081c44L29N7j40L13j84m7n4j36J46K3K23p2r9j0j94L58j31l6J4o3J07p8K82j79
8105H5j72J45l72L81k29J33K3R8q8O3K2j78J04M9m15L11k42J59RL3N6L2j6j89
8129a98K63qJ03j39j04P6j53J14K52l41K66r4L91k63j51j51O0Q1J0j89J76M8k2
8152B7Pj5j02J16m9j29R4m6J02k1J13Rl3k35J44j08m6L98J79n77J85QR9j78J59
8177A01p0k9j07J80m0K46k72N5j49j70K53K72k75J32
8191A27
$$ Imaginary data points
##PAGE= N=2
##DATA TABLE= (X++(I..I)), XYDATA
$$ plain form
0 0 0 0 0 0 0 0 0 0 0 0 0 0 0 0 0 0 0 0 0 -7 8 -8 8 -8 8 -10 15 -16 16 -22 24 -26 31 -34 39 -45 49 -56 64 -71 78
41 78 -86 95 -106 118 -130 144 -158 174 -191 211 -234 258 -283 314 -347 384 -425 478 -536 607
61 607 -695 805 -948 1142 -1426 1871 -2696 4743 -26447 -7472 19785 -10542 -12409 3825
75 3825 3769 -8442 -2180 1933 4630 2755 -3673 -3364 10036 7318 -4607 54 11228 2903 -4444
90 -4444 3072 8063 -825 -3934 774 1716 -1030 -1275 -3707 -3450 458 -2914 -7404 193 3074 -7662
106 -7662 -7272 5052 1569 -6670 843 4985 -2046 -953 4657 2492 1984 3722 -54 1499 6771
121 6771 1583 -2238 4430 3554 -4618 -457 5514 -1434 -5378 -80 -487 -4332 -2130 -488 -3553 -3294
137 -3294 -1135 -2428 -1969 1081 -605 -2785 1017 2881 -438 876 4067 908 -119 3852 3419 740
$$ packed form
0@%%%%%%%%%%%%%%%%%%%pJ5j6J6j6J6j8K5l1L2l8M6n0N7o5P3q4R4j05J20j35J49
41G8j64J81k01K24k48K74l02L32l65M02m45M92n41N97o61P31q09R03j014J143
61F07j302J500j753K090k568L297m567P439l1190J8975K7257l0327j867J6234
75C825n6j2211O262M113K697j875o428L09J3400k718j1925M661J1174q325p347
90d444P516M991q888l109M708R42k746k45k432K57L908l372m490P597K881j0736
106g662L90J2324l483q239P513M142p031J093N610k165n08J738l776J553N272
121F771n188l821O668q76q172M161N971o948l944N298m07l845K202J642l065K59
137c294K159j293M59L050j686k180L802J864l319J314L191l159j027L971m33k679
$$ plain form
153 740 2565 2021 -828 1832 3119 -1775 -1115 2128 -2587 -4731 1454 488 -5445 -2773 425 -3401
169 -3401 -3468 693 -716 -2637 -655 -172 -512 2104 1526 -693 2221 3596 238 813 4678 2228 -1200
186 -1200 1907 4088 0 -627 2169 -284 -1926 60 -628 -1998 -710 -1695 -3996 -1494 358 -3032
202 -3032 -3145 901 -1027 -3100 851 1692 -999 -206 1838 722 1725 3053 808 986 3367 1603
218 1603 -411 2935 3154 -1667 -714 2563 -380 -3066 25 189 -2817 -2165 -845 -1466 -1791 -1421 -2732
235 -2732 -1547 416 -1309 -1819 1682 987 -1904 1213 3499 804 20 3034 2451 632 2170 2714
251 2714 548 855 1662 -409 236 1329 -1038 -2292 251 -445 -3536 -1767 64 -2690 -3119 -404
267 -404 -961 -2201 -334 -364 -1062 668 1012 -410 1468 2847 -93 386 3635 2083 -212 1971 2717
$$ packed form
153G40J825n44k849K660J287m894O60L243m715k144O185r66n933K672L198l826
169c401o7M161j409j921J982M83l40K616n78k219K914J375l358N75L865k450l428
186a200L107K181m088o27K796k453j642J986o88j370J288r85k301K502J852l390
202c032j13M046j928k073L951Q41k691P93K044j116J003J328k245J78K381j764
218A603k014L346K19m821R53L277k943k686L091J64l006O52J320o21l25L70j311
235b732J185J963j725n10L501o95k891L117K286k695p84L014n83j819J538N44
251B714k166L07Q07k071O45J093k367j254K543o96l091J769J831k754m29K715
267d04n57j240J867l0o98J730L44j422J878J379k940M79L249j552k295K183P46
$$ plain form
284 2717 -19 58 1798 150 -1101 58 -529 -1475 -387 -1324 -2405 -1101 -554 -2927 -2005 576 -1444
301 -1444 -2585 439 748 -843 86 1767 218 391 2290 1368 555 2582 2156 202 1955 2058 -272
318 -272 445 1731 -321 -1412 361 -448 -2064 -1072 -692 -2291 -1490 -677 -1907 -1681 -128 -1089 -1887 320
336 320 824 -995 207 2112 341 359 2579 1707 500 1884 1792 922 1085 1481 120 -37 1219 -309
354 -309 -1145 -126 -433 -2051 -1161 -328 -2095 -1956 -231 -1486 -1812 -349 -552 -1509 -52 710 -431 530
372 530 2136 788 470 2164 1542 248 1419 2030 356 698 1533 145 -376 812 -135 -1295 -200
389 -200 -722 -2167 -1208 -675 -1944 -1956 -553 -1163 -2001 -303 126 -835 50 1175 51 278 1719 1004
407 1004 606 1945 1691 489 1784 1821 65 465 1643 -15 -885 628 -1 -1694 -780 -417 -1877
$$ packed form
284B717k736P7J740j648j251J159n87r46J088r37j081J304N47k373R22K581k020
301a444j141L024L09j591R29J681j549J73J899r22q13K027m26j954J753J03k330
318b72P17J286k052j091J773q09j616R92L80j599Q01Q13j230K26J553r61p98K207
336C20N04j819J202J905j771J8K220q72j207J384r2q70J63L96j361j57J256j528
354c09q36J019l07j618Q90Q33j767J39J725j255l26J463k03r57J457P62j141R61
372E30J606j348l18J694o22j294J171O11j674L42Q35j388n21J188r47j160J095
389b00n22j445R59N33j269j2J403o10q38J698M29r61Q85J125j124K27J441p15
407A004l98J339k54j202J295L7j756M00J178j658q70J513o29j693R14L63j460
$$ plain form
424 -1877 -1731 -759 -1841 -1746 -422 -918 -1517 157 166 -833 318 1082 123 133 1749 1394 563 1460 1656 853
444 853 792 1742 651 303 1094 -311 -883 354 -292 -1772 -878 -178 -1890 -1854 -371 -1249 -1916 -653 -587
463 -587 -1143 -225 194 -524 426 1252 478 529 1825 1212 520 1715 1873 511 861 1723 507 146 482
482 482 48 -551 126 -343 -1642 -766 -254 -1710 -1748 -365 -954 -1776 -509 -386 -1399 -434 911 -142
500 -142 191 1173 759 587 1421 1567 670 1692 1703 30 842 1529 172 -263 718 -109 -1256 -304 -243 -1575
520 -1575 -1173 -708 -1758 -1556 -450 -1150 -1420 -185 -147 -1018 -181 878 -7 75 1226 1106 579 1541 1179
539 1179 435 1017 1622 592 401 1534 408 -689 247 171 -1236 -596 -308 -1598 -1853 -752 -1064 -1774
557 -1774 -762 -1011 -1278 -259 223 -659 -422 909 141 46 1483 877 454 1141 1410 606 1372 1342 451
$$ packed form
424a877J46R72j082R5J324m96n99J674Rr99J151P64r59J0J616l55q31Q97J96q03
444H53o1R50j091l48P91j405n72J237o46j480Q94P00j712L6J483q78o67J263O6
463e87n56R18M19p18R50Q26p74N1J296o13o92J195J58j362L50Q62j216l61L36
482D82m34n99O77m69j299Q76N12j456l8J383n89q22J267J23j013R65J345j053
500a42L33R82m14j72Q34J46q97J022J1j673Q12O87j357m35R81q27j147R52O1j332
520a575M02M65j050K02J106p00k70J235L8q71Q37J059q85Q2J151j20n27R62l62
539A179p44N82O05j030j91J133j126j097R36p6j407O40K88j290k55J101l12p10
557a774J012k49k67J019M82q82K37J331p68r5J437o06m23O87K69q04P66l0q91
$$ plain form
576 451 273 860 259 -767 -26 91 -1063 -1066 -258 -1072 -1595 -671 -841 -1824 -849 -263 -845 -372 217 -344
596 -344 -25 1377 571 477 1371 1176 366 1226 1924 713 557 1253 262 151 529 99 -540 -173 -423 -1318
616 -1318 -859 -660 -1349 -1587 -708 -946 -1358 -603 -331 -649 -274 163 -46 327 730 889 439 1048 1141 762
636 762 1207 1698 399 246 1476 526 -318 22 169 -637 -617 -121 -959 -1121 -743 -1324 -1300 -528 -974 -1545
656 -1545 -242 -71 -855 -34 741 -56 -97 961 993 697 1134 1213 801 876 980 618 883 653 159 -209 55
677 55 93 -834 -1040 -570 -907 -1393 -554 -931 -1363 -961 -675 -1051 -382 49 -822 -92 685 390 184 1396 1256
698 1256 308 903 1574 631 758 1180 525 398 401 72 -213 21 -314 -1046 -921 -294 -977 -1281 -744 -760 -1488
719 -1488 -374 -375 -618 -504 -8 -220 -37 721 371 148 1193 1096 601 892 1664 864 245 908 797 -105
$$ packed form
576D51j78N87o01j026P41J17j154lQ08q14n23R24j70r83R75N86n82M73N89n61
596c44L19J402q06r4Q94j95q10Q60O98j211j56O96r91j11L78m30o39L67k50q95
616a318M59J99o89k38Q79k38m12P55K72l18L75M37k09L73M03J59m50O09R3l79
636G62M45M91j299j53J230r50q44L40J47q06K0M96q38j62L78n81K4P72m46n71
656a545J303J71p84Q21P75p97m1J058L2k96M37P9m12P5J04l62K65k30m94l68K64
677E5L8r27k06M70l37m86Q39l77m32M02K86l76O69M31q71P30P77k95k06J212j40
698A256r48N95O71r43J27M22o55j27Ll29k85K34l35p32J25O27o83l04N37j6p28
719a488J114jk43J14M96k12J83P58l50k23J045r7m95K91P72q00o19O63j11r02
$$ plain form
739 -105 418 487 -188 -221 -160 -784 -695 -779 -1371 -1015 -616 -928 -1272 -344 121 -809 -656 395 192 -54 377 897
761 897 422 939 942 899 1048 1082 630 646 956 366 -184 195 -119 -779 -831 -278 -693 -1180 -895 -847 -1113 -918 -600
784 -600 -842 -572 -169 -660 -216 747 70 -166 561 985 146 621 1580 694 596 884 633 670 523 361 -5
805 -5 507 -168 -1075 -631 -138 -846 -1362 -399 -815 -1231 -931 -432 -896 -653 -94 27 -154 376 151 418 791
826 791 691 463 909 1179 655 727 1196 877 103 421 277 -70 -365 -107 -543 -661 -445 -1003 -1240 -181
846 -181 -900 -1309 -598 -355 -858 -524 298 18 -115 160 682 146 663 787 780 775 943 770 543 1109 496 158
868 158 734 303 -305 -265 109 -478 -792 -846 -738 -964 -664 -585 -1065 -563 -109 -460 -202 133 12 -141 726
889 726 802 111 706 1047 742 789 1054 592 602 752 552 45 367 208 -503 -467 -153 -927 -929 -452 -569 -1275
$$ packed form
739a05N23O9o75l3O1o24Q9q4n92L56L99l12l44R28M65r30J53J051k03k46M31N20
761H97m75N17Lm3J49L4m52J6L10n90n50L79l14o60n2N53m15m87K85M8k66J95L18
784f00k42K70M03m91M44R63o77k36P27M24q39M75R59q86r8K88k51L7j47j62l66
805eN12o75r07M44M93p08n16R63m16m16L00M99m64K43N59J21j81N30k25K67L73
826G91j00k28M46K70n24P2M69l19p74L18j44l47k95K58m36j18K16n58k37J059
846a81p19m09P11K43n03L34Q22k80j33K75N22n36N17J24pnJ68j73k27N66o13l38
868A58N76m31o08M0L74n87l14n4J08k26L00P9m80N02M54l51K58L35j21j53Q67
889G26P6o91N95L41l05M7K65m62J0J50k00n07L22j59p11L6L14p74kM77j17p06
$$ plain form
911 -1275 -1076 -661 -739 -780 -156 -178 -375 -21 91 227 308 794 395 1111 1163 823 607 804 649 383 476 436
933 436 -6 19 248 -204 -502 -464 -557 -997 -813 -559 -945 -393 -653 -900 -797 145 -35 -313 293 522 216
954 216 803 755 228 841 653 744 486 864 941 247 432 575 -242 86 77 -224 -771 -280 -625 -1242 -762 -613
976 -613 -958 -820 -640 -424 -461 124 -130 50 389 77 189 763 859 297 721 1170 776 335 607 449 273
997 273 479 458 -90 -255 81 -427 -584 -567 -691 -855 -589 -564 -940 -770 -385 -605 -572 -81 216 108 478 543
1019 543 342 653 861 555 610 766 558 405 569 542 -53 -122 414 -161 -546 -354 -143 -639 -671 -628 -975 -522
1041 -522 -728 -757 -676 -154 -499 -588 255 142 -72 175 631 448 493 924 865 633 898 830 502 583 427 24
1063 24 -47 -6 -208 -550 -309 -357 -610 -924 -557 -727 -801 -392 -426 -506 -253 -429 -286 200 413 159 531 852
$$ packed form
911a275J99M15p8m1O24k2j97L54J12J36Q1M86l99P16N2l40k16J97j55k66R3m0
933D36m42K5K29m52k98L8r3m40J84K54l86N52k60k47J03R42j80k78O06K29l06
954B16N87m8n27O13j88R1k58L78P7o94J85J43q17L28rl01n47M91l45o17M80J49
976f13l45J38J80K16l7N85k54J80L39l12J12N74R6n62M24M49l94m41K72j58j76
997B73K06k1n48j65L36n08j57J7j24j64K66K5l76J70L85k20L3M91K97j08L70O5
1019E43k01L11K08l06N5J56k08j53J64k7n95o9N36n75l85J92K11m96l2M3l47M53
1041e22k06k9Q1N22l45q9Q43j13k14K47M56j83M5M31n9k32K65o8l28Q1j56m03
1063B4p1M1k02l42K41m8k53l14L67j70p4M09l4q0K53j76J43M86K13k54L72L21
$$ plain form
1085 852 540 621 939 943 491 629 691 275 525 422 58 83 -68 -342 -225 -434 -757 -807 -371 -447 -1039 -487
1107 -487 -501 -635 -592 -301 95 14 180 385 496 608 579 579 666 850 709 285 644 815 406 205 181 247 -285
1130 -285 -98 -310 -373 -513 -510 -778 -150 -318 -812 -547 -277 -648 -630 35 128 -144 346 411 523 467 749 550
1152 550 685 735 602 620 583 518 95 360 262 -185 -194 -226 -517 -475 -386 -486 -835 -614 -742 -870 -574 -269 -430
1175 -430 -520 90 227 -88 259 709 481 377 662 560 485 599 429 511 500 194 194 385 -76 -145 -399 -113
1197 -113 -682 -993 -493 -589 -869 -601 -147 -442 -543 -477 -198 -5 151 245 479 158 205 498 477 624 500 594
1219 594 538 659 443 538 161 92 -163 -190 -121 -573 -152 -340 -675 -335 -610 -759 -715 -332 -654 -394 -176 27
1241 27 -185 7 308 391 406 462 625 612 579 438 589 467 480 211 102 180 -75 -70 151 -92 -353 -370 -308 -795
$$ packed form
1085H52l12Q1L18Mm52J38O2m16K50j03l64K5j51k74J17k09l23n0M36p6n92N52
1107d87j4j34M3K91L96q1J66K05J11J12k9%Q7J84j41m24L59J71m09k01k4O6n32
1130b85J87k12o3j40Lk68O28j68m94K65K70l71J8O65R3k72M90O5J12n6K82j99
1152E50J35N0j33J8l7o5m23K65r8m47rl2k91M2Q9j00l49K21j28j28K96L05j61
1175d30r0O10J37l15L47M50k28j04K85j02p5J14j70Q2j1l06%J91m61o9k54K86
1197a13n69l11N00r6k80K68M54k95j01O6K79J93J56R4K34l21M7K93k1J47j24R4
1219E94n6J21k16R5l77o9k55k7O9m52M21j88l35L40k75j49M4L83l22K60K18K03
1241B7k12J92L01Q3J5N6J63j3l3j41J51j22J3k69j09P8k55NK21k43k61j7O2m87
$$ plain form
1265 -795 -675 -378 -432 -705 -565 -249 -244 -373 -278 -167 119 260 320 152 549 457 395 797 699 378 592 381 153
1288 153 180 184 -106 -79 -177 -308 -614 -349 -448 -807 -538 -396 -337 -580 -305 -200 -564 -85 79 -32 238 226 641
1311 641 547 660 460 380 739 458 406 572 614 2 136 124 -126 -323 -152 -98 -406 -692 -334 -503 -208 -447
1333 -447 -811 -474 -476 -246 -443 5 -74 -227 53 362 586 571 672 711 509 644 562 575 583 340 85 -26 110
1356 110 -171 -249 -82 -390 -776 -501 -432 -569 -599 -313 -473 -472 -151 -231 -23 59 181 4 415 224 519 54
1378 54 490 648 274 478 393 389 273 151 269 42 -374 63 -183 -541 -474 -461 -610 -379 -615 -789 -119 -294
1400 -294 -460 -454 -159 -86 198 346 325 378 303 467 546 708 396 199 506 697 495 187 397 240 -238 -108
1422 -108 -259 -166 -545 -167 -583 -330 -333 -798 -425 -388 -304 -213 51 363 -228 154 428 636 140 578 790 424
$$ packed form
1265g95J20K97n4k73J40L16Nj29R5J11K86J41O0j68L97r2o2M02r8l21K14k11k28
1288A53K7Mk90K7r8j31l06K65r9l59K69J42N9k43K75J05l64M79J64j11K70j2M15
1311F41r4J13k00q0L59k81n2J66M2o12J34j2k50j97J71N4l08k86L58j69K95k39
1333d47l64L37kK30j97M48p9j53K80L09K24j5J01L9k02J35q2J3Qk43k55j11J36
1356A10k81p8J67l08l86K75O9j37l0K86j60JL21q0K08Q2J22j77M11j91K95m65
1378E4M36J58l74K04q5mj16j22J18k27m16M37k46l58O7J3j49K31k36j74O70j75
1400b94j66OK95P3K84J48k1N3p5J64P9J62l12j97L07J91k02l08K10j57m78J30
1422a08j51R3l79L78m16K53lm65L73L7Q4R1K64L12n91L82K74K08m96M38K12l66
$$ plain form
1444 424 491 594 540 625 404 241 285 256 -62 115 -85 -290 -525 -546 -320 -584 -845 -670 -383 -509 -514 -188 -346
1467 -346 -81 257 -14 65 505 293 295 728 492 567 327 560 538 142 257 350 20 176 -241 -275 -153 -173 -523
1490 -523 -536 -237 -321 -505 -374 -282 -478 -564 -77 -179 34 -27 122 351 213 207 549 491 588 512 339 658 181
1513 181 284 393 36 -174 -193 -77 -206 -395 -285 -584 -439 -482 -638 -209 -375 -349 -163 -475 -220 -55 -168
1534 -168 145 253 142 153 480 547 531 439 387 490 294 515 215 294 271 418 -177 -164 -304 -410 -470 -505 -564 -595
1558 -595 -207 -148 -308 -193 -132 209 -234 -187 -164 126 244 250 449 393 225 111 584 268 422 355 327 175 -93
1581 -93 104 -261 -4 -342 -382 -461 -469 -465 -644 -475 -205 -262 -516 -20 -12 114 270 184 200 370 300 314 263 520 511 468
1607 468 439 249 439 323 111 23 -74 132 -160 -125 -236 -391 -339 -366 -359 -564 -506 -342 -336 -147 -198 -397 -56 151
$$ packed form
1444D24O7J03n4Q5k21j63M4k9l18J77k00k05k35k1K26k64k61J75K87j26nL26j58
1467c46K65L38k71P9M40k12KM33k36P5k40K33k2l96J15R3l30J56m17l4J22k0l50
1490e23j3K99q4j84J31R2j96q6M87j02K13o1J49K29j38oL42n8R7p6j73L19m77
1513A81J03J09l57k10j9J16j29j89J10k99J45m3j56M29j66K6J86l12K55J65j13
1534a68L13J08j11J1L27O7j6r2n2J03j96K21l00P9k3J47n95J3j40j06o0l5n9l1
1558e95L88N9j60J15O1L41m43M7K3K90J18OJ99n6j68j14M73l16J54o7k8j52k68
1581i3J97l65K57l38m0p9qMj79J69K70n7k54M96QJ26J56q6J6J70p0J4n1K57rm3
1607D68k9j90J90j16k12q8r7K06k92L5j11j55N2k7Pk05N8J64OJ89n1j99L41K07
$$ plain form
1631 151 210 114 305 460 187 499 267 439 511 326 277 303 292 -201 0 -46 -92 -304 -339 -334 -337 -432 -297 -380 -389 -454
1657 -454 -298 -300 -155 -89 76 -191 84 -90 200 374 527 397 282 544 481 281 433 452 261 244 50 -226
1679 -226 -176 -248 -91 -276 -577 -502 -440 -127 -310 -504 -230 -251 -416 -19 203 -144 93 261 138 297 306 143
1701 143 300 241 347 196 136 215 377 58 293 97 -80 -189 -228 -452 -300 -173 -444 -428 -263 -258 -473 -193
1723 -193 -205 -233 -159 152 145 54 372 461 388 211 623 427 509 390 261 255 470 232 134 -21 -71 -271 -175 -137 -382
1748 -382 -357 -210 -269 -579 -501 -421 -135 -269 -264 -272 -9 326 276 367 399 88 10 451 576 345 404 274 313 215 140
1773 140 239 -131 -569 -304 -236 -4 -520 -438 -272 -391 -601 -574 -312 -191 -108 -447 436 270 -133 235 194 255
1795 255 391 350 314 339 246 400 456 687 98 0 97 187 -21 -143 -146 -206 -293 -438 -333 -317 -512 -412 -456 -64 -398
$$ packed form
1631A51N9r6J91J55k73L12k32J72P2j85m9K6j1m93K01m6m6k12l5Nlr5J35q3ro5
1657d54J56kJ45O6J65k67K75j74K90J74J53j30j15K62o3k00J52J9j91j7j94k76
1679b26N0p2J57j85l01P5O2L13j83j94K74k1j65L97K22l47K37J68j23J59Rj63
1701A43J57n9J06j51o0P9J62l19K35j96j77j09l9k24J52J27k71J6J65Nk15K80
1723a93j2k8P4L11pr1L18Q9p3j77M12j96Q2j19j29oK15k38r8j55n0k00R6L8k45
1748c82K5J47n9l10P8Q0K86j34NqK63L35n0R1L2l11p8M41J25k31N9j30L9r8p5
1773A40R9l70m38K65O8K32n16Q2J66j19k10K7K62J21Q3l39Q83j66m03L68m1O1
1795B55J36m1l6K5r3J54N6K31n89r8R7R0k08j22lo0q7j45J05J6j95J00m4L92l34
$$ plain form
1820 -398 -183 -296 40 -53 -206 224 34 104 273 494 430 494 247 381 256 141 119 196 111 285 133 -97
1842 -97 -284 -255 -574 -364 -385 -454 -366 -242 -62 -312 -149 -169 54 -9 -155 71 237 402 40 555 659 319
1864 319 190 448 283 271 165 416 27 189 -5 -271 -86 -401 -499 -320 -87 -468 -701 -137 -400 -155 -366
1885 -366 -165 -98 48 36 219 116 232 -23 451 314 357 338 317 177 390 296 269 61 171 -159 -84 -99 -136
1908 -136 -545 -92 -83 -396 -237 -224 -24 -382 -372 -165 13 65 -173 -126 -189 340 -42 422 258 242 191 312 315 415
1932 415 334 81 409 70 -147 -2 -69 -327 -470 -109 -103 -447 -280 -251 -373 -214 -66 -306 -154 11 134 -44
1954 -44 57 121 319 77 307 277 380 314 237 305 300 100 308 9 97 115 -264 -97 29 -304 -538 -481 -325 -471
1978 -471 -356 -434 -199 -319 -220 -79 25 150 277 17 308 38 321 252 218 396 411 180 184 417 16 53 -75
$$ packed form
1820c98K15j13L36r3j53M30j90P0J69K21o4O4k47J34j25j15k2P7q5J74j52k30
1842i7j87K9l19K10k1o9Q8J24J80k50J63k0K23o3j46K26J66J65l62N15J04l40
1864C19j29K58j65j2j06K51l89J62j94k66J85l15r8J79K33l81k33N64k63K45k11
1885c66K01O7J46j2J83j03J16k55M74j37M3j9k1j40K13r4k7k08J10l30P5j5l7
1908a36m09M53Rl13J59J3K00l58J0K07J78N2k38M7o3N29l82M64j64j6n1J21LJ00
1932D15q1k53L28l39k17J45o7k58j43L61Ol44J67K9j22J59J48k40J52J65J23j78
1954d4J01O4J98k42K30l0J03o6p7O8nk00K08k99Q8J8l79J67J26l33k34N7J56j46
1978d71J15p8K35j20R9J41J04J25J27k60K91k70K83o9l4J78J5k31MK33m01L7j28
$$ plain form
2001 -75 -160 -253 -188 -283 -254 -248 -269 -105 -282 -360 -83 -349 41 -49 -428 -17 -26 -17 -75 169 266 236 97 450 601 520
2027 520 333 330 228 28 375 -112 325 -168 -51 -169 -56 -383 -295 -115 -414 -357 -414 -186 40 -240 -6 -127
2049 -127 40 -27 59 117 130 125 190 398 498 436 128 316 323 275 167 440 122 -75 -45 -58 -298 -307 -211 -272 -183 -127
2075 -127 -541 -159 -256 -125 -85 96 -147 208 94 232 320 258 546 489 503 180 425 370 745 266 -154 102
2097 102 134 -1 -284 -197 -180 -433 -184 -166 -311 -380 -305 -240 -135 -342 -209 -108 -20 35 22 140 235 63 88 398
2121 398 393 -55 306 359 399 457 1 264 164 17 -25 -250 26 -263 -294 -81 -100 -284 -323 -338 -305 -191 -226 -253
2145 -253 -122 -113 -152 86 178 203 279 518 212 481 251 622 155 441 288 278 138 -123 -76 99 -346 -202 -152
2168 -152 -318 -307 -2 -266 -223 -129 -413 -221 -37 -111 76 -118 -92 140 -61 36 201 231 230 183 378 320 -129 -102
$$ packed form
2001g5q5r3O5r5K9Ok1J64j77p8K77k66L90r0l79M11rRn8K44R7l0j39L53J51q1
2027E20j87lj02k00L47m87M37m93J17j18J13l27Q8J80k99N7n7K28K26k80K34j21
2049a27J67o7Q6N8J3nO5K08J00o2l08J88Pm8j08K73l18j97L0j3k40rR6o1Q9N6
2075a27m14L82r7J31M0J81k43L55j14J38Q8o2K88n7J4l23K45n5L75m79m20K56
2097A02L2j35k83Q7J7k53K49J8j45o9P5O5J05k07J33J01Q8N5j3J18R5j72K5L10
2121C98nm48L61N3M0N8m56K63j00j47m2k25K76k89l1K13j9j84l9j5L3J14l5k7
2145b53J31Rl9K38R2K5P6K39l06K69k30L71m67K86j53j0j40k61M7J75m45J44N0
2168a52j66J1L05k64M3R4k84J92J84p4J87j94K6K32k01R7J65L0jm7J95n8m49K7
$$ plain form
2192 -102 394 30 85 -108 -49 -119 -330 -242 -203 -400 -247 -181 -308 -142 -308 -145 -80 -150 -144 -43 235 108 160 418
2216 418 131 350 186 350 449 449 -78 76 -12 -42 -10 307 207 -54 -201 -97 -78 -419 -231 -389 -153 -241 182
2239 182 194 -113 -181 -303 82 49 232 -291 131 205 -37 100 306 210 397 39 219 75 88 -74 -45 -179
2261 -179 68 -122 49 -160 -215 -334 -310 -54 -205 -216 -276 -81 -111 219 274 -247 -160 57 400 317 116 344 250
2284 250 232 392 339 55 259 263 -49 -134 74 38 -309 -226 -150 -190 -118 -207 -341 -287 -29 -185 -106 -138 -30 -65 57
2309 57 316 -130 -41 422 40 339 262 335 446 175 491 22 240 159 141 -7 -44 -169 -59 -17 -375 -56 -96
2332 -96 -190 -233 -412 -23 -3 -279 -200 124 -22 46 -74 33 112 293 252 64 471 180 334 49 280 249 72
2355 72 47 22 198 -42 -3 -137 -157 -135 -461 -180 -395 -330 -103 -162 -53 52 -178 -2 -88 -27 23 42 261 215
$$ packed form
2192a02M96l64N5j93N9p0k11Q8L9j97J53O6j27J66j66J63O5p0OJ01K78j27N2K58
2216D18k87K19j64J64R9%n27J54q8l0L2L17j00k61j47J04J9l41J88j58K36q8M23
2239A82J2l07o8j22L85l3J83n23M22P4k42J37K06r6J87l58J80j44J3j62K9j34
2261a79K47j90J71k09n5j19K4K56j51j1o0J95l0L30N5n21Q7K17L43q3k01K28r4
2284B50j8J60n3k84K04Ml12q5K08l6l47Q3P6m0P2q9j34N4K58j56P9l2J08l5J22
2309E7K59m46Q9M63l82K99p7P3J11k71L16m69K18q1j8j48l7j25J10M2l58L19m0
2332i6r4m3j79L89K0k76P9L24j46O8j20J07P9J81m1j88M07k91J54k85K31l1j77
2355G2k5k5J76k40L9j34k0K2l26K81k15O5K27n9J09J05k30J76q6O1N0J9K19m6
$$ plain form
2379 215 273 128 329 -41 258 227 -21 98 71 33 -115 -232 59 -94 -364 -204 -253 -219 -155 -86 133 -74 -148
2402 -148 224 -17 66 148 -184 277 88 85 317 518 226 400 55 255 89 171 -70 133 -62 -141 50 59 206
2425 206 -339 -196 -435 -312 -89 -131 -299 -240 -129 -74 -313 -107 137 57 24 105 56 165 170 364 83 204 130
2448 130 185 298 241 283 -39 -28 -36 123 97 -96 62 -166 -192 -366 -171 -384 -136 -95 -157 -241 -106 -134 54 -111
2472 -111 423 122 101 202 104 227 75 87 198 349 309 218 222 -210 89 -17 -187 -231 -173 -22 -65 -463 -328
2495 -328 108 -33 -235 -378 64 -176 99 -62 108 58 394 105 37 261 -32 56 225 -21 127 34 146
2516 146 -34 -21 39 125 -186 -74 -66 -130 -21 -223 -293 -210 -272 -274 -395 -180 93 -59 -82 160 38 73 150 156 225 227
2542 227 168 144 239 174 85 228 129 -306 150 -63 302 -191 -264 -2 -3 -432 -516 -167 -436 51 -56 -226 9
$$ packed form
2379B15N8j45K01l70K99l1k48J19k7l8j48j17K91j53k70J60m9L4O4O9K19k07p4
2402a48L72k41Q3Q2l32M61j89lK32K01k92J74l45K00j66Q2k41K03j95p9J91RJ47
2425B06n45J43k39J23K23m2j68N9J11N5k39K06K44q0l3Q1m9J09NJ94k81J21p4
2448A30N5J13n7M2l22J1qJ59k6j93J58k28k6j74J95k13K48M1o2q4J35k8J88j65
2472a11N34l01k1J01r8J23j52J2J11J51m0r1Mm32K99j06j70m4N8J51m3l98J35
2495c28M36j41k02j43M42k40K75j61J70n0L36k89o8K24k93Q8J69k46J48r3J12
2516A46j80J3O0Q6l11J12Qo4J09k02p0Q3o2kj21K15K73j52k3K42j22L5P7OO9K
2542B27n9k4R5o5q9J43r9m35M56k13L65m93p3K62jm29q4L49k69M87j07j70K35
$$ plain form
2565 9 -107 104 194 -133 -118 -28 221 50 53 225 141 197 72 200 251 -132 61 -304 135 -47 -57 -26 -102 -453
2589 -453 -194 -510 -182 24 -178 -67 -191 66 -372 -27 287 178 113 237 420 419 64 217 127 245 327 133
2611 133 89 108 138 28 5 181 -51 -39 -303 -148 -378 -75 -243 -154 0 -108 -334 7 -207 1 168 -68
2633 -68 89 122 112 212 123 -77 170 137 313 251 121 -14 113 16 -84 -63 -20 -173 16 -100 -35 -334 -281 -405
2657 -405 -379 -483 2 -256 -56 -170 35 31 261 269 122 -72 236 379 119 103 111 238 106 17 232 242 169 -189
2681 -189 -163 -220 -368 -44 -250 -167 -169 -240 -267 -55 -219 -301 -153 -126 -31 142 -243 87 200 273 267 -54 87 223
2705 223 161 53 -149 -35 -71 -95 -152 -74 -99 104 -7 -320 -102 -258 -209 -219 -238 -143 -85 -271 -169 129 263 -34
2729 -34 79 47 353 95 148 239 211 117 248 8 98 5 261 -91 3 -40 -14 -55 36 -288 137 -287 -13 -240
$$ packed form
2565Ij16K11R0l27J5R0K49j71LJ72q4N6j25J28N1l83J93l65M39j82j0L1p6l51
2589d53K59l16L28K06k02J11j24K57m38L45L14j09o5J24J83jl55J53r0J18Q2j94
2611A33m4J9L0j10k3J76k32J2k64J55k30L03j68Q9J54j08k26L41k14K08J67k36
2633f8J57L3j0J00q9k00K47l3J76o2j30j35J27r7j00K1M3j53J89j16O5k99N3j24
2657d05K6j04M85k58K00j14K05mK30Qj47j94L08J43k60j6QJ27j32q9K15J0p3l58
2681a89K6n7j48L24k06Q3kp1k7K12j64q2J48K7R5J73l85L30J13P3ol21J41J36
2705B23o2j08k02J14l6k4n7P8k5K03j11l13K18j56M9j0j9R5N8j86J02K98J34k97
2729c4J13l2L06k58N3R1k8r4J31k40R0r3K56l52R4m3K6m1R1l24M25m24K74k27
$$ plain form
2753 -240 -89 -286 -525 -112 -3 13 -177 11 21 -49 213 93 -27 156 218 76 248 -11 351 -2 94 -21
2775 -21 -61 217 157 32 -320 -92 -196 -272 -3 -12 -236 -73 46 -126 -300 -285 -51 -99 20 53 -133 -20 168
2798 168 191 40 75 -51 48 115 -144 163 59 -58 -21 -8 86 83 -56 234 -105 -132 -183 -216 -239 -266 -350 -137 95
2823 95 32 33 -57 -70 20 163 203 206 -33 52 80 112 181 137 367 -90 12 127 -22 14 -3 -148 0 -191 -55 -270
2849 -270 -76 -9 -290 -268 -137 151 141 -36 199 -110 15 47 -113 80 256 34 357 135 374 67 25 -48
2871 -48 207 159 38 -154 -125 27 -143 -239 -40 -175 -248 -142 -209 -99 14 11 -172 -265 -399 -165 -77 -78 141 -100
2895 -100 24 252 207 161 153 199 191 145 -199 132 -28 -59 127 -138 -260 -57 131 -102 -64 -172 -153 -107 -2 -18
2919 -18 2 1 -136 181 -177 113 179 -32 5 14 -16 368 13 100 167 46 252 176 -42 -63 -113 9 85 -55 -135
$$ packed form
2753b40J51j97k39M13J09J6j90J88J0p0K62j20j20J83O2j42J72k59L62l53R6j15
2775b1m0K78o0j25l52K28j04p6K69rk24J63J19j72j74J5K34m8J19L3j86J13J88
2798A68K3j51L5j26R9O7k59L07j04j17L7J3R4lj39K90l39k7n1l3k3k7q4K13K32
2823I5o3Jr0j3R0J43M0Lk39Q5K8L2O9m4K30m57J02J15j49L6j7j45J48j91J36k15
2849b70J94O7k81K2J31K88j0j77K35l09J25L2j60J93J76k22L23k22K39l07m2p3
2871d8K55m8j21j92K9J52j70r6J99j35p3J06o7J10J13lj83r3j34K34Q8jK19k41
2895a00J24K28m5m6qM6qm6l44L31j60l1J86k65j22K03J88k33L8j08J9M6J05j6
2919a8K0jj37L17l58K90O6k11L7Rl0L84l55Q7O7j21K06p6k18k1n0J22P6j40q0
$$ plain form
2944 -135 -393 -298 48 -172 -151 -28 -113 -148 45 -69 -173 38 84 22 123 -17 35 235 446 111 138 340 -19
2967 -19 83 196 35 51 130 -153 -248 -90 -259 -191 -127 -72 -49 -367 -243 -182 135 -194 -135 6 -39 162 -187 24
2991 24 85 52 11 251 -99 102 29 -57 -95 206 -26 177 -54 81 65 225 -298 -195 -153 59 -65 -136 -35
3014 -35 -335 54 -169 1 72 -197 177 -4 43 153 168 321 72 94 347 -157 352 -73 67 190 121 71
3036 71 160 -174 71 -194 -119 -61 -128 -49 -148 -92 -313 96 -88 -7 -222 100 -346 87 558 -74 -232 180 16
3059 16 -173 196 82 220 188 85 244 -17 -18 -36 -122 65 -95 -370 151 -41 -144 -37 13 -19 -118 62 -210
3082 -210 151 187 -233 -37 233 67 99 -109 142 159 241 61 -83 -68 17 10 -191 5 -81 -114 -227 -134 97 -28
3106 -28 -262 -210 1 -32 -17 -269 -111 -9 -8 -59 -61 125 162 99 -160 138 100 21 209 -95 26 236 168 223 244
$$ packed form
2944a35k58R5L46k20K1J23q5l5J93j14j04K11M6o2J01j40N2K00K11l35K7K02l59
2967a9J02J13j61J6P9k83r5J58j69O8O4N5K3l18J24O1L17l29N9J41m5K01l49K11
2991B4O1l3m1K40l50K01p3q6l8L01k32K03k31J35j6J60n23J03M2K12j24p1J01
3014c5l00L89k23J70P1k69L74j81M7J10J5J53k49K2K53n04N09m25J40J23o9n0
3036G1Q9l34K45k65P5N8o7P9r9N6k21M09j84Q1k15L22m46M33M71o32j58M12j64
3059A6j89L69j14J38l2j03J59k61jj8q6J87j60k75N21j92j03J07N0l2r9J80k72
3082b10L61L6m20J96K70j66L2k08K51J7Q2j80j44J5Q5pk01J96q6l3j13R3K31j25
3106b8k34N2K11l3J5k52J58J02Jn1kJ86L7o3k59K98l8p9J88l04J21K10o8N5K1
$$ plain form
3131 244 278 15 -109 -278 -257 -7 -126 34 -402 -111 -345 -37 81 -103 15 -44 48 -67 -201 23 158
3152 158 -60 240 125 -98 119 6 301 140 34 -33 358 19 -129 49 97 -144 -70 -9 -119 -276 -350 105
3174 105 -18 -105 -366 -236 22 -268 -267 144 117 -85 51 -127 275 -64 -5 221 116 201 -24 93 105 -15
3196 -15 -139 -59 -137 94 -182 -68 -243 -147 -135 -187 -110 -43 -185 -114 -7 -31 -189 127 -207 -150 -134 97 26 74 189
3221 189 -14 -3 147 156 345 -26 -4 64 134 54 47 301 51 -166 -104 72 -274 -100 -123 -317 102 -236 -69 123
3245 123 55 52 -179 268 74 16 104 93 -124 260 7 -102 339 171 -28 64 -239 209 151 24 5 -66 -142 110
3269 110 -235 104 -112 -446 -81 -152 -155 85 -102 74 277 96 -161 -112 -13 -204 2 173 -12 123 162 176
3291 176 175 -19 175 -202 5 135 -165 -217 176 -33 -206 -99 101 -127 29 -56 71 -36 11 110 164 -91
$$ packed form
3131B44L4k63j24j69K1K50j19J60m36K91k34L08J18j84J18n9R2j15j34K24J35
3152A58k18L00j15k23K17j13K95j61j06o7L91l39j48J78M8k41P4O1j10j57p4M55
3174A05j23q7k61J30K58k90JM11k7k02J36j78M02l39N9K26j05Q5k25J17J2j20
3196a5j24Q0p8K31k76J14j75R6J2n2P7O7j42P1J07k4j58L16l34N7J6K31p1M8J15
3221A89k03J1J50RJ89l71K2O8P0q0pK54k50k17O2J76l46J74k3j94M19l38J67J92
3245A23o8lk31M47j94n8Q8j1k17L84k53j09M41j68j99R2l03M48n8j27j9p1p6K52
3269A10l45L39k16l34L65p1lK40j87J76K03j81k57M9R9j91K06J71j85J35L9J4
3291A76jj94J94l77K07J30l00n2L93k09j73J07K00k28J56q5J27j07M7R9N4k55
$$ plain form
3313 -91 161 -120 -15 158 99 22 166 275 42 -35 -84 94 90 154 -63 37 62 -18 -38 101 -387 -44 -24 -171
3337 -171 20 -218 -109 -113 -140 -95 111 -163 348 122 213 263 169 74 208 154 66 289 40 -127 -284 113 23 -42
3361 -42 109 121 -75 93 223 -37 -10 -110 -138 -117 -137 -216 -33 -222 195 26 -45 87 -11 -64 -100 -49 6 193
3385 193 0 -47 -6 -92 130 -69 71 -172 -183 16 -69 -223 -134 92 -224 83 -239 127 127 -3 -7 -122 98
3408 98 -53 104 145 65 8 -4 69 212 375 6 143 -9 -80 22 33 -312 146 -247 -15 -35 176 -216 30
3431 30 -105 34 -74 -86 108 -139 -141 51 -80 -62 75 119 134 -209 341 -93 -16 165 -202 -101 238 57 158
3454 158 263 46 17 102 -100 -141 -58 -72 -24 -305 90 -22 -147 -130 69 -89 -192 -122 125 -15 172 -152 -70
3477 -70 170 -8 132 -111 -80 92 -104 -2 197 -134 -85 83 -78 -165 180 -134 119 -104 -303 -187 63
$$ packed form
3313i1K52k81J05J73n9p7J44J09k33p7m9J78mO4k17J00K5q0k0J39m88L43K0j47
3337a71J91k38J09mk7M5K06k74N11k26R1N0r4r5J34n4q8K23k49j67j57L97r0o5
3361d2J51J2j96J68J30k60K7j00k8K1k0p9J83j89M17j69p1J32r8n3l6N1N5J87
3385A93j93m7M1q6K22j99J40k43j1J99q5j54Q9K26l16L07l22L66%j30mj15K20
3408I8j51J57M1q0n7j2P3J43J63l69J37j52p1J02J1l45M58l93K32k0K11l92K46
3431C0j35J39j08j2J94k47kJ92j31J8J37M4J5l43N50m34P7J81l67J01L39j81J01
3454A58J05k17k9Q5k02m1Q3j4M8k81L95j12j25J7J99j58j03P0K47j40J87l24Q2
3477g0K40j78J40k43L1J72j96J02J99l31M9J68j61q7L45l14K53k23j99J16K50
$$ plain form
3498 63 -126 99 37 -79 17 -104 -3 213 7 -123 222 93 -10 292 179 69 150 298 245 -140 -189 0
3520 0 131 341 160 113 -98 -155 39 -253 -103 -112 143 173 -140 -112 302 67 -34 78 33 238 -142 -15 86
3543 86 135 305 251 101 24 129 -128 78 136 93 50 60 -60 -95 -64 95 -76 -30 -66 -98 -57 18 67 62 -19 32 31
3570 31 185 -195 232 -2 74 -63 18 -2 26 179 363 -3 -39 135 -26 264 -90 -182 97 -244 80 133 107
3593 107 -166 -95 73 -45 81 -97 36 -294 66 118 252 -84 141 78 43 108 45 22 103 29 124 79 -48 -213
3617 -213 -267 -6 74 -240 88 25 30 67 -66 2 -64 -229 13 -189 166 120 96 300 170 360 -107 214 215 181
3641 181 337 -144 -53 215 83 39 37 -59 -241 -117 41 -50 82 67 -113 71 -76 -51 59 -6 -10 -3 -38 191 -84
3666 -84 26 8 -204 -47 47 -55 -170 44 -255 -9 366 1 -29 21 40 -19 -13 143 68 -140 -207 -121 120 -89
$$ packed form
3498F3j89K25o2j16R6j21J01K16k06j30L45j29j03L02j13j10Q1J48n3l85m9J89
3520@J31K10j81m7k11n7J94k92J50rK55L0l13K8M14k35j01J12m5K05l80J27J01
3543H6M9J70n4j50p7J05k57K06N8m3m3J0j20l5L1J59j71M6l6l2M1P5M9nq1N1j
3570C1J54l80M27k34P6j37Q1k0K8J53J84l66l6J74j61K90l54r2K79l41L24N3k6
3593A07k73P1J68j18J26j78J33l30L60N2J34l36K25o3l5O5o3k3Q1p4R5m5j27j65
3617b13n4K61Q0l14L28o3NL7j33O8o6j65K42k02L55m6k4K04j30J90m67L21Jl4
3641A81J56m81R1K68j32m4kr6j82J24J58r1J32j5j80J84j47K5J10o5mPl5K29k75
3666h4J10j8k12J57R4j02j15K14k99K46L75l65l0N0J9n9OJ56p5k08o7Q6K41k09
$$ plain form
3690 -89 75 -73 79 -55 -145 149 -100 -67 -139 -84 -121 209 42 63 -2 42 83 -133 162 8 94 -90 121 148
3714 148 -70 118 138 -154 152 -266 -159 -140 -122 88 -141 -105 -117 202 97 197 -127 -163 74 40 91 173 214
3737 214 -158 -85 85 84 -46 -208 260 -95 10 -154 63 283 180 40 -93 16 -58 43 -220 38 -13 -43
3759 -43 -73 124 -128 -182 -57 -5 160 -145 77 5 -48 -326 138 235 -101 -98 121 71 -156 23 -24 122 4 111
3783 111 -194 -128 -230 -295 141 -104 -228 -62 -319 -260 -22 -60 -7 187 52 138 62 216 184 -27 -17 -113 120
3806 120 146 262 280 -174 -99 26 312 35 79 -4 -105 -300 -35 -78 -95 -367 -244 -33 30 -18 120 93 79 78
3830 78 71 -23 -194 75 14 -22 -16 276 252 70 337 -2 -228 -33 138 20 -135 39 148 129 -134 9 -58 -414
3854 -414 22 -226 69 -67 13 167 -204 -143 -149 -27 -44 174 166 -63 115 152 -72 121 65 -225 82 -124 179
$$ packed form
3690h9J64j48J52j34r0K94k49L3p2N5l7L30j67K1o5M4M1k16K95j54Q6j84K11K7
3714A48k18J88K0k92L06m18J07J9J8K10k29L6j2L19j05J00l24l6K37l4N1Q2M1
3737B14l72P3J70jj30j62M68l55J05j64K17K20j03j40j33J09p4J01k63K58n1l0
3759d3l0J97k52n4J25N2J65l05K22p2n3k78M64R7l36LK19n0k27J79m7J46j18J07
3783A11l05O6j02o5M36k45j24J66k57N9K38l8N3J94j35Q6p6J54l2k11J0r6K33
3806A20K6J16J8m54P5J25K86k77M4q3j01j95K65m3j7k72J23K11O3m8J38k7j4j
3830G8pr4j71K69o1l6OK92k4j82K67l39k26J95J71j18j55J74J09j9k63J43o7l56
3854d14M36k48K95j36Q0J54l71O1oJ22j7K18qk29J78L7k24J93n6k90L07k06L03
$$ plain form
3877 179 99 -40 269 -142 -72 154 -67 -130 -275 -158 -132 41 -134 81 22 -385 26 -148 101 -29 16 135
3899 135 51 -35 -82 139 195 24 -34 203 -98 34 -99 -31 -124 -238 -136 -21 -214 -1 -114 -19 -134 -9 -24
3922 -24 14 -204 -53 76 120 112 -170 212 -21 84 5 -225 184 358 69 187 106 140 101 -199 114 -20 -164
3945 -164 -209 29 -188 108 269 -159 156 -122 141 -166 -119 -66 -57 -80 -20 39 113 -179 -233 22 -85 66 148 161
3969 161 -72 -51 69 -5 88 161 210 158 426 -42 21 -322 -388 -45 11 42 418 -279 -10 -122 116 -35 -80 65
3993 65 -109 79 8 102 -75 -110 307 -186 -18 -72 -108 -115 -157 -101 124 -31 119 -197 -70 -5 160 30 -87 178
4017 178 -88 46 116 86 0 110 113 178 -122 -228 -20 50 -70 -32 -77 -135 -91 245 150 -252 -65 406 -136 -247
4041 -247 30 138 183 28 -169 -175 -101 121 -297 -121 -78 -213 66 7 103 5 110 82 185 -106 -146 222 103
$$ packed form
3877A79q0j39L09m11P0K26k21o3j45J17K6J73j75K15n9m07M11j74K49j30M5J19
3899A35q4q6m7K21N6j71n8K37l01J32j33O8r3j14J02J15j93K13j13R5j15J25j5
3922b4L8k18J51J29M4qk82L82k33J05p9k30M09J74k89J18q1L4l9l00L13j34j44
3945a64m5K38k17K96J61m28L15k78K63l07M7N3Rk3O0N9P4k92n4K55j07J51Q2J3
3969A61k33K1J20p4R3P3M9n2K68m68O3l43o6L43N6L1L76o97K69j12K38j51m5J45
3993F5j74J88p1R4j77l5M17m93J68n4l6pm2N6K25j55J50l16J27O5J65j30j17K65
4017A78k66J34P0l0q6J10LO5l00j06K08P0j20L8m5n8M4L36r5m02J87M71n42j11
4041b47K77J08M5j55j97oP4K22m18J76M3j35K79n9R6r8J05k8J03k91m0L68j19
$$ plain form
4064 103 40 -164 100 135 -55 248 -44 -23 -38 -145 -71 85 -131 62 -69 -98 -161 -107 -142 -42 -300 59 118
4087 118 68 110 99 75 253 207 199 211 40 18 47 77 -34 -82 10 119 200 6 50 -144 78 -107 112 99 -63
4112 -63 86 -40 -119 -13 -31 193 -30 108 -105 -283 84 23 41 -65 -197 -19 174 -237 184 59 154 -76
4134 -76 -284 -200 62 74 202 -49 -70 -175 41 -247 157 -123 87 97 -150 17 -140 99 -1 80 -73 109
4156 109 34 242 186 88 -10 -17 49 -11 -31 84 -47 -75 143 80 -211 -20 -147 251 -51 -45 -213 70 -114 89
4180 89 -221 -44 140 267 103 -40 219 39 -51 218 -1 -54 -128 -96 -58 166 80 -78 258 144 -155 -21
4202 -21 -98 -70 -35 -195 -16 -85 -142 -149 227 -138 90 18 27 -237 83 -19 40 -53 186 303 -40 -59 197 -172 10
4227 10 74 -65 -14 -14 -140 104 22 -99 -60 -54 -221 -2 -94 -56 125 -204 -190 -232 -13 -456 -143 197 -143 -221 -160
$$ packed form
4064A03o3k04K64L5j90L03k92K1j5j07P4J56k16J93j31k9o3N4l5J00k58L59N9
4087A18n0M2j1k4J78m6qJ2j71k2K9L0j11m8R2J09Q1j94M4j94K22j85K19j3j62
4112f3J49j26p9J06j8K24k23J38k13j78L67o1J8j06j32J78J93m11M21j25R5k30
4134g6k08Q4K62J2J28k51k1j05K16k88M04k80K10J0k47J67j57K39j00Q1j53J82
4156A09p5K08n6r8r8pO6o0k0J15j31k8K18o3k91J91j27L98l02Oj68K83j84K03
4180H9l10J77J84J27j64j43K59j80r0K69k19n3p4L2L8K24q6j58L36j14k99J34
4202b1p7K8L5j60J79o9n7pL76l65K28p2Rk64L20j02N9r3K39J17l43j9K56l69J82
4227A0O4j39N1%j26K44q2j21L9Oj67K19r2L8J81l29J4m2K19m43L13L40l40p8O1
$$ plain form
4252 -160 138 108 103 8 42 80 -50 133 19 -163 225 232 54 28 59 129 -4 -131 35 -14 -101 -107 37 28 -319 18
$$ packed form
4252a60K98l0nr5L4L8j30J83j14j82L88Pj78k6L1P0j33j27J66m9q7oJ44rl47L37
$$ [...]
8191a07
##END NTUPLES=NMR FID
##END=
