##TITLE=1H_IPACAT-33-1
 CDCl3
 64 sc, 
 3.10.2023
##JCAMPDX= 6.0         $$ Bruker NMR JCAMP-DX V2.0
##DATA TYPE= NMR FID
##DATA CLASS= NTUPLES
##ORIGIN= UXNMR, Bruker Analytische Messtechnik GmbH
##OWNER= root
$$ XWIN-NMR		Version 3.5
$$ Tue Oct  3 15:53:05 2023 Russian Standard Time (UT+4h)  she@DPX200
##.OBSERVE FREQUENCY= 200.13135
##.OBSERVE NUCLEUS= ^1H
##.DELAY= (6, 6)
##.ACQUISITION MODE= SIMULTANEOUS
##.ACQUISITION SCHEME= undefined
##.AVERAGES= 64
##.DIGITISER RES= 18
##SPECTROMETER/DATA SYSTEM= spect
##.PULSE SEQUENCE= zg30
##.SOLVENT NAME= CDCl3
##.SHIFT REFERENCE= (INTERNAL, CDCl3, 0, 15.7039)
##AUDIT TRAIL= $$ (NUMBER, WHEN, WHO, WHERE, WHAT)
$$ ##TITLE= Audit trail, XWIN-NMR		Version 3.5
$$ ##JCAMPDX= 5.01
$$ ##ORIGIN= Bruker BioSpin GmbH
$$ ##OWNER= she
$$ F:/spectra/data/she/nmr/H-F/1/audita.txt
$$ ##AUDIT TRAIL=  $$ (NUMBER, WHEN, WHO, WHERE, WHAT)
(   1,<2023-10-03 15:52:07.82 +0400>,<she>,<DPX200>,
      <continue with go, POWCHK disabled, PULCHK disabled
       configuration hash MD5:
       00 E9 B6 7A A2 85 ED C7 34 08 36 98 17 FE 4E 26
       data hash MD5: 16K
       FD FF AE 0E 54 30 EA D4 D0 6E 31 2C 30 5B E6 2A>)
$$ ##END=
$$ 
$$ hash MD5
$$ 51 5B CA 8F 87 B5 60 30 87 3C 36 6E CE 87 34 04
##$RELAX= 
##$RELAX= 
##$RELAX= 
##$RELAX= 
##$RELAX= 
##$RELAX= 
$$ Bruker specific parameters
$$ --------------------------
##$DU= <F:/spectra>
##$EXPNO= 1
##$NAME= <H-F>
##$PROCNO= 1
##$TYPE= <nmr>
##$USER= <she>
##$AMP= (0..31)
100 100 100 100 100 100 100 100 100 100 100 100 100 100 100 100 100 100 
100 100 100 100 100 100 100 100 100 100 100 100 100 100 
##$AQSEQ= 0
##$AQ_mod= 1
##$AUNM= <au_zg>
##$AUTOPOS= <>
##$BF1= 200.13
##$BF2= 200.13
##$BF3= 200.13
##$BF4= 200.13
##$BF5= 200.13
##$BF6= 200.13
##$BF7= 200.13
##$BF8= 200.13
##$BYTORDA= 1
##$CFDGTYP= 0
##$CFRGTYP= 5
##$CHEMSTR= <none>
##$CNST= (0..31)
1 1 145 1 1 1 1 1 1 1 1 1 1 1 1 1 1 1 1 1 1 1 1 1 1 1 1 1 1 1 1 1 
##$CPDPRG= <>
##$CPDPRG1= <>
##$CPDPRG2= <>
##$CPDPRG3= <>
##$CPDPRG4= <mlev>
##$CPDPRG5= <mlev>
##$CPDPRG6= <mlev>
##$CPDPRG7= <mlev>
##$CPDPRG8= <mlev>
##$CPDPRGB= <>
##$CPDPRGT= <>
##$D= (0..31)
0 1.2 0 0 0 0 0 0 0 0.06 0 0.03 0 0 0 0 0.0002 0 0 0 0 0 0 0 0 0 0 0 0 
0 0 0 
##$DATE= 1696333682
##$DBL= (0..7)
120 120 120 120 120 120 120 120 
##$DBP= (0..7)
150 150 150 150 150 150 150 150 
##$DBP07= 0
##$DBPNAM0= <>
##$DBPNAM1= <>
##$DBPNAM2= <>
##$DBPNAM3= <>
##$DBPNAM4= <>
##$DBPNAM5= <>
##$DBPNAM6= <>
##$DBPNAM7= <>
##$DBPOAL= (0..7)
0.5 0.5 0.5 0.5 0.5 0.5 0.5 0.5 
##$DBPOFFS= (0..7)
0 0 0 0 0 0 0 0 
##$DE= 6
##$DECBNUC= <off>
##$DECIM= 32
##$DECNUC= <off>
##$DECSTAT= 4
##$DIGMOD= 1
##$DIGTYP= 9
##$DL= (0..7)
0 120 120 120 120 120 120 120 
##$DP= (0..7)
150 150 150 150 150 150 150 150 
##$DP07= 0
##$DPNAME0= <>
##$DPNAME1= <>
##$DPNAME2= <>
##$DPNAME3= <>
##$DPNAME4= <>
##$DPNAME5= <>
##$DPNAME6= <>
##$DPNAME7= <>
##$DPOAL= (0..7)
0.5 0.5 0.5 0.5 0.5 0.5 0.5 0.5 
##$DPOFFS= (0..7)
0 0 0 0 0 0 0 0 
##$DQDMODE= 0
##$DR= 18
##$DS= 0
##$DSLIST= <SSSSSSSSSSSSSSS>
$$ [...]
##$SUBNAM2= <"">
##$SUBNAM3= <"">
##$SUBNAM4= <"">
##$SUBNAM5= <"">
##$SUBNAM6= <"">
##$SUBNAM7= <"">
##$SUBNAM8= <"">
##$SUBNAM9= <"">
##$SW= 18.05172834244
##$SWIBOX= (0..15)
0 0 2 0 0 0 0 0 0 0 0 0 0 0 0 0 
##$SW_h= 3612.71676300578
##$TD= 16384
##$TD0= 1
##$TE= 0
##$TE2= 300
##$TE3= 300
##$TEG= 300
##$TL= (0..7)
0 120 120 120 120 120 120 120 
##$TP= (0..7)
150 150 150 150 150 150 150 150 
##$TP07= 0
##$TPNAME0= <>
##$TPNAME1= <>
##$TPNAME2= <>
##$TPNAME3= <>
##$TPNAME4= <>
##$TPNAME5= <>
##$TPNAME6= <>
##$TPNAME7= <>
##$TPOAL= (0..7)
0.5 0.5 0.5 0.5 0.5 0.5 0.5 0.5 
##$TPOFFS= (0..7)
0 0 0 0 0 0 0 0 
##$TUNHIN= 0
##$TUNHOUT= 0
##$TUNXOUT= 0
##$USERA1= <user>
##$USERA2= <user>
##$USERA3= <user>
##$USERA4= <user>
##$USERA5= <user>
##$V9= 5
##$VALIST= <valist>
##$VCLIST= <CCCCCCCCCCCCCCC>
##$VD= 0
##$VDLIST= <DDDDDDDDDDDDDDD>
##$VPLIST= <PPPPPPPPPPPPPPP>
##$VTLIST= <TTTTTTTTTTTTTTT>
##$WBST= 1024
##$WBSW= 4
##$XGAIN= (0..3)
0 0 0 0 
##$XL= 0
##$YL= 0
##$YMAX_a= 147322
##$YMIN_a= -183459
##$ZGOPTNS= <>
##$ZL1= 120
##$ZL2= 120
##$ZL3= 120
##$ZL4= 120
##$ABSF1= 10
##$ABSF2= 0
##$ABSG= 5
##$ABSL= 3
##$ALPHA= 0
##$AQORDER= 0
##$ASSFAC= 0
##$ASSFACI= 0
##$ASSFACX= 0
##$ASSWID= 0
##$AUNMP= <proc_1d>
##$AZFE= 0.1
##$AZFW= 0.1
##$BCFW= 1
##$BC_mod= 2
##$BYTORDP= 1
##$COROFFS= 0
##$CY= 11.3945322036743
##$DATMOD= 1
##$DC= 2
##$DFILT= <>
##$DTYPP= 0
##$F1P= 15.7292609196834
##$F2P= 12.9074282941183
##$FCOR= 0.5
##$FTSIZE= 0
##$FT_mod= 4
##$GAMMA= 1
##$GB= 0.15
##$INTBC= 1
##$INTSCL= 1
##$ISEN= 128
##$LB= 0.24
##$LEV0= 0
##$LPBIN= 0
##$MAXI= 10000
##$MC2= 0
##$MEAN= 0
##$ME_mod= 0
##$MI= 1.114404
##$NCOEF= 0
##$NC_proc= 0
##$NLEV= 6
##$NOISF1= 3.799351
##$NOISF2= 2.8
##$NSP= 1
##$NTH_PI= 0
##$NZP= 0
##$OFFSET= 15.70392
##$PC= 1
##$PHC0= -21709.02
##$PHC1= 9.25271
##$PH_mod= 1
##$PKNL= yes
##$PPARMOD= 0
##$PSCAL= 0
##$PSIGN= 0
##$REVERSE= no
##$SF= 200.130013532006
##$SI= 16384
##$SIGF1= 3
##$SIGF2= 2
##$SINO= 400
##$SIOLD= 16384
##$SREGLST= <1H.CDCl3>
##$SSB= 0
##$STSI= 0
##$STSR= 0
##$SW_p= 3612.71676300578
##$SYMM= 0
##$S_DEV= 0
##$TDeff= 0
##$TDoff= 0
##$TI= <>
##$TILT= no
##$TM1= 0
##$TM2= 0
##$TOPLEV= 0
##$USERP1= <user>
##$USERP2= <user>
##$USERP3= <user>
##$USERP4= <user>
##$USERP5= <user>
##$WDW= 1
##$XDIM= 8192
##$YMAX_p= 0
##$YMIN_p= 0
$$ End of Bruker specific parameters
$$ ---------------------------------
##NTUPLES= NMR FID
##VAR_NAME=  TIME,          FID/REAL,        FID/IMAG
##SYMBOL=    X,             R,               I
##VAR_TYPE=  INDEPENDENT,   DEPENDENT,       DEPENDENT
##VAR_FORM=  AFFN,          ASDF,            ASDF
##VAR_DIM=   8192,          8192,            8192
##UNITS=     SECONDS,       ARBITRARY UNITS, ARBITRARY UNITS
##FACTOR=    0.0002768,     1,               1
##FIRST=     0,             0,               0
##LAST=      2.2672688,     0,               0
##MIN=       0,             -183459,         0
##MAX=       2.2672688,     147322,          0
$$ Real data points
##PAGE= N=1
##DATA TABLE= (X++(R..R)), XYDATA
$$ [...]
$$ plain form
2547 -2150 -1834 -552 -1495 -2590 -1583 -221 -783 -2176 -986 203 -194 -704 -411 615 1438 114 120
2564 120 2497 1673 17 1380 2938 1126 -485 515 2239 429 -613 572 902 -672 -1573 -1732
2580 -1732 -399 -1595 -2203 -2257 -11 -1498 -2384 -798 60 -222 -789 497 761 56 6 1216 1701 1214
2598 1214 976 471 1782 1526 -64 555 1198 135 -1095 546 502 -113 -765 -608 -150 -462 -2390 -858
2616 -858 -360 -1571 -2169 -1206 389 -349 -1466 -11 794 101 18 587 1791 782 470 1552 2416 1005
2634 1005 252 633 1770 975 62 -576 517 -512 -563 -1107 -782 -1600 -2517 -1598 -566 -878 -1429 -984 7
2653 7 -484 -628 617 1302 691 -13 739 1796 635 347 1365 1957 367 -341 1570 2367 176 -461
2671 -461 319 987 -44 -1452 -514 450 -1228 -1564 -1120 -438 -1277 -2330 -1286 151 -1104 -748 1041
$$ packed form
2547b150L16J282r43j095J007J362n62j393J190J189l97n10K93J026Q23j324O
2564A20K377q24j656J363J558j812j611J000J724j810j042J185L30j574r01j59
2580a732J333j196o08n4K246j487q86J586Q58k82n67J286K64p05n0J210M85m87
2598A214k38n05J311k56j590O19O43j063j230J641m4o15o52J57M58l12j928J532
2616h58M98j211n98R63J595p38j117J455Q05o93q3N69J204j009l12J082Q64j411
2634A005p53L81J137p95r13o38J093j029n1n44L25q18r17R19J032l12n51M45R91
2653Gm91j44J245O85o11p04P52J057j161k88J018N92j590p08J911P97k191o37
2671d61P80O68j031j408R38R64j678l36M44O82q39j053J044J437j255L56J789
$$ plain form
2688 1041 932 128 -888 1004 1698 1269 582 2374 2658 828 203 1201 1430 -76 393 815 946 -440
2706 -440 -1790 -41 -123 -1519 -1421 -736 -1163 -1860 -1767 -674 -202 -41 -955 -490 579 637 -552 1222 1897
2725 1897 836 359 1714 1989 173 115 2018 1494 818 118 858 465 -1076 -761 149 269 -1520 -1328
2743 -1328 -868 -1253 -1588 -1737 95 -375 -1976 -1960 -489 -335 194 -598 1488 1268 63 831 1744 1945
2761 1945 678 308 1101 1204 65 391 1381 1275 -930 -504 629 111 -1660 -1448 -1362 -1131 -2148 -1237
2779 -1237 -383 -521 -1555 -1076 456 753 -1157 -632 819 1440 497 646 1893 1251 332 631 934 1464
2797 1464 136 -226 861 643 -587 -690 655 -291 -825 -1324 -632 -325 -1487 -1534 -820 -1219 -1624 -1131
2815 -1131 -227 124 -617 168 1524 1672 674 570 1890 1278 -36 684 1059 1672 375 756 953 876 -863
$$ packed form
2688A041j09q04j016J892O94m29o87J792K84j830o25R98K29j506M69M22J31j386
2706d40j350J749q2j396R8O85m27o97R3J093M72J61r14M65J069N8j189J774O75
2725A897j061m77J355K75j816n8J903n24o76p00P40l93j541L15R10J20j789J92
2743a328M60l85l35j49J832m70j601J6J471J54N29p92K086k20j205P68R13K01
2761A945j267l70P93J03j139L26R90j06k205M26J133n18j771K12Q6K31j017R11
2779a237Q54j38j034M79J532K97j910N25J451O21r43J49J247o42r19K99L03N30
2797A464j328l62J087k18j230j03J345r46n34m99O92L07j162m7P14l99m05M93
2815a131R04L51p41P85J356J48r98j04J320o12j314P20L75O13j297L81J97p7j739
$$ plain form
2834 -863 -834 85 -869 -1618 -698 536 -592 -2047 -1572 -454 -976 -1214 -702 155 207 -539 -313 956 1443
2853 1443 263 766 2263 1474 381 584 2256 815 427 800 1330 434 -1016 -1072 683 -249 -1099 -1184
2871 -1184 -1110 -701 -1932 -1647 58 -831 -1486 -922 -381 -130 -962 677 702 910 -253 1504 1687 1355 618
2890 618 702 1268 1380 641 205 1334 917 -293 -119 558 -536 -2037 -114 -224 -303 -1457 -928 -759 -229
2909 -229 -1862 -1543 441 -319 -1536 248 929 766 180 505 858 731 428 1513 1968 1033 133 719
2927 719 1094 339 200 86 376 -565 -1227 -811 -562 -317 -1736 -1350 -586 -1132 -1551 -422 -231 -532 -723
2946 -723 -354 161 843 103 999 1191 -40 -13 1004 1632 674 278 1394 2066 728 -528 500 372
2964 372 -1078 -1549 -1333 276 -748 -1040 -678 -837 -809 -1766 -956 -340 -860 -939 -281 145 -59 424 1057 1328
$$ packed form
2834h63K9R19r54p49R20J234j128j455M75J118n22k38N12Q57N2p46K26J269M87
2853A443j180N03J497p89j093K03J672j441l88L73N30q96j450n6J755r32q50q5
2871a184P4M09j231K85J705q89o55N64N41K51q32J639K5K08j163J757J83l32p37
2890F18Q4N66J12p39m36J129m17j210J74O77j094j501J923j10p9j154N29J69N30
2909b29j633L19J984p60j217J784O81j63n86L25L53j27l03J085M55r35r00N86
2927G19L75p55j39j14K90r41o62M16K49K45j419L86P64n46m19J129J91l01j91
2946g23L69N15O82p40Q96J92j231K7J017O28r58l96J116O72j338j256J028j28
2964C72j450m71K16J609j024k92L62j59K8r57Q10O16n20p9O58M26k04M83O33K71
$$ plain form
2984 1328 825 1187 928 2285 778 493 1260 1386 712 500 576 787 -668 -993 -338 -456 -1373 -1147 -1160
3003 -1160 -571 -1002 -1774 -738 -495 -885 -545 362 407 149 15 147 1075 411 143 1445 1456 63 -327
3022 -327 1462 1457 769 -358 753 110 301 -517 -488 -435 -1283 -1297 -1120 -995 -647 -951 -998 -388 -879 -1367 395
3043 395 -137 -231 462 1088 1326 715 194 523 1991 805 345 2218 1027 -526 -331 914 614 -674
3061 -674 -1158 106 -153 -647 -1669 -602 -594 -1540 -1232 -505 -328 -1414 -581 239 164 -338 46 751 646 120
3081 120 303 1782 1167 550 414 1669 996 -162 -558 1115 56 -363 -620 -231 -8 -1450 -456 -170
3099 -170 -471 -1509 -1375 -564 -668 -1089 -1316 -136 461 393 -209 1429 1343 235 235 1744 1497 79 455
3118 455 1216 578 757 292 1362 401 -864 -664 -584 -473 -1028 -645 -213 -573 -1017 -1361 48 -963 -829
$$ packed form
2984A328n03L62k59J357j507k85P67J26o74k12P6K11j455l25O55j18r17K26j3
3003a160N89m31p72J036K43l90L40R07M5k58j34J32R28o64k68J302J1j393l90
3022c27J789no88j127J111o43J91q18K9N3q48j4J77J25L48l04m7O10m91m88J762
3043C95n32r4O93O26K38o11n21L29J468j186m60J873j191j553J95J245l00j288
3061f74m84J264k59m94j022J067Qr46L08P27J77j086Q33Q20p5n02L84P05j05n26
3081A20J83J479o15o17j36J255o73j158l96J673j059m19k57L89K23j442R94K86
3099a70l01j038J34Q11j04m21k27J180N97o8o02J638q6j108%J509k47j418L76
3118D55P61o38J79m65J070r61j265K00Q0J11n55L83M32l60m44l44J409j011J34
$$ plain form
3137 -829 -1085 370 316 -786 188 523 327 432 712 1420 1508 629 -114 1220 344 353 678 676 496 -393 -572
3158 -572 -146 45 -976 -752 86 -457 -1126 -530 -571 -166 -1171 -1092 -416 36 -932 1 334 556 205 774
3178 774 1293 533 59 259 1033 529 189 533 416 615 -920 -1059 582 -807 -646 -803 -279 21 -2102
3197 -2102 -1338 -720 -163 -1246 -580 -137 -268 -522 -121 281 511 -289 1151 1003 1571 753 558 2558 744
3216 744 48 -152 609 -36 338 338 711 -812 -805 -270 -652 -71 -1464 -1323 -519 -87 -486 -668 -67 -755 -708
3237 -708 -166 824 -34 -18 460 1757 1233 516 845 758 201 652 -238 1197 630 202 647 610 -35 -1215
3257 -1215 -1017 -877 -414 -1151 -1347 -216 -1274 -1101 165 -182 139 -110 -733 910 117 -158 -537 1324
3275 1324 311 435 695 915 728 406 504 745 542 -105 28 717 -462 -959 -364 -425 -301 -1087 -561 401
$$ packed form
3137h29k56J455n4j102R74L35j96J05K80P08Q8q79p43J334q76RL25kj80q89j79
3158e72M26J91j021K24Q38n43o69N96m1M05j005P9O76M52r68R33L33K22l51N69
3178G74N19p60m74K00P74n04l40L44j17J99j535j39J641j389J61j57N24L00k123
3197b102P64O18N57j083O66M43j31k54M01M02K30q00J440j48N68q18j95K000j814
3216G44o96k00P61o45L74%L73j523PN35l82N81j393J41Q04M32l99j82O01o88M7
3237g08N42R90q58J6M78J297n24p17L29q7n57M51q90J435n67m28M45l7o45j180
3257a215J98J40M63p37j96J131j058J73J266l47L21k49o23J643p93k75l79J861
3275A324j013J24K60K20j87l22R8K41k03o47J33O89j179m97N95o1J24p86N26R62
$$ plain form
3295 401 -1668 -1372 -498 457 -357 -648 38 977 -226 -572 1419 1266 671 -154 630 287 357 512 1192
3314 1192 675 543 -161 451 839 -1391 -713 285 -444 -859 -1320 -719 -1122 -269 -914 -566 -238 428 -707
3333 -707 -76 532 726 126 620 341 1106 324 1246 823 204 140 915 1346 -200 -625 223 1167 -370 -300
3353 -300 -206 -93 -1520 -917 -454 -320 -515 -918 -1464 -892 135 -383 797 657 -246 510 282 767 -348
3372 -348 403 289 1230 870 388 1240 1385 312 -287 460 257 -758 -151 268 -419 -661 -1122 140 -106
3391 -106 -849 -1364 -630 -396 -642 -796 -244 -73 -154 -627 182 903 675 -443 267 608 826 589 1133 382
3411 382 -214 -389 318 403 -422 -157 143 473 -357 -748 -1077 -302 -916 -1443 -486 -1249 -433 -314 526 -668
3431 -668 -54 1077 776 -122 -32 651 805 827 72 669 539 993 -283 159 1152 231 -314 -462 316 -516
$$ packed form
3295D01k069K96Q74R55q14k91O86R39j203l46J991j53n95q25P84l43P0J55O80
3314A192n17j32p04O12L88k230O78R98p29m15m61O01m03Q53o45L48L28O66j135
3333g07O31O08J94o00M94k79P65p82R22m23o19o4P75M31j546m25Q48R44j537P0
3353c00R4J13j427O03M63J34j95m03n46N72J027n18J180j40r03P56k28M85j115
3372c48P51j14R41l60m82Q52J45j073n99P47k03j015O07M19o87k42m61J262k46
3391a06p43n15P34K34k46j54N52J71q1m73Q09P21k28j118P10L41K18k37N44p51
3411C82n96j75P07Q5q25K65L00L30q30l91l29P75o14n27R57p63Q16J19Q40j194
3431f68O14J131l01q98R0O83J54K2p55N97j30M54j276M42R93r21n45j48P78q32
$$ plain form
3451 -516 -742 -537 -26 -558 -597 -716 -752 -731 -912 -322 217 158 -919 406 358 463 42 415 688 572 -3
3472 -3 512 683 616 709 662 805 277 198 -724 -321 33 -189 -941 256 -512 -543 -491 233 -89 -1306 -510 -314
3494 -314 143 -811 -361 677 427 -272 -31 1261 -16 -290 889 1295 431 375 646 134 524 -92 -290
3513 -290 445 127 -314 -628 120 -814 -678 -505 -491 48 -1118 -411 349 -784 -676 -249 262 919 -474
3532 -474 503 1076 1361 -56 619 675 1143 623 1017 449 68 -67 268 587 -362 -54 -1116 36 -1157
3551 -1157 -479 -330 -498 -469 -665 -697 -307 74 -434 589 369 1129 745 71 1983 130 282 517 777
3570 777 830 310 697 596 128 378 44 667 -255 -546 -1412 318 -646 -1371 -695 264 -596 -575 -439 -346 -896
3591 -896 -854 664 -58 1194 -250 600 776 378 -176 367 551 666 -115 979 909 557 -766 -447 458
$$ packed form
3451e16k26K05N11n32l9j19l6K1j81N90N39n9j077J325m8J05m21L73K73j16n75
3472cN15J71o7R3m7J43n28p9r22M03L54k22p52J197p68l1N2P24l22j217P96J96
3494c14M57r54M50J038k50o99K41J292j277k74J179M06q64n6K71n12L90o16j98
3513b90P35l18m41l14P48r34J36J73J4N39j166P07P60j133J08M27N11O57j393
3532d74R77N73K85j417O75N6M68n20L94n68l81j35L35L19r49L08j062J152j193
3551a157O78J49j68K9j96l2L90L81n08J023k20P60l84o74J912j853J52K35K60
3570G77N3n20L87j01m68K50l34O23r22k91q66J730r64p25O76R59q60K1J36R3n50
3591h96M2J518p22J252j444Q50J76l98n54N43J84J15p81J094p0l52j323L19R05
$$ plain form
3610 458 -92 -51 -330 -253 -871 -909 -496 -62 -498 -692 -503 -56 -509 -475 -426 505 549 179 371 683 133 396
3632 396 604 542 691 -35 566 972 127 308 355 307 -1291 -690 -514 252 90 -659 -435 -463 -1042 -1404 -478
3653 -478 -59 -132 -807 -120 134 39 34 1137 890 280 186 1264 1183 165 983 821 1095 564 -309 610 523
3674 523 -545 -262 -916 -10 -608 -513 -875 -37 -521 -1248 -220 -350 -560 -582 408 274 17 -464 826 474
3694 474 652 397 755 433 262 321 383 704 -201 99 -12 462 359 -321 574 -405 -1062 -1170 -671 -409 -540
3715 -540 -1070 -138 209 -310 -300 619 -584 -322 -58 530 386 777 1119 989 505 -347 216 908 220 433
3735 433 568 -65 16 -299 -508 528 697 -551 -396 214 175 -1176 -545 -225 160 -34 -820 -688 238 383
3755 383 -384 266 666 -94 -467 964 295 192 -368 69 616 -331 296 740 107 -89 -682 -517 49 -598
$$ packed form
3610D58n50M1k79P7o18l8M13M34m36j94J89M47m53L4M9R31M4l70J92L12n50K63
3632C96K08o2J49p26O01M06q45J81M7m8j598O01J76P66j62p49K24k8n79l62R26
3653d78M19p3o75O87K54r5nJ103k47o10r4J078q1j018Q18j62K74n31q73R19q7
3674E23j068K83o54R06n98R5l62Q38m84p27J028j30k10k2R90j34k57m81J290l52
3694D74J78k55L58l22j71N9O2L21r05L00j11M74j03o80Q95r79o57j08M99K62j31
3715e40n30R32L47n19J0R19j203K62K64N88j44L91L42j30m84q52N63O92o88K13
3735D33J35o33Q1l15k09J036J69j248J55O10l9j351O31L20L85j94p86J32R26J45
3755C83p67O50M00p60l73J431o69j03n60M37N47r47O27M44o33j96n93J65N66o47
$$ plain form
3775 -598 -653 -784 -177 -874 -897 -491 -442 -704 -357 -47 -489 -465 -482 105 369 101 -220 882 573 609 77 791
3797 791 514 -225 1153 706 770 -455 -242 874 -130 -510 -1034 -1095 -767 -615 -900 -1210 38 -1078 150
3816 150 343 -574 -382 644 463 385 75 662 808 555 -36 819 19 552 373 403 937 -260 -57 -118
3836 -118 609 -236 154 -654 644 -109 -478 -503 -283 131 -867 -249 -67 467 -139 -844 189 48 176 159
3856 159 15 23 310 82 548 322 -119 -194 869 -410 -461 -564 156 105 -251 -772 -114 -142 -970 -296 143
3877 143 64 -455 -825 205 57 -362 -128 255 413 74 559 882 229 331 346 100 536 -293 281 797
3897 797 575 -75 476 426 -377 -735 -914 121 -435 -705 -381 -610 219 -423 -128 179 -386 -337 -589 124
3917 124 494 127 812 902 -275 581 862 1596 349 -208 717 549 -177 -1043 88 652 286 -1057 248
$$ packed form
3775e98n5j31O07o97k3M06M9k62L47L10m42K4j7N87K64k68l21J102l09L6n32P14
3797G91k77p39J378m47O4j225K13J116j004l80n24o1L28J52k85l10J248j116J228
3816A50J93r17J92J026j81p8l10N87J46k53n91Q55q00N33j79L0N34j197K03o1
3836a18P27q45L90q08J298p53l69k5K20M14r98O18J82N34o06p05J033j41J28j7
3856A59j44QK87k28M66k26m41p5J063j279n1j03P20n1l56n21O58k8q28O74M39
3877A43p9n19l70J030j48m19K34L83J58l39M85L23o53J02J5k46M36q29N74N16
3897G97k22o50N51n0q03l58j79J035n56k70L24k29Q29o42K95L07n65M9k52P13
3917A24L70l67O85R0j177Q56K81P34j247n57R25j68p26q66J131N64l66j343J305
$$ plain form
3936 248 -239 -501 12 -869 45 -495 -997 -396 392 51 -69 319 311 -470 -22 1161 191 1097 138 568
3956 568 782 395 -119 294 697 -148 225 339 538 669 -704 -250 -416 -981 -317 -333 115 -127 323 -33
3976 -33 754 -185 -108 210 212 -460 -270 919 795 -350 -423 578 282 43 -198 -344 631 -378 -533 -440 1273
3997 1273 -167 -442 -323 44 -229 -329 -138 121 -723 -1077 489 -159 -347 233 -147 139 -16 438 277
4016 277 -141 419 277 626 1018 820 577 1111 -194 88 -131 248 279 -18 251 173 -186 -63 -255 -297 415
4037 415 -450 -376 -883 -176 224 -493 -158 21 -329 -867 1148 546 -154 -273 -114 783 -492 809 634
4056 634 -38 -286 373 369 458 116 67 513 151 -181 -375 694 -231 -608 -61 -454 -297 -895 -834 696 65
4077 65 -458 -18 216 1094 526 550 320 -38 250 475 515 -69 370 -204 454 321 46 353 65 -242 -1068
$$ packed form
3936B48m87k62N13q81R14n40n02O01P88l41j20L88qp81M48J183r70R06r59M30
3956E68K14l87n14M13M03q45L73J14J99J31j373M54j66n65O64j6M48k42M50l56
3976c3P87r39P7L18Ko72J90J189j24j145p3J001k96k39k41j46R75j009j55R3J713
3997A273j440k75J19L67k73j00J91K59q44l54J566o48j88N80l80K86j55M54j61
4016B77m18N60j42L49L92j98k43N34j305K82k19L79L1k97K69p8l59J23j92m2P12
4037D15q65P4n07P07M00p17L35J79l50n38K015o02p00j19J59Q97j275J301j75
4056F34o72k48O59mQ9l42m9M46l62l32j94J069r25l77N47l93J57n98O1J530o31
4077F5n23M40K34Q78n68K4k30l58K88K25M0n84M39n74O58j33k75L07k88l07q26
$$ plain form
4098 -1068 -652 -525 -437 -755 -4 -66 -33 -121 -681 429 -239 -518 -521 108 -414 39 94 943 541 -21 -425 -98
4120 -98 100 -646 -621 862 191 -559 237 709 78 -182 -131 19 -440 -420 -604 206 23 -1010 -591 395 489
4141 489 -662 347 168 194 220 78 377 508 712 709 889 596 433 759 983 -164 -375 -315 -664 -45 -553
4162 -553 -474 256 -10 -393 -514 -507 363 216 -13 271 6 -326 -701 508 -28 283 599 142 204 -174 655
4183 655 457 591 794 -105 348 -85 -344 196 426 -248 -54 -670 288 -850 -1102 246 -232 -394 -581
4202 -581 329 -660 -846 -636 320 -395 -384 -260 -436 604 -120 406 326 148 -133 352 -359 -177 -17 100
4222 100 396 -28 193 -611 -567 -197 67 -341 -994 -2 -789 -339 -503 -321 -796 -500 -75 37 -33 552 -1
4243 -1 391 225 353 345 777 415 234 671 262 745 -6 -373 -122 45 -503 66 99 136 -57 223 -565 -462
$$ packed form
4098a068M16J27Q8l18P51o2L3q8n60J110o68k79lO29n22M53N5Q49m02n62m04L27
4120i8J98p46K5J483o71p50P96M72o31k60N1J50m59K0j84Q10j83j033M19R86R4
4141D89j151J009j79K6K6j42K99J31K04lJ80k93j63L26K24j147k11O0l49O19n08
4162e53P9P30k66l83j21PQ70j47k29K84k65l32l75J209n36L11L16m57O2l78Q29
4183F55j98J34K03q99M53m33k59N40K30o74J94o16R58j138k52J348m78j62j87
4202e81R10r89j86K10R56p15J1J24j76J040p24N26q0j78k81M85p11J82J60J17
4222A00K96m24K21q04M4L70K64m08o53R92p87M50j64J82m75K96M25J12p0N85n53
4243aL92j66J28qM32l62j81M37m09M83p51l67K51J67n48N69L3L7j93K80p88J03
$$ plain form
4265 -462 -345 -500 -583 -478 -68 -576 -439 136 -203 174 191 19 -420 766 865 -228 647 236 163 -104 136
4286 136 -97 -50 50 -602 -318 208 -475 -747 -463 -276 -176 -389 70 89 -379 -209 -58 218 -121 -913 207
4307 207 388 99 -212 -502 246 419 -175 1043 45 -116 -302 -899 322 314 -495 -43 -119 -426 -840 125
4327 125 -495 -228 -845 -197 150 -275 -774 -141 -160 -446 439 188 376 157 -330 85 900 -12 -465 -547 116
4348 116 949 -156 90 580 54 237 -143 -79 -505 -277 -868 -618 69 -886 -310 -7 -496 20 123 -80
4368 -80 -183 543 -95 610 -479 458 -238 186 -471 97 -99 -171 -446 -149 -271 3 -514 -14 -975 33
4388 33 -30 -294 -353 -804 -335 -277 -65 -447 -88 -518 443 -84 -176 -407 740 550 -455 63 460 121 -325
4409 -325 -40 663 -175 594 -388 -217 -106 403 -225 213 -192 -515 591 410 -522 -930 213 157 377 -274
$$ packed form
4265d62J17j55q3J05M10n08J37N75l39L77J7j72m39J186R9j093Q75m11p3k67K40
4286A36k33M7J00o52K84N26o83k72K84J87J00k13M59J9m68J70J51K76l39p92J120
4307B07J81k89l11k90P48J73n94J218r98j61j86n97J221qq09M52p6l07m14R65
4327A25o20K67o17O48L47m25m99O33j9k86Q85k51J88k19m87M15Q15r12m53q2O63
4348A16Q33j105K46M90n26J83l80O4m26K28n91K50O87r55N76L03m89N16J03k03
4368h0j03P26o38P05j089R37o96M24o57N68j96p2k75K97j22K74n17N00r61J008
4388C3o3k64n9m51M69N8K12l82L59m30R61n27r2k31J147j90j005N18L97l39m46
4409c25K85P03q38P69r82J71J11N09o28M38m05l23J106j81r32m08J143n6K20o51
$$ plain form
4429 -274 296 60 -59 -239 227 158 -591 -144 434 1168 506 -126 100 197 819 107 1037 -274 462 259
4449 259 -623 515 -852 -764 -259 -411 189 -656 -523 142 -202 294 -227 -469 -418 -232 5 184 652 792
4469 792 301 566 3 492 492 617 437 -587 653 -306 600 -263 -343 287 -702 -729 103 221 -30 50 -607
4490 -607 565 534 -306 -408 -292 -334 38 76 118 250 52 242 -153 531 -17 233 674 93 -441 -374 -183
4511 -183 -36 -34 -116 30 -45 -330 -562 -131 503 -66 -118 -156 -508 -834 -298 161 405 566 283 387 32 777
4533 777 -346 238 -527 -47 -124 -42 -314 -102 -325 255 -342 48 400 -442 -405 130 -60 -550 -310 -504 -598
4554 -598 -571 -369 232 -594 -51 317 -215 86 726 234 45 -166 406 -234 828 -45 319 -203 401 -128
4574 -128 324 -284 -586 60 -433 172 180 385 108 -524 -417 -23 -64 -486 -1171 -598 285 550 -43 337 -182
$$ packed form
4429b74N70k36j19j80M66o9p49M47N78P34o62o32K26R7O22p12R30j311P36k03
4449B59q82J138j367Q8N05j52O00q45J33O65l44M96n21k42N1J86K37J79M68J40
4469G92m91K65n63M89%J25j80j024J240r59R06q63q0O30r89k7Q32J18k51Q0o57
4490f07J172l1q40j02J16m2L72L8M2J32j98J90l95O84n48K50M41n81n34O7J91
4511a83J47Kq2J46p5k85k32M31O34n69n2l8l52l26N36M59K44J61k83J04l55P45
4533G77j123N84p65M80p7Q2k72K12k23N80n97L90L52q42L7N35j90m90K40j94r4
4554e98K7K02O01q26N43L68n32L01O40m92j89k11N72o40J062q73L64n22O04n29
4574a28M52o08l02O46m93O05QK05k77o32J07L94m1m22o85N73Q83K65n93L80n19
$$ plain form
4595 -182 219 -151 78 -329 -750 94 -181 113 247 -90 98 -265 745 -584 117 120 -29 -494 -61 386
4615 386 138 -398 -133 -212 -365 -635 -435 -138 139 -152 -112 -281 -393 -303 -316 467 123 12 -44 1015 199
4636 199 -897 553 82 -244 786 -701 -377 -143 516 816 278 -613 424 5 779 -253 -1136 -100
4654 -100 87 -800 467 506 -161 220 316 322 72 6 -27 452 -196 301 308 -255 239 211 118 212 -466 2 125
4677 125 -360 922 -220 49 -26 -496 7 -422 -227 -426 89 -556 683 286 -320 -249 386 -127 -249 463
4697 463 -8 499 344 -443 163 146 -432 509 477 524 -339 -109 169 -851 -373 -342 8 -44 -748 207 91
4718 91 -448 338 -105 73 -807 392 -77 582 185 -179 246 299 461 648 264 -217 587 -268 385 200
4738 200 137 399 -112 154 -520 -98 -890 898 155 -301 -333 -161 -357 -75 155 -540 -832 -672 -306 6
$$ packed form
4595a82M01l70K29m07m21Q44k75K94J34l37J88l63J010j329P01Lj49m65M33M47
4615C86k48n36K65p9j53k70K00K97K77k91M0j69j12R0j3P83l44j11n6J059q16
4636A99j096J450m71l26J030j487L24K34O59L00n38q91J037m19P74j032q83J036
4654a00J87q87J267L9o67L81R6Ok50o6l3M79o48M97Pn63M94k8r3R4o78M68J23
4677A25m85J282j142K69p5m70N03m29J95j99N15o45J239l97o06P1O35n13j22P12
4697D63m71N07j55p87O06j7n78R41l2M7q63K30K78j020M78L1L50n2p04R55j16
4718I1n39P86m43J78q80J199m69O59l97l64M25N3J62J87l84m81Q04q55O53j85
4738B00o3K62n11K66o74M22p92J788p43m56l2J72j96K82K30o95k92J60L66L12
$$ plain form
4758 6 771 609 371 329 433 281 -38 260 473 151 290 -367 302 3 43 -746 -281 -783 12 -511 -321
4779 -321 197 385 -141 -357 -694 -283 -259 -162 -650 -618 211 410 365 -359 836 9 93 156 477 600 -786
4800 -786 -50 -709 35 -238 17 860 -328 5 -480 293 -147 -180 190 -470 181 -655 164 -519 370 301
4820 301 -754 48 142 -289 40 387 686 -280 199 479 280 428 -326 152 -318 871 109 1 -271 -338
4840 -338 203 103 -814 -309 -186 130 -233 -851 -393 -126 31 518 -84 372 -70 -126 110 71 452 -797
4860 -797 118 270 -38 -52 -453 561 941 88 172 -81 203 -378 -305 -4 214 -489 -4 223 -1096 -499
4880 -499 -458 378 454 96 -381 202 -86 201 114 144 1014 466 109 -53 313 416 591 -72 207 280 309 336
4902 336 184 -1047 292 839 30 169 -625 369 699 -272 143 43 -90 -437 61 206 -7 -320 321
$$ packed form
4758FP65j62k38m2J04j52l19K98K13l22J39o57O69k99M0p89M65n02P95n23J90
4779c21N18J88n26k16l37M11K4R7m88L2Q29J99m5p24J195q27Q4O3L21J23j386
4800g86P36o59P44k73K55Q43j188L33m85P73m40l3L70o60O51q36Q19o83Q89o9
4820C01j055Q02R4m31L29L47K99r66M79K80j99J48p54M78m70J189p62j08k72o7
4840c38N41j00r17N05J23L16l63o18M58K67J57M87o02M56m42n6K36l9L81j249
4860g97R15J52l08j4m01J014L80q53Q4k53K84n81P3L01K18p03M85K27j319N97
4880d99M1Q36P6l58m77N83k88K87q7L0Q70n48l57j62L66J03J75o63K79P3K9K7
4902C36j52j231J339N47q09J39p94R94L30r71M15j00j33l47M98J45k13l13O41
$$ plain form
4921 321 109 637 72 554 493 -300 -48 345 146 -685 412 557 139 -192 -652 211 138 -2 -511 -752
4941 -752 744 502 -779 -180 -157 -404 592 -741 557 -107 -223 -159 -423 575 553 -105 -150 495 232 -392
4961 -392 749 -199 569 340 -281 -247 -632 722 -280 -280 491 166 129 212 -576 -245 -687 511 62 -465
4981 -465 171 141 39 -432 353 -511 12 -55 344 -255 245 120 -512 -339 261 -81 376 -31 -9 -30 -336
5002 -336 -116 -475 135 -27 -53 -492 379 -565 -21 -612 -32 -414 -270 124 28 -181 -272 103 116 182 -462 6
5024 6 195 588 -452 350 -567 175 -236 -229 95 130 -303 -437 246 950 -191 -113 -524 -403 -482 88 731 -174
5046 -174 630 -325 224 -621 124 -789 100 31 184 143 259 712 323 -136 -19 785 -332 -424 -329 115 -852
5067 -852 41 -452 -545 -1401 -113 -215 -6 23 -59 98 -114 278 345 293 104 -213 376 -267 421 -675 495
$$ packed form
4921C21k12N28n65M82o1p93K52L93j99q31J097J45m18l31m60Q63p3j40n09k41
4941g52J496k42j281N99K3k47R96j333J298o64j16O4k64R98k2o58m5O45k63o24
4961c92J141r48P68k29o21L4l85J354j002%P71l25l7Q3p88L31m42J198m49n27
4981d65O36l0j02m71P85q64N23o7L99n99N00j25o32J73O00l42M57m07K2k1l06
5002c36K20l59O10j62k6m39Q71r44N44n91N80l82J44L94r6k09r1L75J3O6o44M68
5024FJ89L93j040Q02r17P42m11PL24L5m33j34O83P04j141P8m11J21p9N70O43r05
5046a74Q04r55N49q45P45r13Q89o9J53m1J16M53l89m59J17Q04j117r2R5M44r67
5067h52Q93m93r3q56J288j02K09K9q2J57k12L92O7n2j89l17N89o43O88j096J170
$$ plain form
5088 495 -527 113 85 -340 280 529 -157 -235 12 -300 -357 372 500 534 381 204 -330 408 49 -120 531
5109 531 -299 -28 -215 -240 105 -504 110 -43 785 534 241 679 761 520 17 252 261 -62 -365 120 257
5130 257 -413 101 -382 -8 137 -653 -143 -533 -952 101 388 -448 -84 504 -55 340 704 -188 110 -249
5150 -249 647 477 -456 -118 537 -50 52 911 -440 -617 -500 -708 -435 168 -960 31 -895 266 146
5169 146 -623 164 306 133 -502 -189 457 28 579 -15 529 303 -195 -23 180 156 83 198 -1 181 121
5190 121 441 -101 -138 178 228 -1131 -425 -188 7 -139 -137 -505 -919 14 318 -301 -316 -387 639 -463 -362
5211 -362 73 797 -355 -358 -98 -45 -148 -60 56 1250 172 -192 127 207 -343 -141 -39 116 -407 -756 -264
5232 -264 -641 328 67 244 515 -455 833 -625 -6 600 19 30 49 -114 -229 360 -295 690 -155 -83
$$ packed form
5088D95j022O40k8m25O20K49o86p8K47l12n7P29J28L4j53j77n34P38l59j69O51
5109E31q30K71j87k5L45o09O14j53Q28k51k93M38Q2k41n03K35Rl23l03M85J37
5130B57o70N14m83L74J45p90N10l90m19J053K87q36L64N88n59L95L64q92K98l59
5150b49Q96j70r33L38O55n87J02Q59j351j77J17k08K73O03j128R91r26J161j20
5169A46p69P87J42j73o35L13O46m29N51n94N44k26m98J72K03k4p3J15j99J82o0
5190A21L20n42l7L16N0j359P06K37J95j46Kl68m14R33L04o19j5p1J026j102J01
5211c62M35P24j152lK60N3j03Q8J16J194j078l64L19Q0n50K02J02J55n23l49M92
5232b64l77R69k61J77K71r70J288j458O19O06n81J1J9j63j15N89o55R85q45P2
$$ plain form
5252 -83 1024 -186 -396 -542 585 24 -91 -407 -698 -121 134 -408 -265 -18 -240 301 36 -317 -472
5271 -472 450 -190 194 -555 -25 348 -289 174 187 -45 -246 101 118 549 388 29 242 -397 447 -657
5291 -657 142 45 -390 19 115 -97 -238 -760 -422 91 -569 -84 34 -370 439 321 503 -137 647 -47 -58
5312 -58 411 -213 -726 518 302 450 -74 -727 -709 -26 -38 -277 45 -756 -868 -391 565 219 -296 -658 354
5333 354 339 118 588 -189 163 198 -311 -73 235 -510 595 280 -522 -333 -259 -124 -252 -245 410 93 562
5354 562 437 -235 -212 -206 -1092 -158 -157 -345 -158 67 132 376 -178 -547 547 -62 347 284 207 345 -1212 -184
5376 -184 59 -66 -53 384 -29 -350 -3 -200 36 -305 369 -34 328 244 -95 181 -396 20 -589 236 -355
5397 -355 3 -45 87 -37 -141 -827 177 -154 277 -181 903 -202 -242 324 -816 113 33 -447 -247 910
$$ packed form
5252h3J107j210k10j46J127n61j15l16k91N77K55n42J43K47k22N41k65l53j55
5271d72R22o40L84p49N30L73o37M63J3k32k01L47J7M31j61l59K13o39Q44j104
5291f57P99r7m35M09R6k12j41n22L38N13o60M85J18m04Q09j18J82o40P84o94j1
5312e8M69o24n13J244k16J48n24o53J8O83j2k39L22q01j12M77R56l46n15l62J012
5333C54j5k21M70p77L52L5n09K38L08p45J105l15q02J89P4J35j28PO55l17M69
5354E62j25o72K3Oq86R34Jj88J87K25O5K44n54l69J094o09M09o3p7J38j557J028
5376a84K43j25J3M37m13l21L47j97K36l41O74m03L62q4l39K76n77M16o09Q25n91
5397c55L58m8J32j24j04o86J004l31M31m58J084j105m0N66j140R29q0m80K00J157
$$ plain form
5417 910 12 238 -796 272 124 262 97 190 -24 -299 -790 -499 -404 87 616 -90 -430 194 421 555
5437 555 -415 -353 207 139 166 383 608 -50 370 475 -673 700 197 -506 65 -373 -29 -214 649 -162
5457 -162 -50 -781 92 567 134 -1013 520 222 2 9 -669 538 -452 71 796 -736 -218 590 -455
5476 -455 417 -56 83 -101 972 331 -66 -311 173 -226 -87 -355 682 -396 -93 -189 -1137 -330 -393 -96
5496 -96 439 890 -61 -374 528 -388 48 -547 2 -252 127 35 -396 -307 -504 -264 -22 -102 -215 195 33
5517 33 36 -209 221 10 -2 421 614 188 255 -487 134 306 -201 -427 -9 289 44 185 260 98 -4 48
5539 48 304 277 -301 -98 -316 -8 -667 -344 10 53 418 -915 -401 -222 44 323 175 604 122 -468 -451
5560 -451 436 -360 292 559 37 733 -797 415 382 542 -280 560 947 -397 -594 357 122 -43 -664
$$ packed form
5417I10q98K26j034J068j48J38j65R3k14k75m91K91R5M91N29p06l40O24K27J34
5437E55r70O2N60o8K7K17K25o58M20J05j148J373n03p03N71m38L44j85Q63q11
5457a62J12p31Q73M75m33j147J533k98k20Po78J207r90N23P25j532N18Q08j045
5476d55Q72m73J39j84J073o41l97k45M84l99J39k68J037j078L03r6r48Q07o3K97
5496i6N35M51r51l13R02r16M36n95N49k54L79r2m31Q9j97K40K42q0j13M10j62
5517C3Lk45M30k11j2M23J93m26O7p42O21J72n07k26M18K98k45J41P5j62j02N2
5539D8K56k7n78K03k18L08o59L23L54M3L65j333N14J79K66K79j48M29m82n90J7
5560d51Q87p96O52K67n22O96j530J212l3J60q22Q40L87j344j97R51k35j65o21
$$ plain form
5579 -664 -4 -374 -733 404 -100 -357 -146 -49 479 -69 63 -336 -264 264 438 420 597 -623 209 302 -706
5600 -706 526 453 -237 306 387 -7 -42 589 380 -255 138 226 -104 -377 -193 -729 -640 262 -67 219 -475
5621 -475 -141 -471 119 7 504 -375 295 334 -106 705 -383 208 275 187 86 389 588 704 179 18 -445
5642 -445 188 -87 371 -382 -65 -738 -733 9 428 256 96 131 -723 -60 1018 -41 294 -291 408 -387
5662 -387 -207 -71 -213 245 -433 234 -84 -232 102 -397 -118 -17 210 -263 133 -387 -10 265 103 -470
5682 -470 -234 -532 -182 127 -666 -227 19 223 214 260 577 333 858 -90 -257 185 -360 -269 505 -7 -189
5703 -189 437 -76 -530 -38 327 176 -1326 -57 21 229 -137 -136 315 -200 -441 -371 -87 -14 -243 438 29
5724 29 -23 177 -254 261 -370 113 2 260 374 -185 492 -656 522 -397 -455 -184 -16 140 -153 935
$$ packed form
5579f64O60l70l59J137n04k57K11R7N28n48J32l99P2N28J74j8J77j220Q32R3j008
5600g06J232p3o90N43Q1l94l5O31k09o35L93Q8l30k73J84n36Q9R02l29K86o94
5621d75L34l30N90j12M97q79O70L9m40Q11j088N91O7q8j01L03J99J16n25j61m63
5642d45O33k75M58p53L17o73NP42M19j72j60L5q54O63J078j059L35n85O99p95
5662c87J80J36j42M58o78O67l18j48L34m99K79J01K27m73L96n20L77K75j62n73
5682d70K36k98L50L09p93M39K46K04rM6L17k44N25r48j67M42n45R1P74n12j82
5703a89O26n13m54M92L65j51j502J269P8K08l66JM51n15k41P0K84P3k29O81m09
5724B9n2K00m31N15o31M83j11K58J14n59O77j148J178r19n8K71J68J56k93J088
$$ plain form
5744 935 -128 148 -38 -815 -237 -769 218 308 62 359 268 252 205 221 -43 429 317 402 -104 197 -289 50
5766 50 3 717 9 224 664 -31 -694 99 -46 -573 -153 -111 -38 -10 19 -576 51 653 361 323 -374 -268
5788 -268 -48 -823 -233 432 729 244 193 22 -558 -358 231 165 -339 -394 -530 -140 -406 -162 -173 266 132
5809 132 415 -449 -250 209 -588 -30 22 -106 545 187 752 -80 -101 339 109 630 -514 659 395 302
5829 302 75 413 -248 -357 -479 631 6 162 -91 -351 231 -629 -931 -43 460 -371 -148 476 -553
5848 -553 -405 158 -94 392 323 308 651 142 687 -243 496 383 -323 242 225 106 294 348 109 -252 -446
5869 -446 379 309 -134 205 -284 -725 -425 651 -395 -115 -54 -345 102 -407 -25 -64 -351 139 -298 165
5889 165 295 -207 274 -606 -454 2 268 -269 408 -471 -252 407 197 -33 -515 -666 93 128 130 -197 216
$$ packed form
5744I35j063K76j86p77N78n32R87R0k46K97r1j6m7J6k64M72j12Q5n06L01m86L39
5766E0m7P14p08K15M40o95o63P93j45n27M20M2P3K8K9n95O27O02k92l8o97J06
5788b68K20p75N90O65K97m85n1j71n80K00N89o6n04n5j36L90k66K44j1M39j34
5809A32K83q64J99M59p97N58N2j28O51l58N65q32k1M40k30N21j144J173k64r3
5829C02k27L38o61j09j22J110o25J56k53k60N82q60l02Q88N03q31K23O24j029
5848e53J48N63k52M86o9j5L43n09N45r30P39j13p06N65j7j19J88N4k39l61j94
5869d46Q25p0m43L39m89m41L00J076j046K80O1k91M47n09L82l9k87M90m37M63
5889A65J30n02M81q80J52M56K66n37O77q79K19O59k10k30m82j51P59L5Kl27M13
$$ plain form
5910 216 165 186 -339 -176 -438 57 -136 -28 65 189 328 142 95 474 -204 419 210 119 222 -929 -161
5931 -161 -118 -392 -1036 174 -105 428 233 262 -43 381 631 -320 -145 -17 109 30 -298 294 184 230 524
5952 524 496 735 182 185 -13 -862 -8 -587 -310 403 325 190 -5 -40 -557 -321 261 -55 -170 -292 101 -122
5974 -122 -682 378 -129 154 94 503 -616 104 551 -167 -225 266 322 -2 81 -84 -187 -207 133 -184 -427
5995 -427 -21 -104 -684 289 338 -133 -684 180 -12 -237 71 260 -317 63 -214 -847 28 176 0 -22 -84
6016 -84 25 -315 755 332 376 242 -429 -171 -156 499 83 217 -24 91 90 -42 -332 -69 516 -1224 -15
6037 -15 -72 -521 275 -459 208 476 -182 -296 -225 212 972 -195 361 567 -163 656 -564 671 560 -620
6057 -620 214 693 616 31 -164 -454 -114 -702 450 -103 -414 -680 -116 750 62 43 -229 -361 -324 -139 7
$$ packed form
5910B16n1K1n25J63k62M95j93J08R3J24J39j86m7L79o78O23k09r1J03j151P68
5931a61M3k74o44J210k79N33j95K9l05M24K50r51J75J28J26p9l28N92j10M6K94
5952E24k8K39n53Lj98q49Q54n79K77P13p8j35j95l5n17K36N82l16j15j22L93k23
5974a22n60J060n07K83o0M09j119P20M47p18n8M91N6l24Q3j65j03k0L40l17k43
5995d27M06q3n80R73M9m71n51Q64j92k25L08J89n77L80k77o33Q75J48j76k2o2
6016h4J09l40J070m23M4j34o71K58J5O55m16J34k41J15jj32k90K63N85j740J209
6037a5n7m49P96p34O67K68o58j14P1M37P60j167N56K06p30Q19j220J235j11j180
6057f20Q34M79p7n85j95k90L40n88J152n53l11k66N64Q66o88j9k72j32L7J85J46
$$ plain form
6078 7 21 659 -239 446 280 -10 -420 -158 -508 -532 137 37 37 -75 -482 -223 -396 31 -39 244 -41 277
6100 277 132 371 337 -850 -275 388 323 756 167 -385 -114 376 313 36 138 -81 -136 140 542 -38 226
6121 226 -81 -672 -795 -324 79 239 -3 -6 184 -101 166 789 -147 364 -289 53 -568 -83 -559 -35 -133
6142 -133 590 -369 171 -127 142 237 25 351 421 -30 -150 170 -23 -354 -300 389 69 475 -564 -35 234
6163 234 -680 -471 92 -266 272 601 115 453 580 -305 85 240 42 -101 41 -635 596 -62 15 50
6183 50 484 350 592 -320 256 -332 73 -251 -515 335 11 267 -654 -204 429 101 -667 -994 -175 546
6203 546 1 137 266 54 524 -435 -255 935 116 18 -133 58 -330 -271 -423 348 -497 23 -16 28 -560
6224 -560 -45 153 234 351 -155 -162 210 -6 -432 -445 -136 -11 -36 -14 -76 855 -831 150 316 -44 111 86
$$ packed form
6078GJ4O38q98O85j66k90m10K62l50k4O69j00%j12m07K59j73M27p0K83k85L18
6100B77j45K39l4j187N75O63o5M33n89n52K71M90o3k77J02k19n5K76M02n80K64
6121B26l07n91j23M71M03J60k42lJ90k85K67O23r36N11o53L42o21M85m76N24r8
6142a33P23r59N40k98K69R5k12L26P0m51j20L20j93l31N4O89l20M06j039N29K69
6163B34r14K09N63l58N38L29m86L38J27q85L90J55j98j43J42o76J231o58P7L5
6183E0M34j34K42r12N76n88M05l24k64Q50l24K56r21M50O33l28p68l27Q19P21
6203E46n45J36J29k12M70r59J80J190q19r8j51J91l88N9j52P71q45N20l9M4n88
6224e60N15J98Q1J17n06pL72k16m26j3L09J25k5K2o2R31j686R81J66l60J55k5
$$ plain form
6246 86 27 -688 84 -238 -614 -255 363 -126 473 -263 -376 -403 -321 -325 -38 -358 -217 -56 1 272 -259 466
6268 466 55 -100 -282 138 110 142 316 65 312 724 426 -318 -119 -404 -136 -227 -330 -338 638 147 84 179
6290 179 706 578 120 -417 551 117 408 -716 278 268 -276 89 -235 -147 -17 18 -95 -157 65 810 9
6311 9 -646 855 365 -152 -811 63 133 8 363 -47 -156 354 -252 -931 -461 494 -427 79 344 -598 -138
6332 -138 324 -11 229 162 4 169 548 -104 -368 719 -407 148 -488 437 -112 -826 414 -13 -612
6351 -612 -965 -892 783 280 -102 -361 136 314 -567 -331 -297 -194 385 -30 241 181 -479 417 -197 -230 526
6372 526 755 -323 548 -147 -131 598 -844 75 -381 299 -563 407 -502 -567 -273 -6 264 -715 81 536
6392 536 -181 528 198 -163 17 108 497 -306 -537 -537 -9 -56 -35 -111 -14 16 1268 547 -57 257 422 532
$$ packed form
6246H6n9p15P72l22l76L59O18m89N99p36j13k7Q2mK87l20J41J61N7K71n31P25
6268D66m11j55j82M20k8L2J74k51K47M12k98p44J99k85K68r1j03qR76m91o3R5
6290A79N27j28m58n37R68m34K91j124R94j0n44L65l24Q8J30L5j13o2K22P45q01
6311Io55J501m90n17o59Q74P0j25L55m10j09N10o06o79M70R55r21N06K65r42M60
6332a38M62l35K40o7j58J65L79o52k64J087j126N55o36R25n49p14J240m27n99
6351f12l53P3J675n03l82k59M97J78q81K36L4J03N79m15K71o0o60Q96o14l3P56
6372E26K29j078Q71o95J6P29j442R19m56O80q62R70r09o5K94K67K70r79P96M55
6392E36p17P09l30l61J80R1L89q03k31%N28m7K1p6R7L0J252p21o04L14J65J10
$$ plain form
6414 532 464 273 -1134 108 -141 447 191 304 132 181 -112 -421 418 -328 264 -153 -196 -405 501 -420
6434 -420 430 -1190 226 -643 327 -410 -576 -72 193 -245 415 876 201 218 35 -21 -261 -152 91 -317
6454 -317 -38 -158 -134 156 68 -555 116 -220 -79 -355 19 292 478 396 418 346 685 131 316 -66 493 40
6476 40 22 10 -396 -257 76 87 -55 -101 -618 201 -96 -480 -341 1037 -406 393 191 325 455 939 -461
6497 -461 -138 -310 -146 68 -399 -400 -533 617 -244 -469 209 935 -154 -367 -614 75 -311 359 -162 -54
6517 -54 677 -433 -208 -319 -902 -260 -122 -837 84 -775 101 -464 -399 209 150 352 -134 866 546 442
6537 442 -179 364 -756 424 -124 764 298 180 -202 25 -216 -592 -708 -77 213 178 580 241 32 143
6557 143 95 69 -124 573 -381 478 155 243 397 -7 306 215 740 352 -1270 454 130 610 -614 -295
$$ packed form
6414E32o8j91j407J242k49N88k56J13j72M9k93l09Q39p46N92m17m3k09R06r21
6434d20Q50j620J416q69R70p37j66N04K65m38O60M61o75J7j83n6k40J09K43m08
6454c17K79j20K4K90q8o23O71l36J41k76L74K73J86q2K2p2L39n54J85l82N59m53
6476D0j8j2m06J39L33J1j42m6n17Q19k97l84J39J378j443P99k02J34J30M84j400
6497d61L23j72J64K14m67jj33J150q61k25O78P26j089k13k47O89l86O70n21J08
6517e4P31j110K25j11n83O42J38p15R21q59Q76n65O5O08n9K02m86J000l20j04
6537D42o21N43j120J180n48Q88m66j18l82K27k41l76j16O31K90l5M02l39k09J11
6557A43m8k6j93O97r54Q59l23Q8J54m04L13r1N25l88j622J724l24M80j224L19
$$ plain form
6577 -295 -403 -546 316 807 -671 -312 -30 -19 286 -198 -310 -533 -218 -100 -202 426 -405 -713 3 220
6597 220 416 132 49 -57 -189 431 254 122 232 -164 47 287 62 -334 -208 -181 383 -338 130 336 -494
6618 -494 -874 70 -355 -276 182 237 -443 783 -204 -200 130 -434 -1 -827 982 479 894 -164 452 -467
6638 -467 -608 650 365 689 -47 -429 -326 503 -332 106 -150 282 280 -121 889 -89 -359 59 -66 397
6658 397 -270 17 210 614 -413 -305 -532 -603 375 695 -399 -294 125 -549 -30 -334 -106 201 681 -499
6678 -499 -195 167 424 53 266 -34 86 609 -639 135 -480 44 587 -426 -867 495 -706 294
6696 294 -31 -192 -166 645 70 137 -667 238 -16 -48 528 188 -238 -66 -75 -136 352 -294 -233 -1042 123 -299
6718 -299 -334 268 -4 292 636 391 -144 269 297 -30 916 -548 -155 2 221 -85 -245 51 160 362
$$ packed form
6577b95j08j43Q62M91j478L59K82J1L05m84j12k23L15J18j02O28q31l08P16K17
6597B20J96k84q3j06j32O20j77j32J10l96K11K40k25l96J26K7N64p21M68K06q30
6618d94l80R44m25P9M58N5o80J226r87ML30n64M33q26J809n03M15j058O16r19
6638d67j41J258k85L24p36l82J03Q29q35M38k56M32km01J010r78k70M18j25M63
6658C97o67K87J93M04j027J08k27p1R78L20j094J05M19o74N19l04K28L07M80j180
6678d99L04L62K57l71K13l00J20N23j248P74o15N24N43j013m41J362j201J000
6696B94l25j61K6Q11n75O7q04R05k54l2N76l40m26J72ro1M88o46O1q09J165m22
6718b99l5O02k72K96L44k45n35M13K8l27R46j464L93J57K19l06j60K96J09K02
$$ plain form
6738 362 -113 -87 501 -6 -85 36 -430 -15 -509 509 132 -340 -1173 -236 -687 -148 0 -378 -23 419
6758 419 215 142 346 -73 -463 106 -166 -27 76 107 404 268 -547 -337 -603 -270 237 -617 -284 -640 -280
6779 -280 -535 -114 273 -94 -265 425 1144 -216 446 567 398 -12 -188 -267 178 249 315 251 398 269 438
6800 438 -335 -385 -313 -69 -367 25 -531 398 148 632 -760 125 -127 567 113 151 284 44 318 -494 -27
6821 -27 -65 -352 136 570 887 583 -263 215 330 142 1042 299 -229 -193 -969 349 533 -373 -473 642
6841 642 163 -346 17 -473 -202 431 273 538 -321 77 201 -209 -119 41 2 -97 179 119 27 305 73 -149
6863 -149 373 -216 834 -116 -339 523 -491 -1054 -380 131 -275 256 -17 13 256 48 73 19 145 368
6883 368 -383 -751 202 371 380 492 812 -79 80 -762 351 -244 2 -47 -29 536 -196 -440 -682 458 634
$$ packed form
6738C62m75K6N88n07p9J21m66M15m94J018l77m72q33R37m51N39J48l78L55M42
6758D19k04p3K04m19l90N69k72J39J03L1K97j36q15K10k66L33N07q54L33l56L60
6779b80k55M21L87l67j71O90P19j360O62J21j69m10j76p9M45P1O6o4J47j29J69
6800D38p73n0P2K44k98L92n56R29k50M84j392Q85k52O94m54L8J33k40K74q12M67
6821b7l8k87M88M34L17l04q46M78J15j88R00p43n28L6p76J318J84r06j00J115
6841F42m79n09L63m90K71O33j58K65q59L98J24m10R0J60l9r9K76o0r2K78k32k22
6863a49N22n89J050r50k23Q62j014n63O74N11m06N31k73L0K43k08K5n4J26K23
6883C68p51l68R53J69RJ12L20q91J59q42J113n95K46m9J8N65p32k44k42J140J76
$$ plain form
6904 634 349 -110 -311 -429 22 -316 -47 336 281 -342 -341 75 -168 -103 -32 211 -134 83 -623 152 -141 -189
6926 -189 920 -176 -548 -544 -124 195 -166 -688 -465 585 -57 391 -367 39 36 -163 -782 -516 -260 112
6946 112 -572 726 267 -84 -749 -228 -281 490 -553 389 254 -153 391 -110 385 -256 37 -244 -518 69
6966 69 41 -263 633 -210 406 -294 -360 568 -425 -136 299 5 -394 284 46 86 -72 569 65 306 749
6987 749 175 312 248 306 -226 77 -28 -313 -73 -93 -100 215 408 453 -361 -536 -17 192 360 -576 624 262
7009 262 -172 -56 -925 336 89 316 -211 -242 349 2 147 411 -228 48 243 410 -296 398 -202 -233
7029 -233 433 432 604 193 31 147 382 348 626 -88 80 28 -355 70 -255 1015 -433 -30 -51 -137 -283
7050 -283 632 -514 643 -90 509 -318 114 541 -623 -522 668 14 73 -584 -172 -226 -493 -288 -539
$$ packed form
6904F34k85m59k01j18M51l38K69L83n5o23JM16k43O5P1K43l45K17p06P75k93m8
6926a89J109j096l72MM20L19l61n22K23J050o42M48p58M06lj99o19K66K56L72
6946A12o84J298m59l51o65N21n3P71j043R42j35m07N44n01M95o41K93k81k74N87
6966F9k8l04Q96q43O16p00o6R28r93K89M35k94l99O78k38M0j58O41n04K41M43
6987G49n74J37o4N8n32L03j05k85K40k0pL15J93M5q14j75N19K09J68r36J200l62
7009B62m34J16q69J261k47K27n27l1N91l47J45K64o39K76J95J67p06O94o00l1
7029b33O66jJ72m11j62J16K35l4K78p14J68n2l83M25l25J270j448M03k1q6j46
7050b83R15j146J157p33N99q27M32M27j164J01J190o54N9o57M12n4k67K05k51
$$ plain form
7069 -539 -767 -446 -67 729 -151 -930 149 49 -568 -192 -22 680 280 -162 -154 -589 45 -467 -654 -255
7089 -255 -288 -446 175 262 -267 519 219 -514 -646 209 391 140 -622 -103 -72 -218 22 36 408 801 -335
7110 -335 36 -327 -225 10 829 -37 81 149 674 -289 -374 -29 -430 -108 185 -125 -137 292 29 328 570
7131 570 -127 373 -92 345 184 -305 172 236 -461 -301 300 -125 619 -243 94 725 431 188 291 -1
7151 -1 -79 -410 -605 239 -384 -583 503 -172 -125 245 -888 85 -677 -516 45 -442 244 -69 57 116 665
7172 665 7 -829 788 339 -333 553 382 295 536 -486 -286 -321 670 -38 226 314 -715 -124 137 70
7192 70 -168 371 526 -93 -398 203 -204 -140 -267 -486 298 -473 84 -204 238 557 -58 341 77 -196 51
7213 51 119 -355 252 67 -209 -417 308 -565 -297 -212 166 -308 -493 248 214 -390 -485 -432 385 195 -774 -772 -221
$$ packed form
7069e39k28L21L79P96q80p79J079j00o17L76J70P02m00m42Qm35O34n12j87L99
7089b55l3j58O21Q7n29P86l00p33j32Q55J82k51p62N19L1j46K40J4L72L93j136
7110c35L71l63J02K35Q19q66J18O8N25r63q5L45m01L22K93l10j2M29k63K99K42
7131E70o97N00m65M37j61m89M77O4o97J60O01m25P44q62L37O31k94k43J03k92
7151ap8l31j95Q44o23j99J086o75M7L70j133R73p62J61N61m87O86l13J26N9N49
7172F65o58q36J617m49o72Q86j71q7K41j022K00l5R91p08K64Q8j029N91K61o7
7192G0k38N39J55o19l05O01m07O4j27k19P84p71N57k88M42L19o15L99k64k73K47
7213E1O8m74O07j85k76k08P25q73K68Q5L78m74j85P41l4o04r5N3Q17j90r69KN51
$$ plain form
7236 -221 -515 -586 -460 -13 -37 -55 145 763 -611 98 248 -320 92 170 290 160 715 219 200 146 -9 19
7258 19 -112 -473 -299 228 -316 -255 -526 -98 -344 -399 252 86 256 -173 100 201 562 281 -361 442 -403
7279 -403 636 -351 249 168 -527 313 149 130 -99 34 -201 659 -157 -131 92 496 286 -134 -177 -229 12
7300 12 -86 353 -80 -585 -205 205 397 -66 863 224 194 -748 372 -555 263 -81 634 12 -43 219 -110
7321 -110 -636 -66 -39 -476 -144 -771 -301 206 838 -148 -362 -803 -259 -292 -326 32 -725 218 218 -202 -367 51
7343 51 -89 -271 85 -14 41 -175 -295 -290 7 136 -732 -475 -341 -46 172 -72 79 -39 -197 45 165 -364
7365 -364 -1109 151 -429 -107 -137 317 -91 706 130 444 -338 167 -159 248 355 410 96 -72 537 -651
7385 -651 -173 -147 -502 35 229 -68 4 -743 215 -126 -233 -205 233 67 687 51 493 -324 211 -56 558
$$ packed form
7236b21k94p1J26M47k4j8K00O18j374P09J50n68M12P8J20j30N55m96j9n4j55K8
7258A9j31l61J74N27n44O1k71M28k46n5O51j66J70m29K73J01L61k81o42Q03q45
7279d03J039r87O00q1o95Q40j64j9k29J33k35Q60q16K6K23M04k10m20m3n2K41
7300A2r8M39m33n05L80M10J92m63R29o39l0r42J120r27Q18l44P15o22n5K62l29
7321a10n26N70K7m37L32o27M70N07O32r86k14m41N44l3l4L58p57R43%m20j65M18
7343E1j40j82L56r9N5k16j20NK97J29q68K57J34K95K18k44J51j18j58K42J20n29
7365c64p45J260n80L22l0M54m08P97n76L14p82N05l26M07J07N5l14j68O09j188
7385f51M78K6l55N37J94k97P2p47R58l41j07K8M38j66O20o36M42q17N35k67O14
$$ plain form
7406 558 -235 42 614 -108 469 301 264 -206 -217 470 -625 -243 429 171 393 484 111 -458 267 -497 675
7427 675 21 -55 -252 591 -338 -209 48 -19 524 -351 169 -240 -260 -405 -49 -104 -372 -501 -287 351 400 -242
7449 -242 -293 316 137 385 874 -316 142 -110 -222 -152 -285 -108 -153 -170 258 378 282 299 261 -411 161 593
7471 593 452 1232 306 169 -134 -28 126 702 249 -471 173 448 -893 -417 -658 -205 123 -245 715 -195
7491 -195 308 192 -296 -330 -448 64 113 -64 -495 511 77 581 -93 424 628 71 310 19 649 -439
7511 -439 593 -7 252 -265 -420 -72 16 220 -273 -819 -308 -919 -760 -542 -343 453 322 659 23 610
7531 610 -150 -627 505 355 -16 394 -189 296 178 265 247 813 88 -1027 57 -500 -878 96 -157 269
7551 269 -179 510 -24 162 143 23 -172 -469 -168 11 436 27 261 752 8 759 325 -728 -420 -118
$$ packed form
7406E58p93K77N72p22N77j68l7m70j1O87j095L82O72k58K22R1l73n69P25p64J172
7427F75o54p6j97Q43r29J29K57o7N43q75N20m09k0j45L56n5k68j29K14O38M9o42
7449b42n1O09j79K48M89j190M58k52j12P0j33J77m5j7M28J20r6J7l8o72N72M32
7471E93j41P80r26j37l03J06J54N76m53p20O44K75j341M76k41M53L28l68R60r10
7491a95N03j16m88l4j18N12M9j77m31J006m34N04o74N17K04n57K39k91O30j088
7511d39J032o00K59n17j55L48Q8K04m93n46N11o11J59K18J99P96j31L37o36N87
7531F10p60m77J132j50l71M10n83M85j18Q7j8N66p25j115J084n57l78R74k53M26
7551B69m48O89n34J86j9j20j95k97L01J79M25m09K34M91p44P51m34j053L08L02
$$ plain form
7571 -118 36 -300 424 -143 283 -172 284 716 208 -520 30 -184 -385 -32 -249 -149 -425 228 455 284
7591 284 474 72 264 -16 627 170 -152 -124 -343 253 -341 556 -88 543 -194 486 -471 -59 362 -46
7611 -46 340 86 476 -43 -117 -848 -177 -269 -49 364 -417 -622 203 402 55 359 -739 66 143 308 452
7632 452 -109 422 147 158 319 -55 185 813 452 647 633 -215 -180 -367 383 246 -447 -41 362 -101 -317
7653 -317 -803 163 -287 -373 71 -356 -426 274 322 445 -70 313 -148 277 24 619 -24 -246 -386 104 368
7674 368 264 369 95 -255 633 -11 477 322 296 -542 48 -69 269 -468 406 -211 0 -205 113 282
7694 282 -198 220 16 -216 -10 -215 -161 13 -232 870 34 -236 -556 -739 -329 -595 -32 -139 -237 -421
7714 -421 -337 -214 558 150 95 -307 -468 174 26 -266 92 54 -181 25 -554 -189 197 -218 299 358 -278
$$ packed form
7571a18J54l36P24n67M26m55M56M32n08p28N50k14k01L53k17J00k76O53K27j71
7591B84J90m02J92k80O43m57l22K8k19N96n94Q97o44O31p37O80r57M12M21m08
7611d6L86k54L90n19p4p31O71r2K20M13p81k05Q25J99l47L04j098Q05P7J65J44
7632D52n61N31k75J1J61l74K40O28l61J95j4q48L5j87P50j37o93M06M03m63k16
7653c17m86R66m50q6M44m27p0P00M8J23n15L83m61M25k53N95o43k22j40M90K64
7674C68j04J05k74l50Q88o44M88j55k6q38N90j17L38p37Q74o17K11k05L18J69
7694B82m80M18k04k32K06k05N4J74k45J102q36k70l20j83M10k66N63j07r8j84
7714d21Q4J23P72m08n5m02j61O42j48k92L58l8k35K06n79L65L86m15N17N9o36
$$ plain form
7735 -278 232 219 25 307 27 15 834 138 327 811 -353 370 11 118 -395 -424 -54 -455 -20 7 349
7756 349 -223 553 874 87 506 171 223 -21 -327 655 385 47 268 306 345 231 -9 713 347 -253 -214
7777 -214 62 -387 -481 -2 -241 131 -340 759 325 370 51 71 -359 -20 -28 50 -224 -280 488 230 296 546
7799 546 -655 0 -198 150 416 254 375 -226 -256 -258 341 642 250 -74 192 250 90 -546 -179 575 -589
7820 -589 467 2 -179 -153 737 -519 -155 317 -195 289 -30 538 -329 -254 -169 196 286 500 -476 65 -408
7841 -408 17 -156 -411 -18 -659 471 80 409 65 -224 51 -24 -107 -121 210 -369 86 -92 -313 218 -704
7862 -704 -55 117 387 356 -342 722 167 853 -290 41 -24 41 145 101 -309 -423 -33 -452 -209 -42 -341
7883 -341 120 577 361 -22 300 -15 686 -50 -311 982 258 -77 139 181 52 64 337 536 -209 -111 61
$$ packed form
7735b78N10j3j94K82k80j2Q19o96J89M84j164P23l59J07n13k9L70m01M35K7L42
7756C49n72P76L21p87M19l35N2k44l06R82k70l38K21L8L9j14k40P22l66o00L9
7777b14K76m49r4M79k39L72m71J099m34M5l19K0m30L39qP8k74n6P68k58O6K50
7799E46j201O55j98L48K66j62J21o01l0kN99L01l92l24K66N8j60o36L67P54j164
7820e89J056m65j81K6Q90j256L64M72n12M84l19N68q67P5Q5L65R0K14r76N41m73
7841d08M25j73k55L93o41J130l91L29l44k89K75p5q3j4L31n79M55j78k21N31r22
7862g04O49J72K70l1o98J064n55O86j143L31o5O5J04m4m10j14L90m19K43J67k99
7883c41M61M57k16l83L22l15P01p36k61J293p24l35K16M2j29J2K73J99p45R8J72
$$ plain form
7904 61 -152 -491 149 -107 -276 61 577 -401 -208 -823 -230 385 -715 824 -69 176 90 328 557 -149
7924 -149 238 -748 40 299 0 -705 -137 237 -174 293 127 193 -125 -627 -288 335 -88 447 39 1157
7944 1157 -224 -157 -184 295 -86 72 34 200 280 -318 -1 -430 680 -344 450 -20 -376 -13 -426 -591
7964 -591 58 280 -2 193 327 37 367 77 -82 554 127 276 164 228 -250 5 716 -52 -108 -7 328
7985 328 395 681 525 103 -21 -307 -200 122 4 -225 282 842 140 -572 270 -211 -470 -190 319 460
8005 460 -158 -35 -400 -330 -690 -828 814 -197 520 385 -100 169 420 33 269 913 103 67 78 256
8025 256 265 343 -507 32 -80 -116 -132 90 -228 -649 24 399 195 -365 -644 189 155 -314 -386 855 94 221
8047 221 454 -246 -126 381 403 -44 419 -348 -159 -132 225 153 -18 -631 -118 585 375 -373 -981 -802 315
$$ packed form
7904F1k13l39O40k56j69L37N16r78J93o15N93O15j100J539q93K45q6K38K29p06
7924a49L87r86P88K59k99p05N68L74m11M67j66O6l18n02L39O23m23N35m08J118
7944A157j381O7k7M79l81J58l8J66Q0n98L17m29J110j024P94m70l56L63m13j65
7964e91O49K22k82J95J34k90L30k90j59O36m27J49j12O4m78K55P11p68n6J01L35
7985C28O7K86j56m22j24k86J07L22j18k29N07N60p02p12Q42m81k59K80N09J41
8005D60o18J23l65P0l60j38J642j011P17j35m85K69K51l87K36O44q10l6J1J78
8025B56RP8q50N39j12l6j6K22l18m21O73L75k04n60k79Q33l4m69p2J241p61J27
8047B21K33p00J20N07K2m47M63p67J89K7L57p2j71o13N13P03k10p48o08J79J117
$$ plain form
8068 315 -236 -26 -331 -745 -599 399 -213 351 250 46 -271 58 467 -597 -283 82 -291 30 659 401
8088 401 -427 199 -94 405 -904 -106 351 380 228 353 265 -421 -167 -147 -256 222 -615 219 -506 -171 -34
8109 -34 59 423 -39 -559 -81 -65 -157 511 691 -378 742 83 -414 87 -114 354 -159 410 -412 -42 29
8130 29 -12 -114 13 -499 -139 -367 -177 -799 -38 -247 518 -222 241 -398 -160 913 395 732 368 299 -298
8151 -298 109 390 195 207 316 -476 231 157 -145 -433 -132 -7 73 -22 -97 43 -456 -514 -306 -408 1 -29
8173 -29 -934 -375 518 844 -371 104 255 226 192 35 -250 -705 489 342 607 63 388 -194
$$ packed form
8068C15n51K10l05m14J46R98o12N64j01k04l17L29M09j064L14L65l73L21O29k58
8088D01q28O26k93M99j309P98M57K9j52J25q8o86K54K0j09M78q37Q34p25L35J37
8109c4R3L64m62n20M78J6r2O68J80j069J120o59m97N01k01M68n13N69q22L70P1
8130B9m1j02J27n12L60k28J90o22P61k09P65p40M63o39K38J073n18L37l64o9n97
8151b98M07K81j95J2J09p92P07p4l02k88L01J25Q0r5p5J40m99n8K08j02M09l0
8173b9r05N59Q93L26j215M75J51k9l4j57k85m55J194j47K65n44L25n82
8191a94
$$ Imaginary data points
##PAGE= N=2
##DATA TABLE= (X++(I..I)), XYDATA
$$ plain form
0 0 0 0 0 0 0 0 0 0 0 0 0 0 0 0 0 0 0 0 0 -6 64 -64 64 -64 64 -64 89 -128 128 -131 189 -192 209 -256 270
35 270 -321 349 -393 450 -500 545 -609 675 -752 836 -923 1009 -1120 1239 -1363 1498 -1650
52 -1650 1821 -2012 2221 -2449 2723 -3034 3393 -3816 4323 -4943 5727 -6741 8127 -10133
66 -10133 13296 -19146 33607 -181343 -46254 147322 -85812 -96343 39758 30462 -79679
77 -79679 -22300 34805 42614 2846 -34403 -9460 82969 41806 -41156 19796 94421 -1089
89 -1089 -47982 50759 79043 -28269 -45180 26770 25428 -25187 -19326 -9205 -16517 -16727 -37491
102 -37491 -42053 17692 10446 -79200 -46335 56596 818 -70897 18500 57349 -33246 -29337
114 -29337 52375 43286 3718 5149 8107 32824 44082 -6239 -4977 58512 14039 -60854 10831
$$ packed form
0@%%%%%%%%%%%%%%%%%%%oP0j28J28j28J28j28J53k17K56k59L20l81M01m65N26
35B70n91O70p42Q43r50J045j154J284j427J588j759J932k129K359k602K861l148
52a650L471l833M233m670N172n757O427p209Q139r266J0670j2468J4868j8260
66a0133K3429l2442N2753k14950J35089J93576k33134j0531J36101r296j10141
77g9679N7379N7105P809l9768l7249K4943R2429m1163q2962O0952P4625r5510
89a089m6893R8741K8284j07312j6911P1950j342n0615N861J0121p312k10k0764
102c7491m562N9745p246q9646L2865J02931n5778p1715Q9397L8849r0595L909
114b9337Q1712r089l9568J431K958K4717J1258n0321J262O3489m4473p4893P1685
$$ plain form
127 10831 68598 -25642 -67388 12883 16442 -50561 -33233 14675 -10386 -44086 -29286 -4585
139 -4585 3261 -2806 -21910 -14253 20938 11373 -17513 19844 49154 -1526 -18673 39744 44332
152 44332 -855 7447 27049 3767 2547 14496 -3388 3022 11927 -32002 -32999 24304 622
165 622 -56231 -17362 17736 -33904 -42412 12353 7895 -30543 -18406 4809 8285 9811 -335
178 -335 -93 25542 18923 -8122 17647 50527 9557 -21829 24118 42857 -6779 -12666 24217
191 24217 6506 -26899 -7559 7572 -9543 -16160 -19493 -24595 -6829 -2578 -28786 -18154 10098
204 10098 -14979 -32295 11779 23127 -14628 -8330 21502 10837 5032 19941 15503 11582 21075
217 21075 7218 2157 29483 19435 -19924 -1599 26820 -6289 -26929 7008 6444 -29654 -23832
$$ packed form
127A0831N7767r4240m1746Q0271L559o7003J7328M7908k5061l3700J4800K4701
139d585P846o067j9104P657L5191r565k8886L7357K9310n0680j7147N8417M588
152D4332m5187Q302J9602k3282j220J1949j7884O410Q905m3929r97N7303k3682
165F22n6853L8869L5098n1640q508N4765m458l8438J2137K3215L476J526j0146
178c35K42K5635o619k7045K5769L2880m0970l1386M5947J8739m9636n887L6883
191B4217j7711l3405J9340J5131j7115o617l333n102J7766M251k6208J0632K8252
204A0098k5077j7316M4074J1348l7755O298K9832j0665n805J4909m438l921R493
217B1075j3857n061K7326j0048l9359J8325K8419l3109k0640L3937n64l6098N822
$$ plain form
230 -23832 778 -6922 -21145 -16896 -14003 -8259 -4524 -13767 -7029 14453 100 -18913 12942
243 12942 32974 -78 -7192 28597 23067 -4626 12290 29449 7402 -957 8912 4571 3482
256 3482 6111 -10359 -13595 3427 -9568 -27944 -5581 3689 -26305 -26055 3321 -4371 -20998
269 -20998 -5775 1866 -7147 -515 5622 2709 12703 14000 -1230 8498 30033 13277 -4257 19440
283 19440 24626 -6082 -2364 21533 6446 -13728 -1855 1504 -9938 -10176 -8413 -13818 -9083 -10547
297 -10547 -23189 -9733 4224 -14990 -21063 5622 6738 -14945 -708 19541 3311 -3531 16005
310 16005 17062 7188 13607 13801 6862 14683 13156 -1269 5335 14790 -6435 -12770 6970 704
324 704 -21140 -10483 -433 -15687 -19000 -6060 -10303 -15046 -6542 -9431 -9112 3863 9 -9152
$$ packed form
230b3832K4610p700j4223M249K893N744L735r243O738K1482j4353j9013L1855
243A2942K0032l3052p114L5789n530k7693J6916J7159k2047q359R869m341j089
256C482K629j6470l236J7022j2995j8376K2363R270k9994K50K9376p692j6627
269b0998J5223P641r013O632O137k913R994J297j5230R728K1535j6756j7534K3697
283A9440N186l0708L718K3897j5087k0174J1873L359j1442k38J763n405M735j464
297a0547j2642J3456J3957j9214o073K6685J116k1683J4237K0249j6230o842J9536
310A6005J057r874O419J94o939P821j527j4425O604R455k1225o335J9740o266
324G04k1844J0657J0050j5254l313J2940m243m743Q504k889L19J2975l854r161
$$ plain form
338 -9152 7437 16817 -969 1428 24349 14021 -1874 14342 22562 5727 3471 13865 5899
351 5899 -247 3351 -1497 -4790 900 -7843 -17738 -4538 -2409 -21722 -16106 1800 -11846 -21494
365 -21494 -1865 2540 -11501 -4834 7256 1443 2357 10413 6334 7303 16291 9131 3879 19444
379 19444 15926 -2015 5829 17918 1115 -7100 5758 2853 -12872 -8079 -1698 -10051 -11643 -9406
393 -9406 -14305 -10151 -3839 -13291 -13171 2832 -525 -14722 1089 13388 -1334 -4441 15387 13649
407 13649 1707 10291 16550 9434 8644 9829 5014 9089 10295 -4374 -4249 9522 -2742 -16634
421 -16634 -2400 1733 -17663 -16709 -1555 -7597 -16678 -7432 -4226 -8421 -4982 -2474 -3522 5515
435 5515 6478 -2553 4255 18470 8551 109 15174 19281 2182 4214 16416 8484 -2252 4325
$$ packed form
338i152J6589R380j7786K397K2921j0328j5895J6216Q220j6835k256J0394p966
351E899o146L598m848l293N690q743r895J3200K129j9313N616J7906j3646r648
365b1494J9629M405j4041O667J2090n813R14Q056m079R69Q988p160n252J5565
379A9444l518j7941P844J2089j6803q215J2858k905j5725M793O381q353j592K237
393i406m899M154O312r452J20J6003l357j4197J5811J2299j4722l107J9828j738
407A3649j1942Q584O259p116p90J185m815M075J206j4669J25J3771j2264j3892
421a6634J4234M133j9396R54J5154o042r081R246L206m195L439K508j048R037
435E515R63r031O808J4215r919q442J5065M107j7099K032J2202p932j0736O577
$$ plain form
449 4325 4095 -2223 -1249 -5372 -10013 -3326 -5954 -19343 -10327 663 -13796 -20136 -698 804 -14169
464 -14169 -6770 7442 -160 -3516 6217 7459 7682 10114 5586 6874 16530 10833 1093 11699 17037
479 17037 -2152 -4014 10979 4919 -11013 -6332 1539 -8434 -13006 -7162 -7975 -11749 -8993 -13166
493 -13166 -9881 194 -4702 -12935 243 9004 -3924 -2904 15462 10601 -1901 8267 16329
506 16329 8836 7086 10061 6809 8123 7010 -485 1755 9023 -3781 -14162 2082 2291 -16487
520 -16487 -13618 -395 -7879 -17822 -8088 -850 -8490 -9560 -5061 -990 2614 347 -1667 6236 11835
535 11835 3140 1649 17018 15850 -936 3686 17744 7919 -3282 7210 7698 -3198 -3813 -2026
549 -2026 -4426 -3428 -6372 -15083 -8445 -1048 -13155 -16325 366 -2998 -17084 -5868 7114 -1680
$$ packed form
449D325k30o318R74m123m641O687k628j3389R016J0990j4459o340J9438J502j4973
464a4169P399J4212p602l356R733J242K23K432m528J288R656n697r740J0606N338
479A7037j9189j862J4993o060j5932M681P871r973m572N844q13l774K756m173
493a3166L285J0075m896q233J3178Q761j2928J020J8366m861j2502J0168Q062
506A6329p493j750K975l252J314j113p495K240P268j2804j0381J6244K09j8778
520a6487K869J3223p484r943R734P238p640j070M499M071L604k267k014P903N599
535A1835q695j491J5369j168j6786M622J4058r825j1201J0492M88j0896o15J787
549b026k400R98k944q711O638P397j2107l170J6691l364j4086J1216J2982q794
$$ plain form
563 -1680 -5878 3372 6516 5026 6064 6910 9796 12260 5189 1534 14218 15387 -1542 -1440 11675
578 11675 5155 -10432 -2332 7415 -6214 -16025 -5737 -2662 -9927 -11527 -9802 -7316 -4797 -8810
592 -8810 -9794 3083 4204 -10151 -3407 14810 7021 -4272 8806 15475 4309 3703 13387 10243
606 10243 6090 4951 2326 5265 7768 -2945 -7304 3423 -207 -15277 -9170 1992 -7475 -18365
620 -18365 -7672 -1634 -8647 -10694 -4729 -879 -2568 -4109 -1395 7442 8344 -420 36 14857 13833
635 13833 -620 6083 18160 5847 -4866 8954 12763 -1667 -4305 1930 56 -4285 -6504
648 -6504 -8494 -3645 -5026 -14454 -10729 2352 -5839 -16431 -4347 4090 -6157 -6354 5887 6267
662 6267 -580 2518 6972 9500 10332 5968 4468 11510 9840 1270 3576 11450 3360 -8368 -1123
$$ packed form
563a680m198R250L144j490J038Q46K886K464p071l655J2684J169j6929J02J3115
578A1675o520j5587Q100R747j3629r811J0288L075p265j600J725K486K519m013
592h810r84J2877J121j4355O744J8217p789j1293J3078O669j1166o06R684l144
606A0243m153j139k625K939K503j0713m359J0727l630j5070O107J1162r467j0890
620a8365J0693O038p013k047N965L850j689j541K714Q837R02q764M56J4821j024
635A3833j4453O703J2077j2313j0713J3820L809j4430k638O235j874m341k219
648f504j990M849j381r428L725J3081q191j0592J2084Q437j0247j97J2241L80
662F267o847L098M454K528Q32m364j500P042j670q570K306P874q090j1728P245
$$ plain form
677 -1123 6863 -4403 -12024 -3427 -2697 -10348 -10159 -6309 -5256 -7516 -10896 -9216 1618 2039 -9512
692 -9512 -3488 11413 3052 -5405 9449 15910 2098 1124 10435 11234 5770 4175 5289 5661 4314
707 4314 -2118 -1371 4766 -938 -12456 -6069 1493 -7783 -14756 -4339 -2329 -10798 -11035 -1379 -413
722 -413 -4701 -5995 -1295 3351 4270 399 2673 11883 8775 -1357 7037 17661 5474 -2165 8611
737 8611 11043 -767 -2275 4170 1325 -3747 -6441 -5007 -1042 -4696 -13380 -9939 784 -6574 -15423
752 -15423 -3788 3295 -7700 -9296 3687 5771 -1382 -237 6119 7617 4110 4310 7574 11608
766 11608 7017 -192 5694 12254 3152 -5373 2940 6860 -5352 -8303 405 -707 -10696 -9393 -4078
781 -4078 -5047 -7614 -8865 -6404 -1789 -3055 -8327 -997 7154 -1205 -5185 7235 11723 1388 1740
$$ packed form
677a123P986j1266p621Q597P30p651J89L850J053k260l380J680J0834M21j1551
692i512O024J4901q361q457J4854O461j3812r74R311P99n464j595J114L72j347
707D314o432P47O137n704j1518O387P562r276o973J0417K010q469k37R656R66
722d13m288j294M700M646R19l871K274R210l108j0132Q394J0624j2187p639J0776
737H611K432j1810j508O445k845n072k694J434L965l654q684L441J0723p358q849
752a5423J1635P083j0995j596J2983K084p153J145O356J498l507K00L264M034
766A1608m591p209N886O560r102q525Q313L920j2212k951Q708j112r989J303N315
781d078r69k567j251K461M615j266n272P330Q151q359l980J2420M488j0335L52
$$ plain form
796 1740 11377 10791 2559 5231 8623 6874 3091 -878 1003 5245 -1229 -8898 -2064 2134 -9049
811 -9049 -12781 -1990 -1235 -12235 -10142 -845 -2904 -7553 -4348 890 1445 680 -325 3774 9152
826 9152 5080 -260 8192 13091 3166 878 10772 9095 -1687 315 5848 1852 -3102 -3032 -2092 -2563
842 -2563 -4789 -9423 -6583 -1771 -7517 -12252 -2626 141 -9253 -7891 4142 1567 -4588 -143 6980
857 6980 5375 2204 4650 8009 8943 5466 2450 6911 10058 1715 -2151 6150 5499 -5818 -5310 2704
873 2704 -2004 -10206 -6870 -1996 -6439 -8368 -6568 -4278 -2963 -5201 -7247 -782 3503 -2748 -3853
888 -3853 6825 7160 -727 2507 10774 7037 2287 6095 8011 6044 3440 2878 2861 4302 -695 -5445
904 -5445 -689 1438 -7245 -9231 -1231 -2251 -11105 -8413 -708 -4922 -8544 -3964 723 -1018 -2049
$$ packed form
796A740R637n86q232K672L392j749l783l969J881M242o474p669O834M198j1183
811i049l732J0791P55j1000K093R297k059m649L205N238N55p65j005M099N378
826I152m072n340Q452M899r925k288R894j677j0782K002N533l996m954P0R40m71
842b563k226m634K840M812n746m735R626K767r394J362J2033k575o155M445P123
857F980j605l171K446L359R34l477l016M461L147q343l866Q301o51j1317N08Q014
873B704m708q202L336M874m443j929J800K290J315k238k046O465M285o251j105
888c853J0678L35p887L234Q267l737m750L808J916j967k604n62j7J441m997m750
904e445M756K127q683j986Q000j020q854K692P705m214l622M580M687j741j031
$$ plain form
919 -2049 -688 4269 5523 2522 1353 8401 9754 765 3021 11180 6809 -1313 2817 8071 1841
934 1841 -3907 -347 901 -3802 -4976 -6094 -4004 -3329 -8160 -9501 -3322 -1657 -9201 -6426 2683
949 2683 -1330 -5038 18 6047 1728 388 4956 6258 6323 4463 3847 8109 7490 1222 1192 7414 4830
966 4830 -4126 -2271 4237 -2110 -9755 -4548 -449 -5523 -9330 -5258 -2376 -5552 -7657 -5105 -261
981 -261 36 -4566 -1704 6188 4117 -3162 3592 10250 4489 419 8225 9046 2541 2357 5336 4265
997 4265 1556 -373 -1327 911 418 -6114 -5101 -437 -4751 -10418 -5629 -1601 -6067 -8616 -2421 -536
1013 -536 -3592 -3395 -196 2541 2880 719 2020 7676 7370 460 4477 10311 5902 -709 4984 9509
1029 9509 -510 -3923 3186 3007 -3393 -5034 -3139 -2787 -4691 -8192 -5369 -1543 -5087 -9548 -3876
$$ packed form
919b049J361M957J254l001j169P048J353q989K256Q159m371q122M130N254o230
934A841n748L560J248m703j174j118K090O75m831j341O179J665p544K775R109
949B683m013l708N056O029m319j340M568J302O5j860o16M262o19o268l0O222k584
966D830q956J855O508o347p645N207M099n074l807M072K882l176k105K552M844
981b61K97m602K862P892k071p279O754O658n761m070P806Q21o505j84K979j071
997D265k709j929r54K238m93o532J013M664m314n667M789M028m466k549O195J885
1013e36l056J97L199K737L39k161J301N656l06o910M017N834m409o611N693M525
1029I509j0019l413P109j79o400j641J895L52j904l501K823L826l544m461N672
$$ plain form
1044 -3876 1725 -3721 -6133 1827 3852 -1572 -150 6209 4969 2671 3448 5590 7350 5588 2454
1059 2454 3526 6753 3052 -1625 1036 4089 -1752 -6792 -2337 -76 -6163 -7918 -3898 -3311 -6148
1074 -6148 -7189 -3925 -889 -2097 -5642 -2705 4526 2006 -2821 3860 9318 1125 -954 8379 9534
1089 9534 844 810 6549 5749 1144 90 1926 2925 -2206 -5468 -1885 1407 -5619 -8577 -3298 -2219
1105 -2219 -8349 -7082 -1230 -2368 -6751 -3887 785 1441 -1330 88 3148 4752 4370 2888 5769
1120 5769 8394 3334 371 5508 7552 1110 -1315 2841 2622 -3086 -3178 -173 -1508 -4418 -7230 -5313
1136 -5313 -1181 -4347 -9666 -4335 735 -4592 -6468 2185 3805 -4435 -1827 6185 5645 693 2514
1151 2514 7239 5934 2777 2699 6812 6460 682 -948 3472 3670 -2389 -3690 846 -1931 -7667 -4857
$$ packed form
1044c876N601n446k412P960K025n424J422O359j240k298P77K142J760j762l134
1059B454J072L227l701m677K661L053n841n040M455K261o087j755M020N87k837
1074f148j041L264L036j208l545K937P231k520m827O681N458q193k079R333J155
1089I534q690l4N739q00m605j054J836R99n131l262L583L292p026k958N279J079
1105b219o130J267N852j138m383K864M672O56k771J418L060J604l82j482K881
1120E769K625n060k963N137K044o442k425M156k19n708r2L005j335k910k812J917
1136e313M132l166n319N331N070n327j876Q653J620q240K608Q012n40m952J821
1151B514M725j305l157p8M113l52n778j630M420J98o059j301M536k777n736K810
$$ plain form
1167 -4857 -564 -4451 -8056 -5747 -3661 -3347 -3287 -3626 -2359 386 -61 -2027 3472 6839 1474 714
1183 714 6164 7168 2739 2958 6884 4335 935 1220 3092 3529 -721 -4327 -251 937 -4824 -6299
1199 -6299 -1144 -2080 -9211 -7872 -579 -2071 -7447 -4527 1115 -610 -2962 908 4032 2714 355
1214 355 1928 6383 6483 2008 2726 6461 5584 35 2033 6184 1134 -3481 -952 1234 -1958 -3620
1230 -3620 -4348 -4267 -4054 -5235 -5797 -2611 -2014 -5797 -6225 -72 1328 -2622 -1009 3973 3053 -131 2843
1247 2843 6583 5800 2095 2287 6628 5160 1034 139 4811 3136 -3088 -2070 2914 -200 -7442 -4384
1263 -4384 121 -4455 -7879 -3049 -2016 -4934 -6469 -2932 231 -342 -3058 -1629 2811 3408 -473
1278 -473 2418 7216 4045 951 4932 7082 3206 1044 3309 3427 1768 -412 -720 558 -153 -4538
$$ packed form
1167d857M293l887l605K309K086L14O0l39J267K745m47j966N499L367n365p60
1183G14N450J004m429K19L926k549l400K85J872M37m250l606M076J188n761j475
1199f299N155r36p131J339P293j492n376K920N642j725k352L870L124j318k359
1214C55J573M455J00m475P18L735q77n549J998M151n050m615K529K186l192j662
1230c620p28Q1K13j181n62L186N97l783m28O153J400l950J613M982r20l184K974
1247B843L740p83l705J92M341j468m126q95M672j675o224J018M984l114p242L058
1263d384M505m576l424M830J033k918j535L537L163n73k716J429M440N97l881
1278d73K891M798l171l094L981K150l876k162K265J18j659k180l08J278p11m385
$$ plain form
1294 -4538 -4879 -682 -2451 -7237 -6219 -972 -3314 -6531 -2944 1351 -2399 -4443 472 1902 2105
1309 2105 -296 2504 5508 5045 1663 2974 7968 4609 -575 3525 6912 1717 -2642 989 1649
1324 1649 -3211 -4287 -1456 -919 -4816 -6184 -3539 -1483 -3656 -6065 -3358 720 -1998 -4212 439
1339 439 3833 1001 -1128 3985 5305 2407 2348 4900 5305 3343 2223 2746 4560 2719 -1405 106
1355 106 2962 -857 -4936 -2264 -59 -4286 -6995 -2745 -1581 -5378 -5952 -2644 -291 -1979 -3520
1370 -3520 -508 2726 1091 -2311 2475 6331 2705 371 5660 6649 2256 1453 4457 4162 786 -647
1386 -647 1788 1867 -1393 -3702 -2247 -1055 -3671 -5999 -3815 -731 -5800 -6974 -1789 326 -3790 -3262
1402 -3262 227 1035 -572 -171 2498 3940 2553 1717 3684 6607 3180 588 3842 6145 613 -1417
$$ packed form
1294d538l41M197j769m786J018N247k342l217L587M295l750k044M915J430K03
1309B105k401K800L004m63l382J311M994l359n184M100L387n195m359L631O60
1324A649m860j076K831N37l897j368K645K056k173k409K707M078k718k214M651
1339D39L394k832k129N113J320k898n9K552M05j962j120N23J814j841m124J511
1355A06K856l819m079K672K205m227k709M250J164l797n74L308K353j688j541
1370c520L012L234j635l402M786L856l626k334N289R89m393q03L004k95l376j433
1386f47K435P9l260k309J455J192k616k328K184L084n069j174N185K115m116N28
1402c262L489Q08j607M01K669J442j387q36J967K923l427k592L254K303n532k030
$$ plain form
1418 -1417 3035 3264 -2836 -3166 -39 -108 -4381 -5084 -3322 -2217 -4690 -6235 -3190 130 -3889 -5143
1434 -5143 531 2885 -1122 -1632 4066 5133 606 1278 4798 4902 2231 1952 4045 5078 1684 72
1450 72 2530 3508 -1239 -3456 180 1045 -4637 -5622 -742 -1697 -5745 -4808 -1261 -1951 -4029 -2887 256
1467 256 1399 -471 -1720 2856 4792 841 517 5468 6301 1149 1710 5855 4867 3 718 3400
1483 3400 2099 -1872 -1305 68 -272 -3164 -6128 -950 -1256 -5389 -5760 -674 -1119 -4933 -3495 1142
1499 1142 73 -2488 -206 3017 2968 1269 2238 3886 4499 2366 2055 5408 5209 1384 164 4559
1515 4559 2412 -3139 -1428 1395 -1289 -4455 -3706 -2045 -3158 -4847 -4046 -1840 -1425 -3701 -3557 405
1531 405 934 -3426 -430 3659 3022 72 2007 5525 3674 1559 2821 5395 3317 1325 1390 2853
$$ packed form
1418a417M452K29o100l30L127o9m273p03J762J105k473j545L045L320m019j254
1434e143N674K354m007n10N698J067m527O72L520J04k671k79K093J033l394j612
1450G2K458R78m747k217L636Q65n682r85M880r55m048R37L547o90k078J142L143
1467B56J143j870j249M576J936l951l24M951Q33n152N61M145r88m864P15K682
1483C400j301l971N67J373l40k892k964N178l06m133l71N086m45l814J438M637
1499A142j069k561K282L223m9j699R69J648O13k133l11L353j99l825j220M395
1515D559k147n551J711K823k684l166P49J661j113j689Q01K206M15k276J44L962
1531D05N29m360K996M089o37k950J935L518j851k115J262K574k078j992O5J463
$$ plain form
1547 2853 2530 -1233 -1744 1408 -239 -4656 -3075 -517 -2592 -5712 -4214 -1825 -3067 -4686 -2769
1562 -2769 -460 -546 -1691 -1184 1805 2837 -76 1796 5992 5406 950 2733 4834 4010 557 1829
1578 1829 4081 1041 -1011 -5 568 -391 -3868 -3549 -1528 -1929 -5552 -4064 -635 -2396 -5935 -3392
1594 -3392 331 -1240 -2531 150 2110 1334 762 1814 4908 2916 729 1977 6002 4614 1001
1609 1001 1419 4469 1280 -2067 803 2394 -1474 -3717 -1387 -606 -3006 -4183 -3557 -1944 -3364 -4588
1625 -4588 -2416 -220 -17 -2720 -1489 2788 964 -852 2348 4114 2466 1200 3330 4901 3409
1640 3409 1277 2037 3448 1559 -463 -150 1520 -603 -4397 -2273 352 -2209 -5198 -2798 -1551
1655 -1551 -3778 -4650 -1381 299 -2863 -2905 -24 2104 541 -239 1129 5173 2771 566 3508 5212
$$ packed form
1547B853l23l763n11L152j647m417J581K558k075l120J498K389j242j619J917
1562b769K309q6j145N07K989J032k913J872M196n86m456J783K101q24l453J272
1578A829K252l040k052J006N73r59l477L19K021m01l623J488L429j761l539K543
1594c392L723j571j291K681J960p76n72J052L094j992k187J248M025j388l613
1609A001M18L050l189l347K870J591l868k243K330P81k400j177O26J613j420j224
1625d588K172K196K03k703J231M277j824j816L200J766j648j266K130J571j492
1640C409k132P60J411j889k022L13J670k123l794K124K625k561k989K400J247
1655a551k227q72L269J680l162m2K881K128j563p80J368M044k402k205K942J704
$$ plain form
1671 5212 2609 439 3423 4764 1244 -33 1183 78 -1078 -2510 -1615 -208 -2648 -4712 -3029
1686 -3029 -898 -3282 -4352 -2366 -179 -2298 -3013 -123 2259 52 -1019 2132 3628 2733 1623
1701 1623 3190 4335 2225 637 2950 4685 1614 -1437 1097 1898 -1048 -3023 275 -244 -3582
1716 -3582 -4259 -2488 -1820 -2930 -4606 -2026 71 -2521 -3291 796 850 -902 -1415 3786 4230 1115 1109
1733 1109 3633 3674 1494 2201 2964 3636 705 -210 871 2074 -24 -2736 -1708 56 -2368 -4780
1749 -4780 -1726 -787 -3751 -4773 -1464 -690 -2796 -3332 -673 999 283 -828 2485 3404 1043 274
1765 274 3164 5986 1789 946 4295 3414 586 240 2523 2156 -1699 -2085 110 -603 -3388 -3078 -944
1782 -944 -1922 -4591 -3863 -1327 -589 -3367 -2578 60 59 -1559 -103 2094 2552 677 1036 3708 3813 2048
$$ packed form
1671E212k603k170K984J341l520j277J216j105j156j432Q95J407k440k064J683
1686c029K131k384j070J986K187k119p15K890K382k207j071L151J496q95j110
1701A623J567J145k110j588K313J735l071l051K534Q01k946j975L298n19l338
1716c582o77J771O68j110j676K580K097k592p70M087N4j752n13N201M44l115o
1733A109K524M1k180P07P63O72k931r15J081J203k098k712J028J764k424k412
1749d780L054R39k964j022L309P74k106n36K659J672p16j111L313R19k361p69
1765B74K890K822m197q43L349q81k828l46K283l67l855l86K195p13k785L10K134
1782i44r78k669P28K536P38k778P89K638jj618J456K197M58j875L59K672J05j765
$$ plain form
1800 2048 880 3838 3857 1598 -552 1836 2136 -1180 -2461 151 303 -3395 -3121 -1879 -1644 -3424
1816 -3424 -3372 -1723 -863 -3474 -3178 -436 1030 -2117 -917 2037 2927 -195 1014 4954 3161 1011
1832 1011 1481 4225 2869 813 526 2031 2099 -1059 -2017 1230 -390 -3447 -3049 -56 -1627 -4568
1848 -4568 -3174 -909 -1788 -3430 -1793 320 -425 -738 -520 1862 3100 414 395 3223 3685 1514 1953
1865 1953 3989 3643 34 710 2632 2053 -1058 -1248 1033 511 -2831 -2818 -672 -524 -3891 -3394 -645
1882 -645 -1490 -3596 -2897 573 -473 -2474 -179 2727 1237 -622 1941 3510 2320 2022 1806 3767
1898 3767 3283 1057 940 3527 1920 -1159 -1565 805 -1458 -2896 -1966 -1286 -2726 -3293 -2353 -1356 -1404
1915 -1404 -3955 -1737 -625 85 -1308 -631 2550 1625 -776 490 2942 3107 898 2953 4385 1700
$$ packed form
1800B048j168K958J9k259k150K388L00l316j281K612J52l698K74J242K35j780
1816c424N2J649Q60k611K96K742J466l147J200K954Q90l122J209L940j793k150
1832A011M70K744j356k056k87J505O8l158r58L247j620l057L98K993j571k941
1848d568J394K265q79j642J637K113p45l13K18K382J238k686j9K828M62k171M39
1865A953K036l46l609O76J922n79l111j90K281n22l342J3K146J48l367M97K749
1882f45q45k106O99L470j046k001K295K906j490j859K563J569j190k98k16J961
1898C767m84k226j17K587j607l079m06K370k263j438R30O80j440n67R40R97m8
1915a404k551K218J112P10j393O77L181r25k401J266K452J65k209K055J432k685
$$ plain form
1931 1700 528 1926 2643 1472 -446 -528 788 -122 -2445 -1133 -264 -1325 -4439 -2947 -513 -2449
1947 -2449 -4062 -1919 344 -1022 -1853 -469 2025 832 -237 1516 3490 2333 931 2309 4177
1962 4177 3225 539 1908 3448 677 -97 899 702 -380 -2008 -1341 -440 -1398 -3539 -3055 -1401 -2427
1979 -2427 -3694 -1965 688 -1657 -3060 676 2102 159 -1384 2552 4221 2012 581 2368 4077
1994 4077 2383 1061 1769 3493 1653 -660 843 1942 -485 -2658 -967 344 -3136 -2981 -1593
2009 -1593 -1913 -3520 -3108 -1315 -419 -1564 -2371 -758 1208 -504 -988 1792 4102 1459 96 2936
2025 2936 3228 1796 628 2542 3091 716 -87 590 1840 -710 -1337 -1252 149 -2394 -3182 -1083 -309
2042 -309 -2309 -3302 -622 48 -1948 -1767 62 557 28 -28 1892 2255 1256 1174 2738 4093 1428 526
$$ packed form
1931A700j172J398P17j171j918q2J316r10k323J312Q69j061l114J492K434j936
1947b449j613K143K263j366q31J384K494j193j069J753J974j157j402J378J868
1962D177r52k686J369J540k771p74R96j97j082j628O67R01r58k141M84J654j026
1979b427j267J729K653k345j403L736J426j943j543L936J669k209j431J787J709
1994D077j694j322P08J724j840k313J503J099k427k173J691J311l480J55J388
2009a593l20j607M12J793Q96j145q07J613J966j712m84K780K310k643j363K840
2025B936K92j432j168J914N49k375q03O77J250k550o27Q5J401k543p88K099P74
2042c09k000r93K680O70j996J81J829M95n29n6J920L63r99q2J564J355k665r02
$$ plain form
2060 526 2435 3016 -288 -47 1794 1496 -1052 -1078 -450 -661 -2135 -2978 -1433 -1037 -2668 -3302 -975 -853
2078 -853 -2441 -2622 1012 500 -219 -823 1306 2227 581 608 1974 3705 1398 71 2646 2771 1568
2095 1568 -787 1567 2092 -902 -1730 164 680 -3307 -3001 -785 -547 -3290 -3220 -1019 -1205 -2115 -2286
2112 -2286 -475 1047 -1439 -1016 1871 2524 74 17 3638 3551 1195 1602 3200 2582 277 480 2034
2129 2034 1439 -815 -1672 -246 -220 -2718 -1810 -1213 -1190 -3241 -2930 -848 -1516 -2333 -2626 -151 -108 -1325
2147 -1325 -374 723 2068 736 28 2850 3233 1033 1076 3288 2953 70 1035 2229 1334 -1258 -1029
2164 -1029 644 -447 -2747 -2494 -1108 -1075 -3753 -3219 -260 -801 -2530 -1858 610 345 -585 -172 261
2181 261 1588 544 1499 3524 1516 1148 1883 2689 2281 674 801 1853 1169 -788 -781 1931 306 -2568
$$ packed form
2060E26J909N81l304K41J841k98k548k6O28k11j474q43J545L96j631o34K327J22
2078h53j588j81L634n12p19o04K129R21j646K7J366J731k307j327K575J25j203
2095A568k355K354N25k994q28J894N16l987L06K216K38k743P0K201j86r10j71
2112b286J811J522k486M23K887O53k450n7L621q7k356M07J598o18k305K03J554
2129B034n95k254q57J426K6k498R08N97K3k051L11K082o68q17k93K475M3j217
2147a325R51J097J345j332p08K822L83k200M3K212l35k883R65J194q95k592K29
2164a029J673j091k300K53J386L3k678N34K959n41j729O72K468k65r30M13M33
2181B61J327j044R55K025k008l68P35Q06m08j607J27J052o84j957PK712j625k874
$$ plain form
2199 -2568 -2510 -588 -1239 -3402 -2569 -982 -1571 -2175 -2382 336 244 -2346 -1220 1978 1482 -317 1276
2216 1276 2973 3150 319 619 4023 1822 -43 1066 2269 672 -363 38 516 228 -2514 -1430
2232 -1430 514 -1269 -2454 -2129 -638 -2005 -2649 -1514 240 -886 -1679 19 1468 1086 245 1165
2248 1165 2595 2063 1482 1832 3003 2600 371 577 2989 1303 -824 -206 992 -545 -1296 -1408 -403
2265 -403 -1410 -3173 -2220 207 -1343 -2835 -1904 287 -1521 -1448 -454 2369 429 -747 1751 2058 1474
2282 1474 817 2112 2737 1583 170 1646 2901 774 -824 -161 956 -277 -2299 -831 298 -1811
2298 -1811 -3285 -1125 -1112 -2233 -3166 -1858 -1031 -799 -1421 -487 1599 -308 -547 724 2011 1472 572
2315 572 1894 3829 1822 350 1750 2180 1559 -711 771 1066 -547 -1572 -664 835 -951 -3440
$$ packed form
2199b568N8J922o51k163Q33J587n89o04k07K718r2k590J126L198m96j799J593
2216A276J697J77k831L00L404k201j865J109J203j597j035M01M78k88k742J084
2232a430J944j783j185L25J491j367o44J135J754j126p93J698J449l82q41R20
2248A165J430n32n81L50J171m03k229K06K412j686k127O18J198j537p51j12J005
2265d03j007j763R53K427j550j492R31K191j808P3R94K823j940j176K498L07n84
2282A474o57J295O25j154j413J476J255k127j598O63J117j233k022J468J129k109
2298a811j474K160J3j121r33J308Q27K32o22R34K086j907k39J271J287n39r00
2315E72J322J935k007j472J400M30o21k270J482K95j613j025R08J499j786k489
$$ plain form
2331 -3440 -1422 -390 -1897 -2514 -867 412 -1197 -1804 -366 1071 -1056 -400 590 1358 1624 732 2420
2348 2420 2813 1213 -13 954 1986 564 -232 954 1119 -992 -1246 -507 -352 -2325 -2392 -1376 -1238
2365 -1238 -2040 -2534 -1195 -750 -1632 -2242 -393 769 -301 -389 1028 2221 638 389 2493 2313 1449
2382 1449 1047 2416 1873 515 397 1305 1185 -752 -2560 170 383 -2148 -2733 -1056 -677 -2140 -2953
2399 -2953 -1005 -470 -2551 -1853 86 813 -557 -744 671 2447 669 764 2174 1966 447 228 2932
2416 2932 2098 285 798 1273 952 -309 -1767 -36 167 -2343 -1405 -1308 -206 -1844 -2560 -413 -112
2433 -112 -2543 -1630 537 412 -732 -405 1102 980 -82 462 2514 2539 844 1322 2775 2072 248
2450 248 1013 1640 1173 -473 -1112 1028 -440 -1609 -2250 -604 -1075 -2689 -2223 -1675 -398 -1851 -1508
$$ packed form
2331c440K018J032j507o17J647J279j609o07J438J437k127O56R90P68K66q92J688
2348B420L93j600j226R67J032j422p96J186J65k111k54P39J55j973o7J016J38
2365a238q02m94J339M45q82o10J849J162j070q8J417J193j583k49K104j80q64
2382A449m02J369n43j358j18R08j20j937j808K730K13k531n85J677L79j463q13
2399b953J948N35k081O98J939P27j370j87J415J776j778R5J410k08j519k19K704
2416B932q34j813N13M75l21j261j458J731K03k510R38R7J102j638p16K147L01
2433a12k431R13K167j25j144L27J507j22j062N44K052K5j695M78J453p03j824
2450B48P65O27m67j646o39K140j468j169o41J646m71j614M66N48J277j453L43
$$ plain form
2467 -1508 88 -234 -1543 -655 1268 1297 -418 802 2001 1926 673 755 1830 1974 482 600 1412 847
2485 847 140 -1062 -261 1142 -1935 -1875 -624 -1212 -3176 -2242 -466 -1092 -1767 -1561 623 -54 -1297 -1297
2503 -1297 883 1058 -31 36 2544 2119 900 1249 3152 1831 678 799 1447 1356 -665 -734 396 -222
2521 -222 -1668 -1375 -491 -1157 -2444 -2397 -240 -951 -2308 -1126 -360 -553 -1017 -701 1266 860 -206 1271
2539 1271 1888 1210 990 739 2215 2198 828 614 1533 674 -588 313 1391 46 -1808 -863 276 -910
2557 -910 -2694 -2200 -1056 -1047 -2346 -1198 127 -794 -1534 -369 1773 1188 -494 938 2397 1028 -91
2574 -91 1147 3062 1352 464 339 1865 1062 -102 1178 925 -419 -1847 -781 -60 -1325 -2100 -1751
2591 -1751 -216 -382 -1426 -1817 -45 -532 -1110 -846 714 555 -796 703 2378 1192 541 1959 2362
$$ packed form
2467a508J596l22j309Q88J923K9j715J220J199p5j253Q2J075J44j492J18Q12n65
2485H47p07j202Q01J403l077O0J251n88j964R34J776o26o75K06K184o77j243%
2503a297K180J75j089O7K508m25j219L49J903j321j153J21O48r1k021o9J130o18
2521b22j446K93Q84o66j287M7K157p11j357J182P66j93m64L16J967m06j066J477
2539A271O17o78k20k51J476j7j370k14R19q59j262R01J078j345j854R45J139j186
2557i10j784M94J144Rj299J148J325r21p40J165K142n85j682J432J459j369j119
2574i1J238J915j710q88j25J526q03j164J280k53j344j428J066P21j265p75L49
2591a751J535j66j044l91J772m87n78K64J560j59j351J499J675j186o51J418M03
$$ plain form
2608 2362 984 -88 1125 2474 814 -763 -564 755 -306 -1724 -901 82 -879 -1903 -2005 -214
2624 -214 -673 -2724 -1310 -490 -1206 -771 184 94 -762 -175 925 1748 1520 65 1850 2310 1800 520
2642 520 1227 2245 1167 -788 981 735 199 -848 -665 -203 -1450 -1720 -1590 -790 -579 -1978 -880
2659 -880 -277 -285 -1454 -392 340 -484 -3 1002 1717 298 529 1338 2475 1255 664 1117 1903 812
2677 812 -231 1430 1554 -461 -1438 -931 -105 -1758 -2351 -596 -303 -1875 -1762 -909 -180 -1027 -1628 -107
2695 -107 583 -1045 -143 1342 931 371 -133 2061 1478 836 1110 2182 1748 119 -716 1454 375 -710
2713 -710 -500 71 389 -1419 -2300 -1431 -563 -1119 -2883 -911 -965 -2042 -1830 -378 316 -586 -715 798
2731 798 1693 1333 221 2422 1813 -306 91 1421 2048 1 380 966 525 -372 -1147 452 -328 -1252
$$ packed form
2608B362j378j072J213J349j660j577J99J319j061j418Q23R83r61j024j02J791
2624b14m59k051J414Q20p16M35R55r0q56N87J100Q23k28j455J785M60n10j280
2642E20P07J018j078j955J769k46n36j047J83M62j247k70J30Q00K11j399J098
2659h80O03qj169J062P32q24M81J005P15j419K31Q09J137j220n91M53P86j091
2677H12j043J661J24k015r77N07Q26j653n93J755K93j572J13Q53P29q47o01J521
2695a07O90j628R02J485m11n60n04K194n83o42K74J072m34j629q35K170j079j085
2713g10K10N71L18j808q81Q69Q68n56j764J972n4j077K12J452O94r02j29J513
2731G98Q95l60j112K201o09k119L97J330O27k047L79N86m41q97p75J599p80r24
$$ plain form
2749 -1252 -1433 -414 -1431 -1839 -2004 -1087 -433 -1821 -1592 302 -114 184 -158 721 1114 298 483 1303
2767 1303 1793 910 50 1802 2987 53 128 1104 1167 -557 -1523 207 -352 -1126 -1489 -516 -1375 -2067 -1629
2786 -1629 -924 -572 -2019 -565 -158 146 -1200 -337 833 323 418 171 2196 1658 586 555 1349 1179
2804 1179 752 518 1244 793 -48 -314 -686 -405 -1016 -1340 -467 -815 -1745 -1473 -609 194 -1186 -824 -288
2823 -288 -198 -246 -348 1072 800 -11 228 2080 1402 531 863 1493 1448 271 1368 1723 1276 -317 -357 731
2843 731 573 -1379 -1203 -124 -900 -1819 -569 -649 -592 -1050 -1973 -1 -460 -652 -50 650 534 -608 713
2862 713 1525 1280 -253 1492 1938 843 133 1051 1632 830 -276 227 92 -384 -868 -1166 390 -536
2880 -536 -1872 -438 -399 -1518 -1936 -900 -318 -659 -443 -618 231 419 -191 606 1313 1110 -802 84 2764
$$ packed form
2749a252j81J019j017m08j65R17O54j388K29J894m16K98l42Q79L93q16J85Q20
2767A303M90q83q60J752J185k934P5R76O3j724r66J730n59p74l63R73q59o92M38
2786a629P05L52j447J454M07L04j346Q63J170n10R5k47K025n38j072l1P94j70
2804A179m27k34P26m51q41k66l72K81o11l24Q73l48r30K72Q64Q03j380L62N36
2823b88R0m8j02J420k72q11K39J852o78q71L32O30m5j177J097L55m47j593m0J088
2843G31j58j952J76J079p76r19J250q0N7m58r23J972m59j92O02P00j16j142J321
2862G13Q12k45j533J745M46j095p10R18N81q02j106N03j35m76m84k98J556r26
2880e36j336J434L9j119m18J036N82l41K16j75Q49J88o10P97P07k03j912Q86K680
$$ plain form
2899 2764 1070 970 767 1699 855 352 214 445 -441 -803 -82 289 -320 -1745 -1300 -1072 -897 -1939 -721
2918 -721 32 -1004 -1189 -544 736 -5 -1125 687 1441 89 426 906 1296 778 -122 976 1489 411
2936 411 -61 1062 275 558 -1254 -474 -105 -239 -1930 -852 -408 -1204 -1593 -666 -198 -857 -1251 -450 587
2955 587 -685 -143 152 1085 -238 -34 759 1462 223 -230 1024 1275 -176 -33 603 826 227 -624
2973 -624 -683 -88 -1049 -1316 -562 -810 -1533 -1780 -135 -265 -1490 -440 -129 -200 -448 -219 802 914 639
2992 639 546 784 1650 569 -83 1582 1161 630 -244 320 870 -52 -908 -384 -170 -1070 -1143 -1216 -258 -1392
3012 -1392 -1628 -458 -220 -964 -1551 206 359 -618 -839 130 798 354 -518 633 1439 440 -384 1370
3030 1370 1909 631 253 450 773 -417 -143 82 -119 -945 -935 -203 -311 -1637 -1754 -694 -239 -940 -520
$$ packed form
2899B764j694j00k03R32q44n03j38K31q86l62P21L71o09j425M45K28J75j042J218
2918g21P53j036j85O45J280p41j120J812P54j352L37M80L90n18r00J098N13j078
2936D11m72J123p87K83j812P80L69j34j691J078M44p96l89R27M68o59l94Q01J037
2955E87j272N42K95R33j323K04P93P03j239m53J254K51j451J43O36K23n99q51
2973f24n9N95r61k67P54k48p23k47J645j30j225J050L11p1k48K29J021J12k75
2992F39r3K38Q66j081o52J665m21n31q74N64N50r22q56N24K14r00p3p3R58j134
3012a392k36J170K38p44n87J757J53r77k21R69O68m44q72J151Q06r99q24J754
3030A370N39j278l78J97L23j190K74K25k01q26J0P32j08j326j17J060M55p01M20
$$ plain form
3049 -520 -198 -419 232 296 583 1699 499 346 927 1378 785 715 946 701 233 -344 995 1174 -777
3068 -777 -75 704 32 -419 -1263 -220 -826 -1071 -1378 -214 46 -1434 -984 10 384 -577 40 454 1248
3087 1248 -375 711 524 1265 753 482 1052 1091 528 492 793 352 -682 -505 419 485 -554 -894 -815 -178
3107 -178 -893 -789 -868 5 -1432 -1144 -1206 401 -273 -797 411 781 -581 -110 1116 1760 629 156 1196
3126 1196 1127 424 628 986 921 264 22 544 -554 -1927 -897 81 98 -1744 -1463 -426 -993 -1073 -479
3145 -479 203 -188 -826 -346 708 -131 -3 231 1704 682 384 923 1422 310 515 -25 1480 846
3163 846 -340 -775 495 434 -1005 -1027 -865 -628 -985 -1302 -135 -136 -1473 -1031 -441 -362 -447 386 709 -147
3183 -147 -207 244 1837 829 787 647 1369 1045 464 1515 1276 358 268 66 448 -254 -861 52 -125 -974
$$ packed form
3049e20L22k21O51O4K87J116j200j53N81M51n93p0K31k45m68n77J339J79j951
3068g77P02P79o72m51q44J043o06k45l07J164K60j480M50R94L74r61O17M14P94
3087A248j623J086j87P41n12k71N70L9n63l6L01m41j034J77R24O6j039l40P9O37
3107a78p15J04p9Q73j437K88o2J607o74n24J208L70j362M71J226O44j131m73J040
3126A196o9p03K04L58o5o57k42N22j098j373J030R78J7j842K81J037n67q0N94
3145d79O82l91o38M80J054q39J28K34J473j022k98N39M99j112K05n40J505o34
3163H46j186m35J270o1j439k2J62K37l57l17J167jj337M42N90P9q5Q33L23q56
3183a47o0M51J593j008m2j40P22l24n81J051k39r18r0k02L82p02o07R13j77q49
$$ plain form
3203 -974 -1064 -1002 -143 -249 -1497 -559 384 -108 -1125 -533 65 101 -126 324 940 1168 303 630 1654 1090
3223 1090 528 617 1439 401 -324 388 569 -2 -815 -1215 -125 80 -1270 -652 211 -1120 -714 -678 -554
3242 -554 -852 -691 -169 -198 254 41 1019 1466 1197 648 1132 1331 1367 252 -144 872 175 312 499 376
3262 376 68 -872 -636 -757 -348 -1142 -830 -690 -1290 -1042 -425 407 -95 -1412 -735 -94 -256 -354 532 555
3282 555 143 491 662 1661 439 588 500 693 274 -80 -208 866 -296 -125 927 553 -531 -661 -327
3301 -327 -581 -1216 -1317 -58 -402 -726 -720 173 1119 194 -436 812 641 467 120 1494 1009 -424 82
3320 82 931 1692 514 -291 520 1015 -407 3 -176 63 -545 -803 -852 -74 -838 -787 -507 -493 -559 -907 -578
3341 -578 206 9 -67 575 974 547 351 799 1440 515 -399 968 788 508 207 890 460 781 -480 -130
$$ packed form
3203i74r0O2Q59j06j248R38R43m92j017N92N98L6k27M50O16K28q65L27J024n64
3223A090n62Q9Q22j038p25P12J81n71q13m00J090K05j350O18Q63j331M06L6J24
3242e54k98J61N22k9M52k13R78M47k69n49M84J99L6j115l96J016o97J37J87j23
3262C76l08r40K36j21M09p94L12J40o00K48O17Q32n02j317O77O41j62r8Q86K3
3282E55m12L48J71R99j222J49q8J93m19l54j28J074j162J71J052l74j084j30L34
3301c27k54o35j01J259l44l24OQ93R46r25o30J248j71j74l47J374m85j433N06
3320H2Q49P61j178q05Q11M95j422M10j79K39o08k58m9P78p64N1K80J4o6l48L29
3341e78P84j97p6O42L99m27j96M48O41r25r14J367j80k80l01O83m30L21j261L50
$$ plain form
3361 -130 80 -1218 -868 -460 -255 -768 -1333 -116 -400 -805 -1491 428 527 -657 -600 545 405 -192 -40
3380 -40 525 1112 472 969 800 1172 420 228 723 984 378 -276 222 9 -1005 -310 -770 -338 -814 36
3400 36 -736 -4 -913 -814 -649 156 -299 -336 900 576 295 766 907 1556 400 408 1037 1215 524 -597 600
3421 600 89 -415 -126 479 110 -624 -980 -772 288 -345 -575 -97 -103 -893 -597 433 -854 286 29
3440 29 322 577 600 225 334 1040 629 698 1387 246 123 -154 974 312 -262 161 -208 -53 -599 -791
3460 -791 -313 -900 -1030 -1088 -205 -138 -583 -326 709 -73 -381 -187 405 189 178 44 1139 847 219 440
3480 440 1217 415 463 188 1066 566 -584 571 1283 -528 -1259 -97 -192 65 -916 -919 -707 -457 -784 -739
3500 -739 39 -145 -634 -880 918 368 526 -299 975 1159 623 654 1460 274 305 742 932 44 610 -187
$$ packed form
3361a30K10j298L50M08K05n13n65J217k84m05o86J919R9j184N7J145j40n97J52
3380d0N65N87o40M97j69L72p52j92M95K61o06o54M98k13j014O95m60M32m76Q50
3400C6p72P32r09R9J65Q05m55l7J236l24k81M71J41O49j156QO29J78o91j121J197
3421F00n11n04K89O05l69p34l56K08J060o33k30M78op90K96J030j287J140k57
3440B9K93K55K3l75J09P06m11O9O89j141j23k77J128o62n74M23l69J55n46j92
3460g91M78n87j30n8Q83O7m45K57J035p82l08J94N92k16j1j34J095k92o28K21
3480D40P77q02M8k75Q78n00j150J155P12j811p31J162r5K57r81lK12K50l27M5
3500g39P78j84m89k46J798n50J58q25J274J84n36L1Q06j186L1M37J90q88N66p97
$$ plain form
3520 -187 40 -100 -1192 -163 -386 -842 -1145 -18 -623 -697 -1186 -807 -662 735 -748 -90 314 9 -444
3539 -444 -202 841 323 -130 137 796 454 74 431 1106 662 -60 117 997 -347 -863 -782 -87 -36 -824
3559 -824 -515 -104 -353 -1266 -552 41 -539 -825 -344 -131 322 219 219 1115 457 209 253 943 654 588 525 749
3581 749 -197 100 508 -152 3 -858 -276 618 -576 -1704 -749 -204 -729 -901 -279 -168 -329 -1178 -608
3600 -608 787 302 -233 831 658 -198 -296 385 1704 321 -68 412 492 232 -960 -31 1191 -260
3618 -260 242 -549 121 -121 -427 -318 -184 -686 -425 -282 -299 -844 88 -434 68 -68 -490 347 621 527 -160
3639 -160 183 753 765 300 804 1359 -11 -24 101 412 -18 -510 197 230 148 28 161 -248 76 -818 -468
3660 -468 -853 -1204 -652 -141 321 -594 -508 539 500 292 263 575 396 621 73 1662 817 226 -381 361
$$ packed form
3520a87K27j40j092J029k23m56l03J127o05p4m89L79J45J397j483O58M04l05m53
3539d44K42J043n18m53K67O59l42l80L57O75m44p22J77Q80j344n16Q1O95N1p88
3559h24L09M11k49r13P14N93n80k86M81K13M53j03%Q96o58k48M4O90k89o6o3K24
3581G49r46K97M08o60J55q61N82Q94j194j128R55N45n25j72O22J11j61q49N70
3600f08J395m85n35J064j73q56r8O81J319j383l89M80Q0k60j192R29J222j451
3618b60N02p91O70k42l06J09J34n02K61J43j7n45R32n22N02j36m22Q37K74r4o87
3639a60L43N70J2m65N04N55j370j3J25L11m30m92P07L3q2j20J33m09L24q94L50
3660d68l85l51N52N11M62r15Q6J047l9k08k9L12j79K25n48J589q45n91o07P42
$$ plain form
3680 361 609 -435 -105 -120 143 -438 -866 -437 -335 -704 -1156 -543 -94 -677 -710 304 141 -570 -341 661
3700 661 498 -84 -476 -82 801 562 -708 1009 1074 -330 -108 -366 86 -509 -56 78 11 -80 -393 -209
3720 -209 -455 -742 -784 -426 -487 -1084 -380 -1443 -622 -511 359 278 291 393 -209 656 947 744 358 479 1036
3741 1036 186 -375 610 427 162 -164 -284 -936 -7 -1027 -190 -362 -544 -359 -516 -309 -899 -987 2 352
3761 352 -468 -361 215 -96 380 32 1014 78 -34 512 733 880 512 437 601 513 -267 710 810 58 -341
3782 -341 -519 -906 -719 -734 -81 -480 -404 -264 -921 -699 581 -601 94 -358 676 789 135 1172 570
3801 570 -13 457 300 867 375 -596 334 172 528 231 584 102 -291 -329 -469 -652 -769 -340 -585 -392
3821 -392 -660 -225 -90 -114 -628 -1003 86 698 -289 -83 549 999 448 977 662 528 488 -495 1044 369
$$ packed form
3680C61K48j044L30j5K63n81m28M29J02l69m52O13M49n83l3J014j63p11K29J002
3700F61j63n82l92L94Q83k39j270J717O5j404K22k58M52n95M53J34o7r1l13J84
3720b09k46k87m2L58o1n97P04j063Q21J11Q70q1J3J02o02Q65K91k03l86J21N57
3741A036q50n61R85j83k65l26j20o52R29j020Q37j72j82J85j57K07n90q8R89L50
3761C52q20J07N76l11M76l48R82r36j12N46K21J47l68p5J64q8p80R77J00p52l99
3782c41j78l87J87j5O53l99P6J40o57K22J280j182O95m52J034J13o54J037o02
3801E70n83M70j57N67m92r71R30j62L56k97L53m82l93l8j40j83j17M29k45J93
3821c92k68M35J35k4n14l75J089O12r87K06O32M50n51N29l15j34m0r83J539o75
$$ plain form
3841 369 -245 125 143 -94 -828 -1313 81 36 -1057 -174 -220 -665 -464 -582 -38 -114 185 -42 424 122 353
3862 353 35 492 648 523 690 562 609 -175 29 759 182 595 410 -41 153 -213 -386 -6 196 -930
3882 -930 -233 -101 -156 -822 -668 645 -1030 -632 -765 283 -487 -435 495 210 695 280 400 234 427 502
3902 502 361 1073 101 327 263 700 -336 -247 15 289 85 -397 -1244 184 -135 -761 -1259 -207 121 -746
3922 -746 -17 53 -55 -293 264 690 65 -317 153 935 57 -486 606 437 -83 -295 -81 90 339 -60
3942 -60 -55 -820 -93 -887 -384 60 -380 -484 -429 -248 -668 41 -776 394 352 288 347 -8 -206 206 -512 1292
3964 1292 -44 258 530 410 393 -219 360 -34 567 -194 -161 234 320 -800 -204 -591 -537 -366 -844 -272
3984 -272 -542 -517 -125 69 200 365 32 682 -264 -144 -79 -342 -293 1096 159 298 -355 -570 110 -647 -162
$$ packed form
3841C69o14L70J8k37p34m85J394m5j093Q83m6m45K01j18N44p6K99k27M66l02K31
3862C53l18M57J56j25J67j28M7p84K04P30n77M13j85m51J94l66j73L80K02j126
3882i30O97J32n5o66J54J313j675L98j33J048p70N2R30k85M85m15J20j66J93P5
3902E02j41P12r72K26o4M37j036Q9K62K74k04m82q47J428l19o26m98J052L28q67
3922g46P29P0j08k38N57M26o25l82M70P82q78n43J092j69n20k12K14J71K49l99
3942f0Np65P27p94N03M44m40j04N5J81m20P09q17J170m2o4N9l55j98M12p18J804
3964A292j336L02K72j20j7o12N79l94O01p61L3L95Q6j120N96l87N4J71m78N72
3984b72k70K5L92J94J31J65l33O50r46J20O5k63M9J389r37J39o53k15O80p57M85
$$ plain form
4005 -162 -541 168 -187 128 -856 -624 -134 -416 -168 -187 -518 -453 -403 -9 -146 -245 -837 414 358 459 224
4026 224 701 830 -308 272 567 494 -386 17 56 474 -481 -569 62 -83 -348 -97 -56 -457 -423 -214 115
4047 115 -625 -846 -181 -156 -267 42 703 191 -207 134 265 787 190 -48 377 -226 497 579 389 531 431
4068 431 224 -274 616 -599 -541 166 -46 -481 -81 -945 -230 849 -311 -454 138 -710 -677 181 365 593
4088 593 -6 -8 726 745 466 765 751 943 222 256 827 438 154 275 -333 485 107 -647 -838 183 -273
4109 -273 44 497 21 -787 -401 623 -424 -195 629 289 323 -642 236 -96 593 716 123 1189 480
4128 480 398 -43 285 -353 -954 74 836 61 -778 -1361 -271 -246 -603 -1012 -333 -502 -253 -1081 592 52
4148 52 -14 -840 1 499 167 464 163 1423 -377 248 669 1558 -284 -534 832 -129 -772 468 319
$$ packed form
4005a62l79P09l55L15r84K32M90k82K48j9l31O5N0L94j37r9n92J251n6J01k35
4026B24M77J29j138N80K95p3q80M03L9M18r55q8O31j45k65K51M1m01L4K09L29
4047A15p40k21O65K5j11L09O61n12l98L41J31N22n97k38M25o03P23Q2j90J42j00
4068D31k07m98Q90j215N8P07k12m35M00q64P15J079j160j43N92q48L3Q58J84K28
4088E93n99kP34J9k79K99j4J92p21L4N71l89k84J21o08Q18l78p54j91J021m56
4109b73L17M53m76q08L86J024j047K29Q24l40L4r65Q78l32O89J23n93J066p09
4128D80q2m41L28o38o01J028P62p75q39n83J090K5l57m09O79j69K49q28J673n40
4148E2o6q26Q41M98l32K97l01J260j800O25M21Q89j842k50J366r61o43J240j49
$$ plain form
4167 319 325 -5 358 739 -40 -275 -469 80 141 -295 -525 159 97 -848 302 187 -256 -332 171 357 193
4188 193 -218 247 747 430 -641 171 532 231 342 -125 178 -199 465 -175 102 227 330 -166 185 -505
4208 -505 -590 -332 -278 -267 -1091 -94 -322 208 148 49 497 80 -283 -594 1216 -10 -680 388 75 -2 6 -365
4230 -365 -250 507 -238 45 37 -50 -1198 156 25 153 -79 -516 -300 36 -559 -191 111 576 -206 -150 585
4251 585 671 451 723 639 1029 378 482 559 -20 105 347 -202 -242 271 329 -86 -561 -508 -468 -64 -609 -488
4273 -488 -220 -142 203 -374 -404 69 -450 -265 379 -306 62 203 -106 351 -168 371 -526 92 407 -348 -89
4294 -89 -89 -354 -258 -139 182 -441 195 295 81 -183 -294 168 423 -5 -397 629 -184 291 -115 164 181
4315 181 -1168 -885 308 872 526 796 457 -92 149 74 -421 271 -289 197 -319 -298 296 0 -119 -841
$$ packed form
4167C19Ol30L63L81p79k35j94N49O1m36k30O84o2r45J150j15m43p6N03J86j64
4188A93m11M65N00l17j071Q12L61l01J11m67L03l77O64o40K77J25J03m96L51o90
4208e05q5K58N4J1q24R97k28N30o0r9M48m17l63l11J810j226o70J068l13p7Ql71
4230c65J15P57p45K83qq7j148J354j31J28k32m37K16L36n95L68L02M65p82N6P35
4251E85Q6k20K72q4L90o51J04P7n79J25K42n49m0N13N8m15m75N3M0M04n45J21
4273d88K68P8L45n77l0M73n19J85O44o85L68J41l09M57n19N39q97O18L15p55K59
4294h9%k65R6J19L21o23O36J00k14k64j11M62K55m28l92J026q13M75m06K79J7
4315A81j349K83J193N64l46K70l39n49K41p5m95O92n60M86n16K1N94k96j19p22
$$ plain form
4335 -841 -250 -778 -49 -31 -374 335 -609 -249 -585 -578 682 -363 -396 1311 -56 343 -170 267 -87 989
4355 989 297 252 309 124 100 -830 218 -114 -355 -518 451 -863 -21 -715 -48 555 -105 -237 -466 293
4375 293 -364 -335 77 605 26 79 553 8 -308 -115 -133 661 7 -347 -119 240 -486 154 178 -573 209
4396 209 86 -245 -733 209 -178 -272 705 -182 -397 -471 -818 105 -244 449 483 71 302 290 647 351 372 1013
4418 1013 772 453 263 689 490 73 -410 404 -420 -15 -335 -747 -742 -459 -284 -206 332 -626 -140 748 146
4439 146 -796 112 384 -53 -493 294 746 529 403 804 429 252 657 -131 551 -291 -205 480 1168 474
4459 474 198 -120 531 594 14 472 603 -930 200 279 -622 -208 -317 -114 634 118 -511 371 237 -196
4479 -196 -512 134 504 795 239 325 911 -279 -369 470 62 326 -245 14 146 -69 -184 -422 206 404
$$ packed form
4335h41N91n28P29J8l43P09r44L60l36PJ260j045l3J707j367L99n13M37l54J076
4355I89o92m5N7j85k4r30J048l32k41j63R69j314Q42o94O67O03o60j32k29P59
4375B93o57K9M12N28n79N3M74n45l16J93j8P94o54l54K28L59p26O40K4p51P82
4396B09j23l31m88R42l87r4R77q87k15p4l47R23l49O93L4m12K31j2L57k96K1O41
4418A013k41l19j90M26j99m17m83Q14q24M05l20m12NK83J75P8N38r58M86Q88o02
4439A46r42R08K72m37m40P87M52k17j26M01l75j77M05p88O82q42Q6O85O88o94
4459D74k76l18O51O3n80M58J31j533J130P9r01M14j09K03P48n16o29Q82j34m33
4479a96l16O46L70K91n56Q6N86j190r0Q39m08K64n71K59J32k15j15k38O28J98
$$ plain form
4499 404 -335 -224 446 199 552 433 29 261 100 195 443 138 46 -222 276 751 228 228 -338 171 101 304
4521 304 850 336 -480 -414 -661 264 -727 347 -76 -954 317 -419 -631 -256 -633 13 -519 150 125 193
4541 193 510 12 -80 591 449 91 477 -380 204 346 15 282 798 -314 -33 -298 153 -118 -856 -194
4561 -194 175 -105 51 -333 -147 176 -519 -234 124 -490 -106 -605 247 230 195 514 143 106 247 408 78
4582 78 -9 -159 -238 237 682 183 -507 -141 296 -251 -58 -70 -10 -1253 -27 -134 -446 -446 70 307 -328 -553
4604 -553 -155 182 -213 110 299 -277 0 65 -356 889 -51 -205 710 499 -311 -413 -298 -346 327 186
4624 186 -154 -200 -333 -448 397 -162 147 -461 -109 114 -398 -283 151 35 535 -273 297 -53 -119 354 108
4645 108 -93 -396 474 147 47 756 25 -894 -665 495 -234 170 163 53 186 -5 133 -255 23 -749
$$ packed form
4499D04p39J11O70k47L53j19m04K32j61R5K48l05r2k68M98M75n23%n66N09p0K03
4521C04N46n14q16O6k47R25r91J074m23q78J271p36k12L75l77O46n32O69k5O8
4541A93L17m98r2O71j42l58L86q57N84J42l31K67N16j112K81k65M51k71p38O62
4561a94L69k80J56l84J86L23o95K85L58o14L84m99Q52j7l5L19l71l7J41J61l30
4582G8q7j50p9M75M45m99o90L66M37n47J93j2O0j243J226j07l12%N16K37o35k25
4604e53L98L37l95L23J89n76K77O5m21J245r40j54R15k11q10j02J15m8O73j41
4624A86l40m6j33j15Q45n59L09o08L52K23n12J15M34j16N00q08N70l50o6M73k46
4645A08k01l03Q70l27j00P09p31r19K29J160p29M04pj10J33j91J38l88K78p72
$$ plain form
4665 -749 509 -27 -175 -263 1 202 -227 24 103 224 -120 406 257 54 -372 854 136 -71 542 900
4685 900 59 -291 -724 -542 295 -225 -1046 -586 68 338 80 591 -47 481 1024 343 448 -430 72 807
4705 807 363 -121 -104 453 371 977 207 -114 133 111 -77 110 -81 481 -122 247 219 -961 -278 214 527
4726 527 -532 -260 88 -316 16 -801 171 -430 178 -272 -4 -70 -10 209 -98 -62 249 391 -372 -242 556
4747 556 66 301 -11 306 -518 -306 57 331 -157 505 -465 -483 -76 -207 -31 77 -888 -100 -188 79 258
4768 258 -43 568 352 -437 159 9 -638 232 153 -168 -179 -162 61 -559 279 481 273 408 -596 -222 -121
4789 -121 130 158 408 -6 -218 73 -3 122 -218 -379 385 82 65 -160 -80 1092 743 73 256 954 -339
4810 -339 -71 273 3 94 -716 579 561 331 6 -186 -404 -529 111 -464 407 -95 372 -439 -16 276
$$ packed form
4665g49J258n36j48q8K64K01m29K51P9J21l44N26j49k03m26J226p18k07O13L58
4685I00q41l50m33J82Q37n20q21M60O54K70k58N11o38N28N43o81J05q78N02P35
4705H07m44m84J7N57q2O06p70l21K47k2j88J87j91N62o03L69k8j180O83M92L13
4726E27j059K72L48m04L32q17R72o01O08m50K68o6O0K19l07L6L11J42p63J30P98
4747E56m90K35l12L17q24K12L63K74m88O62r70j8M07j31J76J08r65P88q8K67J79
4768B58l01O11k16p89N96j50o47Q70p9l21j1J7K23o20Q38K02k08J35j004L74J01
4789a21K51K8K50m14k12K91p6J25l40j61P64l03j7k25Q0J172l49o70J83O98j293
4810c39K68L44k70R1q10J295j8k30l25j92k18j25O40n75Q71n02M67q11M23K92
$$ plain form
4830 276 -128 176 -471 -73 273 721 117 111 -427 91 108 803 -321 -359 550 -667 78 -514 -6 -146 119
4851 119 -512 77 33 -204 -273 603 -643 -487 390 49 638 498 -91 104 -52 -22 7 1146 111 -397
4871 -397 -189 260 72 -19 -141 -663 -422 -713 780 -246 79 -636 167 249 534 236 142 -622 -458 -761
4891 -761 4 -643 -280 -321 116 282 -714 -556 147 221 299 97 -22 453 -239 199 344 -325 -495 -81 -115
4912 -115 -40 -279 -505 211 173 -92 -572 -90 5 -310 370 -195 164 -96 93 77 221 444 276 393 349 43
4934 43 -352 840 -371 -311 -360 279 417 -542 70 -571 -377 -1040 -61 94 -158 309 -216 -148 604 -153 -278
4955 -278 -14 404 149 -160 70 622 -187 -250 7 -196 449 306 51 526 202 701 607 555 267 173 -88
4976 -88 434 -526 -283 -2 459 50 -559 -424 -727 -68 390 14 -178 -224 318 129 215 -116 -360 -514 406
$$ packed form
4830B76m04L04o47L98L46M48o04on38N18J7O95j124l8R09j217P45n92N08j40K65
4851A19o31N89m4k37o9Q76j246J56Q77l41N89j40n89J95j56L0K9J139j035n08
4871c97K08M49j88r1j22n22K41k91J493j026L25p15Q03Q2K85k98r4p64J64l03
4891g61P65o47L63m1M37J66r96J58P03P4P8k02j19M75o92M38J45o69j70M14l4
4912a15P5k39k26P16l8k65m80M82R5l15O80n65L59k60J89j6J44K23j68J17m4l06
4934D3l95J192j211O0m9O39J38r59O12o41J94o63R79J55k52M67n25O8P52p57j25
4955b78K64M18k55l09K30N52q09o3K57k03O45j43k55M75l24M99r4n2k88r4k61
4976h8N22r60K43K81M61m09o09J35l03O59M58l76j92m6N42j89Q6l31k44j54R20
$$ plain form
4997 406 195 78 538 -19 -237 395 -307 -516 385 -409 -225 -186 -309 -117 -503 -159 -405 160 106 -238 21
5018 21 -777 -202 218 352 581 14 -229 229 -566 258 30 -181 -419 357 137 -300 528 26 28 -239 -44
5039 -44 -465 98 -494 -81 -847 192 402 -41 231 -622 -331 -494 -519 906 92 32 -318 704 -641 251
5059 251 698 234 735 289 220 431 195 348 38 -123 -38 -339 -12 -248 -68 -85 -340 -291 -336 -369 -430 -367 136
$$ packed form
4997D06k11j17M60n57k18O32p02k09R01p94J84L9j23J92l86L44k46N65n4l44K59
5018B1p98N75M20J34K29n67k43M58p95Q24k28k11k38P76k20m37Q28n02Kk67J95
5039d4m21N63n92M13p66J039K10m43K72q53K91j63k5J425q14o0l50J022j345Q92
5059B51M47m64N01m46o9K11k36J53l10j61Q5l01L27k36J80j7k55M9m5l3o1O3N03
$$ [...]
8191G92
##END NTUPLES=NMR FID
##END=
