##TITLE=1H_IPACAT-31
 CDCl3
 8 sc, 
 16.12.2022
##JCAMPDX= 6.0         $$ Bruker NMR JCAMP-DX V2.0
##DATA TYPE= NMR FID
##DATA CLASS= NTUPLES
##ORIGIN= UXNMR, Bruker Analytische Messtechnik GmbH
##OWNER= root
$$ XWIN-NMR		Version 3.5
$$ Fri Dec 16 13:53:20 2022 Russian Standard Time (UT+4h)  she@DPX200
##.OBSERVE FREQUENCY= 200.13135
##.OBSERVE NUCLEUS= ^1H
##.DELAY= (6, 6)
##.ACQUISITION MODE= SIMULTANEOUS
##.ACQUISITION SCHEME= undefined
##.AVERAGES= 8
##.DIGITISER RES= 18
##SPECTROMETER/DATA SYSTEM= spect
##.PULSE SEQUENCE= zg30
##.SOLVENT NAME= CDCl3
##.SHIFT REFERENCE= (INTERNAL, CDCl3, 0, 15.7039)
##AUDIT TRAIL= $$ (NUMBER, WHEN, WHO, WHERE, WHAT)
$$ ##TITLE= Audit trail, XWIN-NMR		Version 3.5
$$ ##JCAMPDX= 5.01
$$ ##ORIGIN= Bruker BioSpin GmbH
$$ ##OWNER= she
$$ F:/spectra/data/she/nmr/H-F/1/audita.txt
$$ ##AUDIT TRAIL=  $$ (NUMBER, WHEN, WHO, WHERE, WHAT)
(   1,<2022-12-16 13:51:53.89 +0400>,<she>,<DPX200>,
      <created by zg, POWCHK disabled, PULCHK disabled
       configuration hash MD5:
       00 E9 B6 7A A2 85 ED C7 34 08 36 98 17 FE 4E 26
       data hash MD5: 16K
       A4 D2 38 BD B5 8B 5D 8E C9 71 60 A7 FF 64 35 3A>)
$$ ##END=
$$ 
$$ hash MD5
$$ E6 03 09 CC 50 37 66 A9 71 FB 9A EE 7E 85 87 5B
##$RELAX= 
##$RELAX= 
##$RELAX= 
##$RELAX= 
##$RELAX= 
##$RELAX= 
$$ Bruker specific parameters
$$ --------------------------
##$DU= <F:/spectra>
##$EXPNO= 1
##$NAME= <H-F>
##$PROCNO= 1
##$TYPE= <nmr>
##$USER= <she>
##$AMP= (0..31)
100 100 100 100 100 100 100 100 100 100 100 100 100 100 100 100 100 100 
100 100 100 100 100 100 100 100 100 100 100 100 100 100 
##$AQSEQ= 0
##$AQ_mod= 1
##$AUNM= <au_zg>
##$AUTOPOS= <>
##$BF1= 200.13
##$BF2= 200.13
##$BF3= 200.13
##$BF4= 200.13
##$BF5= 200.13
##$BF6= 200.13
##$BF7= 200.13
##$BF8= 200.13
##$BYTORDA= 1
##$CFDGTYP= 0
##$CFRGTYP= 5
##$CHEMSTR= <none>
##$CNST= (0..31)
1 1 145 1 1 1 1 1 1 1 1 1 1 1 1 1 1 1 1 1 1 1 1 1 1 1 1 1 1 1 1 1 
##$CPDPRG= <>
##$CPDPRG1= <>
##$CPDPRG2= <>
##$CPDPRG3= <>
##$CPDPRG4= <mlev>
##$CPDPRG5= <mlev>
##$CPDPRG6= <mlev>
##$CPDPRG7= <mlev>
##$CPDPRG8= <mlev>
##$CPDPRGB= <>
##$CPDPRGT= <>
##$D= (0..31)
0 1.2 0 0 0 0 0 0 0 0.06 0 0.03 0 0 0 0 0.0002 0 0 0 0 0 0 0 0 0 0 0 0 
0 0 0 
##$DATE= 1671184313
##$DBL= (0..7)
120 120 120 120 120 120 120 120 
##$DBP= (0..7)
150 150 150 150 150 150 150 150 
##$DBP07= 0
##$DBPNAM0= <>
##$DBPNAM1= <>
##$DBPNAM2= <>
##$DBPNAM3= <>
##$DBPNAM4= <>
##$DBPNAM5= <>
##$DBPNAM6= <>
##$DBPNAM7= <>
##$DBPOAL= (0..7)
0.5 0.5 0.5 0.5 0.5 0.5 0.5 0.5 
##$DBPOFFS= (0..7)
0 0 0 0 0 0 0 0 
##$DE= 6
##$DECBNUC= <off>
##$DECIM= 32
##$DECNUC= <off>
##$DECSTAT= 4
##$DIGMOD= 1
##$DIGTYP= 9
##$DL= (0..7)
0 120 120 120 120 120 120 120 
##$DP= (0..7)
150 150 150 150 150 150 150 150 
##$DP07= 0
##$DPNAME0= <>
##$DPNAME1= <>
##$DPNAME2= <>
##$DPNAME3= <>
##$DPNAME4= <>
##$DPNAME5= <>
##$DPNAME6= <>
##$DPNAME7= <>
##$DPOAL= (0..7)
0.5 0.5 0.5 0.5 0.5 0.5 0.5 0.5 
##$DPOFFS= (0..7)
0 0 0 0 0 0 0 0 
##$DQDMODE= 0
##$DR= 18
##$DS= 0
##$DSLIST= <SSSSSSSSSSSSSSS>
$$ [...]
##$SUBNAM2= <"">
##$SUBNAM3= <"">
##$SUBNAM4= <"">
##$SUBNAM5= <"">
##$SUBNAM6= <"">
##$SUBNAM7= <"">
##$SUBNAM8= <"">
##$SUBNAM9= <"">
##$SW= 18.05172834244
##$SWIBOX= (0..15)
0 0 2 0 0 0 0 0 0 0 0 0 0 0 0 0 
##$SW_h= 3612.71676300578
##$TD= 16384
##$TD0= 1
##$TE= 0
##$TE2= 300
##$TE3= 300
##$TEG= 300
##$TL= (0..7)
0 120 120 120 120 120 120 120 
##$TP= (0..7)
150 150 150 150 150 150 150 150 
##$TP07= 0
##$TPNAME0= <>
##$TPNAME1= <>
##$TPNAME2= <>
##$TPNAME3= <>
##$TPNAME4= <>
##$TPNAME5= <>
##$TPNAME6= <>
##$TPNAME7= <>
##$TPOAL= (0..7)
0.5 0.5 0.5 0.5 0.5 0.5 0.5 0.5 
##$TPOFFS= (0..7)
0 0 0 0 0 0 0 0 
##$TUNHIN= 0
##$TUNHOUT= 0
##$TUNXOUT= 0
##$USERA1= <user>
##$USERA2= <user>
##$USERA3= <user>
##$USERA4= <user>
##$USERA5= <user>
##$V9= 5
##$VALIST= <valist>
##$VCLIST= <CCCCCCCCCCCCCCC>
##$VD= 0
##$VDLIST= <DDDDDDDDDDDDDDD>
##$VPLIST= <PPPPPPPPPPPPPPP>
##$VTLIST= <TTTTTTTTTTTTTTT>
##$WBST= 1024
##$WBSW= 4
##$XGAIN= (0..3)
0 0 0 0 
##$XL= 0
##$YL= 0
##$YMAX_a= 306079
##$YMIN_a= -253569
##$ZGOPTNS= <>
##$ZL1= 120
##$ZL2= 120
##$ZL3= 120
##$ZL4= 120
##$ABSF1= 10
##$ABSF2= 0
##$ABSG= 5
##$ABSL= 3
##$ALPHA= 0
##$AQORDER= 0
##$ASSFAC= 0
##$ASSFACI= 0
##$ASSFACX= 0
##$ASSWID= 0
##$AUNMP= <proc_1d>
##$AZFE= 0.1
##$AZFW= 0.1
##$BCFW= 1
##$BC_mod= 2
##$BYTORDP= 1
##$COROFFS= 0
##$CY= 11.3945322036743
##$DATMOD= 1
##$DC= 2
##$DFILT= <>
##$DTYPP= 0
##$F1P= 2.36226072786647
##$F2P= -0.459571619588291
##$FCOR= 0.5
##$FTSIZE= 0
##$FT_mod= 4
##$GAMMA= 1
##$GB= 0.15
##$INTBC= 1
##$INTSCL= 1
##$ISEN= 128
##$LB= 0.24
##$LEV0= 0
##$LPBIN= 0
##$MAXI= 10000
##$MC2= 0
##$MEAN= 0
##$ME_mod= 0
##$MI= 1.114404
##$NCOEF= 0
##$NC_proc= 0
##$NLEV= 6
##$NOISF1= 3.799351
##$NOISF2= 2.8
##$NSP= 1
##$NTH_PI= 0
##$NZP= 0
##$OFFSET= 15.70392
##$PC= 1
##$PHC0= -19102.12
##$PHC1= 16.80072
##$PH_mod= 1
##$PKNL= yes
##$PPARMOD= 0
##$PSCAL= 0
##$PSIGN= 0
##$REVERSE= no
##$SF= 200.130013532006
##$SI= 16384
##$SIGF1= 3
##$SIGF2= 2
##$SINO= 400
##$SIOLD= 16384
##$SREGLST= <1H.CDCl3>
##$SSB= 0
##$STSI= 0
##$STSR= 0
##$SW_p= 3612.71676300578
##$SYMM= 0
##$S_DEV= 0
##$TDeff= 0
##$TDoff= 0
##$TI= <>
##$TILT= no
##$TM1= 0
##$TM2= 0
##$TOPLEV= 0
##$USERP1= <user>
##$USERP2= <user>
##$USERP3= <user>
##$USERP4= <user>
##$USERP5= <user>
##$WDW= 1
##$XDIM= 8192
##$YMAX_p= 0
##$YMIN_p= 0
$$ End of Bruker specific parameters
$$ ---------------------------------
##NTUPLES= NMR FID
##VAR_NAME=  TIME,          FID/REAL,        FID/IMAG
##SYMBOL=    X,             R,               I
##VAR_TYPE=  INDEPENDENT,   DEPENDENT,       DEPENDENT
##VAR_FORM=  AFFN,          ASDF,            ASDF
##VAR_DIM=   8192,          8192,            8192
##UNITS=     SECONDS,       ARBITRARY UNITS, ARBITRARY UNITS
##FACTOR=    0.0002768,     1,               1
##FIRST=     0,             0,               0
##LAST=      2.2672688,     0,               0
##MIN=       0,             -253569,         0
##MAX=       2.2672688,     306079,          0
$$ Real data points
##PAGE= N=1
##DATA TABLE= (X++(R..R)), XYDATA
$$ [...]
1878a05K74KM65Q9k8M72j79j48J9m83m31rL3k39J78M2K44n84k04m73K7M0K89L71
$$ -105 169 171 636 725 697 1169 990 842 861 378 -53 -62 -29 -268 -90 -48 196 -388 -592 -1065 -1038 -998 -709 -338
1902c38K51J64L1j4j09l2K27J67K75J95k7j26l73j30j91k2k06K27L14J00m04k27
$$ -338 -87 77 108 94 -15 -47 180 347 622 817 790 664 291 161 -30 -52 -258 -31 283 383 -21 -248
1924b48l61j74K70K12J97J7O7o6J75l22P7O2M0M03k37K33J15j93P5N0j48j36k2
$$ -248 -609 -783 -513 -301 -104 -87 -20 -86 89 -233 -156 -94 -54 349 112 345 460 267 342 392 244 108 86
1947H6k45l90j59J04L33J43J36L96m14K17l82j59k61Q5N54J0O17R0j00k82r6l34
$$ 86 -159 -549 -708 -604 -271 -128 8 404 -10 207 -175 -334 -595 -510 44 54 671 761 661 379 283 -51
1969e1j86j85L22j04K28k89j41J29M0j84R9Mk02O6o9K61K66K80O6L89K22O7o46
$$ -51 -237 -422 -100 -204 24 -265 -406 -277 -237 -421 -322 -318 -520 -454 -523 -262 4 284 350 739 961 1028 382
1992C82l18j33k09M3M37NJ65R8n52j39l60l30j91K44J74L21K44K77j21J99mk41
$$ 382 64 -69 -278 -235 202 207 372 470 -82 -221 -581 -911 -1102 -858 -684 -363 -119 158 37 236 232 -9
2014iK09J62k2K68J8K75J4l6N8k41j16l74n01m53K20l33L60Q0K9K38n19M1k92
$$ -9 200 362 340 608 626 901 915 879 937 696 580 206 -295 -748 -528 -861 -501 -421 -392 -154 -673 -632 -924
2037i24J56PK67L5P24J15M40p6M1Q1q5M22k08p7j59m45Ml95n3K01j13l45j77r5
$$ -924 -768 -761 -494 -459 265 380 820 744 785 866 781 1203 995 918 759 314 318 -77 -130 71 -42 -387 -564 -659
2061f59p83O5L1K59L92L46L33J2J34k0j39J86L72k3K96N27K1j55j91o5k63k73
$$ -659 -1442 -1377 -1346 -1087 -695 -349 -16 -4 130 110 -29 157 529 506 802 1329 1350 1195 1004 939 676 403
2083D03k21j81l57l23q4Q9N0J79q7k45l8j4k20l07N69K68P90K94O5N45m27n00
$$ 403 182 1 -356 -679 -763 -674 -624 -445 -532 -777 -815 -829 -1049 -1356 -787 -519 271 565 630 1175 748 248
2105B48R9l9l7L30M92K32m53l29k79o35J36l00l3j11J94n0k48J15n0k2K60m2q7
$$ 248 347 308 271 601 1093 1325 872 543 264 -371 -235 -535 -568 -679 -485 -535 -783 -668 -718 -740 -480 -522 -609
2128f09M88L69l23K67J19J94L6J81n7j43K9k27L03l95K07J54l64L6l21o24N2L5
$$ -609 -121 248 -75 192 311 505 541 722 665 522 551 324 627 232 439 593 229 265 -56 -680 -628 -593
2150e93P5O7o8J40r2j54k47J42Q4K67K61O43j47j00L5j53k9k5M27L3K98M1L8k11
$$ -593 -518 -451 -519 -379 -471 -625 -872 -730 -646 -379 -118 525 378 278 313 160 131 106 533 566 864 905 943 732
2174G32l23l31k01k0J56k40M4l10o9q6K60k2n2k7L01k93J75r3P9L01J96J34J10
$$ 732 409 78 -123 -143 13 -227 -183 -493 -562 -648 -388 -410 -462 -489 -188 -481 -306 -399 -320 -19 177 311 421
2197D21Rk43Q3O9P7J87p6J02J66k90m52j00p3q5q3Jk43K82m2n57J2K56J48j3K43
$$ 421 430 187 270 339 416 603 527 629 795 505 53 -47 -120 -205 -288 -287 -530 -248 -290 -847 -835 -579 -431 -444 -201
2222b01J57J8rk44K31P3L82K48j49p9L20p6k63j82j65K71Mn4k33j26l37P8k68
$$ -201 -44 -26 -35 -279 -48 25 407 655 506 427 747 671 408 226 61 332 336 282 49 -77 -414 -336 -604
2245f04N6QJ80J20o0j66r9J9J99L0L69K78Q5J91k99R8Q2J20J28j61j39K48k76
$$ -604 -548 -540 -360 -240 -300 -466 -565 -546 -347 -317 52 330 415 606 307 405 487 607 735 574 435 683 407
2268D07k32m3l1k33NM8p4n24j47K60L1J17O8L31j48m40K56J97k15J12K63L11O
$$ 407 175 132 101 -132 -127 -79 -153 -677 -824 -564 -533 -416 -348 -17 -165 -605 -349 -152 -367 -255 8 319 325
2291C25N69l42k8k83r2o4j8L89j5k94M07k81j63l07J06j43j62l0r5RR3Qm5L46
$$ 325 894 552 524 241 149 85 67 456 441 147 554 273 110 -197 -91 -234 -396 -426 -521 -512 -419 -411 -456 -110
2315a10J07q5j02J08n2J64KJ49M23q1K22J70m56o0k72j10k27M02l12L37p7l23
$$ -110 -3 -88 -190 -82 -134 30 32 181 604 523 745 915 459 399 127 17 -210 192 -120 217 140 -183
2337a83j29k21p0Q6o1K7o2L01K38j57L0M85r7M7l8j3j47KM0K40J78P6K94l24l66
$$ -183 -312 -533 -603 -517 -578 -551 -613 -312 -74 -231 -201 284 187 234 196 183 36 38 78 318 496 572 866 542 176
2362A76j80J16m20O6P1j5J86k3n7j92q6k93L47j83L33J29j25J46N8p5J14K59q4
$$ 176 -4 112 -308 -242 -171 -186 0 -23 -80 -272 -358 -651 -304 -487 -154 -25 -150 -4 54 -21 93 352 268
2385B68K08k53Q9j96O4m66N62m9J60j18l36n1l8l46j2L52q6J50Qn1o9J04k92L41
$$ 268 476 223 312 116 180 -286 276 227 387 269 -67 -118 -156 -502 -514 -162 -248 -98 -90 -141 -210 -106 -398 -57
2409e7j03L14m58M81l10j07L6K20K52p9J90j90q2l56Q7m8L9L20n2K77l08R6L1
$$ -57 -160 154 -304 177 -133 -240 -204 16 268 189 379 189 107 -249 -162 -210 -171 149 97 374 66 162 193
2432A93k40m68J26k9M27M4L83l34q5n9J42j84j13n8M14j44q3O9J76J36j54P3j62
$$ 193 -47 -515 -389 -418 9 53 436 102 17 -42 100 -84 -197 -255 159 15 -68 1 177 313 159 232 70
2455G0j76K3NR7J31o6j70J38J97k20Q7o04J48q0L89m0J27k2R1k13m6j09M8Q5J52
$$ 70 -106 -83 -78 19 150 84 -86 52 249 29 116 -488 -340 -420 -31 -71 56 34 125 -88 -134 -243 -195 -110 42
2480D2o1K17j16k68L37k54J84L9m7K83j03l27P7p0j99K16j42J78L9J37j92k49
$$ 42 -19 198 82 -186 151 -103 81 120 73 356 253 -74 3 -67 -266 -50 -192 -14 25 162 -30 -279
2502b79J72L2j97J15M2K40l02J24R7j7L44o81K75N8K2j27pK46O9O4j23O2k50m4
$$ -279 -107 -75 -272 -157 -115 125 -177 -53 44 27 371 -310 -35 23 45 -82 -89 157 226 290 167 229 -21 -65
2526f5k01J04J2J88M4RL1J71m66k8J9K7j35J62J07J14j46rJ97k07J4J12M4m3K68
$$ -65 -266 -162 -150 38 82 91 122 293 -173 -201 -182 -155 -290 -128 -21 93 -53 -62 135 -72 -58 54 98 55 323
2551C23j34Ok2o7n9q6MpK72j16p4j5k2O7Q1j39m1j77J5J2j90K00K04J01pj53j14
$$ 323 189 195 173 106 47 -39 -35 -42 230 114 40 25 3 70 151 12 -29 -206 -191 -179 -369 -169 35 136 129 -24 -138
2578a38J10J6k40K61K77J29j86O0k18q3j62M6K02L10j51k59o1M64l97j31n6M6
$$ -138 -28 -12 -252 9 286 415 229 289 71 -12 -174 -128 74 384 233 -26 -87 377 -20 -151 -207 -161
2600a61J74L3Jk65j62L60P6j23j1J81J48k94Q4j17K62l66O3Q0M05j33k39J38k77
$$ -161 13 46 47 -218 -380 -20 56 -67 -78 103 251 -43 41 -76 186 -180 -117 -37 368 235 -4 134 -143
2623a43QJ23Mr3J6M6K68k95k21Q2J6L13l82J04K03k54R4J32Q6o8m5Q4j43N3j44
$$ -143 -135 -12 -8 -101 -85 -39 229 -66 -287 -205 -189 124 -258 -154 49 -205 -111 21 107 39 -6 78 -65 -12 -156
2648a56RJ42J8J59O8j48o1j80jl2L2K81k7K41k31k6r4j06Q4J1m6K84j58O7M0O
$$ -156 -147 -5 13 172 240 92 31 -149 -150 -182 -150 131 104 345 114 88 -6 -112 -28 -17 -63 221 63 130 170 176
2674A76l46R7j50j16K25j70O6J13K6R2K47j31J17Rj77J18j81PK44l76J97J73r0
$$ 176 -170 -73 -223 -339 -114 -284 -218 -105 -79 13 260 129 246 255 78 196 15 22 266 -110 87 260 170
2697A70j40L3n2r2J48k78J90K00m52J4K0J0K85j45p2J95J64J69l23n1r0N16j12
$$ 170 30 63 11 -81 67 -211 -21 179 -273 -259 -239 -229 56 -89 -161 34 198 367 44 -7 -97 419 307
2720C07N5Nr0Kk04n0N4kMq7O3l20J06k83k2j00K40kj92M48j22K23L4k30K28rM2
$$ 307 362 367 277 279 75 25 79 77 81 -6 57 -263 -157 -440 -462 -562 -322 -324 -516 -68 -190 33 67 -163 65 56 98
2747I8L96k79R5j67O9j40J5K47K4k44j98l07j0o7O8J00J00J73l72K41J37l35j20
$$ 98 494 215 310 143 212 72 87 334 358 114 -84 -391 -401 -468 -400 -300 -200 -27 -399 -158 -21 -356 -476
2770d76K28J39ML20j26r4L40k8O9q1K9k77j09M17n66j01Q3M7M5J38j51j15j27
$$ -476 -248 -109 -105 215 89 -5 335 307 376 295 324 47 -62 355 -211 -312 -229 -182 -137 1 -150 -265 -392
2793c92J44j90J82K22q4K57K1l7j02J29kn4L5J47l9k13K37j96M9l04J32J63j80
$$ -392 -248 -438 -256 -34 -118 139 160 123 21 150 148 94 129 276 237 24 261 65 114 -190 -58 105 -75
2816g5j72j20j9M33j71j53L07j74%L04j10J15l06M09l06N4j48K41k05J12m8r7
$$ -75 -247 -367 -386 47 -124 -277 30 -144 -144 160 50 165 -141 268 -38 16 -132 109 -96 16 -32 -129
2838a29Mj7j86J04L65k54j22K40q7P0l7K4J64J08j02j45m5R9K52K9j39R8k65j61
$$ -129 -125 -142 -328 -224 141 -113 -235 5 -82 -12 -49 -25 139 247 145 0 -45 54 306 335 196 294 29 -132
2862a32j16K51l81K96k25K05J31k02P9k41K3J00l2J83Lj84L92K8j5n2J42o6O0
$$ -132 -248 3 -378 -82 -307 -102 29 -173 -94 -335 -312 -212 -244 -61 -58 -242 150 178 163 111 253 187 247
2885B47J96l79J54k52j06L72j61k87L44j66m08K99k12R5O7L5K87j55P4J17p6k21
$$ 247 443 64 218 -34 -140 232 71 -216 128 -38 -446 -147 -359 -264 -197 -162 125 -30 44 161 85 -136
2907a36M8j4J78K89r4L70n53l9J30j80J51J55k01J61m79R1k4O0k11J34L1j10J32
$$ -136 -88 -102 76 365 271 641 88 49 179 -1 150 305 104 265 -214 -123 -147 -87 -298 -164 -133 -243 -111
2930a11j5Q8l81K71M13k85K1K77k76J93j61j54M02r9K63k71m2r7j12o7N6Q1p6
$$ -111 -126 -38 -419 -148 265 -20 1 278 2 195 34 -120 282 183 446 175 133 36 -76 -143 -87 -6 -82
2953h2J9jo9j95J72K3J52j4j82j74K32J02o1K54l63K86k20M81j72K49m17K25r0
$$ -82 -63 -64 -133 -328 -156 -133 19 5 -177 -351 -119 -17 -78 176 -187 99 -121 360 188 437 20 245 155
2976A55q0J64k84K40l29J57j77j61Q8J56n3L47m85L06kJ06k74j6Q4J07j76n8M88
$$ 155 75 239 -45 195 -134 23 -154 -315 -227 -71 -124 223 -262 44 42 148 -126 -142 -58 49 -127 -185 303
2999C03m0l53mK55L7k89J84O5l44L41k52P3J94K7J13m34R2j31O9k40K62J63m8
$$ 303 263 -90 -94 161 198 -91 93 158 -186 155 -97 -24 170 197 310 -124 -32 -163 -94 -334 -72 91 43
3022D3J26O9l72m5K02j45J35J04J28j63Q7l5k19L7m0K03j37M3l18L35R0k10l6
$$ 43 169 238 -134 -179 23 -122 13 117 245 82 169 134 -85 -48 -88 115 -22 21 -297 38 128 -82 -118
3045a18K06j94p4J34J30j25j24J00J34K18k60koj5J44k35n2J84j69K59l27L0j07
$$ -118 88 -106 -180 -46 84 -41 -165 -65 69 287 27 25 19 4 148 -87 -139 45 -124 135 -192 -162 -269
3068b69PK53k01L02j29MQ4J17j62j32k1J63L70l46J86K9j03k21M8n1O1%m2j17
$$ -269 -262 -9 -210 92 -37 -33 51 168 6 -126 -147 16 386 40 226 255 152 -69 -21 -72 -11 -11 -53 -170
3092a70R8JJ90L7m77J53j60J10L39oJ40l7l07J54L8R6J57m7L9p6j22j00K16p8
$$ -170 -72 -71 119 156 -321 -168 -328 -218 121 115 255 218 -89 65 103 199 356 309 348 272 150 50 266 188
3116A88l5j30r5j4j58k37L09j70K38R3J3k84J94j21j27J47K13l3K58j27J39M65
$$ 188 153 23 -72 -86 -244 -481 -172 -342 -104 -11 2 -282 -88 -209 -336 -189 24 -9 249 122 261 726
3138G26l54M4q7k39j14K70k5nn03L35j94J31K7m43L24m18K20k29k9L49j07L80
$$ 726 372 416 329 90 -24 246 221 216 -287 48 -146 -15 12 -431 -107 -525 -305 -534 -563 -214 -321 59
3160E9n6p2K15Om0j55M40l26NK54k7L9j49j39R7k25%K9J03k12J33n29QJ95n3Q1
$$ 59 3 -69 146 152 112 -43 397 71 76 330 303 342 193 54 151 -74 -74 -45 58 -154 -21 -550 -542 -347 -400 -319
3186c19k59J76K72l4P2K15k16L61n0l4J75k53J22jJ69rj3j76k26n2Q5J67o95J10
$$ -319 -578 -402 -130 -164 -92 123 -93 268 218 184 359 106 228 227 396 387 374 198 -28 -80 5 172 -523 -413
3210d13J31K35k50K9J46j55J17j30J66j47J13J20Q8r1K2J64rJ22K47l29J77j43
$$ -413 -282 -47 -297 -268 -122 -277 -160 -290 -124 -271 -158 -38 50 -41 -19 145 136 258 505 176 353 210
3232B10J42j89l6J21j66o0k2q9n7j53OO6k97K81j24Q9J25jN1M4Oo1K01K60k05
$$ 210 352 163 127 248 82 22 0 -89 -146 -299 -293 -227 -524 -243 -367 -278 -153 -154 -103 -59 -53 -114 87 347 142
3257A42J45j80K3j51M20l93L18j86m48M08l41k5P3K63j72Q3p3J66m6k53J00o4
$$ 142 287 107 130 -21 399 6 324 138 -310 98 -243 -268 -195 68 -104 -21 -94 72 26 -227 -127 -191
3279a91M48k23K1N7Q1k38O5K43m02L76k6M4J6k22p5J48l64J01n1M02j97o8j7j89
$$ -191 257 34 55 112 193 -45 20 263 -139 237 211 255 271 49 -26 122 -242 -141 -192 210 13 -55 -72 -261
3303b61O0j8m7K13j81K44K8k91M43l48L58J22k51j45R4k7k05K46J11L2j53L43
$$ -261 -201 -219 -266 -53 -234 10 38 -253 190 -158 200 322 71 -74 20 -7 -212 34 145 177 24 367
3325C67m07M5j53K02l03L09J91m84L91o9j74QP4l5Q2k6M5k6l36N51j66k01K34
$$ 367 -40 5 -148 54 -249 60 251 -233 158 89 -85 -77 -3 -38 44 18 63 37 -299 252 86 -115 119
3348A19J03l14J09j00j9k2J84j06J08j03J67j30O6k1J09j53J57n5k3O5R4j74N7
$$ 119 222 -92 17 -83 -102 -124 60 -46 62 -41 126 -4 62 41 150 -3 154 99 76 141 235 61 118
3371A18L5m6Q7j56p7J61j28k31J86Q1k21K06N7K7n72L26L30pj05j21l7K29J3k09
$$ 118 153 107 194 38 -39 122 -6 -237 -51 30 -191 15 72 99 -473 -147 183 176 71 -50 -87 142 155 -54
3395e4O3K55j00j7j7J3j14%R4j36k23J26K03n1O5l12K42k2k4j25J39j42K49M6
$$ -54 9 264 164 147 130 143 29 29 123 -13 -236 -110 93 42 107 -205 37 15 -9 -134 5 -137 112 158
3419A58J83j90m7k71P7k1J68J47l93J52K0m2N7k05J95n6r2p7L09r5k96N48k13
$$ 158 341 151 104 -167 -90 -111 57 204 -189 -37 -17 -59 -2 -207 -12 -68 -160 -237 72 -23 -319 229 16
3442A6J37n1Q2j32N7p9k84K85J09j71J79M3k62qL33k32l08K72q1K58M1j73q8l2
$$ 16 153 102 184 52 109 30 -254 31 140 -31 148 191 -71 -79 254 22 -286 -14 -95 163 204 31 -57 -89
3466h9r9Q0j14J26j6J3Q9l3nL0J14r4j3J06P9m6k19q4k4P0J35P0j33k6J34j03
$$ -89 -188 -108 -222 -96 -112 -99 -10 -43 -48 -18 96 2 -11 95 174 128 -91 -175 -199 -129 6 76 -57 -83 51 -52
3492e2K2q7K29J28j99J0M3k21J19J23j73MK29k19N2L1j85O4l4k05M47n9p2J24
$$ -52 -30 -117 112 240 41 51 94 -127 -8 115 -58 -54 175 -44 8 39 -146 -82 -116 -321 126 67 -5 119
3516A19Jj28j37l3K63j00M4Mj68N0PQ1K60m16n5J93J44j33K37m17k1J43K4l0j25
$$ 119 120 -8 -145 -178 85 -15 29 33 -135 -85 -78 3 263 -153 -208 -15 129 -4 233 -184 -205 -62 -38 -68 -193
3541a93K93k73mR2l50L05R4p0J30k3M4k29K36m3L7k38J64j08K91k0n1o1K0j09
$$ -193 100 -173 -177 -85 -435 -130 -36 -106 24 1 45 -184 52 9 46 -192 -28 -136 155 135 84 23 43 -66
3565f6J12K3m5j5j70j60M01l38Q7J39k51J3L40j9j84J47j24J16m2J23q0PJ3P6
$$ -66 46 69 24 9 -161 -321 80 -258 -171 -32 -283 -270 70 51 -133 14 -110 6 -36 87 7 14 27 103
3589A03J48k6nk16J47J1j14J38j83P9p9j36L72m30%j89J07J39J31j71J05J56l04
$$ 103 251 225 220 4 151 162 48 186 3 82 3 -133 239 -191 -191 -380 -273 -134 -3 -174 -69 87 -217
3612b17K71r7k8K51r9R9kk38J38J77l86J28J78j90J40q6r2o0O2p5P7k81P6o8l7
$$ -217 54 -43 -71 180 81 180 178 -60 78 255 -131 -3 175 -15 125 39 -53 -113 -51 -126 -49 -330 -254 -322 -359
3637c59Q7p4K03R9M5o8Kr1K43k18K33O8q5O0K48l22nj3R2J0M5j93p2O7N7k04J99
$$ -359 -272 -346 -143 -44 1 -67 -65 -156 87 -131 102 170 85 145 393 71 66 53 145 155 200 7 -65 2 59 -145 54
3664E4l64n4J26j3J69M5J42P1j13k9j18O3J76j56K7j77l6K04K77j85NO8j60J55
$$ 54 -310 -364 -238 -251 -82 -37 105 176 63 34 -84 -21 155 -1 26 -151 -187 17 294 109 114 182 22 177
3688A77m6q6l12K11K31k47K03o9o3j79jj65K93p6r3J55J16J38j43j34K35j44J24
$$ 177 131 45 -267 -56 175 -72 131 62 -1 -180 -181 -346 -53 -129 -222 -67 49 187 44 -90 145 1 125
3711A25M7l97L33Jj43J63L3l93K38k7n9j34j76N75k98p5R6J05k18J93k27K09K4
$$ 125 172 -225 108 109 -34 129 162 -231 7 -20 -79 -213 -389 186 -112 -187 -91 14 -204 -11 -238 -29 -5
3734ej4n7L3r5KL95l41J44j8l9j0M4j85L41K13k92m3j62K02j89m2L48l52K79m18
$$ -5 -19 -76 -43 -138 -136 259 -82 62 44 5 -5 39 -146 195 408 116 73 -89 113 -76 -118 230 -122 157 -261
3759b61L21L2j73J21j83N0k71L20K00j48mp8lJ57j74m6P9R6L9K9nJ63j03q9l1
$$ -261 60 92 -81 40 -143 -93 -364 -44 156 8 4 -74 -77 80 -94 -140 -61 35 74 103 98 261 158 69 38
3784C8O2o0j44K68k35O7j55Q5p8k1J41r7J7R7o2K85k83j03R5Q3J90k10j09J61
$$ 38 100 40 -104 164 -71 -4 -159 -74 -152 -173 -32 -129 -112 -15 -77 208 -75 -178 -83 0 190 -20 -129 32
3808C2m0j33L30k4k23j75M28k70J99k14J59J7j91K06j04l8LJ11j25j11R1kj02
$$ 32 -8 -141 189 165 -58 -233 195 -75 124 -90 69 86 -105 101 -3 -41 -38 73 -52 -163 -72 -74 -176
3831a76M5J73N0j33R1n0r0N6j48L42m02K28j2N4r2K8j91K23p4o8L9L2O0j68P4
$$ -176 -131 42 92 -41 50 0 -90 -34 -182 160 -242 -14 -26 28 -64 -36 -227 -4 -78 -146 -107 -75 -15 -183 -109
3856a09Q3m4l0J03j87Q6J6J85l23L02l32J26l6K12L13l96J22J29k65Jo7L73j85
$$ -109 -26 -70 -100 3 -184 -98 -82 103 -220 82 -250 -124 -160 52 365 -31 91 220 -45 -44 -111 262 77
3879G7k22J06K05o9l47K03Kk9p3K9J42j02j76L47j41P9j32J80j23j05K1J22Q2
$$ 77 -145 -39 166 97 -250 -47 -45 -74 -147 -118 24 -78 -254 93 -48 31 -101 79 -44 -149 -128 -6 76
3902G6k75K32j58J91L2j14J0L20k89R8j83q9j84K21K55r7j53K31j33l6K1K1Q4
$$ 76 -199 33 -125 66 98 -16 -6 314 25 123 -60 -149 -333 -112 143 46 -107 124 -9 -45 -24 -3 81
3925H1j88N7Q7q6K25k33J32m17L81J60n3k07j9J6JQ0J00j73j04J13L6k2l0P2l2
$$ 81 -107 -50 37 -49 176 -57 75 -342 39 199 146 -61 -80 -64 -63 17 117 -56 -160 -47 -11 -33 -63 9 -23
3950b3j7K49k17p2J50j64L61p6l22j17L38j06l27M36k34Q5J19k96N1M01r3k32
$$ -23 -40 209 -8 -80 70 -94 267 191 -131 -248 90 -16 -343 93 -141 -56 63 -233 -182 219 126 -106
3972a06k6J12K31j38Q3j24j16O8mpK03k5k33q1L0J33k71O1K14J62k88N6j33J17
$$ -106 -132 -20 211 73 156 32 -84 -16 -20 -27 176 151 -82 -163 -133 0 -271 -210 4 166 -122 -66 -199 -82
3996h2L96j15k37n0j13J9J52j15j0R4p0j40J22J93m4p3K35J21l76M4J25m03M72
$$ -82 314 199 -38 -88 -201 -182 -30 -145 -155 -61 -131 -271 -149 44 0 -73 162 283 -93 -49 76 -327 145
4019A45j59Q7L06m01j7j27K43l28K81K4q1N0k05J25J14j98J70n6K9J10p4o1o8
$$ 145 -14 73 379 -22 -39 -166 77 -251 30 54 -27 23 -182 -57 57 -141 29 -27 2 112 38 -23 -91
4042i1Q5k3M01k64j63j75L32k73K79j10M4j22OK24j82l6P2j2L7j19k8K25l35K76
$$ -91 -6 -29 372 108 -55 -230 102 -171 108 -2 42 -80 -74 150 -32 -68 4 -8 29 -90 -118 107 -228 48
4066D8o1J84k15J21j05R1j86M10k33k13M71j37j65J20k09J86p0P4k19J42J15O0
$$ 48 -13 171 -44 77 -28 63 -123 287 54 -159 312 175 10 130 -79 107 37 111 -108 34 149 209
4088B09k84q0K67k6Lk21J84KO3j04NQJ37j90k11j0L99j31N7J0j27j07J48J95j58
$$ 209 -75 -155 112 86 89 -132 52 54 117 13 18 26 163 -27 -238 -248 151 20 77 87 -40 -147 1 196 38
4113C8k5k21K88m9jQ9m21K02j37J76p4J94j75r8J02R3J8J12k55j3J76K7j60j30
$$ 38 13 -208 80 31 30 119 -302 -100 -237 -61 -135 59 -116 -214 -112 -19 -1 111 -144 -157 19 46 -114 -244
4137b44M81l20K11kq9Pj6K57j05k52L1k4J24q1j88J37j32K57k30K97k50J26j46
$$ -244 237 -83 128 126 37 44 28 285 180 -72 -41 -65 59 -22 -210 -73 -205 52 -178 119 -131 -5 -151
4160a51J7M1P2J13j21J56k79K23k5J5j29m6K13l02J94r6J83k58M5J00j02K43o1
$$ -151 -134 -93 -21 92 -29 127 -152 71 46 61 -68 -114 99 -203 -9 -105 78 -180 -135 -35 -137 106 45
4183D5J0j52K66k41J61j83P0K9K7o09K82J01J52r1P3J08m6l12L34j33K1j10J76
$$ 45 55 -97 169 -72 89 -94 -24 5 32 -577 -295 -194 -42 -133 -60 48 2 -310 24 -109 -88 -198 -22
4206b2m5J31Rk04j81L69j64L75k66J28j6k03M25l06R7J41m65j1K10n4J1J9Q5r1
$$ -22 -67 64 73 -131 -312 57 -107 268 2 130 114 -89 336 30 127 268 -197 -208 2 -52 -41 -22 63 -28
4230b8L0J16r4l2j00K89o0j44j39l67L94L8L1K77k85L0J12l23L91j77q8K31j76
$$ -28 2 118 24 -8 -108 181 121 -23 -162 -529 -135 -97 -66 211 -74 -44 68 -255 136 -41 -129 102 -74
4253g4p9K36K03k45k24K45k34J16N4j60N3L18j96P8l60K26j26J97J18k61K56k00
$$ -74 -153 83 286 41 -183 62 -172 -56 -2 -162 -109 209 13 91 -269 -43 -169 28 146 -115 141 -59
4275e9k76L56L2j71K50j01K9j38j0Pm9k5r9K04j16J85J13o9j07q9R7O5kJ66j01
$$ -59 -335 21 53 -118 132 31 60 -78 -88 -81 -130 -155 -254 -50 -166 19 132 63 -44 -133 -36 29 27 193 92
4300I2j8j63P7L34j79j60j44M5J12j64K05J41j30J25k23q8k21K18K29m73J66K29
$$ 92 74 -89 -12 322 143 -17 -161 -116 -4 -168 37 178 48 173 -50 -138 -359 -141 88 -385 -219 10
4322A0j83K41j8k74J60L9Q3mJ31Q3m47L22K0j58j07l9M5J53j42k4J43k33K64L7
$$ 10 -173 68 50 -224 -64 -25 58 54 185 268 -179 143 163 5 -102 -141 -96 57 -85 -109 34 -199 65 102
4346A02P8o7j94R6K6L0j11J07M0l24L77l54q4P1M35k86K01j96l16L34K75l2j44
$$ 102 180 113 -81 15 41 71 -40 67 107 -217 160 -194 -278 -207 228 -58 143 -53 -369 -35 240 208 64
4369F4qj47J04m0P1j63J42r2J90k28n4J87%m4j05K49L9j63j67M5Q4m9M0q7J81
$$ 64 56 -91 13 -27 44 -119 23 -69 121 -107 -161 26 26 -18 -123 126 165 2 -165 -120 -36 -85 -45 -132 49
4394D9j02K10k04k03L34j10k3N8m3K4J66m2k17n0J77l2j84P3K57k58K54k58J59
$$ 49 -53 157 -47 -250 84 -26 -49 9 -34 -10 156 114 -103 -153 24 -8 -192 -119 138 -120 134 -124 35
4417C5pj19N0k1K31j67r8R2K02k82L65m62J73m3j6J48o2J30j47lK6L34m00K27
$$ 35 28 -91 -41 -62 169 2 -96 -4 198 -84 281 -181 -8 -51 -67 81 19 149 2 -1 25 359 -41 186
4441A86l13K51j13Oj7p2L7k32K06J48O9o7j68k40M50j13J1l7K71l27j8J97j22
$$ 186 -127 124 11 17 0 -72 -35 -267 -61 87 156 89 -79 -319 131 18 29 -8 263 -64 -82 115 -7
4464gn3Q2Jrj12J56o2j33K36M0J00j03p5O0J9k95K03l42K82j17J87k10K21j13
$$ -7 -60 22 23 14 -98 58 -4 -137 99 139 239 136 61 121 140 -155 48 -294 -12 -129 58 -152 69 -44
4488d4j30J87P7j10N1JK75l37K4J38k59K42J3j18q5k31N65k08Q1j21j04j2M7J64
$$ -44 -174 13 90 -20 31 32 307 -30 -6 132 -127 115 128 10 -75 -306 259 51 132 11 -93 -105 -58 106
4512A06o8j94R7N6L6O2j35J02p9K2j90P9J72J03M5k12%oj71L14j50J34J0l75L41
$$ 106 38 -156 -59 -3 33 95 -40 62 -17 5 -185 -106 66 169 214 2 2 -4 -175 139 -11 123 133 -242 99
4537I9m0j62J59j28j40M7J18P9m3j6m8J31p9R5j64J58k10L92kj38J8J8J3N2l28
$$ 99 59 -103 56 -72 -212 -165 -47 32 -11 -27 -75 56 -23 72 -92 66 -144 248 246 108 126 144 157 209 -119
4562a19p7K92p9j89j37L30l5L8J12l54M01k91R8k16J80j43J60L2j55K08j10J72
$$ -119 -196 96 17 -172 -309 21 -14 24 136 -218 183 -108 -10 -226 -46 -189 -29 3 -152 56 -54 118
4584A18m8j11J55j48M7p1R5O0J05j27q2M4o1J82j42l6l4J77k10L07k73M4K09j13
$$ 118 70 -41 114 -34 13 -58 37 97 202 75 -7 37 -24 158 16 -20 -54 123 -87 220 -53 -9 200 87
4608H7k1j88L3%MR5j27J80J16r1n7j3k46K00j57R2Rj00K92k04J30j97O3K07k24
$$ 87 66 -122 -89 -89 -85 10 -117 63 179 88 31 18 -228 -28 -185 -93 -84 -184 108 -96 34 -163 -100 107 -117
4633a17Pl1J20j6J1q5L2K32j58k49K53J06J0q2K04o6q7k63N2J96k48K85k18NP1
$$ -117 -110 -141 -21 -37 -26 -111 -79 153 -5 -254 -1 105 115 33 237 171 84 -179 -127 69 -179 106 -112 -107 -36
4658c6J76k60np8K54j5j05O0j54M37j78j74k59M54l27P8MJ18L1l16L13J21l12
$$ -36 140 -120 -125 -203 51 36 -69 -9 -163 274 96 -78 -337 117 -210 -132 -128 -10 21 -295 18 139 -173
4681a73k11J58L80k03J21q0o2M9j25m1K63k22J66K88l17K86l21O3o3K02j36K20
$$ -173 -384 -226 154 -49 72 -8 -70 -21 -146 -187 76 -146 20 308 -9 277 -44 19 -44 158 22 242
4703B42l29q0p6M12j16k15J78j6P2J86l37k20J11J31j28L32j50k07K48o6L8j4
$$ 242 -87 -167 -243 169 53 -162 16 0 72 258 -79 -299 -188 -57 -185 147 -3 -210 38 -28 10 -4
4725dJ01q7R7j93j18J83r2KK09k55n2L38q7j67K28p7j1m2K02k96J35o3N3l4LJ3
$$ -4 97 10 107 -86 -204 -21 -113 -111 98 -157 -209 129 42 -125 103 26 15 -27 175 -121 14 -49 4 -30 -27 -14
4751a4Q5J29m34J24N0J86j64j58J10J94j40PK10j57ON4j35J22k13J28k94L22j46
$$ -14 71 200 -234 -110 -60 126 -38 -196 -86 108 -32 -25 185 28 34 88 -47 75 -138 -10 -304 18 -128
4774a28L6J98k1J06m64K32l1R7k63J31J58L0kj1q5k7N0k44K71J62l80J49km6J97
$$ -128 -92 106 85 191 -273 -41 -72 25 -238 -107 51 81 79 68 -17 -44 6 -238 33 195 -185 -36 -38 -84 113
4799A13j41j75K6J06K14n3k17Q6n9K38j24r8M6q6J64K6R2j04o2K60l12N33n98
$$ 113 -28 -203 -177 -71 143 90 -127 -41 -100 138 14 -84 -38 -124 40 66 158 54 -8 252 -60 473 -125
4822a25J27n7n3k5L30k08J7r1j4n5o2J53J45j0n8R6j41JJ86n04K70J1Q0J45k00
$$ -125 2 -55 -108 -133 197 -11 6 -85 -99 -154 -216 -63 82 72 14 110 -31 -30 156 -348 -78 -67 13 158 -42
4847d2N0M0r1l8K02q8k5K4J94j79q3j9J56j66nK7J3Q6k51L37K00m77l8L80k02
$$ -42 8 48 -43 -81 121 33 8 32 226 47 -36 -55 101 -65 -70 -43 -30 56 -195 142 342 -135 -173 207 5
4872EJ64l05K11n6o3n3J15J0j00J28j48K13o0k8k99L59J64k76K6R6j50n8L7rQ3
$$ 5 169 -136 75 19 -44 -97 18 28 -72 56 -92 121 61 33 -266 93 257 -19 7 103 -47 -105 -68 -77 6
4897FK2m6j16K61j13PO6l27M18k3j24j80K02pj45J78j72J64P5p0N8l7m4M5J2j57
$$ 6 28 -18 -134 127 14 21 87 -240 178 155 31 -149 53 46 -99 79 -93 71 146 76 134 97 53 98 110 -47
4923d7Lj68J05J9j22J68K6q0J14j3o1K89j83q2J83l15O8N9J42q5OJ45k63K35j72
$$ -47 -44 -212 -107 -88 -210 -42 -16 -96 18 5 -56 233 50 -32 151 -164 -96 -37 105 20 26 171 -92 143 -29
4948b9K32j36j69J71j74P3P3k80J58r7L22l08L70k13J22l04J39Q5j64L06k86q3
$$ -29 203 67 -102 69 -105 -32 41 -239 -81 -178 144 -164 206 -7 115 -189 -50 35 -129 177 -109 -192
4970a92M08l95K08k05M21j98q5j28Q8k43L90km1j17J97J32k36P4k52l6q2J51J64
$$ -192 216 -179 29 -176 245 47 -38 -166 -78 -321 69 67 26 -91 106 238 2 76 -176 -212 -294 -143 21
4993B1n7K05k01j03J94k87J92J62j49j60R7Q8K55n7j47j21M3j70N5J07j12L00
$$ 21 -36 169 -32 -135 59 -228 -36 126 -23 -183 -86 2 257 200 53 -68 -25 -195 -140 -33 -145 155
5015A55k36PK6J66j89N7q6M0P8k17J21Q1qJ47l91L62j52q4J97j12L09j60p1O3
$$ 155 -81 -74 -48 118 -71 -14 -100 -60 18 -199 -78 3 -5 142 -249 113 -39 -123 74 -38 271 111 40 103
5039A03J38r4j29j34qJ50q4L8k22L98j97K06j84j27J55o9r1J2M15k98N6J6k6J7
$$ 103 241 147 18 -116 -124 26 -58 -20 -242 156 -41 165 -19 -146 9 -60 -151 -139 276 -22 34 50 24 41
5063D1k62K40J34R9k41j02P1L18l38J08Q0j84J38l4l11j0J70K00k12k1j05O2K42
$$ 41 -221 19 153 252 11 -91 -20 298 -40 68 148 -36 102 68 -243 -253 -83 117 -95 -116 -221 -159 83
5086H3l93K80R5m3j76J34k64K59J3L41n72J06m5J79l71L60O9kj48J50j88K98j39
$$ 83 -310 -30 65 22 -154 -20 -284 -25 -12 329 -243 -137 -182 -3 -374 -14 55 53 -95 55 -133 165 26
5109B6k10K14j61L15K1l31j45K46J88k65M5J29O4j23j71L40k90K6J15j40J37J19
$$ 26 -184 30 -131 184 205 -126 -271 -25 163 -102 -57 72 136 13 -158 182 -108 -82 33 -107 30 149
5131A49m66M11j85J66Q7Om7j08q4j4J67j33j36K29K0j72J85%R7K29l98P6O6j5
$$ 149 -317 94 -91 75 162 168 121 13 -71 -85 82 -51 -187 42 62 -110 75 75 172 401 3 79 145 130
5155A30j95n9L25K3k16L2k00J22K61l53J05l4Q6K84k68kj91K66j07R0o0j32J08
$$ 130 -65 -124 201 224 8 40 -160 -38 223 -130 -25 -59 27 311 43 41 -150 116 9 99 39 -93 15
5178A5J69L2k38k14m3Q9K00o9J74o9m33K59K08n1j13J61M3l17K08j31J19lo5k
$$ 15 184 216 -22 -236 -279 -190 10 -59 115 46 -387 -128 80 29 -84 77 120 -197 11 -120 -1 -4 -69 -71
5202g1R4O2J7k71q4N69k69q3R7K8j24N7q4J76R9j04J21k79r6J48J16Q8k95L04
$$ -71 23 85 102 -169 -253 316 47 -36 61 89 -35 22 -62 114 213 109 230 -49 -145 3 119 207 -88 216
5226B16k63kk26M19k72K26k54K21r4K62j22n8M1j61J38j62O9j43J13rK26k85K43
$$ 216 -47 -49 -275 144 -128 98 -156 65 -29 233 111 53 94 -67 71 -91 -22 -165 -52 -61 165 -120 123
5249A23q9q2J53k70P5L8rJ11j21N3J37p4PmJ02j01L3k18J08N8j65K62l4j70M8
$$ 123 34 -48 105 -165 -90 -52 -61 50 -71 -18 119 45 52 48 150 49 82 -136 -28 30 -135 127 93 -77 -29
5274b9j5K3j17R7J0p2q6K08Q2p9l24N49k30J69k82R9k71J95J30Q1j33J19k81L92
$$ -29 -44 -21 -138 -41 -31 -103 -189 19 101 22 -302 247 17 186 -96 3 -268 -73 57 138 5 124 -157 235
5298B35k59j09L4K62k49K53N9k38l6rJ78p0p7JK12R3k40j02R0j36J04J04J64l11
$$ 235 -24 -133 -99 163 -86 167 226 -12 -48 -57 121 51 -26 -25 187 280 40 -62 28 -108 -4 100 264 -47
5322d7N1o6O6j76K57o0j87J26j43Q0Q2k49L26m1M2N9j08M6j88J19P2M1J7j33J2
$$ -47 4 -62 4 -172 85 25 -162 -36 -179 -99 -17 -266 60 19 61 120 12 58 -130 -11 61 102 119 -14 -2
5347bK5L4j42N5j56M90k42n6j10K73m00j3J29K60k59j1K9J39lJ00k88L37k97J51
$$ -2 23 57 -85 -30 -186 304 62 6 -104 169 -231 -244 -115 145 -114 -125 -96 43 40 140 -148 189 -108 43
5371D3J12J43l90K9o6K93l77L08O6l65K57k62p2M03j10o7J08k09N0qJ81r4r4n9
$$ 43 155 298 -92 -63 -129 164 -213 95 161 -204 53 -209 -281 122 12 -55 53 -156 -106 -114 67 -27 -121 -180
5395a80L05O0k92J64k28L4K63p7j21j25M11o2j13j26J07l26L18J1j99Q7J1J50
$$ -180 125 185 -107 57 -171 -137 126 49 -72 -197 214 152 39 -87 20 -306 12 23 -176 -89 -78 72
5417G2J30k06j91RP8K21k65J02J51m1J88l46K15k64K08lJ47j20j40J62j1j15r7
$$ 72 202 -4 -195 -186 -108 113 -152 -50 101 60 248 -98 117 -147 61 58 205 85 -55 107 96 -19 -116
5440a16n5k9p6J12J64Q5%k81K73p8J19q7J77K5l97K6k5J91N9J0%ML5k71J48J08
$$ -116 -171 -200 -276 -164 0 85 85 -196 77 -1 118 31 208 233 -164 -138 -163 28 87 97 97 101 136 -135 13 121
5466A21J08k97L7p4K8K4P4J39j47J00j42J1QO4m0Lj03J68k10N4M27l64L1Q3k3
$$ 121 229 -68 -31 -105 -77 -53 21 160 13 113 -29 -18 -10 54 14 17 -86 82 -128 -74 353 -11 20 103 80
5491H0j17K61J5m06J62q4R5N5q0N0K48j96q9J04k17Q6L49n3l50J41j32L4j30K71
$$ 80 -37 224 239 -167 -5 -89 6 61 -19 31 279 83 -6 98 -119 -33 316 263 -87 54 -78 -44 -174 97
5515I7R8j00k5k30L08j01O2o4J6m0j52K90N6j41j06J7J96n5k33J08p7N7j19L97
$$ 97 195 95 70 -160 148 47 109 45 61 21 -131 159 215 74 -32 -15 181 126 -107 1 -76 -19 -138 259
5539B59m27K5K33J3n8n6o2l8J47q8L4jj83M5J85M0j53P3j34q0K7K3K93j83l0j29
$$ 259 -168 -143 90 103 45 -11 -73 -111 36 -52 -18 -19 -202 -157 28 68 -85 -12 -146 -226 -199 -176 117 -66 -96 -225
5565b25J41J69j26j28J19n7J3QJ4K2M8O9l16L27j06L7k35L30J00j39k8o6Q5J8
$$ -225 -84 85 -41 -169 -50 -107 -94 -86 -72 -50 -2 67 -249 78 -28 9 -226 104 204 65 37 -29 56 74
5589G4l05M23k04l2J12o6n0J39J38J2j62j17L6R3l05K00K67l99J6K93k58K76k44
$$ 74 -231 192 -12 -44 68 2 -48 91 229 241 79 -38 -2 91 -214 -14 253 -146 -130 163 -95 181 -63
5612f3J15m6j45j46L35p5j74J56J17M1j09P7j18J4l4L45n23J81J35Q6k22j98K33
$$ -63 52 6 -139 -285 50 -25 -199 -43 74 115 6 83 -35 -21 -55 290 -233 -52 83 169 -53 -251 -18
5635a8P7l36Q6K67r3J23R0P7l87K26p0j77K64n4Q1j92O8L2p5O4Q5n2j94J99j09
$$ -18 59 -277 -191 76 -17 106 196 273 -114 112 42 -135 129 75 156 -36 32 64 -11 53 138 86 -108 91 -18
5660a8j29R2k2Q5j28J91j93K78l4l91J2J89K2o5J17L2k43L4K81n4j42L26j10q0
$$ -18 -147 -55 -77 8 -120 71 -122 156 122 -269 -257 -68 -46 -111 6 38 -205 -171 110 56 -86 240 130 50
5684E0l4j51J59k47M97m17J20J06J10l05R3M5J05Nj84KPj09P5L66o06J63L02J5
$$ 50 16 -135 24 -223 274 -143 -23 83 193 -112 -19 26 131 136 -48 -46 -39 -148 -73 293 -313 -150 152 167
5708A67l85L54j43m8J55j44J52j53j05P2P5k07L19o4n7j77L21k59J93P4q6o8j1
$$ 167 -218 136 -7 -55 100 -44 108 -45 -150 -78 -3 -210 109 45 -12 -189 132 -127 66 140 54 -14 -25
5731b5k10J19K53k83R1K99j89o4j52K82k12q1J68J36j12o6o9K22k47K81k11M4
$$ -25 -235 -116 137 -146 -55 244 55 -9 -161 121 -91 -172 -4 132 20 -46 -115 107 -140 141 -70 -26
5753b6p2J09j6K5j17k36oK88Q6K0l18M40q0k98K61J07k95J46Q1l74K99J5j37J9
$$ -26 -98 11 -5 20 -97 -333 -339 -51 35 55 -263 177 97 -201 60 167 -128 18 99 -275 24 39 -98 -79
5777g9q4o3K25r6L06j57N2k17j5J36P4Qk27L61k90o3Q3K4J62j53K84l41k7J7j27
$$ -79 -163 -226 -1 -97 209 52 104 -113 -128 8 82 90 -137 224 -66 -129 -46 -22 140 -13 271 -70 -97 -80 -207
5802b07L17k0j20J4M7n5M7k63R5L05l27R3l9K06n6p5J53n7j9M2l23K63j82L5o3
$$ -207 110 90 -30 -16 31 -24 23 -240 -145 160 -167 -74 -113 93 37 -38 115 58 39 81 -242 21 -161 -126 -189
5827a89M18j29j84j52K52o6R3n8j79J90j0pK77k00j42j73M86m05R1J36j78j8J03
$$ -189 229 100 -84 -236 16 -50 43 -15 -194 -4 -14 -21 256 56 -86 -259 227 -178 -87 49 -129 -147 -44
5850d4qK4j03N6J8M5J43J5m48L26N7j93k6L3m1lJ38j89K50n8J57k51J19j42J94
$$ -44 -52 -28 -131 -75 -57 -12 131 146 -302 24 81 -112 -138 -105 -146 -149 -11 -200 50 -8 149 -102 17 -125 69
5875F9j47N7j07J7K63r5k1Q3k24K30k64O3K55m92O01l07q2L3K11o1J9k29M8J61
$$ 69 -78 -21 -128 -111 152 57 36 119 -105 125 -139 -76 179 -313 288 -19 -101 -68 143 82 101 -128 -80 81
5899H1j39j04J79K18l29k93M82P5j10j33J08J42J14j02p7%J22o8J71k02j25j69
$$ 81 -58 -162 17 235 -94 -387 95 170 60 -73 35 177 291 189 112 112 234 166 337 135 10 -159
5921a59o3J60j55J31m7K27m9nk47J46O6J24n8J12J88n00K97j85J75r7M1j97K69
$$ -159 -222 -62 -217 -86 -133 94 45 40 -207 -61 5 129 71 183 371 -129 168 -17 158 61 102 -95 174
5944A74r3r1K73k80L5j9n7j74M8J87j40k0J24r6N0N9R2j73L02j48j46J04m06M38
$$ 174 81 -10 263 -17 18 -1 -58 -232 -184 3 -137 -157 -33 -129 -79 -20 72 -101 201 53 -93 11 -395 43
5968D3L2j37J02K6J42k86RK02k47p9J60J36l06M26l85J37j0J39M0j68K06l44r4
$$ 43 75 -62 40 66 208 -78 -69 133 -114 -193 -33 103 -203 223 -162 -25 -35 104 144 -24 182 -162 -256
5991b56K5J98O5m00M25l79l7N33k78K79k37J95k8q8k15Oj93L06LJ95r2m3m8J20
$$ -256 -231 -33 32 -368 57 -322 -359 174 -104 175 -62 133 105 17 -198 -192 -385 -79 -76 119 27 -16 -64 56
6015E6k5K20l45RJ64j18j08K68l61L2L1K45P4k40R0j72J89o1Rj42J53K7J1PM5
$$ 56 31 251 -94 -85 79 -39 -147 121 -240 -208 -177 68 142 -98 -8 -180 9 -52 -43 -185 -32 -5 6 13 58
6040E8KN9j45M1j7R0J66l64L44m90K34K1o5M76l87k96L08L8o2P9r4K70r9l00j71
$$ 58 60 119 -26 15 -2 88 254 -110 234 -256 -22 -1 -66 410 23 -273 35 73 11 90 -4 266 167 -133 -304
6065c04M33p0j32J13j57K33m5j90J37j13n5J97J83k97K86k18N3K66k31p0J10M
$$ -304 129 59 -73 40 -117 116 71 -119 18 -95 -150 47 230 -67 219 1 54 320 89 19 129 133
6087A33K6k31L7l01N33J28l97K35k34L4L9J1N5j12J67p9o7J2J21l29L00j43rP1
$$ 133 159 -72 -35 -336 197 325 -72 163 -71 -37 2 13 68 -44 123 44 -23 -11 110 -219 81 -62 -71 0
6111@P2Q1P8k3k43N2J25q2j30M8j07J15p3M6J7k6N8M4m5O6N3k18K78J72m74J66
$$ 0 72 153 231 208 -35 17 142 60 -70 -22 -129 -14 -87 -41 -24 -50 8 52 7 73 126 -92 186 358 -116 50
6137E0j25n6R6pJ9m5J51n7J07p2M2J17k31J46k80L9J66j10k5n5K25j83j22L75
$$ 50 -75 -131 -35 -42 -23 -68 83 26 133 61 103 220 -11 135 -145 -106 60 -50 -75 -130 95 -88 -210 165
6161A65k03J00R7m03m3L16l04N7L26r5j37Qj37M10j23mJ2l2J73m25J10K01j78
$$ 165 -38 62 159 -244 -287 29 -275 -218 108 13 -124 -116 -253 157 34 30 42 10 183 -242 -132 69 -109
6184a09M98m68J40k8Q6j71P5l10K40j5J83l40L90l19J20J0k7j43L93j75k55J70
$$ -109 389 -79 61 33 119 -52 23 -287 -47 -62 121 -219 171 -148 -28 -18 -45 -188 205 30 -225 -55
6206e5K59j64q3K03p8O6p1j7j43J69j66O8L5l1k9L7J42k94K3L23j03k47J08OR9
$$ -55 204 40 -43 160 82 148 77 60 -83 86 -80 -12 23 -8 -37 0 142 -152 -129 194 91 -156 -48 -42 57
6231E7Q4O8j4l08N5J08ON0J1k31P5R3o8k49J80J00J4n0J56k27J38n8j08K30k3
$$ 57 141 209 195 -113 -58 50 56 106 117 -114 -39 54 -14 -263 -83 17 31 -19 137 -90 48 -10 -118 112 89
6256H9R8j71k0k25J59j06O5N49l53k23J25J0K39k36L7k60r0M13Pk18K02J48l34
$$ 89 187 16 -4 -229 -70 -176 -111 438 85 -138 -13 -3 236 0 37 -223 -313 100 107 -111 91 239 -95
6279i5J03r3J61q7q7Q2R4k8k5J39l61K29j81K95k05j33L16j51k7J00r3J7O9n0
$$ -95 8 -85 76 -11 -98 -16 78 50 25 164 -197 32 -149 146 -59 -192 124 -27 -54 46 -47 -30 39 -11
6303a1l49N27l22J67m4l1K83k26J73l42k1J8r4M7K21k89L43K53k61r5j1J06Nl15
$$ -11 -360 167 -155 12 -32 -63 220 -6 167 -175 -196 -178 -272 -225 -4 -293 50 303 42 -53 -64 42 47 -268
6327b68N5L38m7M0j56Q6j9j68J24j25l7P9K32j88J6L08m10J96k49K56k89J21j90
$$ -268 -213 125 78 118 -38 48 29 -139 -15 -140 -177 -98 134 -54 -38 270 -140 56 -193 63 -226 -105 -295
6350b95J27j23M69l17k0K33k15K02k9j48k2M40l06J8l4k4o6K47J6Qj04P6l53M7
$$ -295 -168 -291 178 -139 -159 74 -141 61 32 -116 -138 302 -4 14 -20 -44 -110 137 153 161 57 133 -220 -173
6374a73K15k99R1R2j53J88Q6%k86L99k19O5K1L8j55k17M05j98J90J54p4k67j18
$$ -173 42 -257 -166 -74 -227 -39 47 47 -239 160 -59 6 27 65 -90 -307 98 -100 90 244 170 -97 -215
6397b15K35O2k16J92k69K61r1M48l75n9L3K11k84l39K40K37l3n0k2L15j89k06
$$ -215 20 82 -134 58 -211 50 -41 407 32 -27 6 217 -67 -406 -166 71 38 -12 -34 281 92 -114
6419a14J4q2K60j35j73k1L25P3k00J22o4K15j43l7J90l72J77m7o3j6K76l24m4
$$ -114 -100 -182 78 -57 -230 -251 74 147 -53 69 5 220 77 40 230 -142 35 -12 -75 -91 185 -139 -183
6442a83J33N2j07L9j23K49j58J04J27j84J24R5l09OR0K15l04Mk41N05j17j97J43
$$ -183 -50 2 -105 -66 -189 60 -98 6 133 -51 73 168 -141 -135 -45 170 -134 -130 -371 134 17 -180 -37
6465c7J42rK0j30M0j60K10P8r9j19J29L9n6j0K78m36K4j69J29j95L87P7k64Q5
$$ -37 105 96 116 -14 26 -134 76 154 55 -64 65 104 48 38 316 -120 -96 -265 -136 -331 56 133 -131 -46
6489d6L05k27L5j16J1K9Qj48J94J19k10J27j36J51j09p2j35l7M41j99J16p4J05
$$ -46 259 32 67 -49 -38 -9 -1 -149 45 164 -46 81 -55 96 -13 -85 -220 -257 184 -15 101 27 132
6512A32Q4k3k9N5r5q0J28l7j22r2K63k69n8P0J45k94J00J8QK5M5L9j9J75j18j40
$$ 132 216 193 164 219 124 44 172 135 13 -79 184 -85 -143 -73 72 -222 -122 -104 -96 -71 -26 13 -6 169 51 -89
6538h9K19k98L18j75J42k07K92k9k34M2J05l3j25j06K28J11j70K87k98K15m54
$$ -89 130 -168 150 -25 117 -90 202 173 -61 -19 86 53 -72 -178 50 161 -9 278 -20 195 -259
6559b59K4J86P1J51l0j78N0J05J51k12%j95O9L7o1O1j93L40k41P7m5N8m1N9J00
$$ -259 -235 -49 22 173 143 -35 15 120 271 59 59 -136 -67 -30 -91 -30 -223 117 -124 -47 -92 -34 -75 -16 84
6584H4r6L21k91pJ7p6j68J40j23J83mJ83m81J06O3k8L26k51NL8J81r2j79K67j04
$$ 84 -12 309 18 11 28 -48 -216 -76 -199 -16 -20 163 -318 -212 -149 -177 149 -102 -97 -59 122 30 -149 118 14
6609A4L7k62J10k5L1N3k17K65J27k5l75J46O6O7M4k39K29mj21Q8m8j00J52R0K38
$$ 14 51 -211 -101 -126 -95 -42 -259 6 133 108 -267 -121 -55 12 56 -183 46 42 -79 9 -39 -139 13 103 341
6634C41l57q6J89r0mL3j72J35j41M8LO6J04m5MJ25j36n3n9J5O8J67k3m2R9m22
$$ 341 -16 -102 87 -3 -7 26 -146 -11 -152 -104 -101 -35 69 24 28 153 17 -36 -95 -80 -12 155 132 90 189 -233
6660b33J62K33k6l71J77J07M6q3k14Q8j78K62j71L67j41o4j13J29O0J1K00n29
$$ -233 -71 162 136 -235 -58 49 95 12 -202 -114 -292 -30 -201 166 25 -39 -152 -23 37 48 248 -281
6682b81Q2L56k24o4l7K83K0j53j14K70o63M13J41M8J13M1l18J21k63M34m1k53
$$ -281 -199 157 -67 -131 -168 115 135 -18 -132 138 -525 -112 29 77 190 231 -87 34 -229 205 164 -89
6704h9J67NL7k21J64J72m27J29P1j02k6R5M9ll65M64j12r2P9K16k1n5j62r9mp8
$$ -89 78 83 120 -101 63 235 -192 -63 8 -94 -120 -25 24 21 -344 120 8 -84 -5 211 190 135 -27 -126 -130 -208
6730b08K39j71K85j38N9l40K07qj33M0J82Q7l38K54j70k8L90l40J20j74J33J08
$$ -208 31 -140 145 7 66 -274 -67 -75 -208 -168 14 101 -237 17 -153 -181 209 -131 -11 -185 -52 56
6752E6k64k4L22Q5j88J68j11J0o4J3Pk81M16n7k24J65J07k10p6J19J00R5k93J15
$$ 56 -208 -232 90 175 -13 155 44 54 -10 3 10 -271 145 88 -136 29 136 -74 -150 -31 69 164 -129 -14
6776a4j38K02q8J07j10R4j51K35l54K20J7J49K0l30Q6P3q2pJ21Rr1J68j71j00
$$ -14 -152 50 -38 69 -41 53 -98 137 -217 3 20 169 189 -141 -55 18 -64 -71 50 59 -32 136 -35 -135
6800a35K00j98J63M6j1J12k99l7L31j23n4k29K85l6j68L4m8Q9K63l9k83K11l28
$$ -135 65 -133 30 76 65 177 -122 -159 172 49 -5 -234 51 15 -153 -119 -167 -78 185 146 -137 74 -254
6823b54M53k33K36Nk86R6k27J35L1M12k95q0J52k94K56j12q8L9LJ06J29o4k82
$$ -254 199 -34 202 207 -79 17 -210 -75 -44 368 73 -7 145 -149 107 -5 -93 -54 -51 55 184 120 -162
6846a62j07K40P0Q9mj36q3J94J4k42P8J73r2j19R6k1L00l32J53j52J26l58J45
$$ -162 -269 -29 41 130 126 -10 -93 101 115 -127 -49 124 32 -87 9 -12 288 -44 109 -43 83 -275 -130
6869a30Q6J26q3j24K3J38j18J04J54l80L48J25k35P0j22NK03j10J49k30ql9k40
$$ -130 -44 82 -1 -125 -102 36 -82 22 176 -204 144 269 34 104 -18 -13 190 80 229 -1 -9 -48 -288
6892b88J45R9K6M5j61j17L48M7j85p7R3J86k01K64m45N5J33JP4j8r4M1R1o7j9
$$ -288 -143 -44 -18 27 -134 -251 97 144 -41 -118 -25 161 -40 224 -221 -166 -33 -32 42 24 -70 -29 62 -5 -24
6917b4J53k12J22j86J77K2j22K00l64Q6KJ33J34J61m27J00n0j91K95J84j53O5
$$ -24 129 -83 39 -147 30 52 -70 130 -234 -148 -146 -13 121 282 -145 -45 -95 -286 9 193 40 105
6939A05n8o3j11R5N9J76j57j79l0J38Q4Kn5J79k67J20j57J7J47n6O4q0J39j88
$$ 105 47 -16 -127 -32 27 203 46 -133 -163 -25 59 61 6 185 -82 38 -119 -102 45 -11 53 -27 112 -76
6963g6K58j38J37k21L9p9J70m5r9J90j52njj59K92k81K65k46K22K20m05M6j8k1
$$ -76 182 44 181 -40 -1 -80 90 45 -54 136 -16 -21 -22 -181 111 -170 95 -151 71 291 -114 -68 -86 -107
6987a07L17j76q7j29K23R2j13l8R8j82O3J22r9K04K1j45j85M4j18L06j65J78j50
$$ -107 210 34 -53 -182 41 133 20 -18 80 -102 -39 83 -16 188 209 64 -121 -77 -195 111 -54 124 -26
7010b6J8N5o5L61k64Q2j62R3K55o19L38l8m1q0J74j94Q6r0L30j98J10l43rL2J95
$$ -26 -8 47 -18 343 79 161 -1 92 347 -272 66 28 -13 -93 81 -113 -27 -117 213 15 125 -218 -227 -195 0
7035@R6p8k96N31j50j55K51l79J49J05l53K31J68J34l65J49J81j36j40L2R5j67
$$ 0 96 18 -278 253 103 -52 199 -180 -31 74 -279 -48 120 254 -111 38 219 83 -57 -25 70 -97
7057i7J87k95J00K8R0j65K69k5j67j03J22j6Q3L6j86J18J42K0k98L42k36M4j01
$$ -97 90 -205 -105 -77 13 -152 117 92 -75 -178 -56 -72 11 47 -139 -21 121 141 -157 185 -51 -7 -108
7080a08M95l44L9J3lQ6o0N1o2j77j11L55o4k56J81p5K6J23q5q9qJ0M9J5J57k93
$$ -108 387 43 82 95 92 178 118 169 107 -70 -181 174 110 -146 35 -40 -14 109 24 -65 -73 -63 -14 1 158 -135
7106a35M99l89K7R2M4m04K73k70L71j74J18l00K90J65k19K19J7k71j09j5J68l81
$$ -135 364 -25 2 94 138 -266 7 -263 108 -66 52 -248 42 207 -12 207 224 -47 -156 -171 -3 -384
7128c84N76l83Q3N8P3j09p5K19j38O8p0l8K47l33R2K98k08J16q1J6P5l96J65J80
$$ -384 192 -191 -108 -50 23 -86 -161 58 -80 -12 -82 -120 127 -206 -114 184 -24 92 11 27 102 -294 -129 51
7152E1l84K03pl7JK34O8j69J57r6l65M10m1k4Q1J48l07qQ2J33j83J57k06M53j52
$$ 51 -333 -130 -137 -174 -173 61 129 -40 117 21 -344 66 25 1 82 230 -77 -85 -3 130 -53 104 -102 351 199
7177A99k04j26R4j1K1mO8j2r4J04r5N2j62J34k9k07L85l01K28j67J68P3J9N2j55
$$ 199 -5 -131 -37 -48 -27 -31 37 25 -69 35 -60 -8 -170 -36 -65 -272 113 -188 40 -127 41 114 133 185 30
7202C0k02K07j7j50M07l48j76M04l39J09K85j95kj61P1J62O8k74K69r3K7j79r3
$$ 30 -172 35 18 -132 275 -73 -249 155 -184 -75 210 15 13 -148 -77 85 153 -121 148 55 82 -97 -190
7225a90J38J9P0l4O7Mj4j07j02J79q0K00j83R2j48K59l9o4p6j08q7J91k2k5rR7
$$ -190 -52 -33 37 3 70 74 60 -47 -149 30 -50 150 -33 59 -89 170 131 67 -9 -117 -204 -13 -35 -60 -69 28
7251B8l1J19p6l88K29J34j19K32j66nJ43k35L05M4l26L7j21JJ57lL9j33P7L28
$$ 28 -3 116 40 -348 -119 15 -104 128 -38 -43 100 -135 170 214 -112 -75 -196 -195 -38 -41 -2 -135 -58 270
7275B70l90M6J87j70j22J26P8m1J04j72J16J75l80J16J07j13J29k56L01k24K26
$$ 270 -120 -74 113 -57 -179 -53 25 -16 88 -84 32 207 -173 -57 50 -63 66 -190 111 -113 113
7296A13k05M37qr5j40j43P4R7O8j10q1J91J31o64M08J96k01j48J05k10O4o8j02
$$ 113 -92 345 337 242 102 -41 33 130 198 88 7 198 329 -335 73 269 68 -80 25 -185 -121 -189 -291
7319b91K53p9M28k75j89J21N7J64l1p3j36J90k58K19j7J02l76J50n9K51j40J45
$$ -291 -38 -117 311 36 -153 -32 25 189 158 85 -51 139 -119 100 83 185 -191 -41 -100 151 11 156
7341A56j19k2K55j10j96j10L80p0j22J3j5K2jmL5p5K08l91L63j21l2J81j22j81
$$ 156 37 15 270 160 -36 -146 234 164 42 55 40 62 61 57 92 17 225 -166 197 76 44 225 103 -78
7365g8q8K23K2K21k68R3J9n4l64K12O3k1R5L8L3k06M3j25L58l54L28l63M03j40
$$ -78 -166 57 79 300 32 125 144 90 -274 -62 1 -20 75 113 146 -60 -17 -142 216 -138 190 -173 230 90
7389I0J61m17J46J70l40K26J38l03j0P8K93m17J97l2L1J7k27K45j17j8M3o0L13
$$ 90 251 -166 -20 150 -190 36 174 -129 -139 -61 232 -185 12 -20 11 28 -199 46 -71 -89 -46 -106 207
7412B07k41q0N4J85L2o3m6O7j74R8q8Q7P6N0j99J32J76m24K59k1Kj83J07L8JR6
$$ 207 -34 -114 -60 125 157 94 48 115 -59 39 -49 38 114 164 -35 97 273 -151 108 87 89 -94 13 51 52 148
7438A48l8k55Oj11R6J1k7K54j59j34L09j50%J12l61K15m5K65j68J7K2j92M57k29
$$ 148 110 -145 -139 -250 -154 -143 -170 84 -75 -209 100 -50 -50 62 -299 -84 -129 136 -32 -15 7 -185 272 43
7462D3M8M8k11k1J71j10P0J7n0j07J89l10J35J26q3J31k46R8k09J93j17L78l59
$$ 43 91 139 -72 -93 78 -32 38 55 5 -102 87 -223 -88 38 -45 86 -160 -62 -271 -78 -195 183 -176
7485a76K89J61r2k89J36J11j16j26K48j30j88K06j3j6r7K16k20K00J9o8q2R7j02
$$ -176 113 274 182 -107 29 140 24 -102 146 16 -172 34 21 5 -92 124 -96 104 123 55 -27 70 -32
7508c2q2q5K41o6J17O4k11J2O0K77k67K58K0m47K58j95N7j29l3K65l87M69j39
$$ -32 -114 -199 42 -24 93 157 -54 -42 18 295 28 286 306 -141 117 -78 -21 -150 -183 82 -305 164 25
7531B5r1K00j25p2J08k52L9J18K02m33K76l23M21M9j89J36K46l25j97K55j28j4
$$ 25 -66 134 9 -63 45 -207 -168 -50 152 -281 -5 -328 93 142 -47 89 335 10 -187 68 -60 -74
7553g4j39L94r6J79j18k51k9K12P9j59k20J37l7n4j81J71L7L58j06J20l84L25
$$ -74 -213 181 85 264 146 -105 -134 78 157 -2 -222 -85 -122 -176 -357 -186 -149 209 103 223 -161 164
7575A64k39O6K45m87K99k86J56J26j34J70j28n8O0J46m36J96J32K8j08N5O8J29
$$ 164 -75 -9 236 -251 48 -238 -82 44 -90 80 -48 -106 -46 100 -336 -140 -8 20 -88 -33 35 164
7597A64p7j38J4l1O1R1J90o1l64K4K31k28K15K00l69p3Q2M1J80l6k22J39j09M94
$$ 164 87 -51 -37 -68 -7 84 274 213 -151 -127 104 -124 91 291 -78 -151 -69 -28 152 116 -106 33 -76 418
7621D18m22k6n2J47p3Q2j30J47K0j39J96m7r9N5J4K50l78J84p1j34J34n3j28J82
$$ 418 -4 -30 -82 65 -8 74 -56 91 111 -28 168 121 22 77 91 341 -37 147 76 -58 76 23 -105 77
7645G7k56K17j32J95l47j13L16L5l5j19J43J81j90r4J14J09k40K04j13l66O06
$$ 77 -179 38 -94 101 -246 -359 -43 -8 -43 -162 -19 162 -28 -122 -8 101 -139 65 -48 -414 192
7666A92j31L3k88K55J03n4k3j25L5K99l11O2k40K28j02J08J4j60Q2J1L06k48O0
$$ 192 61 94 -194 61 164 110 87 -38 -3 296 -15 47 -193 35 -67 41 55 -105 -23 -12 294 46 106
7689A06k64KK46k91L90k05M4j78J19J31QJ47j24j70j74J08l8j6KP1J18j1l63N16
$$ 106 -158 -156 90 -201 189 -16 28 -150 -31 100 108 255 131 -39 -213 -105 -143 -159 -157 -86 32 21 -342 174
7713A74l16J52j59O1J31l1j43L32l08J17j9r6J5L6O8K8k24K46j36J54r0LN9p7
$$ 174 -142 10 -149 -88 43 12 -131 201 -107 10 -9 -105 -90 -54 14 42 -182 64 -72 82 -8 -5 54 -23
7737b3P1L38m26k13J74o1J33jm2J87j56N6K07l32K7Q6K16l46J63J16j52q7J95
$$ -23 48 386 -40 -253 -79 -140 -7 -8 -50 137 -19 37 244 -88 -61 25 241 -105 58 174 22 -65 130
7760A30j1J7j34l5r0J58q9R8j01k54M85j57m5rJ14k76o4L0J80n9J14n7R8J41k47
$$ 130 119 136 2 -33 -123 35 -54 44 -57 -311 174 17 -28 -37 77 -199 -263 -233 -53 -112 2 -55 43 184 -63
7785f3M4Q2j29J1m8J63l7j62K42j21K92k18P8r6K02k37K13m06j28KM69k39%K11
$$ -63 -19 63 -66 -55 -103 60 23 -139 103 -18 274 56 134 38 240 3 216 -190 -318 -316 153 -86 -86 125
7809A25k35L12j88M8M6k22J38pj52M65j94j80P0L46l84J0L2j07J30J47n63N29
$$ 125 -110 202 14 62 108 -114 24 17 -135 330 136 -44 26 372 -12 -2 30 -77 53 200 -363 166
7831A66j66j56L00n1j26k37L23L27l14N1m69M01j2O4L8p0Rk47m3J29k8J72K58
$$ 166 0 -156 144 93 -33 -270 53 380 66 117 -352 49 37 101 139 69 78 -169 -212 -83 -111 61 319
7854C19n62J48K07k60J85J19m4j43J03j22K24j67QJ66l93L63j60r5J69r5k07K41
$$ 319 -243 -95 112 -148 37 156 112 -31 72 -50 174 7 15 181 -212 151 -9 -104 65 -30 -237 4
7876DK4j43l8M5J90n2K5M4q2l1J05j18K38l72K2L89r8k58q4L59l98N22m40L13
$$ 4 28 -115 -153 -108 82 30 55 99 17 -14 91 -27 211 -161 -139 250 152 -106 -190 169 -229 293 -147 166
7900A66j89j74O0L03k04j5K88m75K40j52J86kp2n4J98K42o48j03L15J75l4O2j
$$ 166 -23 -197 -137 166 -38 -53 235 -240 0 -152 34 32 -40 -94 104 346 -302 -405 -90 85 51 113 112
7923A12k21M1j52L28k32J88n5l3P0J93j92j42K39m86L82J03j55J2J22k78lJ95
$$ 112 -109 -68 -220 108 -124 64 9 -24 46 239 47 -95 144 -342 40 143 -12 0 122 -156 -159 36
7945C6N7l05Q4J77r1j08J77P8p2l01M20k89J54l8lL2J32Kj27k06K49J12j34j73
$$ 36 93 -212 -128 49 -42 -150 27 105 33 -268 152 -137 17 -21 -24 8 140 142 15 -191 58 170 36 -137
7969a37j46K55l17L50Q6j87J05Q3j48K54k16p7L78l33n7J34l0j4L4j4j13K36j3
$$ -137 -283 -28 -345 5 91 -96 9 92 -56 198 -18 -95 283 -50 -107 27 -3 -17 17 3 -110 126 113
7992A13J00l89K33M1k29M47l17j11j77j30M66K0Q1j8K8J7Mj22M2oK8k32J95j51
$$ 113 213 -176 57 98 -131 316 -1 -112 -289 -419 47 67 148 130 158 175 179 57 99 93 121 -111 84 -67
8016f7J73J01j75j4P9j93J41J87k96J89j32o8K20l8j41r6%J03o6J80k01K59k75
$$ -67 106 207 32 18 97 -96 45 232 -64 125 -7 -75 145 107 -34 -130 -130 -27 -93 87 -114 145 -130
8039a30O3J63j56K41j83j21L05k50K71k75m3K47O6k38J0k7J80l03K16J69k18r
$$ -130 -67 96 -60 181 -2 -123 182 -68 203 -72 -115 132 198 -40 -30 -57 123 -180 36 205 -13 -22
8061b2oj89L3J01l3O9k4K25k51j2K45j71J47m8J18j65K17m50L37j78j37J8L13
$$ -22 -28 -217 -184 -83 -116 -47 -71 154 -97 -109 136 -35 112 64 182 17 234 -216 121 -57 -194 -176 137
8084A37p0Q1k69lL5K70j21q8k58L76K07n51J42J14j41J65J15Q7m00K44o0OO0J78
$$ 137 67 148 -121 -124 -89 181 60 -28 -286 90 297 -254 -112 2 -139 26 141 228 -172 72 12 18 78 256
8108B56m85L48P9l42K40j24K08k33o5M0J20k92K41j6K67n20L73j95q8L19j59L3
$$ 256 -229 119 198 -144 96 -28 180 -53 -118 -78 42 -250 -9 -25 242 -278 95 -100 -188 131 -28 5
8130EP1l29J41J72k54L43J6k99M1PJ27q6p4L0M0L1j01L44m09p2K33J16o0NP7K0
$$ 5 76 -253 -112 60 -194 149 165 -134 -93 -86 41 -45 -119 -89 -49 -18 -119 225 -184 -256 -23 93 33 38 115 135
8156A35j7k36K72n9m5j9j44J32J31R1m16M5K55J68k60J40k16K6J5L4J02N1l47
$$ 135 118 -118 154 95 50 31 -113 19 150 241 -175 -130 125 293 33 173 -43 -17 -2 32 134 185 -162
8179a62J80j49L34j36J04j07j10K54k01j40L85k54
$$ -162 18 -131 203 67 171 64 -46 208 7 -133 252 -2
8191b
$$ Imaginary data points
##PAGE= N=2
##DATA TABLE= (X++(I..I)), XYDATA
0@%%%%%%%%%%%%%%%%%%JrJ6j6J6j6J6k1K9l2L7m5N0n5O3p2Q1r1J01j13J27j43
$$ 0 0 0 0 0 0 0 0 0 0 0 0 0 0 0 0 0 0 0 1 -8 8 -8 8 -8 8 -13 16 -16 21 -24 26 -29 34 -38 43 -48 53 -60 67 -76
40g6J60j78J98k18K40k68K96l23L56l93M32m75N26n81O41p09P86q75R77j098J245
$$ -76 84 -94 104 -114 126 -142 154 -169 187 -206 226 -249 277 -304 337 -372 414 -461 516 -582 663
61F63j423J643j931K323k885L770n377R224l4414m3759M7469M5085O1153Q0197
$$ 663 -760 883 -1048 1275 -1610 2160 -3217 6007 -28407 -72166 -24697 20388 81541 161738
75A61738P6113L2987R923k4280n7247o7403n5560m9404k7693o890l653j0804j7903
$$ 161738 237851 270838 280761 256481 199234 131831 76271 26867 -826 -7716 -11369 -22173 -40076
88d0076l5655m7482m5777l5303j9875N366L0863M8399N5253N6241M6525K8403
$$ -40076 -75731 -123213 -168990 -204293 -224168 -218802 -187939 -139540 -84287 -28046 18479 46882
100D6882J3202J0547P167O331J8833K6536J8738J4529O224j7574l7139m1615m8085
$$ 46882 60084 70631 77798 84129 102962 129498 148236 162765 168989 151415 114276 72661 24576
113B4576m6501k9133j7839j3548l372k940j1505j0129o082n899M413K1107K5202
$$ 24576 -21925 -51058 -68897 -82445 -85817 -88757 -100262 -110391 -116473 -122372 -117959 -96852 -71650
126g1650K9307L4753K9535J8092J4874J1912O459P114R548N766l94o251j1918
$$ -71650 -42343 -7590 21945 40037 54911 66823 73282 80396 89944 95710 95316 89065 77147
139G7147j8253k1804k1683k0088j8630j3078q423p031n878l699m623k496K584
$$ 77147 58894 37090 15407 -4681 -23311 -36389 -44812 -51843 -57721 -61420 -66043 -68539 -65955
152f5955M115O854J4146J5461J4419J8356J7297R338N725N650k035l883P43l79
$$ -65955 -61840 -54986 -40840 -25379 -10960 7396 24693 34031 39756 45406 43371 39488 40231 39852
166C9852k097J74j245p718r959j0611j3605j1407o971l652q39K673J687m88m11
$$ 39852 37755 37929 36684 28966 19007 8396 -5209 -16616 -23587 -27239 -28078 -25405 -23718 -24206 -24617
181b4617J84O98L673O969O108M941M497K041n17n51J972K188M023O804M682j147
$$ -24617 -24433 -23735 -20062 -13093 -6985 -2044 2453 4494 3977 3426 5398 7586 11609 18413 23095 21948
197B1948l918n697r021n963r19J990M030P063M214l27l312p306r600p373l294
$$ 21948 18030 12333 3312 -2651 -3570 -1580 2450 9513 13727 13400 10088 2782 -6818 -14191 -17485
212a7485j358L738P383N084K661J028l295p988n980m047k575K849R271J0759J0151
$$ -17485 -18843 -15105 -7722 -2638 23 1051 -2244 -10232 -16212 -20259 -22834 -19985 -10714 45 10196
227A0196R071L696l382o058o679n372j092N332Q405R057P327R68p157j3043j5120
$$ 10196 19267 22963 19581 13523 6844 1472 380 5712 14117 23174 30501 31469 24312 11269 -3851
242c851j4439q240m37M566P063P881K871l668o755q008p905j760O675J0512J3125
$$ -3851 -18290 -26530 -26967 -22401 -15338 -7457 -4586 -8254 -15009 -23017 -30922 -32682 -26007 -15495 -2370
257b370J4476J0383L945m55l056n960l225K13K331L534M594K102k142n942r370
$$ -2370 12106 22489 26434 25979 22923 16963 13738 13951 16282 19816 24410 26512 24370 18428 9058
272I058j2664j2032q251n508p40M048M294M043K482j31l655l713n59K494P246
$$ 9058 -3606 -15638 -23889 -29397 -30137 -26089 -21795 -17752 -15270 -15401 -19056 -22769 -23328 -20834 -13588
287a3588J2385J3547J0705P596L397l117n540n309l837j269K451K755P47k145
$$ -13588 -1203 12344 23049 30645 34042 30925 25385 20076 16239 14970 17421 20176 20923 18778
301A8778n928j0206j1044j0103q183m472K7J884K775L831L533J439J679K633K287
$$ 18778 12850 2644 -8400 -18503 -26686 -31158 -31131 -29247 -26472 -22641 -19108 -17669 -15990 -13357 -11070
316a1070K834N803O397O758O997O897M375K769Q62k862n172m871n584n080l341
$$ -11070 -8236 -2433 3964 10722 17719 24616 28991 31760 32622 29760 24588 19717 14133 9053 5712
331E712k292l563l771l744o241o373m902l561k256J764L315L402M705N340M913
$$ 5712 3420 -143 -3914 -7658 -13899 -20272 -25174 -28735 -30991 -29227 -25912 -22510 -17805 -12465 -7552
346g552M873N835M858M607M007L131J349J164J217N24J65K41j889n166n823p429
$$ -7552 -2679 3156 8014 12621 16628 19759 21108 22272 23489 24013 24178 24419 22530 17364 11541 4112
362D112q422p176m606l258j133R51N09q28r77m55m77J432L584M745O138P076O697
$$ 4112 -4310 -11486 -16092 -19350 -20483 -19532 -19023 -19851 -20828 -21283 -21760 -20328 -16744 -11999 -5861 1215 7912
379G912N057M505L297J210J090j27j809k295k490k631k989k504k180l809l698
$$ 7912 12969 17474 20771 21981 23071 22944 21135 18840 16350 13719 10730 8226 6046 2237 -1461
394a461m937o181n754m426k440j74K639L868L778M159K981K306J258L149K605
$$ -1461 -6398 -12579 -18333 -22759 -25199 -25373 -22734 -18866 -15088 -10929 -7948 -5642 -4384 -1235 1370
409A370L573M706M575L159K788J320M4j134j650l499m243m242n108m533l370j667
$$ 1370 4943 9649 14224 17383 20171 21491 21535 20401 18751 15252 11009 6767 1659 -2874 -6244 -7911
425g911j813p50k92j615k455k656k208o26J753L944N042O078O173M005K781R66
$$ -7911 -9724 -10474 -10766 -12381 -14836 -17492 -19700 -20326 -18573 -14629 -9587 -3509 2664 6669 9450 10416
441A0416N16j03N90J127J038J123O39l43j838k085l363m574l885l849m457l335
$$ 10416 10932 10829 11419 12546 13584 14707 15346 15003 13165 11080 7717 3143 -742 -4591 -9048 -12383
457a2383j811n20M48J688J947P18K16J35r27M18J721L208M806N875N044L064J767
$$ -12383 -14194 -14714 -14266 -12578 -10631 -9913 -9697 -9562 -10489 -10071 -8350 -5142 -336 5539 10583 13647 15414
474A5414J17k028j866j464j600o81J63o06j369j290k753k892l183k960l381k989
$$ 15414 15531 13503 11637 10173 8573 7892 8055 7449 6080 4790 2037 -855 -4038 -6998 -10379 -13368
490a3368j549l20J12K456L083K711K793K426J12P2J24Q48K089L791M358L340K182
$$ -13368 -14917 -15237 -15125 -12669 -9586 -6875 -4082 -1656 -1544 -1472 -1348 -500 1589 5380 9738 13078 15260
507A5260R84j165l559k598l378k523j075q63j104j075j215k161j977j751j800
$$ 15260 16244 15079 11520 8922 5544 3021 1946 1083 -21 -1096 -2311 -4472 -6449 -8200 -10000
522a0000j932q16Q6K3J489K375K910L410L776K762J055N85P5j55M58J656J604
$$ -10000 -11932 -12748 -12662 -12639 -11150 -8775 -5865 -2455 1321 4083 5138 5723 5798 5643 6101 7757 9361
539I361K149J637o7j814l141l007l891k610j884j925j148m05r90j044p34n31n39
$$ 9361 11510 13147 13080 11266 8125 5118 1227 -1383 -3267 -5192 -6340 -6745 -7735 -8779 -9513 -10044 -10583
556a0583K73J250N65R91K372J838K843L643L063K274J508J73n84j077n77m57L09
$$ -10583 -10310 -9060 -8495 -7504 -5132 -3294 -451 3192 6255 8529 10037 10210 9626 8549 7972 7515 7824
573G824O50lj290k001k877l577l097k613j827m66K34m68P1n75L23O89J120K296
$$ 7824 8474 8471 7181 5180 2303 -1274 -4371 -6984 -8811 -9277 -9043 -9511 -9440 -10015 -9692 -9003 -7883 -5587
591e587K271J677K126J888P35J622K079J749J954J392Q84j301j896k442k365j785
$$ -5587 -3316 -1639 487 2375 3110 4732 6811 8560 10514 11906 12790 11489 9593 7151 4786 3001
607C001j443j261j120r01j929k040k179k226j473k64P84N40J348K017K186K068
$$ 3001 1558 297 -823 -1724 -3653 -5693 -7872 -10098 -11571 -11835 -11051 -10511 -9163 -7146 -4960 -2892
623b892K450K272J738J721O68M05J61J018J461J545J301j40j629k829l526l332
$$ -2892 -442 1830 3568 5289 5957 6362 6523 7541 9002 10547 11848 11708 10079 7250 3724 392
639C92l118j578m10J62N48j019j571k252k216j594O88K253K722L322L644J774
$$ 392 -2726 -4304 -4714 -4552 -4004 -5023 -6594 -8846 -11062 -12656 -11968 -9715 -6993 -3671 -27 1747
655A747P88P9J52K04J617K419K115J616J125m91j534k091k980k658k136j750j141
$$ 1747 2535 2614 2766 2970 4587 7006 9121 10737 11862 11371 9837 7746 4766 2108 -28 -1778 -2919
672b919o21n29m45o84j094j551k115j179j1O85K172L757L759K721K494Q20j508
$$ -2919 -3540 -4069 -4514 -5198 -6292 -7843 -9958 -11137 -11148 -10463 -8291 -4534 -775 1946 4440 5260 3752
689C752j031m70J031K161L482K462J472m53k252m282m184l281k043l80P50P15
$$ 3752 2721 2251 3282 5443 8925 11387 12859 12406 10154 5872 1688 -1593 -3636 -4016 -3266 -2551
705b551K79j338k186k446j706q43j09J406K436K452K340J609J903J377J477Q12
$$ -2551 -2272 -3610 -5796 -8242 -9948 -10791 -10900 -9494 -7058 -4606 -2266 -657 1246 2623 4100 4912
721D912J105O38P20O86J21L12L2k58j193j389k537k517k323k059j840o23p65q45
$$ 4912 6017 6655 7375 8061 8182 8494 8526 8268 7075 5686 3149 632 -1691 -3750 -5590 -6213 -6978 -7823
739g823q66J7n62O81J095J468J774J483J377N80R03J585K203L056K861K096N45
$$ -7823 -8689 -8672 -9234 -8553 -7458 -5990 -4216 -2733 -1356 -776 127 1712 3915 6971 9832 11928 12473
756A2473q21k715l072k513j778p40O89J071o6j459k748l774m049l027r64O61K558
$$ 12473 11652 8937 5865 3352 1574 834 1523 2594 2528 1069 -1679 -5453 -9502 -12529 -13493 -12832 -10274
773a0274L428L030J813J013%m91O06O97J862K285L045K325J866O40p20j848k402
$$ -10274 -6846 -3816 -2003 -990 -990 -1481 -875 -178 1684 3969 7014 9339 11205 11845 11125 9277 6875
790F875k329k855j776q07n84K64o78q46k235k226k126j875p0J614K532K876K461
$$ 6875 4546 1691 -85 -892 -1476 -1212 -1890 -2736 -4971 -7197 -9323 -11198 -11268 -9654 -7122 -4246 -1785
807a785J436O79k44P8P06J900K733K598K334N66j076k643k878k235j154q8J322
$$ -1785 -349 330 86 164 870 2770 5503 8101 10435 11001 9925 7282 4404 2169 1015 927 2249
824B249K79k48j637k878m181k847j717k03K038L313K893K285J081o11j160j218
$$ 2249 2528 2280 643 -2235 -6416 -9263 -10980 -11183 -9145 -5832 -2939 -654 427 -184 -1344 -2562
840b562q22O62K470L357L476L034J799n97j885l565l728l171j534L32K124K408
$$ -2562 -3384 -2722 -252 3105 6581 9615 11414 10817 8932 5367 1639 -1532 -3066 -2734 -610 1798
856A798J963L66k238l620m445m246k175P17L132N015M980K984O18j511l145k905
$$ 1798 3761 4127 1889 -1731 -6176 -10422 -12597 -11880 -8748 -3733 1247 4231 4849 3338 193 -2712
872b712j858M78K800M118M165K714N57j750l058l635k498j815l7J392J667J238
$$ -2712 -4570 -4092 -1292 2826 6991 9705 10262 8512 5454 1819 -679 -2494 -2531 -1139 528 1766
888A766L38p55k052k209j836j479m94O17J714J808J410J433P53k85n77m74l48
$$ 1766 2104 1349 -703 -2912 -4748 -6227 -6721 -6104 -4390 -2582 -1172 261 1014 729 152 -322 -670
905f70N20R70J604J611J039N8p75j421j325m05m24L99K73J14m20j535j783j269
$$ -670 -150 820 2424 4035 5074 5132 4357 2936 1611 1206 782 1181 1454 1568 1148 -387 -2170 -3439
923c439q44R7R44J478Q40J84r34j283q35l34O89K043K066K240J219P7n63j420
$$ -3439 -4283 -4186 -3242 -1764 -924 -740 -1674 -2957 -3792 -4126 -3437 -1394 672 2912 4131 4208 3645 2225
941B225j245l87K54R46J641R68K06o43j202k240j904j171q48q6K82R64J94M21
$$ 2225 980 593 847 1793 3434 4402 4608 3965 2763 523 -1381 -2552 -3400 -3486 -3204 -2240 -2046 -1625
959a625l63l69q70m68m38N82Q56J676J911J499J069P9m41o69n24k24O62R65Q74
$$ -1625 -1988 -2357 -3227 -3695 -4133 -3551 -2695 -1019 892 2391 3460 3539 3098 2429 1905 1681 2343 3308 4182
978D182K66k64j369j827j870j578n92M74L54M21o6m05j436j326p55M43R60K196
$$ 4182 4448 4184 2815 988 -882 -2460 -3052 -2578 -2224 -1803 -1869 -2274 -3710 -5036 -5791 -5348 -4388 -2192
996b192K244J448J174j50n36p48o0K14J076J738J032O74m77j209j502k042j550
$$ -2192 52 1500 2674 2524 1988 1240 1180 1394 2470 4208 5240 5914 5437 4228 2726 684 -866
1013h66r56q06M0K02L22k1k08o85j256m31m12P6J029J780K071J642J653M39J32
$$ -866 -1822 -2628 -2588 -2386 -2064 -2085 -2293 -2978 -4234 -4665 -5077 -5001 -3972 -2192 -121 1521 3174 3613 3745
1032C745r91m93l52M78N90J516P95L44j108k123k257j938j838k93M15P42J064
$$ 3745 2754 2261 1909 2387 2977 4493 5288 5632 4524 2401 144 -1794 -3632 -3925 -3510 -2768 -1704
1049a704Rk70j404j086n80K73J320J678K018J532Q62L75l52k48m35R5N51N77O89
$$ -1704 -1695 -1965 -3369 -4455 -5035 -4762 -3442 -1764 254 1786 2648 3023 2671 2423 1988 2083 2634 3211 3900
1068C900J6m66m68j173j205j544j195n08o40j02O80O49M86r9l33m98m93l69Q08
$$ 3900 3916 3450 2982 1809 604 -940 -2135 -2643 -3283 -3385 -2705 -2056 -1570 -1669 -2002 -2500 -2993 -3362 -2554
1087b554J073J484K103J016J065l44j014r31j006n90O47P23Q81q9q1q84j280j316
$$ -2554 -1481 3 2106 3122 4187 3843 2829 1898 892 302 949 1672 2553 2464 2383 1499 219 -1097
1105a097r04q25J09L41N69K58J8%K94j19M54K81M50J81k1k3L64M23P17N07J66
$$ -1097 -2001 -2826 -2717 -2376 -1807 -1549 -1531 -1531 -1237 -1356 -902 -621 -171 10 -11 -34 330 753 1470 1977 2143
1126B143O31q35l68q48q03j60j02K04N01L44m01n53j65l99q30J38j32o3K30K44
$$ 2143 2774 1939 1571 723 -80 -240 -342 -138 363 707 306 -247 -412 -811 -1641 -1503 -1635 -1698 -1468 -1224
1146a224L45N66L94J18M61M5k82n03l31R3J57P87J023M79N24l97p21j139j007
$$ -1224 -879 -313 81 199 660 705 423 -80 -411 -318 -161 626 1649 2128 2652 2255 1534 395 -612
1165f12j02N3J98N97L11K55k30r93m19p91l27J9j49O17L64K14M99K52N07O27J51
$$ -612 -714 -661 -463 134 445 700 470 -523 -942 -1733 -2060 -2041 -2190 -1573 -1209 -995 -496 -244 263 890 1041
1186A041k12p1j27n29J79N97Q48M47P99J21p95j254r91j283o56l28O23P03L01
$$ 1041 829 758 631 102 281 878 1726 2173 2972 3093 2298 1044 53 -1230 -1886 -2214 -1591 -888 -587
1205e87L68j24p57o00m77m38K06N25P52R32P98J095L78P46n21k76m86m72m58q0
$$ -587 -219 -343 -1100 -1700 -2177 -2615 -2409 -1884 -1132 -200 598 1693 2071 2817 2296 2020 1534 1062 604 524
1225E24P44L9J040j14l74j235j461j162j023m99L31O94O12J043J32k65j79m95
$$ 524 1268 1307 2347 2233 1859 624 -837 -1999 -3022 -3521 -3190 -2496 -1884 -841 -709 -974 -1153 -1648
1243a648J09K19O26J121P36P30N46K83J64j08l54J16o56m27k32r22n30j23j88
$$ -1648 -1539 -1320 -694 427 1163 1893 2439 2722 2886 2778 2424 2540 1884 1457 1225 303 -227 -350 -538
1262e38J02O8p35m16p92q55m50N0O47P57Q69J324N62L25K18m2L14j13N91N7M02
$$ -538 -436 -368 -1103 -1519 -2311 -3166 -3616 -3566 -2919 -2162 -1293 31 593 918 1136 1094 1408 1295 1886 1943 2345
1283B345L61j0M7j23j59n67j115j071j127j099m15J52Q2R20L31J53m27m79o50
$$ 2345 2706 2696 2743 2620 2461 1894 779 -292 -1419 -2518 -2933 -2781 -2699 -1779 -1448 -1295 -1722 -2201 -2851
1302b851k55L37P73J773J503J112O56J44l35j00q48M4L32L00k33k98k25o35j007
$$ -2851 -3106 -2769 -1996 -223 1280 2392 3048 3192 2857 2757 1909 1953 2285 2585 2352 2054 1829 1194 187
1321A87p14o28q06l45m85o23n1O1K76N71O72N62L31P02K70L65M50N74Q28P41M57
$$ 187 -527 -1155 -1961 -2306 -2791 -3414 -3465 -3404 -3128 -2557 -1885 -1323 -992 -290 -20 345 795 1369 2197 2938 3395
1342C395k9p8n42l10k85k63m58m65q52q14o86n75m61j08J04j37K05J33n30n7m4
$$ 3395 3366 3288 2746 2436 2151 1888 1430 965 113 -701 -1387 -1962 -2423 -2531 -2427 -2564 -2359 -2226 -2756 -2813 -2857
1363b857P28R46J285R77J083M57l41l48j02k31O07L79L97j71Kp21r67j107p72
$$ -2857 -2129 -1183 102 1079 2162 2619 2278 1930 1828 1597 2204 2583 2980 2809 2811 2090 1123 16 -756
1382g56m37r20K67k17k83j6k62j57J65L68L01K89O58J92M07N09J064N74O54N71
$$ -756 -1193 -2113 -1846 -2063 -2346 -2362 -2624 -2781 -2616 -2248 -1947 -1658 -1000 -808 -401 108 1172 1746 2400 2971
1402B971j84p6l77m60J6k59J26n7k62o88q86o72j120l06l0L90n0O4l93K4j77j90
$$ 2971 2787 2711 2334 1874 1890 1631 1757 1700 1438 750 -136 -808 -1928 -2234 -2264 -1874 -1924 -1860 -2253 -2229 -2406 -2596
1424b596R02N12R64O33N86M03K54n8k68O51K30M07K21n4o62p53m38k11n03k55
$$ -2596 -1694 -1182 -218 415 1001 1404 1658 1600 1332 1983 2213 2620 2841 2787 2125 1372 934 723 220 -35
1444c5k44m69l78j178k27k24J93L36L35J3K05J94J92J06M53O95R70P12L16N55
$$ -35 -279 -748 -1126 -2304 -2531 -2755 -2562 -2226 -1891 -1878 -1673 -1479 -1287 -1181 -728 -33 937 1649 1965 2520
1464B520j0j84l27L05j80k12J82o15l32p84n67n77k20m02q2n57l86k64j19P9K43
$$ 2520 2510 2326 1999 2304 2124 1912 2094 1479 1147 363 -204 -781 -1001 -1403 -1485 -2042 -2428 -2692 -2811 -2732 -2489
1485b489J006M06P72M72r5J71P2M84N86Q95L57P31j12k25q06q57n46j31m3j02
$$ -2489 -1483 -1077 -305 167 72 243 315 799 1385 2280 2637 3368 3256 3031 2225 1368 822 691 648 546
1505E46m14p43j50p76n07k53p7K74j53L06K75J6M1N53O95O22P60M09L50J76r9
$$ 546 132 -611 -761 -1537 -2044 -2297 -2374 -2100 -2253 -1947 -1672 -1656 -1615 -1062 -367 255 1015 1424 1774 1950 1851
1526A851k58r0L12M41j25n2l71o09k08q71q24l56l35l23m43K5R9J79M37L28Q5
$$ 1851 1593 1503 1815 2256 2131 2079 1708 1099 891 20 -804 -1160 -1495 -1818 -2261 -2236 -2137 -1958 -1521 -1193 -1108
1547a108M35m11j05K4M43N76J079R54O02L91k60l75p64p79n24K18N46L79L7M1
$$ -1108 -673 -1084 -1189 -1165 -722 -146 933 1887 2489 2880 2620 2245 1481 702 178 396 942 1321 1358 1399
1567A399o48j194r89r21m14J06K62Q55L15N54o0j22J49l3K17J64N57L16N28M03
$$ 1399 751 -443 -1432 -2353 -2767 -2661 -2399 -1544 -1229 -675 -735 -857 -708 -741 -524 -360 197 513 1041 1444
1587A444L87L54K02l33j92n17p61l00l60J17J44n2j16k41p62n23m85J8L0N91K94
$$ 1444 1831 2185 2387 2054 1862 1345 584 284 -76 41 185 133 17 -224 -986 -1509 -1994 -1976 -1946 -1355 -1061
1608a061L46L8L7M6J32O57N92L31K67J76k22l16j92K1K13L16J68k53j38n69q58
$$ -1061 -715 -677 -640 -594 -462 195 787 1118 1385 1561 1339 1023 831 852 1065 1381 1549 1296 1158 589 -269
1629b69p78q02K36J21L42M69L29J3l58l50l20J4L00J17R92N54M17M74o0j90m4
$$ -269 -1047 -1849 -1613 -1492 -1150 -681 -352 -339 -697 -1047 -1367 -1353 -1053 -936 56 610 1027 1501 1441 1251 1207
1650A207m44o4n93M3R3P2O64m6L1l91n92q29m94l25P6M84O26N54R1k15l79k98
$$ 1207 763 699 106 149 242 314 978 932 963 572 -20 -849 -1343 -1668 -1592 -1108 -482 72 163 -52 -431 -729
1672g29k05J1K28N69Q67L07J49j85o18k48L1J08J88K97L68l79k81m67l50l97K69
$$ -729 -934 -923 -695 -126 741 1048 1197 1012 394 146 177 285 473 770 1138 759 478 11 -339 -736 -467
1693d67m0J83M80O4m78k58O9l49k46N6K20O55K00J86P6n5j94k00K5k81K81J08
$$ -467 -507 -324 156 220 -258 -516 -447 -796 -1042 -986 -766 -111 89 275 351 296 102 -98 -73 -354 -73 35
1715C5M67O06K24K3O6p07r38m67k84J19N08O42M74j00l22q66o15m65k09j79J141
$$ 35 502 1108 1332 1355 1421 714 -224 -691 -975 -856 -348 294 768 668 346 -520 -1135 -1600 -1809 -1988 -847
1736h47Q13O51J35j9L3p74n55L57j07N86M91O10J55k90r6k75p34l07k16m26K16
$$ -847 -34 617 752 733 766 -8 -563 -206 -313 273 764 1374 1529 1239 1143 868 134 -173 -389 -815 -599
1757e99J76L7K43k37j47j79j02m57O4K88K12N84K81N31J91j24r1j80m29L31K05
$$ -599 -423 -386 -143 -380 -527 -706 -808 -1265 -1201 -913 -701 -117 164 695 886 762 671 491 62 393 598
1778E98O71m43J67l9o81l21p38j45J91K27L9j26n6k2l65n6k44N77J61M51O03L80
$$ 598 1269 826 993 954 273 -48 -786 -931 -740 -513 -474 -600 -656 -678 -1043 -1099 -1343 -766 -605 -154 449 829
1800H29o0j96J31k7p4L42J51k11j35o0J9m38k85l57J82l18k60O9j3m33J72K81
$$ 829 769 573 704 677 603 945 1096 885 750 690 709 271 -14 -371 -189 -507 -767 -698 -711 -1144 -972 -691
1822f91J26N3L99nK4N9Q8N90j74K17Q0M4K08l62K8Mk80j22r1k06k45n48J19k85
$$ -691 -565 -512 -113 -118 -94 -35 53 643 469 686 766 810 1018 656 684 688 408 286 195 -11 -256 -804 -685 -970
1846i70L33q9L33k89K06j01n58M73K9N64Q10K99NJ65n11l26l78K63k15M86M45
$$ -970 -637 -726 -393 -682 -476 -577 -1135 -662 -633 -69 741 1040 1045 1210 699 373 -5 258 43 529 974
1867I74k45j45j94j68o11l19l31J47kK40o4K79J33o1K11o7PN5K16n8J93L77J90
$$ 974 729 584 390 222 -389 -708 -1039 -892 -894 -654 -718 -439 -306 -367 -156 -223 -216 -161 55 -3 190 567 757
1890G57J60M3M8k58k96n37l38L15r5J0L72k14k32Q8m41k38M6P4J56M67K17o6R3
$$ 757 917 960 1008 750 454 -83 -421 -106 -201 -191 181 -33 -265 -177 -618 -856 -810 -736 -580 -113 104 38 131
1913A31M3j33N6K58K26R9m6j56k17l52K96l33L35J86j9j48k65m66k1p6j26L68
$$ 131 174 41 97 355 581 680 634 478 261 -91 205 -128 207 393 374 226 -39 -505 -526 -602 -728 -360
1935c60r7L91J08j81M67j52J83L5j77L14k53j65k38K18J29l9J15M11m88m24j54
$$ -360 -457 -66 42 -139 328 176 359 394 217 531 278 113 -125 93 222 183 298 709 221 -203 -357
1956c57m61J65O5J78P66j90L3on5m56Pl7K06M82M9L08k01j04J61k81k90J55n29
$$ -357 -818 -653 -588 -410 356 166 199 193 138 -318 -311 -348 -142 340 389 697 496 392 553 272 -18 137 -392
1979c92l7J87l80O8M9L09K84J73q9l25k12k33r6M22M82L15L08K89J63o25k10m33
$$ -392 -429 -242 -622 -554 -505 -196 88 261 172 -153 -365 -598 -694 -272 210 525 833 1122 1285 660 450 17
2001A7P6o3j0P2J10N9jm47k57l96j00k20L05M7K51K58L6M28J17j11L83J47j45
$$ 17 93 30 20 92 202 261 260 -187 -444 -840 -940 -1160 -855 -808 -557 -299 -263 165 282 171 554 701 556
2024E56k33J67j31K42L99m0k58M4l25n77l43k65J25O8j55l2Nj28J21l00R1J88
$$ 556 323 490 359 601 1000 960 702 746 421 -156 -499 -764 -639 -571 -726 -758 -753 -881 -760 -1060 -969 -781
2046g81O59K9P9L06N4j65N26K28O4M56k98j74q05J26k49k34K28J51j27o8k12n98
$$ -781 -122 -93 -14 292 346 181 707 935 999 1455 1157 983 178 304 55 -179 49 200 73 5 -207 -805
2068h05m83k23K45j88K38O24K22J60J57J53K75j8k10L37K47R1J4J33n1P9lk12
$$ -805 -1288 -1511 -1266 -1454 -1216 -592 -370 -210 -53 100 375 357 147 484 731 822 836 969 918 997 994 782
2090G82l53m45k85l22k23j7J62L13L5j24l3l48k26Q2O4M73L60L05N83j8j53j35
$$ 782 429 -16 -301 -623 -846 -863 -701 -388 -353 -477 -510 -858 -1084 -1002 -938 -465 -105 200 783 765 612 477
2112D77K0l7K25R3O0J43K6n20l28J04o27L26m7m67j46J20j09J13k16Q2J78p5L31
$$ 477 497 460 685 778 838 981 1007 487 159 263 -364 -38 -85 -552 -698 -578 -687 -574 -790 -708 -530 -605 -274
2135b74qJ5k50N10K55R0L03J79l05k18O0r4J55k8J99m3l31o6m80J03l2k28K73
$$ -274 -282 -267 -517 -7 248 338 641 820 515 297 357 263 418 390 589 546 215 149 -331 -228 -260 -488 -215
2158b15P7j0j11j18j21j58j65R2M69J18L91P0m33J74K69k13L08k09J43M05J62
$$ -215 -138 -148 -259 -377 -498 -656 -821 -729 -260 -142 249 319 -114 60 329 116 424 215 358 763 925
2179I25l71K48l50j82j48q6J42l62n9m4m3j31Nj60K51P1k40j61K04r7J97J97L55
$$ 925 554 802 452 270 122 36 178 -184 -243 -287 -330 -461 -456 -616 -365 -294 -534 -695 -491 -588 -391 -194 161
2202A61J28P9O0j61J20o7R1J10L29k70r6Q9m02m2j62l72L41K5j7n24P9j99K1q6
$$ 161 289 368 428 267 387 320 411 521 850 580 484 573 171 129 -33 -405 -64 -39 -56 -580 -501 -700 -679 -765
2226g65K03J44J80J93k35Q9j53M09m4L61JK92k8K8m6j41j48R5k46L15k60j50j27
$$ -765 -562 -418 -238 -45 -280 -191 -344 65 21 382 383 675 647 675 629 488 340 435 189 504 244 94 -33
2249c3n41K02j11J64k5j95K9j57K24q9m0L74K7J88n0L9L64r1L77j31j83J31J5
$$ -33 -574 -372 -483 -319 -344 -539 -510 -667 -443 -532 -572 -198 -171 17 -33 6 370 279 656 525 342 473 488
2272D88j94J35m31J11K71O2O1m22j5k96l45J17k47K20J16j65N26m6j79p2j21J41
$$ 488 294 429 -2 109 380 442 503 81 66 -230 -575 -458 -705 -485 -369 -534 -8 -54 -233 -305 -426 -285
2294b85J53k29N60N6K44R2J02l71l2j54P4R8k29K74o2m3k06r3LKj84k22l85n3
$$ -285 -132 -361 199 255 499 591 693 322 290 136 210 308 79 353 291 248 42 -51 -48 -46 -230 -452 -837 -890
2318h90K3K40L37n7M11K52l12p5j42j87J97K39k8N38mK05j30j82j99j8k11L7J54
$$ -890 -867 -627 -290 -347 64 316 4 -71 -213 -400 -203 36 8 546 542 747 617 435 236 218 7 44 198
2341A98j70R2q5l50P7J17p2j66j98J63o7j39J23J11Q3M69L6P7L9n7k66r0K20L53
$$ 198 28 120 35 -315 -238 -121 -193 -359 -557 -394 -461 -600 -477 -366 -283 186 222 299 338 281 15 -75 145 498
2365D98L6r4J52o5k84j75k9J11l64l8J0m6j76P5K7J4r6L06k02j18J79O8K06j5
$$ 498 534 440 592 527 243 68 39 150 -214 -252 -242 -288 -464 -389 -362 -348 -444 -138 -340 -458 -279 -211 -5 -20
2389b0K00J24R8j82r3J1n4k09Q8K95L5r6J09p6k68J2J04m68K88K28k42l68J75
$$ -20 180 304 402 220 127 138 84 -125 -37 258 293 197 306 230 -38 -26 78 -390 -102 126 -116 -484 -309
2412c09J02K9L13k32O4J60j31j39n2k74L72N8L67L9j44K22j27k95l2p9L8j45K64
$$ -309 -207 -178 135 -97 -33 127 -4 -143 -195 -469 -97 -39 328 367 223 445 318 23 -9 -88 -50 -195 69
2435F9R3J8k1j93m1k84q7Q8M84j85nl9P2K03l15K5l6kj42J9L70l13K04P2M65l20
$$ 69 162 180 159 -34 -75 -359 -446 -358 126 -59 -64 -103 -31 172 -143 -118 -154 -156 -298 -279 91 -222 -18 54 519 199
2461A99O3j67j8j08r0rJ81L70p6N0n9n45K30j68J49J37l92L14P1k82l95K94n5
$$ 199 262 95 77 -31 -121 -130 51 421 345 395 336 -209 21 -147 2 139 -253 61 132 -150 -545 -251 -306
2484c06J23K20J01o1R1n2m13L4L4L86K8K5j80L8J32k10l6j16Jj52K14J22J74N
$$ -306 -183 37 138 77 168 116 -297 -263 -229 157 185 210 30 68 200 -10 -46 -162 -161 -313 -99 23 197 202
2508B02k22j77J22k50J36J63j61K45k58M72j28K52j54k62Rp7m00K54J75L39Q1
$$ 202 -20 -197 -75 -325 -189 -26 -187 58 -200 272 144 396 242 -20 -11 -88 -488 -234 -59 280 361
2529C61Ql7j02m14j14J17O9J94N7J11JK6l77k5k21L6r6L94L6j59L13j97N0m2j83
$$ 361 369 332 230 -184 -298 -181 -112 82 139 250 251 277 -100 -125 -346 -310 -406 -12 24 -135 178 -19 31 -11 -194
2554a94K80L3j05j02J7K1k7R5K57j65j95j33O9Q0J7J4J22j80K75j52j27m5K10
$$ -194 86 119 14 -88 -71 -50 -77 18 275 110 -85 -218 -149 -69 -52 -38 84 -96 179 27 -100 -145 65
2577F5j06k57M0M48k18R0m4r4k14K74j66l5M95k71R7J84k54J76m00K44oo6p7J58
$$ 65 -41 -298 -258 190 -28 62 18 -76 -290 -16 -182 -217 278 7 104 288 34 210 -190 54 48 -18 -95 63
2601F3k20K9k4k14L14Q7l5Nk05j2K0K6K4k6M04k04K70n26M17k63RJ43P9J30J05
$$ 63 -157 -128 -152 -366 -52 35 0 5 -200 -212 -192 -166 -142 -168 236 32 302 -224 193 -70 -61 82 161 291 396
2626C96l12p3k08L12j17j7N9RJ42l15J28k06l7J25M51m34N0J37k36K77j50J59
$$ 396 84 11 -197 115 -2 -19 40 49 191 -124 4 -202 -239 -114 337 -97 -47 90 -146 131 -19 140
2648A40O2j29o4o2J84l83K37j53J20N6Q3K02j40k99m7ro3K51q2M0K82O9M6l67
$$ 140 202 73 9 -53 131 -252 -15 -168 -48 8 91 293 153 -146 -193 -202 -265 -14 -96 -56 226 295 341 -26
2672b6J47M9j44J1J35j19l60J73K61n94N93j76L8k1k79J59M1q4J67nL17r0j57
$$ -26 121 170 26 37 172 53 -307 -134 127 -467 126 -50 -12 -33 -312 -153 -112 -196 -29 -34 283 193 36
2695C6K12q7j41J73j83J89k6K1p7j02R8n03K00k0q7L30j55k68K35j4p0J07N1k5
$$ 36 248 161 20 193 10 199 173 194 117 15 113 -390 -190 -210 -297 33 -122 -390 -155 -169 -239 -132 -81 -106
2719a06K7O5R3j23O6o5K99k15L49j03J4J7P8m13R2j59%L9J08j0m39NK00k36K38
$$ -106 -79 -14 79 -44 22 -43 256 41 390 287 301 318 396 -17 75 -84 -84 -45 63 53 -386 -381 -181 -417 -179
2744a79J07J32k35r6j19J39K73l4J91J14J59k66N4q2j72oJ10J30M5k33j11N1o7
$$ -179 -72 60 -175 -271 -390 -251 22 -12 179 293 452 186 240 158 -14 -20 90 220 265 32 -79 -28 -95
2767i5k78m7j42L45QJ60k75o7K25L04n3j26l1J20j0L5K47j18l9OL27r2n3q19L31
$$ -95 -373 -420 -562 -217 -209 -49 -324 -391 -166 138 85 -41 -72 48 38 73 320 202 163 169 496 404 351 -468 -137
2792a37J04K07m18K92R4L7o9m0j38l71M8J42J75J08k09K06K6o7J02m0J11j30J17
$$ -137 -33 174 -244 48 142 179 110 70 -68 -439 -391 -249 -74 34 -175 31 57 -10 92 52 163 33 150
2815A50k30J90o1k3j17J44J48p9l95J16K0j02o1L81k8L4Q7K28k73r6j29j8O0J16
$$ 150 -80 110 49 26 -91 53 201 122 -273 -157 -137 -239 -300 81 53 87 174 402 129 33 -96 -114 -54 62
2839F2J33k91M3K7P4q0j28L24j49j48j25J72j3o2j88L74K84p2r5P6j34k68O7K7
$$ 62 195 -96 -53 -26 48 -32 -160 164 15 -133 -258 -86 -99 -161 -349 25 309 237 142 218 84 -184 -117 -90
2863i0J82K98l02M58l71K29o19J2K88k14O4j24L0j40J48j42L33k15j3R4L8r2J21
$$ -90 92 390 88 546 175 404 -215 -203 85 -129 -65 -189 -159 -299 -151 -293 40 -175 -188 -94 -56 -148 -27
2886b7k8M57k87m0K37P1l27J86p4j63K13j10K8j61l1M0j9j86k2j75Q6J29L2k4
$$ -27 -55 402 115 75 312 383 56 242 168 5 218 108 136 -25 -56 -16 -35 -221 -243 -418 -332 -203 -171 -195
2910a95N8J52j62J65M09k93j80M54k67n5L09k1m06K51K7j03j18K6q9j48L4j98
$$ -195 -137 15 -147 18 427 134 -46 408 141 86 395 374 -32 219 246 143 25 51 -38 -186 -152 -350
2932c50l6J59K15k48j78M26m64K44K39l5MK05q1n9O5j45R5L85j82J24k20m6l6
$$ -350 -386 -227 -12 -260 -438 -12 -476 -232 7 -28 -24 181 100 41 106 -39 56 441 259 383 163 117 81
2955H1j35O1j53N3pJJ18l25n6m2M34k18J22j24L6L08Q5j71M6k68K42J65l2qK9
$$ 81 -54 7 -146 -93 -100 -99 19 -306 -362 -404 30 -188 -66 -190 -154 154 239 68 114 -154 88 253 221 213 242
2980B42k43K36Q1m37L3j11M11j47J25k41J57j19j38J64j85J04r0J29p0R7O3m7
$$ 242 -1 235 316 -121 -88 -199 212 65 190 -51 106 -13 -151 13 -172 -68 -158 -29 -99 -2 61 14
3002A4j42J94N7O8P9k93K6m2J49L5j2n1O6j54m9j47M35j68q8p6J98J81m33J12
$$ 14 -128 66 123 191 270 -23 3 -39 110 145 133 82 148 -6 -55 -202 233 65 -23 -99 99 280 -153 -41
3026d1j29J32o3K05NN2n2k36n2K65N9j09QJ10l32l2j52L24P5j64L98l40p9k01
$$ -41 -170 -38 -101 104 109 161 109 -127 -179 86 145 36 44 154 -178 -210 -362 -38 37 -127 271 -69 -148 -349
3050c49N49m49K07J40k42K35J45j11J27m2l6k91l4J66M9m15L66N4q6O4j01k43
$$ -349 200 -249 -42 98 -144 91 236 125 252 210 174 -117 -151 15 64 -351 15 69 -17 47 -54 -297
3072b97K3J18j41J58K8M5l9K45q9J28j15LJ10L5R4j05l9M3K0m8k29k9J61j80j38
$$ -297 -274 -156 -297 -139 -111 -66 -105 140 51 179 64 67 177 212 306 201 162 205 225 177 -52 -81 80 -100 -238
3097b38M7r0K54r7K1m5j47N1M2j29M3K65K4k84L81K3l9J42J5q0P9k5oj93J17J31
$$ -238 -191 -281 -27 -124 -103 -148 -295 -244 -202 -331 -288 -23 1 -283 98 121 82 224 239 159 238 213 207 14 131 262
3123B62O7l52n5p1J83k19l15K71r2J86J12j55k70L08M5J04KJ9j01L39k9K10k17
$$ 262 329 -23 -78 -149 34 -185 -500 -229 -321 -135 -23 -178 -448 -140 -95 9 11 30 -71 268 239 449 232
3146B32J12k08J89p9n2l18J24j13m7K47l84K41k01K90k65j70k55n7M34j33L35
$$ 232 344 136 325 246 194 -124 0 -113 -160 87 -297 -56 -257 33 -232 -402 -657 -714 -280 -413 -78
3167g8R2Jj12q6R6M72m8l0M8p4k53K17Nj17l0m0j55K66l07qJ19l24j00N2K68r5
$$ -78 14 15 -97 -183 -87 385 337 307 355 281 28 245 250 133 103 63 -92 174 -133 -141 -22 -346 -446 -394 -126 -221
3193b21N9l0j34K13Q4N8j40J85k47M60j15QK05j06J33J17k97q8M5p7j96k0Oj7
$$ -221 -162 -192 -326 -113 -29 29 -111 74 -173 287 172 180 385 279 412 529 232 144 189 112 -84 -104 -98 -115
3217a15K48m48J17j25o0l14K47K77L2j95L18L47l52j12L05l3MM1N7L9K67m10Q5
$$ -115 133 -315 -198 -323 -383 -697 -450 -173 -141 -336 -18 329 -23 -135 170 137 141 182 239 278 545 135 220
3240B20K3k95J04j55J9R2j55L5M0m07J71J42R7L6j16j32R2O4j23J35J53J56j25
$$ 220 243 -52 52 -103 -84 8 -147 -112 -72 -479 -308 -166 -69 -33 -149 -281 -189 -125 -248 -113 40 196 71
3263G1m6k0L56k78L4J59k13J67k8j06j97Q2Q9j96n0J64K1J27n0k28r5K14P5m0
$$ 71 25 5 361 83 117 276 63 230 202 96 -101 -19 70 -126 -176 -12 9 136 86 -142 -237 -23 52 12
3287A2O8J44m84L30n0J35k39J8L76j6j71mm4rq9J48m3m5J10l83L49l63N6j21J93
$$ 12 80 224 -260 70 20 155 -84 -66 310 294 123 119 75 66 -23 125 82 37 147 -236 113 -250 -194 -315 -122
3312a22O7J4j31J86O6k46J64j2J60k3j26J66Rj75N5J2J62j04o6j02R6J44k32j20
$$ -122 -55 -41 -172 14 80 -166 -2 -14 146 123 -3 163 172 -3 52 64 226 122 56 -46 50 194 -38 -158
3336a58n5J32q5J30K0L7j66K7oK11j34RM82n06N1JnP3p2r0o0R4o7K73j76j56K31
$$ -158 -213 -81 -166 -36 -16 21 -145 -118 -124 87 -47 -38 444 -62 -11 -10 -15 58 -14 -104 -164 -70 -137 136 -40 -196 35
3363C5k6K8oJ50k47M0K18J56k39K97n51L66j73K52l12J60j78j4j62L46J95k50
$$ 35 9 37 31 181 -66 -26 192 348 109 406 -145 221 48 300 -12 148 -30 -44 -206 140 335 85
3385H5k27J74j00P0k07l4J13J3K84j67j59K77oJ52o3k40K73j53J02Pj53J19o5
$$ 85 -142 32 -68 2 -205 -239 -126 -113 171 4 -155 122 116 268 205 -35 238 85 187 194 41 160 95
3408I5R8k30J05J8k26j8j2L0K94l14J32R4q1L7J18j95L33k0j50P9k29Rl54L36
$$ 95 193 -37 68 86 -140 -158 -170 -140 154 -160 -28 66 -15 22 140 -55 278 258 108 187 -42 -33 -387 -51
3432e1J50J10k30K2K24j37j46J1n5K31n8J17k42K9j40J95j4J10qM1M0l44K49j10
$$ -51 99 209 -21 1 225 88 -58 -47 -102 129 71 188 -54 -25 -165 30 16 126 118 159 199 -145 104 -6
3456fj13j2p6M03J06m04L97l08M2j44j38J97l4K46o7j11q7j41J51j25J4L31O5
$$ -6 -119 -131 -207 196 302 -102 295 -13 29 -115 -253 -56 -90 156 89 -22 -109 -250 -99 -224 -210 121 186
3479A86j65J7n3O7j06K60k93P7K5N3j30j32J47K8l9J71r7m3l6M0k6Q4O0o3J4n4
$$ 186 21 38 -15 52 -54 206 -87 -10 15 68 -62 -194 -47 -19 -58 113 16 -27 -63 -23 -49 35 95 32 46 -8
3505hK0J61j60J57r5j97M49j18k54J6k9M9k33K67Oj06N9k27J75q1J22J00Q2o0
$$ -8 12 173 13 170 75 -122 327 209 -45 -29 -58 -9 -242 25 31 -75 -16 -243 -68 -149 -27 73 155 95
3529I5J1k02J60K43p9j36J59j45j44K16k78K9K37l73J72P4j12J7N1%k47K2K20
$$ 95 106 -96 64 307 228 92 251 106 -38 178 -100 -71 166 -207 -35 39 -73 -56 -5 -5 -252 -230 -10
3552a0j96J59J38k88O8J39k14kJ88p1L7K99K3k48QJ10O7l4j00R3n0j21k33M2K54
$$ -10 -206 -47 91 -197 -129 10 -204 -206 -18 -89 -52 247 270 22 30 140 207 173 73 166 116 -5 -238 -196 58
3577E8rM1k98N2j15p3J08K57j42J10j64J50j38L8Q1O6l5j6Q3Q4J56k39J20M4j99
$$ 58 49 90 -208 -156 -271 -344 -236 21 -121 -11 -175 -25 -163 -125 -44 22 -13 -29 54 138 294 55 175 219 20
3602B0J8j38K78k51J77k04L46m56J94rn0J92j15j48J15J6k41J03Q9j80N07p0j83
$$ 20 38 -100 178 -73 104 -100 246 -210 -16 -25 -75 117 2 -146 -31 -15 -256 -153 -64 -244 263 193 10
3625A0M1j90L12J12j89j55R3J06N8P7k98L23k95m2J5o3L38l40m0k12L28j33P9
$$ 10 51 -139 173 285 96 -59 34 140 198 275 -23 300 5 -37 -22 -85 253 -87 -127 -339 -11 -144 -65
3648f5J43j58P1K14k9k59K09P3M3l3n2R8k04K37q1l1mJ06k19j09L04o5j99j33
$$ -65 78 -80 -9 205 176 -83 126 199 242 209 157 255 51 288 207 176 172 278 59 -50 254 189 -10 -143
3672a43O8Q2p7L5m2j17q6L09j93J54r9J99nJ6k2jR4j79K34j65O0J51N1n56K29
$$ -143 -75 7 -70 -35 -77 -194 -280 29 -164 -10 -109 90 85 101 79 78 172 -7 227 62 122 273 324 -232 -3
3697cq6K98j05l13M5n1l0L1J97j67Q1N8P2K3k00J50N1J10o2O3q0k8j16J69j7K32
$$ -3 -89 209 104 -209 -164 -215 -245 -214 -17 -184 -103 -45 27 50 -150 0 51 161 99 162 82 54 -62 107 90 322
3723C22k04j11J06K8J71l81M77m24j46M16l91R3j52K25l00K53n3j13qQ6%M1rK4
$$ 322 118 7 113 141 312 -69 408 -16 -162 254 -137 -44 -196 29 -271 -18 -71 -184 -192 -106 -106 -65 -74 -50
3747e0J50j34K22j52J8j08J4L12j54J18q7j04K2nk33K16P8L1j51j41J76j69oJ63
$$ -50 100 -34 188 36 54 -54 -40 272 118 236 149 45 67 62 -171 45 123 154 3 -138 38 -131 -137 26
3771B6j72L51k48J87k47p4K08J28k03k7J05j18J62J0J33l8j87J43J88j82K4k23
$$ 26 -146 205 -43 144 -103 -177 31 159 -44 -71 34 -84 78 88 221 183 -4 139 327 145 169 -54
3793e4J47k19kK54j12k18K64j59j50K33L5k60K0R1K26j21j26K28L32j66on05K06
$$ -54 93 -126 -128 126 14 -204 60 -99 -249 -16 19 -241 -221 -130 96 -25 -151 77 409 243 237 -268 -62
3816f2R1j01k5J34q0j06J77J08n8j61q9J94k64L56k40j05M00k29l4K58k17j93
$$ -62 29 -72 -97 37 -43 -149 28 136 78 -83 -172 22 -242 114 -126 -231 169 -60 -94 164 -53 -246
3838b46L13j12K7oJ84j10j4p3J61M5k00J83r2k25M26l50J76O4j41J57jj06l54
$$ -246 67 -45 -18 -24 160 50 36 -37 124 169 -31 152 60 -165 261 -89 87 151 10 167 166 60 -294
3861b94M99k83J7j24J37o3k6n4K31M9j46J23k92K06k11J60P9K13j34j26K59k13
$$ -294 205 -78 -61 -185 -48 -111 -137 -191 40 89 -57 66 -226 -20 -231 -71 8 221 87 -39 220 7
3883Gk6J66k46K60J5j72K48q6l05K40q9m6k68O1J94k4K94k24K13j34JO9k75K46
$$ 7 -19 147 -99 161 176 4 252 166 -139 101 12 -34 -302 -241 -47 -71 223 -1 212 78 79 148 -127 119
3907A19j55K54o0j00j81L40j42M8k51J91j36k2K10j07m4J52k88J54n3P3N5k15
$$ 119 -36 218 158 58 -123 217 75 123 -128 63 -73 -95 115 8 -36 116 -172 -18 -71 2 57 -158
3929a58k6O1l6J67k01L19oj90K51l81K61J5L6j54M1J08J16j14Qj48pO6j47Jk5
$$ -158 -184 -123 -159 8 -193 126 120 -70 181 -200 61 76 112 -42 -1 107 223 109 117 -31 -38 28 -119 -118 -143
3954a43J58r4k14L16Oj3j32mL20J7K1p5n1J5j66L6J30j02Q3kj46p7J37J50l89
$$ -143 15 -79 -293 23 29 16 -116 -120 200 217 238 163 112 127 -39 -3 127 25 108 106 -40 -117 20 170 -219
3979b19K13J37m02L28q6l1K5L4m0J39j92j17K81j63J65j73R7M7mk65K96p1j83
$$ -219 -6 131 -271 57 -29 -60 -35 -1 -41 98 -94 -211 70 -93 72 -101 -4 43 39 -226 70 -1 -184
4002a84L44o5j53Q0m3j43K63k28Q0Q4k00J77j21K96k43Q3L2j1j12J63m6j96L44
$$ -184 160 95 -58 22 -21 -164 99 -129 -49 35 -165 12 -109 187 -56 27 59 48 -64 99 53 -143 201
4025B01k76J50P3K8j23q4K29l10J76j71L41l72J43N8l85L76Kr9n8J13j17j12K78
$$ 201 -75 75 148 176 53 -31 198 -112 64 -107 234 -138 5 63 -322 54 56 -43 -101 12 -105 -217 61
4048F1N4k2Q8Rj12r8L6NO6k8m9j19K68j12j89J69p3r8j2J41l0j36K32m5j2j0p
$$ 61 115 93 181 190 78 -20 16 21 87 59 10 -109 159 47 -142 27 -46 -144 -156 -15 -45 -181 51 6 -6 -16 -23
4075b3J43j99J61M8r3J08p3o0k14K87k49J52J63j88j2j20K48q0q7K08k40M96l73
$$ -23 120 -79 82 130 37 145 72 12 -202 85 -164 -12 151 -37 -49 -169 79 -1 -88 120 -120 376 3
4098Cj01r8L42r1K1l83K62j83J23K81n2j37J87R4k94Q6k02J22K71m91K77j3J59
$$ 3 -98 -196 146 55 76 -307 -45 -228 -105 176 124 -13 174 268 -26 60 -142 -20 251 -240 37 24 183
4121A83j57Q7j79K06j49j62K3l3k0J47j1J13OJ23k44J7J96o4j18nM5m8K48m24
$$ 183 26 113 -66 140 -9 -171 -148 -181 -201 -54 -65 48 54 177 -67 -50 146 82 -36 -41 4 -44 204 -220
4145b20K24J93k42NJ18p3Ln4K24j95k8q5L46l31o4j6J77n1J11k34J40K2J57q1
$$ -220 4 197 -45 -40 78 5 8 -46 178 -17 -45 -130 216 -115 -179 -195 -18 -69 42 -192 -52 -30 127 46
4169D6J75l70L07l73J54n5R6L6o4J71j23j42j47J68P1m2j3J66m8J08j11j08q0
$$ 46 221 -149 158 -215 -61 -116 -20 16 -48 123 0 -142 -289 -121 -50 -92 -105 61 13 121 10 -98 -178
4192a78Q8k4J38j7j8K0j93Q1P1K69j40j1j65JK15l4j01R7p9l1J92j80J5K2J34
$$ -178 -90 -114 24 7 -11 9 -184 -103 -32 237 97 86 -79 -78 137 103 2 99 20 -11 181 1 16 38 172
4217A72j29O2r9k10o2N8K17J87j63j48L1K03k86K16j89K61l33K13j01r4K49j19
$$ 172 43 105 6 -204 -266 -208 9 196 33 -115 -84 119 -167 49 -140 121 -212 1 -100 -194 55 -64
4239f4J06J99o3j50J40k97J07J98l12K41M3kp2o7K36j90K16l64Q4O7l85M01p1
$$ -64 42 241 178 28 168 -129 -22 176 -136 105 148 146 74 7 243 53 269 -95 -11 56 -329 72 1
4262Ak53K73j24Q0l9L17j30q5kk37J85Q4J84m3k73J3J77j72J45j72K41l6k58K08
$$ 1 -252 21 -103 -23 -62 255 125 40 38 -199 -14 70 254 211 -62 -49 128 -44 101 -71 170 134 -124 84
4286H4k36L34k00j63K98j60k5J11k8K2o8rN7K06m70J17Q0L25q8j94q6K19O1k00
$$ 84 -152 182 -18 -181 117 -43 -68 43 15 37 -31 -40 17 223 -247 -130 -50 275 187 -7 -93 126 187 -13
4310a3J38j64K00j69O3j11P4O4k5k9Q3p3m2K9l2j05j53P0L79l65J87j03q2K66
$$ -13 125 -39 161 -8 55 -56 18 82 57 28 111 38 -4 25 -7 -112 -265 -195 184 -181 6 -97 -179 87
4334H7j60J79J73k32j62K20jr6j01J21K7Q2j85J22J22l67J98l7K01n9m3j19j31
$$ 87 -73 106 279 47 -115 105 104 8 -93 28 55 137 -48 74 196 -171 27 -10 191 132 89 -30 -161
4357a61p7K53j98M47k41L1m6K00k86R3L61n25K25k29M5n2m0K99j87q0k0L59L4
$$ -161 -238 15 -183 264 23 54 8 208 -78 15 376 -149 76 -153 -108 -160 -200 99 -88 -168 -188 171 205
4380B05j89J38j30j46J46k34K15L2m15L36L1K5l9Q4p6J19k68K79Jj17k12M8j3
$$ 205 16 154 24 -122 24 -210 5 37 -378 -42 -11 14 -25 59 -17 102 -166 113 114 -3 -215 -167 -180
4403a80L30j95P4j00p4j10M50j56m9m9K9J26k97Q7J89k56L02k4l54L84P1k25P3
$$ -180 150 -45 29 -71 -145 -255 195 39 -10 -59 -30 96 -201 -114 75 -181 121 97 -257 127 198 -27 46
4426D6o3j10J66K8L0m3j02J09j3k4j30M17j90j26L7k10J85J30K9j86J18k0j74
$$ 46 -17 -127 39 67 97 54 -48 61 48 24 -106 311 121 -5 32 -178 7 137 166 -20 98 78 -96
4449i6j04J54Jp6jQo5J97j65J14P9j5JJ23J14k4m50L49m22M15l95L82k39L02o8
$$ -96 -200 -46 -45 -121 -122 -114 -179 18 -147 -33 46 31 32 155 269 245 -205 144 -278 137 -258 124 -115 187 119
4474A19k96K13K78j66j19K2l3j25K10j13m9j44L72l95L87m83L11L17l07l5l2J54
$$ 119 -177 36 314 148 29 51 18 -107 103 -10 -59 -203 169 -226 161 -322 -11 306 -1 -36 -68 86
4496H6k14j90L02J59j16J13K2j74q5J7J36lj5R0R5k37q9J12J91l94K38k4k66K75
$$ 86 -128 -318 -16 143 27 140 162 -12 -97 -80 56 53 38 128 223 -14 -103 9 200 -194 44 20 -246 29
4520B9M7j92k5n5R8k68L63l1p4k35M16P5p0J00p6j81Q9o1J59j28K53k96j07K10
$$ 29 76 -116 -141 -196 -98 -366 -3 -34 -108 -343 73 148 78 178 102 -79 10 -51 108 -20 233 -63 -170 40
4544D0J1k70J46L05m39K06j08p2K16k79K06K55k53q8J51p2J84p5p9J10r5J64k90
$$ 40 51 -219 -73 232 -207 -1 -109 -181 35 -244 -38 217 -36 -124 27 -45 139 64 -15 95 0 164 -126
4567a26K94k28l1K66j93J28j73q1R6k1O1P0N0j72K23l38K36j5j08M0O7n7j43K45
$$ -126 168 -60 -91 175 -18 110 -63 -144 -48 -69 -8 62 112 -60 163 -175 61 46 -62 -22 45 -12 -155 90
4591I0k25J37J9l13M60J77m02m0J5j87L10K8j8J05j00j09J17N9j29j86M02j48
$$ 90 -135 2 21 -292 168 345 -57 -97 -82 -269 41 69 51 156 56 -53 64 123 -6 -192 210 62
4613F2L2l02J46l8J86j08Pr9n9M15l30O0j7N2J88j97L3J54m07L80j57r9K75Jk10
$$ 62 94 -208 -62 -100 86 -22 -15 -114 -173 242 -88 -28 -45 7 195 -2 31 185 -222 158 1 -98 177 178 -32
4638c2j57J04K12rj85R0j45P5L30l95J28k00M34j68k4N6j01o7P5K2l32L80j46
$$ -32 -189 -85 127 118 -67 23 -122 -47 283 -112 16 -184 250 82 58 114 13 -54 21 43 -289 91 -55
4661e5J17m1j3K5Q7j05n3j27L86n09M14j30k07mK58j98R8K72m7j45K62j38J28
$$ -55 62 21 8 33 120 15 -38 -165 221 -288 126 -4 -211 -215 43 -155 -57 215 168 23 285 147 275
4684B75l24P2j5k07J01j9L56m96L12k0N7j41L0L5j25L19q1j77l9J27j07J40l30
$$ 275 -49 23 8 -199 -98 -117 239 -257 55 35 92 -49 -19 16 -109 210 129 -48 -87 40 -67 73 -257
4707b57J93L5l4O2k4J00K6j39J06k05M33k96j24q6M69k71j6k9L14p6j57P7j62
$$ -257 -64 -29 -63 -1 -25 75 101 -38 68 -137 296 0 -124 -210 259 -12 -28 -57 257 181 24 101 -61
4730f1r0K87q9j6k17K94m7r5K0l4J66j52J57MJ21k48N7p9J67j55k32K82j6k6K20
$$ -61 -151 136 47 31 -186 108 61 -34 -14 -48 118 -34 123 127 248 0 57 -22 145 -10 -242 40 24 -2 218
4755B18j70j05J49r4n0n1m4K23j01k68N06l57M3J04K22m9j95l26M06j76N3J78
$$ 218 48 -57 92 -2 -52 -103 -147 76 -25 -293 213 -144 -101 3 225 176 -19 -345 61 -115 -62 116
4777A16k02K96j75j72K94j1j42K69k1k90rL1l0K67k03L8j55J60j58J40J8k20K38
$$ 116 -86 210 35 -137 157 146 4 273 252 -38 -47 -16 -46 221 18 56 -99 61 -97 43 61 -159 79
4800G9k64K96J8l51L79q3k32K22j49pk9o9K34Pj60K90l39M50k92p5J38k67J4L55
$$ 79 -185 111 129 -222 157 74 -158 64 -85 -92 -121 -190 44 51 -109 181 -158 292 0 -75 63 -204 -190 165
4824A65L5k91j49M81j89q0j61KL39l5J0j38nk0nJ59j25p4J51k16k73L30j79J96
$$ 165 200 -91 -240 241 52 -28 -189 -187 152 117 127 -11 -16 -36 -41 118 -7 -81 70 -146 -419 -89 -268 -72
4848g2j08J69J99q6lJ25l85J42L56n11L18k90K69p7q4J10k81J66j61K09J42p0
$$ -72 -180 -11 188 102 99 224 -161 -19 337 -174 144 -146 123 46 -38 72 -209 -43 -204 5 147 77
4870G7p6K0k63L03o9lj06K02J8j17J16n5L5l7k5q0M7l4J47j77j0K25k89K34m9
$$ 77 1 21 -242 61 -8 -11 -117 85 103 -14 102 47 82 45 20 -60 -13 -47 100 -77 -87 138 -151 83 34
4895C4J38o8k2J42k90L14k07j1J77j01j29r7J25p2J51j54J60l68J29J05j02N49
$$ 34 172 104 82 224 -66 248 41 30 207 106 -23 -120 5 -67 84 -70 90 -278 -149 -44 -146 403
4917D03m64j85M05j08j57K05%P8j54j37K07P5k90J04j7j32J07k44J69K86l01J5
$$ 403 -61 -246 159 51 -106 99 99 177 23 -114 93 168 -122 -18 -35 -167 -60 -304 -135 151 -150 -135
4939a35j90L81k57J28N4%j36J66O2k63J17N1N6k0n0J04J50n08K28K44k14q5K93
$$ -135 -325 56 -201 -73 -19 -19 -155 11 73 -190 -73 -22 34 14 -36 68 218 -290 -62 182 -32 -117 176
4962A76j75Q1L2R9k78q0q4R6O5J4k99K91j28K26k48l31N36j0l19K56J3J66Q7R
$$ 176 1 82 114 213 -65 -145 -229 -133 -68 -54 -353 -62 -190 36 -212 -543 -7 -17 -336 -80 -67 99 186 195
4986A95k31J92m8j42L3J71k03J16j18j34K48l40j08K63K83k11mJ15N4k61o5O9
$$ 195 -36 156 108 -34 -1 170 -33 83 -35 -169 79 -261 -369 -106 177 -34 -38 77 131 -130 -195 -126
5008a26J1l5L04j82j93K00j20K95nj29J82j13k12J76j56o4J54J26j92J46n5k45
$$ -126 -115 -150 154 -28 -221 -21 -141 154 149 20 202 89 -123 53 -103 -167 -13 113 -79 67 12 -233
5030b33J68j30K02r6P9j74J67K60j85J35m50K40j2O0MJ69m45J45R1J54k79K3J3
$$ -233 -65 -195 7 -89 -10 -184 -17 243 58 193 -257 -17 -29 31 35 204 -241 -96 -5 149 -130 -107 -94
5053i4r0N03m41O4J94j16l62N06k78j8K7m0J04j17K32j2K9N1J86k89j43L3J27
$$ -94 -184 319 -122 -58 136 20 -342 164 -114 -132 -105 -145 -41 -158 74 62 91 142 328 39 -104 -71 56
5076E6j83K92q8j60J03n9J7Nm8K3Qk9K99k91o9L51m67L22j22k22L2J77K69j72
$$ 56 -127 165 77 -83 20 -39 -22 -17 -65 -42 -34 -63 236 -55 -124 227 -240 82 -40 -262 -230 -53 216 44
5100D4j31O0R1Q8j96J70j90L3k6J26j37N2O8P1l4Lj23l9J48m1j29J30J34j35k94
$$ 44 -87 -27 64 152 -44 126 -64 -31 -57 69 -68 -16 52 123 89 92 -31 -70 78 37 -92 38 172 37 -257
5125b57K33R0k81M32m24M6J33jJ12J6j49Kj0j4k6j48J42L6m7J4J39k8L7ok02K22
$$ -257 -24 66 -215 217 -207 -161 -28 -29 83 99 -50 -48 -58 -72 -98 -246 -104 -68 -115 -101 38 10 47 41 -161 61
5151F1p1K32j31k53K92O6j65j90%K2J6j0Q9J50J7j95M3j00m6M0L12j66l51L79
$$ 61 -10 222 91 -162 130 196 31 -159 -159 -137 -121 -131 -42 108 125 -70 -27 -127 -173 -133 179 13 -338 41
5175D1l5j92K45J6j09p6J89J53k14R3k4p8q6J40l50K77j91J09j93K25k46M96j07
$$ 41 6 -186 59 75 -34 -110 79 232 18 111 87 9 -77 63 -287 -10 -201 -92 -285 -60 -306 190 83
5198H3K9j75Q2nj99M28k83j52OK58j94K8k20J92J88J34j69k88M58k20l0m9NPL4
$$ 83 112 -63 19 14 -185 243 -40 -192 -186 72 -122 -94 -314 -122 66 200 31 -257 201 -19 -49 -98 -93 -86 -52
5223e2p2Q0J02j13M21l03j19Q3J11j26Q6l81K26R4j67L99k86j97K11j37K34j44
$$ -52 -124 -44 58 -55 366 63 -56 27 138 12 98 -283 -57 37 -130 269 -17 -214 -3 -140 94 -50
5245e0L01l34L9K15j74j40j17R7m0J50K39k62K7Q0j46J15O3m3J31j93K0J51p9
$$ -50 251 -83 -44 171 -3 -143 -260 -163 -203 -53 186 -76 -49 31 -115 0 63 20 151 -42 -22 129 50
5268E0n7J30p2j38j2J61j00l2N2k00K02L36m92K75l12J27M9q8J85lR9M7k52j52
$$ 50 -7 123 51 -87 -99 62 -38 -70 -18 -218 -16 320 -172 103 -209 -82 -33 -121 64 61 160 207 -45 -197
5292a97K46O1o4r6R2J29k42k03L95p0l10J14L10j37J46k39K74j90l5J33k17P8
$$ -197 49 110 46 -50 42 171 -71 -274 121 51 -259 -145 165 28 174 -65 209 19 -16 117 -100 -22
5314b2j36J32J83L5k7j18j52K97m5N4l35J13J31Jk1j1J5l42J77J08j37m4K0P8
$$ -22 -158 -26 157 192 165 47 -105 192 147 201 -134 -21 110 111 90 79 94 -248 -71 37 -100 -144 -124 -46
5338d6NJ0J91k13M2P9k21K55n7j64K49k83N5j02L21R8n18M49k75K92j60O2j82
$$ -46 -41 -31 160 -53 -11 68 -153 102 45 -119 130 -153 -98 -200 121 219 -299 150 -125 167 7 69 -113
5361a13K4k1J02j32j26L03m5J06q3Pl2j35M3J50R7q8O4j60J82Nj15N6m6l2L8j71
$$ -113 -89 -110 -8 -140 -266 37 -8 98 15 22 -10 -145 -102 48 145 57 121 -39 143 148 33 89 43 11 49 -122
5387a22J10p8L68n07J30L83m74J67N3Q1j3ol89N61m81L02o4L1KOj41K00k62L53
$$ -122 -12 -90 278 -229 -99 284 -190 -23 30 111 98 92 -297 264 -217 85 21 52 54 60 -81 119 -143 210
5411B10n1k1K0l93L22j39L2J78l68R4j51J78Q1p1L8J56O9m86L24rj38k2NL16j93
$$ 210 159 138 158 -235 87 -52 -20 158 -210 -116 -267 -89 -8 -79 -41 115 184 -302 22 13 -125 -147 -142 174 -19
5436a9r6M8Q6j22L17j73p4J71j47J61n4O1j88j05rr2L59q2m5n7K02m03L40j40
$$ -19 -115 -67 19 -103 214 41 -33 138 -9 152 98 159 -29 -134 -143 -235 124 42 -3 -60 142 -261 79 -61
5460f1J24j2J2Jj62L5M24m01j68K11q4p0M0k07N09l53Q3J13j74J00j30J37R2K1
$$ -61 63 51 63 64 -98 -63 361 -40 -208 3 -81 -151 -111 -318 191 -162 -79 34 -140 -40 -170 -33 59 80
5484H0k90J91n3r0J80j65J72Qm3J20p8k34K01k69M47J54k56L6Kl74K00J81j2J14
$$ 80 -210 -19 -72 -162 18 -147 25 33 -10 110 32 -202 -1 -270 177 331 75 111 113 -261 -61 120 108 222
5508B22j73K49l42J18q6r8L67k28q3J82p8q9q1K21k63K08k07NJ98J71j12j52R7
$$ 222 49 298 -44 74 -12 -110 257 29 -54 128 50 -39 -120 101 -162 46 -161 -156 42 213 101 -51 46
5531D6q3J13q2J02P6j64J19l35J7J99Q8J6O0j38j46j11K07ro7Q4j49J91j53J40
$$ 46 -37 76 -6 96 172 8 127 -208 -191 8 96 112 172 34 -112 -223 -16 -25 -92 -8 -157 34 -119 21
5555B1P0o4j97L17l65K42j11J67n3J03m9j64J01jK33m44J66l10N39o14K42L85
$$ 21 91 27 -170 147 -218 24 -87 80 27 130 81 -83 18 17 250 -194 -28 -338 201 -413 -171 214
5577B14l17J29j37j22M0J00r3P1J30O8k01J8J58J17l51J61p9j60M13k06J6O2p2
$$ 214 -103 26 -111 -233 -193 -93 -186 -115 15 83 -118 -100 58 175 -176 -15 -94 -254 159 -47 -31 31 -41
5600d1K73k37R3j65J06j04p0K85m8q8j35J76j26J9J97k00O5P9l0lL4k82J06J03
$$ -41 232 -5 88 -77 29 -75 -145 140 92 4 -131 45 -81 -62 135 -65 0 79 49 46 80 -202 -96 7
5624GK03l12J45Q5l02J63R0j08j43L14l81M26j07n3l9m2j05K7K68r9k39K55k62
$$ 7 210 -102 43 128 -174 -11 79 -29 -172 142 -239 187 80 27 -12 -54 -159 -132 136 37 -202 53 -209
5647b09J2K23p5P2j28J52R2r1l0o1J58k6Ro9k2R6l80K94j98O2L48L4l10R2N0j69
$$ -209 -197 26 -49 23 -105 47 139 48 18 -43 115 89 98 29 7 103 -277 17 -181 -119 229 263 -47 45 95 -74
5673g4mK7J19Q9m44K72J09L5p3J31m28L89j87J04K4Q9k28J91m74J40K30rQJ01
$$ -74 -78 -51 68 157 -287 -15 94 129 56 187 -241 148 -39 65 89 178 -50 141 -333 -193 37 28 36 137
5697A37m23L48N8q4j49r8J28MK01J4Q3j38J22j75j93J58M4j78O8J86j34j25k29
$$ 137 -286 62 120 36 -113 -211 -83 -79 122 136 219 81 203 28 -165 -7 37 -141 -73 113 -21 -146 -375
5720c75M60j30Q7j46J4J12M1K38o6j13m1l42K55m2Q8N2j45M6n8K25k17M8mK34
$$ -375 85 -45 42 -104 -90 22 63 301 235 122 81 -261 -6 -48 40 92 -53 -7 -65 160 -57 -9 -13 221
5744B21l40j56L09Lj14J54J2j15M7M3j07J38K95n09K82R4j7j90j52J34o5R7k74
$$ 221 -119 -275 34 37 -77 77 89 -26 21 64 -43 95 390 -119 163 257 240 50 -102 32 -33 64 -210
5767b10J03K32q2m8P9Pq8R3O4J1p6m1J87j23J2r6n3O8n7O7l59J76L69l92K4Nj24
$$ -210 -107 125 43 -5 74 81 -7 86 150 161 85 44 231 108 120 24 -29 39 -18 49 -310 -134 235 -157 -133 -128 -252
5794b52M15k30M8K41j07p2k48L3M76q8j60m4j15K78j11r4o5N6K16j17j35J98k17
$$ -252 163 -67 -19 222 115 43 -205 -172 304 216 56 12 -103 175 64 -30 -95 -39 177 60 -75 123 -94
5817i4J45o5Qr9J85M7k43L14P3l34q3j1L30M9n5j08K6j78J70j96j96L02p5R2j88
$$ -94 51 -14 -6 -105 80 127 -116 198 271 -63 -146 -157 173 222 167 59 85 -93 77 -119 -315 -13 -88 4 -184
5842a84K47l39K80j69K39J69m15K72J34L8l25J69p5l5j64K80k97L58j28J17j29
$$ -184 63 -276 4 -165 74 243 -172 100 234 272 -53 116 41 6 -158 122 -175 183 55 172 43
5863D3m1k3j94K3N41l13k03m0J75k5O8r1nJ60l18J92j09K87m3Q0k52K41j20k28
$$ 43 2 -21 -215 -192 349 36 -167 -207 -32 -57 11 -80 -85 75 -243 -51 -160 127 84 164 -88 153 33 -195
5887a95m9L47o1k9K28l77Q5L7N5Q3k96K38j50J67k2r9J5J78M9l97K71j93J57j14
$$ -195 -244 103 42 13 241 -136 -51 -14 41 124 -172 66 -84 83 61 -38 -23 155 204 -193 78 -115 42 -72
5911g2M4L3l6k22M01m3l46J76L6N0j41K92l19J97j52r6M40k17k07L23NQ8m27M11
$$ -72 -28 5 -31 -253 148 105 -241 -65 -29 21 -120 172 -147 50 -102 -198 242 25 -182 141 146 234 -193 218
5935B18l88oJ07r1J80J2km22L56J65j38J42k70Q5j51J70j4K54j94pj02N3k49m1
$$ 218 -170 -176 -69 -160 20 32 30 -392 -36 129 -9 133 -137 -52 -203 -33 -47 207 13 6 -96 -43 -292 -333
5959c33K88J91j11R7k05m8J05n1j4P4R6q2J21k31J78q3L8K2j6j68K1N3j10Q8J3
$$ -333 -45 146 35 132 -73 -121 -16 -67 -81 -7 89 7 128 -103 75 -8 30 52 36 -132 -111 -58 -168 -80 -67
$$ [...]
8191I4
##END NTUPLES=NMR FID
##END=
