##TITLE=1H_IPACAT-27
 CDCl3,8 sc, 
 3.9.2021
##JCAMPDX= 6.0         $$ Bruker NMR JCAMP-DX V2.0
##DATA TYPE= NMR FID
##DATA CLASS= NTUPLES
##ORIGIN= UXNMR, Bruker Analytische Messtechnik GmbH
##OWNER= root
$$ XWIN-NMR		Version 3.5
$$ Fri Sep  3 08:43:53 2021 Russian Standard Time (UT+4h)  she@DPX200
##.OBSERVE FREQUENCY= 200.1313
##.OBSERVE NUCLEUS= ^1H
##.DELAY= (6, 6)
##.ACQUISITION MODE= SIMULTANEOUS
##.ACQUISITION SCHEME= undefined
##.AVERAGES= 8
##.DIGITISER RES= 18
##SPECTROMETER/DATA SYSTEM= spect
##.PULSE SEQUENCE= zg30
##.SOLVENT NAME= CDCl3
##.SHIFT REFERENCE= (INTERNAL, CDCl3, 0, 15.7039)
##AUDIT TRAIL= $$ (NUMBER, WHEN, WHO, WHERE, WHAT)
$$ ##TITLE= Audit trail, XWIN-NMR		Version 3.5
$$ ##JCAMPDX= 5.01
$$ ##ORIGIN= Bruker BioSpin GmbH
$$ ##OWNER= she
$$ F:/spectra/data/she/nmr/H-F/1/audita.txt
$$ ##AUDIT TRAIL=  $$ (NUMBER, WHEN, WHO, WHERE, WHAT)
(   1,<2021-09-03 08:42:18.00 +0400>,<she>,<DPX200>,
      <created by zg, POWCHK disabled, PULCHK disabled
       configuration hash MD5:
       00 E9 B6 7A A2 85 ED C7 34 08 36 98 17 FE 4E 26
       data hash MD5: 16K
       B3 9B 36 39 0F AE BD 58 7C D0 3A 88 84 84 01 3F>)
$$ ##END=
$$ 
$$ hash MD5
$$ 68 ED 92 51 21 34 B5 0D 5B 46 B3 7C 6C A8 B3 B5
##$RELAX= 
##$RELAX= 
##$RELAX= 
##$RELAX= 
##$RELAX= 
##$RELAX= 
$$ Bruker specific parameters
$$ --------------------------
##$DU= <F:/spectra>
##$EXPNO= 1
##$NAME= <H-F>
##$PROCNO= 1
##$TYPE= <nmr>
##$USER= <she>
##$AMP= (0..31)
100 100 100 100 100 100 100 100 100 100 100 100 100 100 100 100 100 100 
100 100 100 100 100 100 100 100 100 100 100 100 100 100 
##$AQSEQ= 0
##$AQ_mod= 1
##$AUNM= <au_zg>
##$AUTOPOS= <>
##$BF1= 200.13
##$BF2= 200.13
##$BF3= 200.13
##$BF4= 200.13
##$BF5= 200.13
##$BF6= 200.13
##$BF7= 200.13
##$BF8= 200.13
##$BYTORDA= 1
##$CFDGTYP= 0
##$CFRGTYP= 5
##$CHEMSTR= <none>
##$CNST= (0..31)
1 1 145 1 1 1 1 1 1 1 1 1 1 1 1 1 1 1 1 1 1 1 1 1 1 1 1 1 1 1 1 1 
##$CPDPRG= <>
##$CPDPRG1= <>
##$CPDPRG2= <>
##$CPDPRG3= <>
##$CPDPRG4= <mlev>
##$CPDPRG5= <mlev>
##$CPDPRG6= <mlev>
##$CPDPRG7= <mlev>
##$CPDPRG8= <mlev>
##$CPDPRGB= <>
##$CPDPRGT= <>
##$D= (0..31)
0 1.2 0 0 0 0 0 0 0 0.06 0 0.03 0 0 0 0 0.0002 0 0 0 0 0 0 0 0 0 0 0 0 
0 0 0 
##$DATE= 1630644137
##$DBL= (0..7)
120 120 120 120 120 120 120 120 
##$DBP= (0..7)
150 150 150 150 150 150 150 150 
##$DBP07= 0
##$DBPNAM0= <>
##$DBPNAM1= <>
##$DBPNAM2= <>
##$DBPNAM3= <>
##$DBPNAM4= <>
##$DBPNAM5= <>
##$DBPNAM6= <>
##$DBPNAM7= <>
##$DBPOAL= (0..7)
0.5 0.5 0.5 0.5 0.5 0.5 0.5 0.5 
##$DBPOFFS= (0..7)
0 0 0 0 0 0 0 0 
##$DE= 6
##$DECBNUC= <off>
##$DECIM= 32
##$DECNUC= <off>
##$DECSTAT= 4
##$DIGMOD= 1
##$DIGTYP= 9
##$DL= (0..7)
0 120 120 120 120 120 120 120 
##$DP= (0..7)
150 150 150 150 150 150 150 150 
##$DP07= 0
##$DPNAME0= <>
##$DPNAME1= <>
##$DPNAME2= <>
##$DPNAME3= <>
##$DPNAME4= <>
##$DPNAME5= <>
##$DPNAME6= <>
##$DPNAME7= <>
##$DPOAL= (0..7)
0.5 0.5 0.5 0.5 0.5 0.5 0.5 0.5 
##$DPOFFS= (0..7)
0 0 0 0 0 0 0 0 
##$DQDMODE= 0
##$DR= 18
##$DS= 0
##$DSLIST= <SSSSSSSSSSSSSSS>
$$ [...]
##$SUBNAM2= <"">
##$SUBNAM3= <"">
##$SUBNAM4= <"">
##$SUBNAM5= <"">
##$SUBNAM6= <"">
##$SUBNAM7= <"">
##$SUBNAM8= <"">
##$SUBNAM9= <"">
##$SW= 20.0189088683792
##$SWIBOX= (0..15)
0 0 2 0 0 0 0 0 0 0 0 0 0 0 0 0 
##$SW_h= 4006.41025641026
##$TD= 16384
##$TD0= 1
##$TE= 0
##$TE2= 300
##$TE3= 300
##$TEG= 300
##$TL= (0..7)
0 120 120 120 120 120 120 120 
##$TP= (0..7)
150 150 150 150 150 150 150 150 
##$TP07= 0
##$TPNAME0= <>
##$TPNAME1= <>
##$TPNAME2= <>
##$TPNAME3= <>
##$TPNAME4= <>
##$TPNAME5= <>
##$TPNAME6= <>
##$TPNAME7= <>
##$TPOAL= (0..7)
0.5 0.5 0.5 0.5 0.5 0.5 0.5 0.5 
##$TPOFFS= (0..7)
0 0 0 0 0 0 0 0 
##$TUNHIN= 0
##$TUNHOUT= 0
##$TUNXOUT= 0
##$USERA1= <user>
##$USERA2= <user>
##$USERA3= <user>
##$USERA4= <user>
##$USERA5= <user>
##$V9= 5
##$VALIST= <valist>
##$VCLIST= <CCCCCCCCCCCCCCC>
##$VD= 0
##$VDLIST= <DDDDDDDDDDDDDDD>
##$VPLIST= <PPPPPPPPPPPPPPP>
##$VTLIST= <TTTTTTTTTTTTTTT>
##$WBST= 1024
##$WBSW= 4
##$XGAIN= (0..3)
0 0 0 0 
##$XL= 0
##$YL= 0
##$YMAX_a= 80613
##$YMIN_a= -63071
##$ZGOPTNS= <>
##$ZL1= 120
##$ZL2= 120
##$ZL3= 120
##$ZL4= 120
##$ABSF1= 10
##$ABSF2= 0
##$ABSG= 5
##$ABSL= 3
##$ALPHA= 0
##$AQORDER= 0
##$ASSFAC= 0
##$ASSFACI= 0
##$ASSFACX= 0
##$ASSWID= 0
##$AUNMP= <proc_1d>
##$AZFE= 0.1
##$AZFW= 0.1
##$BCFW= 1
##$BC_mod= 2
##$BYTORDP= 1
##$COROFFS= 0
##$CY= 11.3945322036743
##$DATMOD= 1
##$DC= 2
##$DFILT= <>
##$DTYPP= 0
##$F1P= 2.36226072786647
##$F2P= -0.459571619588291
##$FCOR= 0.5
##$FTSIZE= 0
##$FT_mod= 4
##$GAMMA= 1
##$GB= 0.15
##$INTBC= 1
##$INTSCL= 1
##$ISEN= 128
##$LB= 0.24
##$LEV0= 0
##$LPBIN= 0
##$MAXI= 10000
##$MC2= 0
##$MEAN= 0
##$ME_mod= 0
##$MI= 1.114404
##$NCOEF= 0
##$NC_proc= 0
##$NLEV= 6
##$NOISF1= 3.799351
##$NOISF2= 2.8
##$NSP= 1
##$NTH_PI= 0
##$NZP= 0
##$OFFSET= 15.70392
##$PC= 1
##$PHC0= -13355.86
##$PHC1= 9.400972
##$PH_mod= 1
##$PKNL= yes
##$PPARMOD= 0
##$PSCAL= 0
##$PSIGN= 0
##$REVERSE= no
##$SF= 200.130013532006
##$SI= 16384
##$SIGF1= 3
##$SIGF2= 2
##$SINO= 400
##$SIOLD= 16384
##$SREGLST= <1H.CDCl3>
##$SSB= 0
##$STSI= 0
##$STSR= 0
##$SW_p= 3612.71676300578
##$SYMM= 0
##$S_DEV= 0
##$TDeff= 0
##$TDoff= 0
##$TI= <>
##$TILT= no
##$TM1= 0
##$TM2= 0
##$TOPLEV= 0
##$USERP1= <user>
##$USERP2= <user>
##$USERP3= <user>
##$USERP4= <user>
##$USERP5= <user>
##$WDW= 1
##$XDIM= 8192
##$YMAX_p= 0
##$YMIN_p= 0
$$ End of Bruker specific parameters
$$ ---------------------------------
##NTUPLES= NMR FID
##VAR_NAME=  TIME,          FID/REAL,        FID/IMAG
##SYMBOL=    X,             R,               I
##VAR_TYPE=  INDEPENDENT,   DEPENDENT,       DEPENDENT
##VAR_FORM=  AFFN,          ASDF,            ASDF
##VAR_DIM=   8192,          8192,            8192
##UNITS=     SECONDS,       ARBITRARY UNITS, ARBITRARY UNITS
##FACTOR=    0.0002496,     1,               1
##FIRST=     0,             0,               0
##LAST=      2.0444736,     0,               0
##MIN=       0,             -63071,          0
##MAX=       2.0444736,     80613,           0
$$ Real data points
##PAGE= N=1
##DATA TABLE= (X++(R..R)), XYDATA
$$ [...]
1859F72k17k19o81k2q4k94R4K97j60K90J99R0R1j40J97L1K65m28j13J66Q5J18
$$ 672 455 236 -445 -467 -551 -845 -751 -454 -614 -324 -125 -35 56 -84 113 144 409 -19 -132 34 119 237
1881B37j12J9J94M0O6l19j72k82J68k61N8j76J38k51K95J51L08L76j59K77J03
$$ 237 125 144 338 378 444 125 -47 -329 -161 -422 -364 -540 -402 -653 -358 -207 101 477 318 595 698
1902F98k49J0k07l17J49n09K88j56O9j41J94j66P74j25L59m92rL63l44k31l4j00
$$ 698 449 459 252 -65 84 -425 -137 -293 -224 -365 -171 -337 437 312 671 179 170 533 189 -42 -76 -176
1924a76j05l27L71n5m1J33J25M82k85L24l43O33l62k63j5j6k42p2n0R1J07J63
$$ -176 -281 -608 -237 -292 -333 -200 -75 407 122 446 103 736 374 111 96 80 -162 -234 -284 -193 -86 77
1946G7j52J12j48J27j72k20J96J06l0j94K07n4K68j9L59J86k75J31L8j84j83k64
$$ 77 -75 37 -111 16 -156 -376 -180 -74 -104 -298 -91 -145 123 104 463 649 374 505 543 359 176 -88
1968h8l56J0j35J48n15M93j66K73L85j34L46L25j23J36k4j85K2m30j02Kj36j46
$$ -88 -444 -434 -569 -421 -936 -443 -609 -336 49 -85 261 586 463 599 575 390 412 -18 -120 -118 -254 -400
1990d00J25J88k89p9M91j28P0J47J85l35K22P5k00m2K08k68j42mM22j70o6k4J83
$$ -400 -275 -87 -376 -455 36 -92 -22 125 310 -25 197 272 72 30 238 -30 -172 -176 246 76 10 -14 169
2013A69l70J55q5o9j09K71k38K4M80QM8j17l1j50K86k0j18k26J01j27P9l30Q9
$$ 169 -201 -46 -131 -200 -309 -38 -276 -252 228 236 284 167 136 -14 272 252 134 -92 9 -118 -39 -369 -280
2036b80J59nl3M49L7J47q1J18l52K69n42J73J8k94j08k09J41j3J40J00J78%M91
$$ -280 -121 -126 -159 290 327 474 393 511 159 428 -114 59 77 -217 -325 -534 -393 -406 -266 -166 12 12 503
2059E03j90k92K89K3r7o3J60j47J24k63j38j51O4k67K10j40l4L75l16J26m6K17
$$ 503 313 21 310 333 236 173 333 186 310 47 -91 -242 -178 -445 -235 -375 -409 -34 -350 -224 -270 -53
2081e3R8L6K47R2O7l19J42P9n7j56j84k62j08j93P1k34K84K06Q9J5K48lN7J04
$$ -53 45 81 328 420 487 168 310 389 332 176 -8 -270 -378 -571 -500 -734 -450 -244 -155 -140 108 105 162 266
2105B66K15m6n9k17j82j17Q1L25n30P0O4j67oJ72j06N7K4J87q8Q8k6N6K44R6J47
$$ 266 481 435 376 159 -23 -140 -59 266 -264 -194 -130 -297 -303 -131 -237 -180 -156 31 -57 31 5 61 305 401 548
2130E48k46l8j8o3Rl8l24k5J14m24j64L13J14K39l79J46O01j50K10J46m08J81
$$ 548 302 264 246 183 192 154 -170 -195 -81 -505 -669 -356 -242 -3 -382 -236 365 215 425 571 163 344
2152C44j35k00k2j33J59n11J24J13N6j38K88k0k03J45L13L2j18M9J18l5l9R6l04
$$ 344 209 9 -13 -146 13 -498 -374 -261 -205 -343 -55 -75 -278 -133 180 212 94 143 261 226 187 283 -21
2175b1K90m70L35k8o0k52M89m50J56j3l8j88O4m5K30j13j4P0L17l11K14l20J84
$$ -21 269 -201 134 106 46 -206 283 -167 -11 -24 -62 -250 -186 -231 -1 -114 -128 -58 259 -52 162 -158 26
2198B6J05L6k13k51L13m7k77P1J04J68J00O8M4Qn8m1o5J05j28l42J81j5l23l8
$$ 26 131 167 -46 -297 16 -31 -308 -237 -133 35 135 203 247 255 197 156 91 196 68 -274 -93 -108 -431 -469
2222d69J90j8L27m9L28L5O2k57J3k8l31mK67k72L0Q0j24J23j8j4K35p9k19q7K08
$$ -469 -279 -297 30 -19 309 344 406 149 162 134 -197 -201 66 -206 -176 -96 -220 -97 -115 -129 106 27 -192 -279 -71
2247g1J01J63l83K36J65j49o9j7R0J18J26j05J88n57K28k66o9P1R4k17J9J12n
$$ -71 30 193 -190 46 211 62 -7 -24 66 184 310 205 393 -164 64 -202 -271 -200 -106 -323 -304 -192 -197
2270a97K49K7j73L05Q4L8P8l57J49j09l22%j51J5R6j19N14k90O7k3K31q1K64j19
$$ -197 52 79 -94 211 295 333 411 54 203 94 -228 -228 -379 -364 -268 -387 127 -163 -96 -119 112 31 295 176
2294A76j4j72p2K23k68K44m1j04p0K00K2p2o0nJ17k83L25j6k39J95k92K53J19
$$ 176 162 -10 -82 141 -127 117 76 -28 -98 102 124 52 -8 -13 104 -179 146 130 -109 86 -206 47 166
2317A66Lj6l94M92j55j97K16j38j63K06k18j3J22k1o5K58j01J42p0L22j63j65
$$ 166 169 153 -241 251 96 -101 115 -23 -186 20 -198 -211 -89 -110 -175 83 -18 124 54 376 213 48
2339D8L56n82K28J39j40j59N5k1j96N4m9N14J5k95q3K13J0K57p0l74L44l30j81
$$ 48 404 -178 50 189 49 -110 -55 -76 -272 -218 -267 247 262 -33 -116 97 107 364 294 -80 264 -66 -247
2362b47L54l70K9J25K18k26J42j59K16K61l05pk05L40k1j15j95L62j15J1J56l49
$$ -247 107 -263 -234 -109 109 -117 25 -134 82 343 38 31 -174 166 145 30 -165 197 82 93 249 -100
2384a00K29o0J60m21j00K37j9J19j57j01j33M54k30K47q3L5L35l71O9j18K6j80
$$ -100 129 69 229 -192 -292 -55 -74 45 -112 -213 -346 108 -122 125 42 77 412 41 110 -8 18 -162
2406a62L19k57%k8q9o9L09n4j65K46j49p6J70L98l84J42l25M2K6L37N6k88J31
$$ -162 157 -100 -100 -128 -217 -286 23 -31 -196 50 -99 -175 -5 393 9 151 -174 -132 -106 231 287 -1 130
2429A30j66J03o0l5r3Q6J92k81p1K95K74k90J06k67k74L06J05k3m5q8J85k18O9
$$ 130 -36 67 7 -28 -121 -35 157 -124 -195 100 374 84 190 -77 -351 -45 60 37 -8 -96 89 -129 -60
2452f0O6r5k5j44J30J87L2k8o5q2K18k29J77m7l20K92j24R4j67J52k31J67p3J30
$$ -60 6 -89 -114 -258 -128 59 91 63 -2 -84 134 -95 82 35 -285 7 -117 -23 -190 -38 -269 -102 -175 -45
2476d5q1n2L8L02k52M72k77o4j09J64j41J45r3M9%k43n9M46k62M4j43J67J53m03
$$ -45 -126 -178 -140 162 -90 382 105 41 -68 96 -45 100 7 56 56 -187 -246 200 -62 -18 -161 6 159 -244
2500b44L90l96N71k33J31p0J60l11l4J30j0j92J03k4j19Lr4K09k7j12O3J02K45
$$ -244 146 -250 321 88 219 149 309 -2 -36 94 84 -108 -5 -29 -148 -145 -239 -30 -57 -169 -106 -4 241
2523B41l49J29q6K60j06R9j39j20K57j61Q9m04K02j72M09k66NJ9j20K57j8j27
$$ 241 -108 21 -65 195 89 188 49 -71 186 25 114 -290 -88 -260 149 -117 -112 -93 -213 44 26 -101
2545a01O0R1L9j87J14P2n0L60j85j72j34J39m0O6k56K7J40j56J71j85L7K47m9
$$ -101 -41 50 89 -98 16 88 38 398 213 41 -93 46 6 72 -184 -157 -17 -173 -2 -187 -150 97 48
2568D8j52P4L37j75k31K97j22j59N7Q0l74J06J28K5J99p8j9Q9j16N5j69M4Q9K31
$$ 48 -104 -30 307 132 -99 198 76 -83 -26 54 -320 -214 -86 -61 138 60 41 130 14 69 -100 -56 33 264
2592B64j29k70j42N33j36l60M68l40J30m3M1J48j02n4O1p0p2L3KJ19j17P4r8M2
$$ 264 135 -135 -277 256 120 -240 228 -112 18 -25 16 164 62 8 69 -1 -73 -40 -38 81 -36 38 -60 -18
2616a8J11k08M8m2J02J50l88M9O6o1K6L99j82L13l92L0o7J26r4j58L60k47m6j79
$$ -18 93 -115 -67 -109 -7 143 -245 -196 -130 -191 -165 234 52 365 -27 3 -64 62 -32 -190 170 -77 -123 -302
2640c02K25j16J42o0J14l99K58K41p9J71j53j35P4J29j05k1o0O3N7j06J71m6K8
$$ -302 -77 -193 -51 -111 3 -396 -138 103 24 195 42 -93 -19 110 5 -16 -76 -13 44 -62 109 63 91
2663I1k53J5K08k67L52l39Q5J01k30L32r1J37K7J92k61J04q7pM7J15j22l57P8
$$ 91 -162 -147 61 -206 146 -193 -108 -7 -237 95 4 141 168 360 99 203 116 109 156 271 149 -208 -130
2686a30J15J82l37M00J7j50p1j20J12J86N9m49L74m05J19P3kK2k45K14m7K72j63
$$ -130 -15 167 -170 230 247 97 26 -94 18 204 263 -186 188 -217 -98 -25 -27 -5 -250 -36 -83 189 26
2709B6J63j97R2J4L6j39n9m4J66l5j92M62l27m6LJ38L5n3O3j13j16N9J5N9k10
$$ 26 189 -8 84 98 134 -5 -64 -108 58 23 -169 293 -34 -80 -77 61 96 43 106 -7 -123 -64 -49 10 -200
2734b00K10J70k92J47j05K14j89j96K40R7j91p6K43j34k35K60J08o4J72j65K24
$$ -200 10 180 -112 35 -70 144 -45 -241 -1 96 -95 -171 72 -62 -297 -37 71 7 179 14 238
2755B38m1l57L08P3j05J9m01J48K90k83J11j06k4L80m15j38K65n4K15r2nL4K1
$$ 238 197 -160 148 221 116 135 -266 -118 172 -111 0 -106 -130 250 -165 -303 -38 -92 123 31 26 60 81
2778H1J80k02l9J4K95q8n12J26o5J48j55l5K35j48L11j54r9RJ34J61k91M9j29
$$ 81 261 59 20 34 329 241 -271 -145 -210 -62 -217 -252 -17 -165 146 -8 -107 -98 36 197 -94 -45 -174
2801a74K70p6o1J37K58m46L01m04J71P2j42K29N0j7j10o3n1j10M2N6j0J50K20
$$ -174 96 20 -41 96 354 -92 209 -195 -24 48 -94 135 185 168 58 -5 -56 -166 -124 -68 -78 72 292
2824B92m3j96%J68j88j38J32O8Qj78M5m3P0K9k00MJ05j06L22k50K87m7L8l9l17
$$ 292 249 53 53 221 33 -105 27 95 103 -75 -30 -73 -3 26 -174 -170 -65 -171 151 -99 188 141 179 140 -177
2849a77L23j77O8K15q3j51j42M25m49J17j43J6J99P9j54k07q7L22M4r8J0j98l0
$$ -177 146 -31 37 252 169 18 -124 301 -148 -31 -174 -158 41 120 -34 -241 -328 -6 38 -60 -50 -248 -278
2872b78L9L85k51j6M60k38K16l83P4P6k41P9R2Q9k37K0q7K20n8J17k86K4J35K64
$$ -278 -239 146 -105 -121 339 101 317 -66 8 84 -157 -78 14 103 -134 -114 -201 19 -39 78 -208 -184 -49 215
2896B15l60J84j06k71L47j47K72R8m8L8k22p3J0K67j14J21m90L64j5l58RK02K71
$$ 215 -145 39 -67 -338 9 -138 134 232 184 222 0 -73 -63 204 90 211 -279 85 70 -288 -279 -77 194
2919A94k24Q5j05j8J48n4p7J36r1j3K48j61o8n0k00K45k66J30J35l17J97R3O1
$$ 194 -30 55 -50 -68 80 26 -51 85 -6 -19 229 68 0 -50 -250 -5 -271 -141 -6 -323 -126 -33 28
2942B8J05l82L55k2j86o3J46p5j0P0J60m16K29J01k89J64K4J5l2j32r0K11K00
$$ 28 133 -249 106 84 -102 -165 -19 -94 -104 -34 126 -290 -61 40 -249 -85 -61 -46 -78 -210 -300 -89 111
2965A11j40m8l5K06Nk28J77n6p3K28j59j79K87j23J56J24n04K00O5m8n8N8J99
$$ 111 -29 -77 -112 94 99 -129 48 -8 -81 147 -12 -191 96 -27 129 253 -251 -51 14 -34 -92 -34 165
2988A65j25j8m7j92J78L7k46J93J66j44l09K26K71k22J36M07k50k00j5j18L67
$$ 165 40 22 -25 -217 -39 -2 -248 -55 111 -33 -342 -116 155 -67 69 476 226 26 11 -107 260
3009B60l7j33k51K67m0R2k29J99k8j48Q0j10J87o8l33M52j6j65n7J60m4l26K84
$$ 260 223 90 -161 106 66 158 -71 128 100 -48 32 -78 109 41 -292 160 144 -21 -78 82 38 -288 -4
3032dJ83k57K18J02k70k9L79l60P4j10K23l19l3M87o30L57o0NK07k98k8K95k41
$$ -4 179 -78 140 242 -28 -57 322 -38 36 -74 149 -170 -203 284 -346 11 -49 -44 163 -135 -163 132 -109
3055a09RL30m10J45K2r5K20j69j68o1J08K74J57j29j51l9o1K52p4Q6r9KO5j06
$$ -109 -100 230 -180 -35 -13 -108 112 -57 -225 -286 -178 96 253 124 -27 -66 -127 125 51 137 38 40 105 -1
3079aq3J74l12J70K92n4q0j54J4q7O7J61j42K9Q3o5J10l6QJ3j81J39j03N5J09
$$ -1 -84 90 -222 -52 240 186 106 -48 -34 -121 -54 107 -35 -6 77 12 122 86 94 107 -74 65 -38 17 126
3104A26j09j10J35k5k9Nj7J04J01j55J69n2l8j52j11J6J5J16K50K28k73j96j5
$$ 126 17 -93 42 17 -12 -7 -24 80 181 26 195 143 105 -47 -158 -142 -127 -11 239 467 194 -2 -17
3127a7j31J58J95k37J84j62J30n0J6j87Q9q6lK61j21q9J6n4r1K92Q5O5k18j29
$$ -17 -148 10 205 -32 152 -10 120 70 86 -101 -12 -98 -101 160 39 -50 -34 -88 -179 113 198 263 45 -84
3151h4K36N4l72L97o6l39J69O3Q4J51l17Q6j6k15J26J7pj74k8L08l0n8J5l7L8
$$ -84 152 206 -166 231 165 -174 -5 58 142 293 -24 62 46 -169 -43 -26 -33 -207 -235 73 43 -15 0 -37 1
3176AK91m85J05J87j59J00K35l54j27K56R5J16k74K5j01J61k27K6J54r1M9K50
$$ 1 292 -193 -88 99 -60 40 275 -79 -206 50 145 261 -13 12 -89 72 -155 -129 25 -66 -17 233
3198B33j67l0j04P3o1J00Q9J4J22l80J46L4k28O8n8N3M35n52K57Q2m4P9o4j85
$$ 233 66 36 -68 5 -56 44 133 147 269 -111 35 69 -159 -91 -149 -96 339 -213 44 126 82 161 97 -88
3222h8J0K83j81Q9r8k43J84l9M5l2n0M5J86k86M94p3l14J0k6O5j00N3K0m6J60
$$ -88 -78 205 24 113 15 -228 -44 -83 -38 -70 -120 -75 111 -175 319 246 -68 -58 -84 -19 -119 -66 -46 -92 68
3247F8j64o9N6QJ34k04J20J60j63N5j14l8J03n4J63q6J75l6m2k22Q8J00j45J62
$$ 68 -96 -165 -109 -101 33 -171 -51 109 -54 1 -113 -151 -48 -102 61 -25 150 114 72 -150 -62 38 -107 55
3271E5j76L7j48L55m40K49k6M5K42k40K35k7k76K56O2l17j83J42K08l39K02K01
$$ 55 -121 -84 -232 123 -317 -68 -94 -49 193 -47 188 161 -115 141 203 -114 -297 -155 53 -286 -84 117
3293A17j93K87k18M7j4j42L14l52K49J8J14p7j82p3J58j91J12J99l46M54m32K12
$$ 117 -76 211 -7 40 26 -116 198 -154 95 113 227 150 -32 -105 53 -138 -26 173 -173 281 -151 61
3315F1j21M4JM1k40L00k00O8Ok85L41J72m47J05m6L77l30K90J0m9l43O8K50q1
$$ 61 -60 -16 -15 26 -214 86 -114 -46 -40 -325 16 188 -259 -154 -200 177 -153 137 147 98 -245 -177 73 -8
3339hJ71m28J04K16qk82R0L73j07j67j53J90o7j9J9oN9n2r7L54m10Q0J04Q1J04
$$ -8 163 -265 -161 55 47 -235 -145 228 121 -46 -199 -9 -76 -95 -76 -82 -23 -75 -172 182 -228 -148 -44 37 141
3364A41j69M4k3m7p6J33k7J68j63K84m17K33J37k86O6l4mr3K31k26K79j13p3J17
$$ 141 -28 16 -7 -54 -130 3 -24 144 -19 265 -152 81 218 -68 -2 -36 -40 -133 98 -128 151 38 -35 82
3388H2q6k20K23n3j3M1r3L52k08j64K11j03M3m0OR9j90O6p2J86l36K15l2J0J36
$$ 82 -4 -224 -1 -54 -67 -26 -119 233 25 -139 72 -31 12 -28 -22 77 -113 -47 -119 67 -269 -54 -86 -76 60
3413F0j91J67rJ66k07o9P9O5o2o5K20l03J08k99L77j44K32l81L39k55L86j77O5
$$ 60 -131 36 27 193 -14 -83 -4 61 -1 -66 154 -149 -41 -340 37 -107 125 -256 83 -172 214 37 102
3436A02j63j25J03J49k26K36L3l7o7q8j30Rk3L92j50K3l1m3K10k35J77q5j13M7
$$ 102 -61 -186 -83 66 -160 76 109 72 5 -83 -213 -204 -227 165 15 38 7 -36 174 -61 116 31 -82 -35
3460c5J02o2R5k35Q7N2j53l75Q04l80N6k1K53k21Q9l76K28K56j72M0k07M13j77
$$ -35 67 5 100 -135 -48 4 -149 -524 280 -100 -44 -65 188 -33 56 -320 -92 164 -8 32 -175 238 61
3483F1L1k81K22j13J64k7k1J80k07K1PM8J68l95J42oQNpJ73k05N7k87L08l78K41
$$ 61 92 -189 33 -80 84 57 36 216 9 30 37 85 253 -142 0 -6 2 7 0 173 -32 25 -262 46 -332 -91
3509i1r0J10K07k05J14k01K92r1K27m30L38k7k8j95K4O7Q3M1j44M5k2J41j99R1
$$ -91 -181 -71 136 -69 45 -156 136 45 272 -158 180 153 125 -70 -46 21 104 145 1 46 24 165 -34 57
3533E7L2n2j28J69m3k13L69j52k37K30jj00PL24l10P3j81K81j20K22n9j54j34
$$ 57 89 37 -91 78 35 -178 191 39 -198 32 31 -69 -62 262 -48 25 -156 125 5 227 168 14 -120
3556a20P1q5L42j26o7r8J49J20m69J03J46J51j33L32m27j26K41l7m7J26j00k2
$$ -120 -49 -134 208 82 15 -83 66 186 -283 -180 -34 117 -16 316 -111 -237 4 -33 -80 46 -54 -76
3578g6J98n9L0k3j95N00k97j98K02l8L0k86K39N7j94J22JQ6k13M44k69j87J04
$$ -76 122 63 93 70 -125 375 78 -120 82 44 74 -212 27 84 -110 12 13 99 -114 330 61 -126 -22
3601b2Q3M7j82N6J05j42J57k78O0J38p5P0J58k33Kj2j95L33k85J02K73j53P3l25
$$ -22 61 108 -74 -18 87 -55 102 -176 -116 22 -53 17 175 -58 -56 -68 -263 70 -215 -113 160 7 80 -245
3625b45K10J37j55J74L8j6j04k2J35j58j77J80J8J6J00l54K06J25m38M01m07K38
$$ -245 -35 102 -53 121 159 143 39 17 152 -6 -183 -3 15 31 131 -223 -17 108 -330 71 -336 -98
3647i8j52J74J0q6J93K86j65k23o9J96J37l13K55j95l5O2j61L14l86J37J48R4
$$ -98 -250 -76 -66 -152 41 327 162 -61 -130 66 203 -110 145 -50 -85 -23 -184 130 -256 -119 29 123
3669A23j73J05P6k87K82P1J63l75K2J92j48k3j7j47K15k00K03N7k2j46K9k26K21
$$ 123 -50 55 131 -156 126 197 360 -15 7 199 51 28 11 -136 79 -121 82 139 117 -29 0 -226 -5
3692eQ8nk40J22j0M1N0Q8p5j0q9P9l44L49L07j76O1m13k7J28J65k09m8J91J62
$$ -5 83 78 -162 -40 -50 -9 41 129 54 44 -45 34 -310 39 346 170 231 -182 -209 -81 84 -125 -173 18 180
3717A80k56J86k23K75P5m8M7k17j53J60j92L51k82J82j55j67M61k23r9O1K6k92
$$ 180 -76 110 -113 162 237 189 236 19 -134 26 -166 185 -97 85 -70 -237 224 1 -98 -37 -11 -303
3739c03K16j92M55P0l75J79m8R5K03k12Q5k70J37K4J67k13k36n7L02j05J38J02
$$ -303 -87 -279 176 246 -129 50 2 97 300 88 173 -97 40 64 231 18 -218 -275 27 -78 60 162
3761A62P1J00k52p0p5m4N2J75n4J4o7p4J04p7j65K42j26K5K65k5k91%L09k36n7
$$ 162 233 333 81 11 -64 -108 -56 119 65 79 12 -62 42 -35 -200 42 -84 -59 206 181 -110 -110 199 -37 -94
3786i4K35K4j47J62l36J74Q4O7k69j27K82L0p7j9k6J1j40K14q9RJ53N5m60K61
$$ -94 141 165 18 180 -156 18 102 169 -100 -227 55 85 8 -11 -37 -26 -166 48 -41 -32 121 176 -284 -23
3810b3J7J40p1P0k31r7r1M86j23kR0q2j75K66O1j96l55L69K3k0j74O1J40m9J66
$$ -23 -6 134 63 133 -98 -195 -286 200 77 75 165 83 -92 174 235 39 -316 53 76 56 -118 -57 83 34 200
3835B00o5k67K29q5m3r9k4j8K01q1Rj56J19P2Lj02j14J96K80k69J12R9Rj0o9k49
$$ 200 135 -132 97 12 -31 -130 -154 -172 29 -52 -43 -199 -80 -8 -5 -107 -221 -25 255 -14 98 197 206 196 127 -122
3861a22J82p6N8j8l68K63L43r7j51J14j41O0K00l24J14j54n2N07k21p3rO5K5K3
$$ -122 60 -16 42 24 -344 -81 262 165 14 128 -13 47 247 -77 37 -117 -169 338 117 44 35 100 125 148
3885A48n5j76K23K9m29L01M9k35O0l0KL50k9j32j69K33QM6j57j31K1m7K85l48
$$ 148 93 -83 140 169 -260 41 90 -145 -85 -115 -113 237 208 76 -93 140 148 194 37 -94 -73 -120 165 -183
3909a83L78k06p1j45L52k70K85k25J09o5j53K0J20K38j58KJ54q1k70R3P7j47J55
$$ -183 195 -11 -82 -227 125 -145 140 -85 24 -41 -194 -174 -54 184 26 28 182 101 -169 -76 1 -146 9
3932Ik75P8J47J0J59j31k9jR1o0n9J13k76J19mO2n0j3N1j1K12l39P3M9Q8R0j04
$$ 9 -266 -188 -41 -31 128 -3 -32 -33 58 -2 -61 52 -224 -105 -109 -47 -97 -110 -59 -70 142 -197 -124 -75 13 103 -1
3959aK0n5O2j70L76j53M8K06m72J20P5J57l2k01j14k5JJ01K84k04J2j22k53J15
$$ -1 19 -36 26 -144 232 79 127 333 -139 -19 56 213 181 -20 -134 -159 -158 -57 227 23 35 -87 -340 -225
3983b25J32K80q1m73L89m4pJ96k24J12o0J90j01j79M13n28M89m12K2J61N3Qo9
$$ -225 -93 187 106 -367 22 -22 -29 167 -57 55 -5 185 84 -95 318 -210 279 -133 -111 50 103 111 42
4006D2j73K52qj13K5k12J79oJ64k80J3L07j20j5L26n49L52p3m0J51l70K51k37
$$ 42 -131 121 113 0 25 -187 -8 -14 150 -130 -117 190 70 55 381 -168 184 111 71 222 -148 103 -134
4029a34K88m32M16k89j4J04K8J00k73K69M5k22J76qNlk2k03N1N1j79L84n7k86
$$ -134 154 -278 138 -151 -165 -61 -33 67 -206 63 108 -114 62 54 59 56 34 -169 -118 -67 -246 138 81 -205
4053b05L73r8j05K29k37J10M5J20J7l86L24l92J78n5q4J02q9J5K51M9j42O1p1
$$ -205 168 70 -35 194 -43 67 112 232 249 -137 187 -205 -27 -82 -166 -64 -153 -138 113 162 20 81 10
4076A0J81l75K01n7N1K95n34M28j61j0Qnq2J11k9r4O6K2j49J95Ml53L04rK2n1
$$ 10 191 -184 17 -40 11 306 -228 200 39 29 37 32 -50 61 32 -62 4 26 -123 72 76 -277 27 18 40 -11
4102a1M6j01K52j25n0J70J2l16Q2k9K20l99J85K10k97J63R7j86j06K66j70L7Q7
$$ -11 35 -66 186 61 11 181 193 -123 -41 -70 150 -249 -64 146 -151 12 109 -77 -183 83 -87 -50 37
4125C7k43J5L24l43K99j36J0k21L53k11K61O7j29j58N9j86J28K41p2N2K96m20
$$ 37 -206 -191 133 -210 89 -47 -37 -258 95 -116 145 212 83 -75 -16 -202 -74 167 95 147 443 23
4147B3N5J6j50nN5j17J7K47j93j90L18q5n6K25j44J22M1l83L07J11k5k02j91K76
$$ 23 78 94 -56 -61 -6 -123 -106 141 -52 -242 76 -9 -65 160 16 138 179 -204 103 214 189 -13 -204 72
4171G2l7k14J66P8m6j11K09j29Q6N4m2k61K42n2L0K27j70p8N2L9k5N5j44L8j39
$$ 72 35 -179 -13 65 19 -92 117 -12 74 128 86 -175 67 15 45 272 102 24 76 115 90 145 1 39 -100
4196a00J65P4o6k17j24K36J46m92N66k09K3o1J15L0k23j31L15j4j04P5j57R0J26
$$ -100 65 139 73 -144 -268 -32 114 -378 188 -21 2 -59 56 86 -137 -268 47 33 -71 4 -153 -63 63
4219F3J24j53Q2k44L39m21K23k01N83l72P7l47J67J97n0R7m1Jj51k0n9K09k70
$$ 63 187 34 116 -128 211 -210 13 -188 395 23 100 -247 -80 117 67 164 123 124 -27 -47 -106 103 -167
4242a67J14K31m7k97Q3J74L1o0J70m26K90j98J86l5k07K84j57L2L9N4N8L3o7l23
$$ -167 -53 178 131 -166 -83 91 122 62 232 -194 96 -102 84 49 -158 126 -31 1 40 94 152 185 118 -205
4266b05L08J23k23o8P4J29l57J98J42m25L43k67N33k82k77L92k82p2J40j28K33
$$ -205 103 226 3 -65 9 138 -219 -21 121 -304 39 -228 305 23 -254 138 -144 -216 -76 -204 29
4287B9j08J58k0j63J90j80o2K00k00P1L18k37J16k1o4o7K47j96O9K2K4k92J89
$$ 29 -79 79 59 -104 86 -94 -156 44 -156 -85 233 -4 112 91 27 -40 207 11 80 102 126 -166 23
4310B3J3j89K45l42L75j46P7K19p4k97K09J91l45J50l7k79L77j28o1K3l3R9k58
$$ 23 36 -153 92 -250 125 -21 56 275 201 -96 113 304 -41 109 72 -207 170 42 -19 4 -29 70 -188
4333a88L15k83L5J58J20k09N0q1o8K19K6q1o6N9m7m7K6J74j82n7J64J4l32M23
$$ -188 127 -156 -121 37 157 -52 -2 -83 -151 68 94 13 -53 6 -41 -88 -62 112 -70 -127 37 51 -281 142
4357A42k11P1J28k76J85j9j4k6R8K7j00J00P5j42Mj06J02j51K8L18R9l29r4L59
$$ 142 -69 2 130 -146 39 20 6 -20 78 105 5 105 180 38 42 -64 38 -113 -85 233 332 3 -91 268
4381B68k90m7k6K10k76L67k77N1n1k35K31J84j2j10J51P2l87K24P5j15N6q3M36
$$ 268 -22 -69 -95 115 -161 206 -71 -20 -71 -306 -75 109 97 -13 138 210 -177 47 122 7 63 -20 416
4404D16l09J08j76Q9j32p4P1J32j62KM3R3n2K6k7k73L56j3j89k0r8M48m07K62
$$ 416 107 215 39 128 -4 -78 -7 125 -37 -35 8 101 49 75 48 -225 131 118 -71 -91 -189 259 -148 114
4428A14k97P1J69J22n3l11J74L5m8K07j24J16m2o6j7n1lj2n9J27j76MK49j5m25
$$ 114 -183 -112 57 179 126 -185 -11 24 -24 183 59 175 133 67 50 -1 -4 -16 -75 52 -124 -120 129 114 -311
4453c11K30K12NQ1kLj13j39L9Q9j57K0Q5R6k86m9J64oj73K19j54K7K58l05L04
$$ -311 -81 131 136 217 215 218 105 -34 5 94 -63 -43 42 138 -148 -197 -33 -39 -212 7 -147 -120 138 -167 137
4478A37n3l6o4m8R8pj2j14kQ9J12l6j36q6L11p5k68r7J0L07J8L4j68m3jM9J10
$$ 137 84 48 -16 -64 34 27 15 -99 -101 -12 100 64 -72 -158 153 78 -190 -287 -277 30 48 82 -86 -129 -130 -81 29
4505B9M7l00K44N8j77K34J76l30m60N44Q5m15J54K21N5n8k75ML09j80l7J37k56
$$ 29 76 -224 20 78 -99 135 311 -19 -479 65 150 -265 -111 110 165 107 -168 -164 145 -35 -72 65 -191
4528a91J4K55N8j13j55J52J23l72L44j54m2J12q1LR8J84k92L35m14O0J05j89Q2
$$ -191 -177 78 136 23 -132 20 143 -229 115 -39 -81 31 -50 -47 51 235 -57 278 -136 -76 29 -160 -78
4551g8R6o1R2k1n3J08k65J91M5l07J68K89o0k79QK5j10K40N6poq4Kr1R3K68m50
$$ -78 18 -43 49 28 -25 83 -182 9 54 -253 -85 204 144 -135 -127 -102 -212 28 84 77 71 -13 -11 -102 -9 259 -191
4578a91j1J85k10Q8J15j42J76P6r2J2P9l22L67p8P7j36l17N16q1k10L41k5k36
$$ -191 -202 -17 -227 -139 -24 -166 10 86 -6 6 85 -237 130 52 129 -7 -324 192 111 -99 242 217 -19
4601a9L2k8p8J8J6k2O0M4k14L53j08N3k76l9n7mK99oK43l17J05j48O3KPo0Oq8
$$ -19 13 -15 -93 -75 -59 -81 -21 23 -191 162 54 107 -169 -208 -265 -269 30 24 267 -50 55 -93 -30 -28 -21 -81 -75 -163
4629a63K07j59J21J43m8J51j86P8j46O3L7P1j87O0k1N0j4k6R3M3k62J65m3R8k51
$$ -163 44 -115 6 149 101 252 66 144 -2 61 98 169 -18 42 21 71 57 31 124 167 -95 70 27 125 -126
4654a26K83j74K44j94l8m1J73L5l0j93R8r1j02J6J18j38mJ70j09K07M5j09q6J54
$$ -126 157 -17 227 33 -5 -46 127 162 132 -61 37 -54 -156 -140 -22 -160 -164 6 -103 104 149 40 -46 108
4678A08M90n25j01J87o2j91K05j91k6J60j30J48j6p3q2L5qL90l59L07k26K02m11
$$ 108 598 73 -28 159 97 -94 111 -80 -106 54 -76 72 56 -17 -99 -64 -72 318 -41 266 40 242 -169
4701a69K47r3kj11j46J36K13Q3k91J39J46k52m3L23pj74j04K7M0K09l04N6j10
$$ -169 78 -15 -17 -128 -274 -138 75 158 -133 6 152 -100 -143 180 173 -1 -105 -78 -38 171 -133 -77 -187
4724a87N2K39k25n3J14l6J15M8L02k91l75M73j51J27l12J95j48L39k32P5K86l94
$$ -187 -135 104 -121 -174 -60 -96 19 67 369 78 -297 176 25 152 -160 35 -113 226 -6 69 355 -39
4746c9Q5K38jl38j90JL76j99N6K2J22Ok96K26j76j8r3PK95k85j74J09K78R5j08
$$ -39 46 284 283 -55 -245 -244 132 -67 -11 11 133 139 -157 69 -107 -125 -218 -211 84 -201 -375 -266 12 107 -1
4771aJ74j06m8J79n2m7j33L32m73M69k71m2K47l57K03Qr2R2K65l02m8m0k0J12
$$ -1 173 67 19 198 146 99 -34 298 -175 294 23 -19 228 -129 74 82 -10 82 347 45 -3 -43 -63 49
4795D9L32j08n7k3k13j26J16q9k27M55j93j12L47k2m67M49j36K45r2l1n27L79
$$ 49 381 273 216 193 -20 -146 -30 -119 -346 109 -84 -196 151 129 -338 111 -25 220 128 97 -430 -51
4817e1k77L85J7J98m08M09n36L55l7n6k35J96Q5J4m6k8J21j37K69j00j19r6K74
$$ -51 -328 57 74 272 -136 273 -263 92 55 -1 -236 -40 45 59 13 -15 106 -31 238 138 19 -77 197
4840A97l64J92j44N2q0K30K8l6k25j94L19L1n3j79jJ89J55k4k95J97L3j01o3J78
$$ 197 -167 25 -119 -67 -147 83 111 75 -150 -344 -25 6 -47 -226 -227 -38 117 93 -202 -5 28 -73 -136 42
4864D2J21k49K2PM6J23l97L20k14J76j65L4K58r3k4O7r7j53Q1J89J20k57K11p
$$ 42 163 -86 -64 -57 -11 112 -285 35 -179 -3 -168 -134 124 31 7 74 -23 -176 -95 94 214 -43 168 161
4888A61l08J25J2j76K08L6kK46k98q3J90j06m0L56l39N7k7j94J79N6J38l31L20
$$ 161 -147 -22 -10 -186 22 58 56 302 4 -79 111 5 -35 321 -18 39 12 -182 -3 53 191 -140 180
4911A80k26J16k77L52m34L60j58R4M7J75j84L39k46k87J75k52K14p1mo4J41m8
$$ 180 -46 70 -207 145 -289 71 -87 7 54 229 45 384 138 -149 26 -226 -12 -83 -87 -151 -10 -58
4933e8K62k95j40L06RLj94J02m5j50L8J31P0j06J51j78M86m20L50k14k16L03o3
$$ -58 204 -91 -231 75 84 87 -107 -5 -50 -200 -162 -31 39 -67 84 -94 392 -28 322 108 -108 195 132
4956A32k35J17m9j29J70K5k08Q7K17j92R2j44K33O6j18ok00P8l4M02k72J20m14
$$ 132 -103 14 -35 -164 6 31 -177 -90 127 -65 27 -117 116 182 64 58 -142 -64 -98 304 32 152 -262
4979b62L60j88J6j55L10k44L49n2m02J37j41K22k0N9K41k11j18L04j26j53J7q
$$ -262 98 -90 -74 -229 81 -163 186 134 -268 -131 -272 -50 -70 -11 230 19 -99 205 79 -74 -57 -65
5001f5j48j34M08J11j47Q8l30J75J92j12k02K88l62K78j78K20J75k12J95k30n1
$$ -65 -213 -347 61 172 25 113 -217 -42 150 38 -164 124 -238 40 -138 82 257 45 240 10 -41
5022d1p1N1J64J00k40Q7p2J5O0L5j77M0K14k76n8N8K56j70L8r3L4J03L4k01J63
$$ -41 -112 -61 103 203 -37 50 -22 -7 53 88 -89 -49 165 -111 -169 -111 145 -25 13 -80 -46 57 91 -110 53
5047E3R5k41p4L37J04k98j55K23l5J93j87j54K31p4j40J73l29M42j25p2J7M9R
$$ 53 148 -93 -167 170 274 -24 -179 44 9 202 15 -139 92 18 -122 51 -278 164 39 -33 -16 33 42
5070D2r0K7k36J12K24l7j16P1P9k94J13M2q2K35j69M1K91j88J94k47r1K39J4j93
$$ 42 -48 -21 -257 -145 79 42 -74 -3 76 -218 -105 -63 -145 90 -79 -38 253 65 259 12 -79 160 174 -19
5094a9r9j6K29N7j19J73j87K11K4j27j68L9R9j83J47P6K9j19J55m3k86L40k06
$$ -19 -118 -134 95 152 33 206 19 230 254 127 -41 -2 97 -86 61 137 166 47 202 159 -127 213 7
5117GK03j75m5lJ20j24J36k42k9j26M06jj26J61k45J5Pk50J30O0m4J17n7J34l7
$$ 7 210 35 -10 -13 107 -17 119 -123 -152 -278 128 127 1 162 -83 -68 -61 -311 -181 -121 -165 -48 -105 29 -8
5142hJ32j52J78j96J57l19M13q0k44K11J35k69J73j1k38K73mj81J72pm53L70j39
$$ -8 124 -28 150 -46 111 -208 205 125 -119 92 227 -42 131 120 -118 155 151 -30 142 135 -318 52 -87
5165h7P9j13N7j84K19k18J42r5K02p4pJ19l10M42j12j84J61j4j12NN0J41k12O1
$$ -87 -8 -121 -64 -248 -29 -247 -105 -200 2 -72 -79 40 -270 172 60 -124 37 23 -89 -84 -34 107 -105 -44
5189d4N0R3P6k76J8J23r2j38K11j91N04l14J9K7J11j41j7j00j17K19j39L7J88
$$ -44 6 99 175 -101 -83 40 -52 -190 21 -170 334 20 39 66 177 36 19 -81 -198 21 -118 -81 107
5212A07j12P3j22l1J05Q9N0k41J71O8j88J58m0pK1J2j3k9l0m0M4%n2n1j02N3Q2
$$ 107 -5 68 -54 -85 20 109 159 -82 89 157 -31 127 87 80 101 113 100 71 41 1 45 45 -7 -58 -160 -107 -25
5239b5J80k46K09k33J80l8j70J7K51k21m8O0j04j85K08K35l77M23k91j19K35J7
$$ -25 155 -91 118 -115 65 27 -143 -126 125 -96 -144 -84 -188 -373 -165 70 -307 116 -175 -294 -59 -42
5261d2J19l1j5k23J44N1l2J20k17J38o8J24j78J40k39L77j97P2J41j87M7Q4J62
$$ -42 77 46 31 -192 -48 3 -29 91 -126 12 -56 68 -110 30 -209 168 -29 43 184 -3 44 128 290
5284B90k56K13j37j22K28l39J33N4k48J0J73k2J93l46K00o9M1PJ70j22k14K53
$$ 290 34 247 110 -12 216 -123 10 64 -184 -174 -1 -23 170 -176 24 -45 -4 3 173 51 -163 90
5306I0k56K24j2J29j02j71L69j75j85m1L07l7k34L94j04l98J18L30l71j43L97
$$ 90 -166 58 46 175 73 -98 271 96 -89 -130 177 140 -94 300 196 -202 -84 246 -125 -268 129
5327A29j24J5K3j26K83p5J5m1k75O3M97l93K02j98R5k5j46J60j84N7P9N0l00M23
$$ 129 5 20 43 -83 200 125 140 99 -176 -113 384 -9 193 -5 90 65 -81 79 -105 -48 31 81 -219 204
5351B04r1k3k91M47k75M1P6o9j1j51N0K17j46M4J74j85l22M13ql16L42j57r6K76
$$ 204 113 90 -201 246 -29 12 88 19 8 -143 -93 124 -22 22 196 11 -311 102 94 -222 120 -37 -133 143
5375A43k21j20J06m6n3L04l08N54k84j95L29n00P1M57m04K48R6l08K41k82K19
$$ 143 -78 -198 -92 -138 -191 113 -195 359 75 -120 209 -291 -220 237 -167 81 177 -131 110 -172 47
5396D7J17l05J16J99j98K05p1j5j99K75k08j8K90m97L49j12L10m35J23O4j66m1
$$ 47 164 -141 -25 174 -24 181 110 95 -104 171 -37 -55 235 -262 87 -25 285 -150 -27 37 -129 -170
5418a70k16O58k19k8p6N1m4N1J46K9k02J9J44l8p1K8j85K02k01j17J4J88j21K23
$$ -170 -386 272 53 25 -51 0 -44 7 153 182 -20 -1 143 105 34 62 -123 79 -122 -239 -225 -37 -158 65
5442F5j09L6Q0J04l01R0J09J2M0j94Rl97N56Q4k22K15J0m5n12L17k7N4m6o1J09
$$ 65 -44 -8 72 176 -125 -35 74 86 126 -68 -59 -456 100 184 -38 177 187 142 -370 -53 -80 -26 -72 -133 -24
5467b4q3K18m7j00j37L51l05J27P8J79K53l63k41K45pj51k48K82k00L06l7l9q5
$$ -24 -107 111 64 -36 -173 178 -127 0 78 257 510 147 -94 151 144 -7 -255 27 -173 133 96 57 -28
5490b8k5l3J14k6p8J94k6O8m2l58K88r1K27j82K17k77n1R4K5j08J80k21K01r1
$$ -28 -53 -86 28 2 -76 118 92 160 118 -240 48 -43 184 2 219 -58 -109 -15 10 -98 82 -139 62 -29
5514b9k08J75J76m8j62N3J80pk66J11q1rk04K68N1J98j64j08J10j44K06p1k08
$$ -29 -237 -62 114 66 -96 -43 137 130 -136 -25 -106 -115 -319 -51 0 198 34 -74 36 -108 98 27 -181
5537a81L85l05J26K2K51m74q2J67J01K70k53J23k01j32K00J29J15o8n8l42K84
$$ -181 204 -101 25 47 298 -176 -258 -91 10 280 27 150 -51 -183 17 146 261 193 135 -207 77
5558G7l6p4J93r1J08k44K54k4l67o5K24L68k95j29L46p8k08k6N6J97k35J4K6j45
$$ 77 41 -33 160 69 177 -67 187 163 -204 -269 -45 323 28 -101 245 167 -41 -67 -11 186 -49 -35 -9 -154
5582a54k3K06p0K09l15K06r1k94P39l75j18o3K23k38J09J61k81J72J88qL5l08
$$ -154 -177 29 -41 168 -147 59 -32 -326 413 38 -80 -143 80 -158 -49 112 -169 3 191 183 218 -90
5604i0J68j22k0J33j96jJ23J27k51l2P7K08j10n7M2J15k30qJ43j22J03J03j33
$$ -90 78 -44 -64 69 -127 -128 -5 122 -129 -161 -84 124 14 -43 -1 114 -116 -124 19 -103 0 103 -30
5627c0m6k18O57m89K00P1k20L6J88j29M5k58J65j63O7J61j48j9K30j02k7J30K9
$$ -30 -76 -294 363 -126 74 145 -75 -39 149 20 65 -193 -28 -191 -124 37 -111 -130 100 -2 -29 101 130
5650A30j49j13J85k4J53j82q6L9J69l07K92q2J85j62j45J0J25J76k98j72J78P1
$$ 130 -19 -132 53 29 182 0 -86 -47 122 -185 107 25 210 48 -97 -87 38 214 -84 -256 -78 -7
5672gj2m7N7RK30k6j63m15L94J69j8k9l06q6K25r7m4J22p0J77ok26N8R1jJ6j11
$$ -7 -19 -66 -9 0 230 204 41 -374 20 189 171 142 -164 -250 -25 -122 -166 -44 -114 63 57 -169 -111 -20 -21 -5 -116
5699a16R3N6L7QqQlj12J31j28m1Q4L8J0O6o0j09j46L43j93J42j29l4J56k1J66
$$ -116 -23 33 70 78 70 78 75 -37 94 -34 -75 9 47 57 123 63 -46 -192 151 -42 100 -29 -63 93 72 238
5725B38l03M7J49K8lj48qrj59Q1R7M7nj92M17l15K06j43M4k92O0L94k01m9O5k2
$$ 238 -65 -18 131 159 156 8 0 -9 -168 -87 10 57 52 -140 277 -38 168 25 69 -223 -163 231 30 -19 46 24
5751B4k83M16l25J58K84l05K08l68j6J11P5J23k95K85r5R6J7k62R5L87l23J30
$$ 24 -259 157 -168 -10 274 -31 177 -191 -207 -96 -21 102 -193 92 -3 93 110 -152 -57 330 7 137
5773A37j60J04J9l65M20j22k62K10L5N5j62J55m12L94q2M3j4j31K31j33J50j2
$$ 137 -23 81 100 -265 155 33 -229 -19 16 71 -91 64 -348 46 -36 7 -7 -138 93 -40 110 98
5795I8O1n6k01L17L9l89J92j30lk8q3K82q8K07j85o4q7K7jM2K88j51j05P5ok03
$$ 98 159 103 -98 219 258 -131 61 -69 -72 -100 -183 99 11 218 33 -31 -118 -91 -92 -50 238 87 -18 57 51 -152
5821a52M8K07M1l9q3j50K22j97L2l53M64j71J05j15R3O4J75J3n21L0J46J38j40
$$ -152 -104 103 144 105 22 -128 94 -103 -71 -424 40 -131 -26 -141 -48 16 191 204 -317 -287 -141 -3 -143
5844a43J95j18j35P7K09J92k85M3j90K0J11j95K77K13l88J4K47Q3q9j6o3O8j73
$$ -143 52 -66 -201 -124 85 277 -8 35 -155 -135 -24 -219 58 271 -117 -103 144 227 138 122 59 127 -46
5867d6K37k62P4J87K19m55l4Q0L8j22J29j42j99K20j30J48K35l71J82R4K9J92
$$ -46 191 -71 3 190 409 -46 -80 0 38 -84 45 -97 -296 -76 -206 -58 177 -194 -12 82 111 303
5889C03l07j47K77OO6l99M49q9l47J45n2N8j56K51o5j11K89k80K41q9k39J32L64
$$ 303 -4 -151 126 132 198 -201 248 159 -188 -43 -95 -37 -193 58 -7 -118 171 -109 132 43 -196 -64 300
5912C00j94k19J84j76J28j05O2N6k17K63L7l2j56J9N2l1P2qj19m6K48n0k7K06
$$ 300 106 -113 71 -105 23 -82 -20 36 -181 82 119 87 -69 -50 2 -29 43 35 -84 -130 118 68 41 247
5936B47j3j6m40L2K42M7j20J11j41R6J40k4m5k09J15j06M6J2k26K78J31j87J73
$$ 247 234 218 -222 -190 52 99 -21 90 -51 45 185 161 116 -93 22 -84 -38 -26 -252 26 157 -30 143
5959A43k74K86k42J25l17K65J84l65J96j05J17K11j0j37J44m60K87O5M1k79J3
$$ 143 -131 155 -87 38 -279 -14 170 -195 1 -104 13 224 214 77 221 -239 48 113 154 -125 -112
5980a12K99l20L49j44k9m1K83m85P8K07j29j36K54j34j5J05n1j8j9J86j57J49
$$ -112 187 -133 216 72 43 2 285 -200 -122 85 -44 -180 74 -60 -75 30 -21 -39 -58 128 -29 120
6002A20m04M17m8O1l18L08r7Ol2l10L60l9j5MK4N1q5mj2p1K11k85L96k32M0P6
$$ 120 -284 133 85 146 -172 136 39 45 13 -297 63 24 9 13 37 88 3 -1 -13 -84 127 -158 238 6 46 122
6028A22k83N2J3J73J0j64J47j47J12l5j20K31l2P0j97K16p8L3J53j42n8k39J58
$$ 122 -161 -109 -96 77 87 -77 70 -77 35 0 -120 111 79 149 -48 168 90 123 276 134 76 -163 -5
6051eQ1j42o0l2j1K75j33K5j7j58Q5L7q1J05m7K15l25M31j6k05J15%O9l7o3M5
$$ -5 76 -66 -126 -158 -169 106 -27 -2 -19 -177 -92 -55 -136 -31 -78 137 -188 243 227 22 137 137 206 169 106 151
6077A51p8q2j36J82j40K51n2m7j13n2K44j52J2K24k14J36jR1m5m5jJ9l54L43m6
$$ 151 73 -9 -145 37 -103 148 96 49 -64 -116 128 -24 -12 212 -2 134 133 224 179 134 133 152 -202 141 95
6102I5j62MJ86j94j50O9J74q4R4j23L58k23n5k63L54k14J42q5MJ06l2M3j67M98
$$ 95 -67 -63 123 -71 -221 -152 22 -62 32 -91 267 44 -11 -274 80 -134 8 -77 -73 33 1 44 -123 375
6126C75j82j41K68q4k81n7K81k30N0J69l15L11l23L63l55K21l2N9j98L26k93J17
$$ 375 193 52 320 236 -45 -102 179 -51 -1 168 -147 164 -159 204 -151 70 38 97 -101 225 -68 49
6148D9K1k98L59j41k1K85j27j5J23l41j68J65L51l30L35k64P8j13J42k9j24k7
$$ 49 70 -228 131 -10 -31 254 127 112 235 -106 -274 -109 242 -88 247 -17 61 -52 90 61 -63 -90
6170i0q5J59k1J17m23L31J35r3o8N4j09R2M9m14M41L7k17rJ86L6n9K3J43k20J34
$$ -90 -175 -16 -37 80 -343 -12 123 30 -38 16 -93 -1 48 -366 75 112 -105 -114 72 108 49 72 215 -5 129
6195A29m50O55l38O9L1j85N9q4J03m2l6J47k0mJ07j75j21J20k91J1N18j44J72
$$ 129 -321 334 -4 65 96 -89 -30 -114 -11 -53 -89 58 38 34 141 -34 -155 -35 -326 -315 203 59 231
6218B31k53J84k28o7J31m4J18P6m20K73k18O6J40r9K25R2q8j6l8l3j57Q5m9m0
$$ 231 -22 162 -66 -133 -2 -46 72 148 -272 1 -217 -151 -11 -110 115 207 119 103 65 32 -125 -40 -89 -129
6242a29J18j58L61ml9j88n7L78n13J99R1M1k82K07L6nJ29o3n01L43L7j53J62K8
$$ -129 -11 -169 192 188 149 -39 -96 282 -231 -32 59 100 -182 25 61 56 185 122 -379 -36 1 -152 10 38
6266C8j50P4K88k25J42k65l2J80M2m58L00K08l63O3L23j9o4j2j3l98M54j06L3
$$ 38 -112 -38 250 25 167 -98 -130 50 92 -366 -66 142 -221 -158 165 146 82 70 57 -341 113 7 40
6289D0O1j62nk25M13j50J86j02M4k89R8J11l8K40n8k31j63K67q4k56K14K30j0
$$ 40 101 -61 -66 -291 122 -28 158 56 100 -189 -91 20 -18 222 164 -67 -230 37 -47 -303 -89 141 131
6312A31j57r8k2K29K4m5j16J97l1l11L61q8j0l00J63j5k0n4J12O3j68k2K75k38
$$ 131 -26 -124 -146 83 107 62 -54 143 112 -199 162 74 64 -236 -73 -88 -108 -162 -50 13 -155 -177 98 -140
6336a40K50R5k18Nj08P9k63K12p7J36KL4L5J6j11R5J28k82O3J60m2j92K41j46
$$ -140 110 205 -13 -8 -116 -37 -300 -88 -165 -29 -27 7 42 58 -53 42 170 -112 -49 111 69 -123 118 -28
6360b8J13L6l01k7L6M4M0J64k7L5k7Qj2o6P2J91J6j73n4j45K18j45p5R3m0j57
$$ -28 85 121 -180 -207 -171 -127 -87 77 50 85 58 66 54 -12 60 251 267 94 40 -105 113 -32 -107 -14 -54 -211
6386b11J95j9j86J51J10j04L15k01O1p1k40L19n15M26M83p77J17K58q6n7K84k84
$$ -211 -16 -35 -221 -70 40 -64 251 50 111 40 -200 119 -396 30 513 -264 -147 111 25 -32 252 -32
6408c2k14L86m15K05j76L27j76K06O3%l48p3K08J25l1l4p2L4j9P1k14J32J44k68
$$ -32 -246 140 -275 -70 -246 81 -95 111 174 174 -174 -247 -39 86 55 21 -51 -17 -36 35 -179 -47 97 -171
6432a71J9K33j09r6J96m9J54l38j10L19k90MK73k15K37j2m15M91J20l34J55k52
$$ -171 -152 81 -28 -124 72 23 177 -161 -271 48 -242 -238 35 -180 57 45 -370 121 241 -93 62 -190
6454a90K21k01K52j99M0J22p0j4R9m4J68j49k18L30l23K27k01J04J93k49K68n32
$$ -190 31 -170 82 -117 -77 45 -25 -39 60 16 184 35 -183 147 -176 51 -150 -46 147 -102 166 -366
6476c66K10K38l3k77K75l0j98K87n6N4j10J20nj99J65j43R8l5n1o5O0J34l57L65
$$ -366 -156 82 49 -228 47 17 -181 106 50 104 -6 114 109 -90 75 -68 30 -5 -56 -121 -61 73 -284 81
6500H1J57k02j61n5J24n0o7N62m64J33Mp2P1P8j90L21j55k6o1M5n9J31m7j04K03
$$ 81 238 36 -125 -180 -56 -106 -173 389 -75 58 62 -10 61 139 -51 270 115 89 28 73 14 145 98 -6 197
6525A97l00rK61m24L27k06r1K98k50j8M92k44o6l8K26k31O1n9K50k39J08l13K52
$$ 197 -103 -112 149 -275 52 -154 -245 53 -197 -215 277 33 -33 -71 155 -76 -15 -74 176 -63 45 -268 -16
6548a6l5M5qk70N34l18j63K69k33J73J79l69L03J83j89k63K87l18mK91p0J75k71
$$ -16 -51 -6 -14 -284 250 -68 -231 38 -195 -22 157 -212 91 274 85 -178 109 -209 -213 78 8 183 -88
6571h8J71j71j11J4K51j48J07J52j16K4Q3l74J39j4l7J70O7r1n7j04O3j8L25j49
$$ -88 83 -88 -199 -185 66 -82 25 177 61 85 168 -206 -67 -81 -118 52 119 28 -29 -133 -70 -88 237 88
6595H8k21J89O6p3l02L33NM7j00m8J2l0K08j01J65r2j73k94M17m1o3j43jM48l10
$$ 88 -133 56 122 49 -253 80 85 132 32 -16 -4 -34 174 73 238 146 -27 -321 96 55 -8 -151 -152 296 -14
6620a4J40M6j91j63K69l0j24Kj16J86q7r5J91J00k9%K7q7j02P5j09J54l8j05R8
$$ -14 126 172 -19 -182 87 57 -67 -65 -181 5 -82 -177 14 114 85 85 112 25 -77 -2 -111 43 5 -100 -2
6645bj07jK18p6rJ3k04L52k12j39rJ17L09l37N1R6j18J48j8J26k16nk42J68p2
$$ -2 -109 -110 108 32 23 36 -168 184 -28 -167 -176 -59 250 -87 -36 60 -58 90 72 198 -18 -23 -265 -97 -169
6670a69K72n8J00m5j88R1P6J87k50J15l8j25J01N3l18K36J41k7j20nM4j12O5l2
$$ -169 103 45 145 100 -88 3 79 266 16 131 93 -32 69 122 -196 40 181 154 34 29 73 -39 26 -6
6694fK37j64m7m1Q5k1j73JK26p8R3j34P4J25Q8k87j48K51J53l30k26R0K7R8K02
$$ -6 231 67 20 -21 64 43 -130 -129 97 19 112 -22 52 177 265 -22 -170 81 234 -96 -322 -232 -205 -107 95
6719I5j99J26J56l90J55J81rj16K67j06j05K41k03j89P9NMk25N8o2J21L47k93
$$ 95 -104 22 178 -212 -57 124 115 -1 266 160 55 296 93 -96 -17 -12 -8 -233 -175 -237 -116 231 -62
6742f2J26o8O9qM0m8j57J01no3J16m1n0r4J17J74l36J18L4J06P1p7Q1k59m3K02
$$ -62 64 -4 65 57 97 49 -108 -7 -12 -75 41 0 -50 -144 -27 147 -189 -71 -37 69 140 63 144 -115 -158 44
6768D4J05j7j16L4j69O0k0j05R8k8P2P1J79J00k44o0JKP3L8l25R8p0J11J19n0
$$ 44 149 132 16 50 -119 -59 -79 -184 -86 -114 -42 29 208 308 64 4 5 7 80 118 -207 -109 -179 -68 51 1
6794AJ36l04M87m20J38J02k37j58J46K60J27m16K00k30J78m0J83r8k07J86K62
$$ 1 137 -167 320 -100 38 140 -97 -255 -109 151 278 -138 62 -168 10 -30 153 55 -152 34 296
6815B96jn05Q5M23j50j56j08q4K15O7K38l00j44j21K82J09j36j07J12J4L1L9j72
$$ 296 295 -210 -125 298 148 -8 -116 -200 15 82 320 20 -124 -245 37 146 10 -97 15 29 60 99 -73
6838g3P3j22L9k05J82K22k26K56j28Q1r2K08j42j02J32j40l8j00K52Kj28n5m9
$$ -73 0 -122 -83 -288 -106 116 -110 146 18 99 7 215 73 -29 103 -37 -75 -175 77 79 -49 -104 -153
6861a53J89K3j18j82K03k8P2L80k63l08K45j96P1j10L42o5o3J83k03l8j09k6J82
$$ -153 36 59 -59 -241 -38 -66 6 386 123 -185 60 -136 -65 -175 167 102 39 222 19 -19 -128 -154 28
6884B8q0j1K07k48k6q7L51K9k98N2j02K2J83N6m9j01r0J4K49k10J14m2j56K10
$$ 28 -52 -63 144 -104 -130 -217 134 163 -135 -83 -185 -163 20 76 27 -74 -164 -150 99 -111 3 -39 -195 15
6908A5k63K0K36j09o4M2J18r8l09O19n21K77K44m52J96J81j55K50l54L1J94l31
$$ 15 -248 -228 8 -101 -165 -123 -5 -103 -412 207 -314 -37 207 -245 -49 132 -23 227 -127 -96 98 -233
6930b33M47l20O1J81J61l42j95J93j6J46k03J49rj00J66k25K2K79n3k29J13r3
$$ -233 214 -106 -45 136 297 -45 -240 -47 -63 83 -120 29 20 -80 86 -139 -117 162 109 -120 -7 -100
6952a00J92j77J27J22m19K76j07L23l27J14K55j07q2k67J26J08J94j73M4L5J32
$$ -100 92 -85 42 164 -255 21 -86 237 -90 24 279 172 90 -177 -51 57 251 78 122 157 289
6973B89l23J38o1P8m0m4J15k13O2j71J99J11k23J81k62L85k40K6R3k17K99k13
$$ 289 -34 104 43 121 81 37 152 -61 1 -170 29 140 -83 98 -164 221 -19 7 100 -117 182 -31
6995c1Q5J46k74K09k06J14k52K10l9qLM8J82J18k12%J97j40j50M7mM1n7j93K65
$$ -31 54 200 -74 135 -71 43 -209 1 -38 -46 -43 5 187 305 93 93 290 150 0 47 43 84 27 -166 99
7020I9j41J32j49J57l03K59J0J43j72j46J44j21J6J16K15j90o7m5J99l78K77k66
$$ 99 -42 90 -59 98 -205 54 64 207 35 -111 33 -88 -72 44 259 69 2 -43 156 -222 55 -211
7042b11J69n8O7K2N5j29K64j82m3Q2r5N1O2J8kJ23l87K41J29k3l5J13m32M63j25
$$ -211 -42 -100 -33 -11 44 -85 179 -3 -46 36 -59 -8 54 72 70 193 -194 47 176 153 118 231 -201 262 137
7067A37k43K51k00L03r2k70Q8j0k2M4n7J21k38K17k0j39ln3K03k57K0K07r6l21
$$ 137 -106 145 -55 248 156 -114 -26 -36 -58 -14 -71 50 -188 29 9 -130 -133 -186 17 -240 -220 -13 -109 -430
7091d30P08o16K83J38k70J44Rk4M9O9j38M4k10K45k32L49j63J02q7r5J78p6J74
$$ -430 278 -338 -55 83 -187 -43 -34 -58 -9 60 -78 -34 -244 1 -231 118 -45 57 -30 -125 53 -23 151
7114A51p6r7q5J27l6J60mj85P2K52m01J10M2n7J2K04n6l2r1q5K85l41J15K8J43
$$ 151 75 -22 -107 20 -16 144 140 -45 27 279 -122 -12 30 -27 -15 189 133 101 10 -75 210 -131 -16 12 155
7139A55j88nN4k30J63J24M5k61n2K99%j06J92L0j97j90J56J0J08J41l73K63j26
$$ 155 -33 -38 16 -214 -51 73 118 -143 -195 104 104 -2 190 220 23 -167 -11 -1 107 248 -125 138 12
7162A2l7J27j26M1K11l71K50o5k23J70P5J14k84rJ84r9r7P1j29L25k09K6Qj07
$$ 12 -25 102 -24 17 228 -143 107 42 -181 -11 64 178 -106 -115 69 -30 -127 -56 -185 140 -69 -43 -35 -142
7186a42nJ28KJ25m8o1J97l81M00k59Q8n0o8J98P0j49QL9P6r9L0j06r0J96L6J26
$$ -142 -147 -19 -17 108 60 -1 196 -185 215 -44 44 -6 -74 124 194 45 53 92 168 69 99 -7 -97 99 135 261
7212B61l34J14k8j90J93j79K58k85q7K87J62k71O1j38J38J56j28j6P8j04R3j71
$$ 261 -73 41 13 -177 16 -163 95 -190 -277 10 172 -99 -38 -176 -38 118 -10 -26 52 -52 41 -130
7234a30J64k96K52J21m7l14K49J41k96L11p4k21q4K46l0p8j71J80j99K35M0J63
$$ -130 34 -262 -10 111 64 -250 -1 140 -156 155 81 -140 -224 22 -8 -86 -257 -77 -276 -41 -1 162
7256A62k9j8j84J03L05k47l1j01K48j04K1Q9j04j02J46r2m0N9j94J27j66J98L97
$$ 162 133 115 -69 34 339 92 61 -40 208 104 125 214 110 8 154 62 22 81 -113 14 -152 46 443
7279D43k20j26J42l35K18k00J55j23k21N50m92J34M3J29rj49J14p8j38L65k34
$$ 443 223 97 239 -96 122 -78 77 -46 -267 283 -209 -75 -32 97 88 -61 53 -25 -163 202 -32
7300c2l3L84l02J07l76K70M8j72J89l01L05l09Q9J97k93L27N4j0l23K60k86J85
$$ -32 -65 319 17 124 -252 18 66 -106 83 -218 87 -222 -133 64 -229 98 152 142 -181 79 -207 -22
7322b2K09k50M05l79J78k99J62p1j79J67K11j27J91m24L17k27Q2q6K48n4k01L70
$$ -22 187 -63 342 -37 141 -158 4 -67 -246 -79 132 5 196 -228 89 -138 -56 -142 106 52 -149 221
7344B21l45K01j17kj25J66P3Mj55Q0K58k98K79n24L81k58l8J44L73l92P3N4k68
$$ 221 -124 77 -40 -42 -167 -1 72 76 -79 1 259 -39 240 -284 97 -161 -199 -55 318 -74 -1 53 -215
7367b15J15m7K56n9J18k72o9L17m02M63l25J11j02K24p3p9O4j45J43J9j2q5p7
$$ -215 -100 -147 109 50 168 -104 -173 144 -258 205 -120 -9 -111 113 40 -39 25 -120 23 42 30 -55 -132
7390a32J45O9r7k12K18o5J0L32k96m5J56P6k06l23N19k7k21L78n09Q5N9j6k15
$$ -132 13 82 -15 -227 -9 -74 -64 268 -28 -73 83 159 -47 -370 149 122 -99 279 -230 -145 -86 -102 -317
7413c17L05J71k83K06k17L85l97L14j59K5L9k94P8J27K64j37J4j71J50J02k07
$$ -317 -12 159 -124 82 -135 250 -147 167 8 33 72 -222 -144 -17 247 110 124 -47 103 205 -2
7434bj31L37l25n0J40J25p4J07k3k82K35k37J52j96K67Q9m75L10j00L75k50j74
$$ -2 -133 204 -121 -171 -31 94 20 127 104 -178 57 -180 -28 -224 43 132 -343 -33 -133 242 -8 -182
7456a82P8l6J10k8RL4K09l97L45k13k5J40j95J2j8K14j70N9r6J74j68K16k14R7
$$ -182 -104 -140 -30 -58 -49 -15 194 -203 142 -71 -96 44 -151 -139 -157 57 -113 -54 -150 24 -144 72 -142 -45
7480d5J66j18N0K52l69R1O3k49J26j15J73j14l1K04R7k29m1j04N13k35j34K56
$$ -45 121 3 53 305 -64 27 90 -159 -33 -148 25 -89 -120 84 181 -48 -89 -193 320 85 -49 207
7502B07o0J5j18j22K25j28k38N9O2J15K19k51J62j58P4j70R0p6J11n7k06K87J33
$$ 207 147 162 44 -78 147 19 -219 -160 -98 17 236 -15 147 -11 63 -107 -17 -93 18 -39 -245 42 175
7525A75l02N9j27J0K05J77j37K5k52K45k73M00k40N5l3k66L45K33l87J10L2%k19
$$ 175 -127 -68 -195 -185 20 197 60 85 -167 78 -195 205 -35 20 -13 -279 66 299 -88 22 54 54 -165
7548a65J69k1j79K49J18l4k57K50j42J29k34K57k44M7j12J44j94M67l0O5l36j13
$$ -165 4 -17 -196 53 171 137 -120 130 -12 117 -117 140 -104 -57 -169 -25 -219 248 218 283 -53 -166
7570a66j05J07K62k72P8K42q1ko2J5n0Q3j77L24j2j7j40k15m3J23N7K74m36M45
$$ -166 -271 -164 98 -174 -96 146 65 63 1 16 -34 49 -128 196 184 167 27 -188 -231 -108 -51 223 -213 232
7594B32j08k64J96j40J42j59M86m63k25L62j61L57l14ln2J07q3o1j09L32k07Q2
$$ 232 124 -140 56 -84 58 -101 385 -78 -303 59 -102 255 -59 -62 -114 -7 -90 -151 -260 72 -135 -53
7616e3n5K90Ll06M6J03j8O3n1m2k5K9L25m22J02k16J67J19j6j41K96k95N34k17
$$ -53 -108 182 185 -121 -75 28 10 73 22 -20 -45 -16 309 -113 -11 -227 -60 59 43 -98 198 -97 437 220
7640B20m33K47j72jK05j02J34l1j76J79k72J92k34L9L37N0j43qn5K0j8l8M31k02
$$ 220 -213 34 -138 -139 66 -36 98 67 -109 70 -202 -10 -244 -205 132 182 39 31 -24 -4 -22 -60 371 169
7664A69m94M55o3j25J9j10J94kk46K18k3k21K48J70j47j08qJ5J5K69m28nN42n07
$$ 169 -325 130 67 -58 -39 -149 45 43 -203 15 -8 -229 19 189 42 -66 -74 -59 -44 225 -203 -208 334 -173
7688a73J57K41l40L20k7q4n0K02l5m23J52J44k19J14L6k23K30J35Q3k67L5j62
$$ -173 -16 225 -115 205 178 94 44 246 211 -212 -60 84 -135 -21 15 -208 22 157 240 -27 8 -154
7710a54L08k05J12J4m2J15j04k66K45k12L70Pl50R9K2J7N2K40m36j5K02L0l7N8
$$ -154 154 -51 61 75 33 148 44 -222 23 -189 181 188 -162 -63 -41 -24 28 268 -168 -183 19 49 12 70
7734G0L0L61l43o2j91K64K7j16J49l42jK78j2L2J13j08N6j66L8J03J88j67k01
$$ 70 100 461 118 56 -135 129 156 40 189 -153 -154 124 112 144 257 149 205 39 77 180 368 201 0
7757@L3m0K6J14k28j6N9N1J35r6k99M09j31N2m4j85K91K0q4k62J25j21L55M4r1
$$ 0 33 -7 19 133 -95 -111 -52 -1 134 38 -261 148 17 69 25 -160 131 151 67 -195 -70 -191 164 208 117
7782A17l81K45J31l02K71q3m2q0J72j4J07l13K34r4o8J63j32K70q3L4l40J15j11
$$ 117 -264 -19 112 -190 81 -2 -44 -124 48 34 141 -172 62 -32 -100 63 -69 201 118 152 -188 -73 -184
7805a84L07Pj83M6K68j23k22P9k66K00R3N7J22k73k52K48m3L10j17l12Q5M0K29
$$ -184 123 130 -53 -7 261 138 -84 -5 -271 -71 22 79 201 -72 -324 -76 -119 191 74 -238 -153 -113 116
7828A16J67j04k58q8N3L2J28r7k2L09l93J37K69j88l3J55l10l7K57j66J49J9J
$$ 116 283 179 -79 -167 -114 -82 46 -51 -73 236 -157 -20 249 61 28 183 -127 -164 93 -73 76 95 96
7851I6j34j97M4L41j9q1q0k72K07L4j11M36m41J95j61k7O4O3J28p3Q4k23n7J21
$$ 96 -38 -235 -191 150 131 50 -30 -302 -95 -61 -172 264 -177 18 -143 -170 -106 -43 85 12 96 -127 -184 -63
7875f3K28l72K95k23K90k48J76J48k83J12k04j41J86j0K87m20L75j98J06j8L83
$$ -63 165 -207 88 -135 155 -93 83 231 -52 60 -144 -285 -99 -109 178 -242 133 -65 41 23 406
7896D06k81r6J1j14J00k59K00K54k81Q3k73J3o2K08qK95l05J11o3k8P9k79M05
$$ 406 125 29 40 -74 26 -233 -33 221 -60 23 -250 -237 -299 -91 -99 196 -109 2 -61 -89 -10 -289 116
7919A16l40J82n8J34k77L08k5l15K19N6j69J60o2Q8K31l0k83j25J35m3r4O4q7
$$ 116 -224 -42 -100 34 -243 65 40 -275 -56 0 -169 -9 -71 17 248 218 -65 -190 -55 -98 -192 -128 -215
7942b15K74l18L29L0l90K93K75L4l79J55o4l6K53m24J30J25P5j56K6p4r2J05j37
$$ -215 59 -259 70 100 -290 3 278 312 -67 88 24 -12 241 -183 -53 72 147 -9 17 -57 -149 -44 -181
7965a81L30P5k61J0R9j02K1P8k11j63M37R9l50N2M0Mm2J0j32K73j69J58j38L05
$$ -181 149 224 -37 -27 72 -30 -9 69 -142 -305 132 231 -119 -67 -27 -23 -65 -55 -187 86 -83 75 -63 242
7989B42l04J35p5k38L51l66L88j63J80j64j62N65m94l3K00J73k82J76k60k40L66
$$ 242 -62 73 -2 -240 111 -255 133 -30 150 -14 -176 389 -105 -138 62 235 -47 129 -131 -371 -5
8010ej26L86n23K30J97j98r4J42K0O4j0l41M90m45J31m9o0M37k10Mj39j35J05
$$ -5 -131 255 -268 -38 159 -39 -133 9 29 93 83 -258 232 -213 -82 -131 -191 246 36 40 -99 -234 -129
8033a29K2K97J55l95J07K04p2l07K04kp8j82L75j58j19J03J97k63j7L76m02K9
$$ -129 -107 190 345 -50 57 261 189 -118 86 84 6 -176 199 41 -78 25 222 -41 -58 318 -84 -55
8055e5J92k29n3O1J76j41k27M04k69J30No5J32J36j84R6l57J20O8j55L03k23N0
$$ -55 137 -92 -145 -84 92 -49 -276 128 -141 -11 -6 -71 61 197 13 109 -248 -128 -60 -215 88 -135 -85
8078h5mJ7k7Q2P2l4J37l75L3J84P5N2r4n9Q3k27L32O2k61Q8J07j12L3j11j19K3
$$ -85 -89 -72 -99 -17 55 21 158 -217 -184 0 75 127 33 -26 57 -170 162 224 -37 51 158 46 79 -32 -151 -128
8104a28j80J29K65j75J46j61KK01k46R2R9O5j91R1Nk5k13K36k30L03r3l72M02
$$ -128 -308 -179 86 -89 57 -104 -102 99 -147 -55 44 109 -82 9 14 -11 -224 12 -218 85 -8 -380 22
8127B2N1l0J29NL7N7k27K2o0o9L2J13Q1J13m94J04J37P6n5o4J36l47L35l82K61
$$ 22 73 43 172 177 214 271 44 66 6 -63 -31 82 163 276 -218 -114 23 99 44 -20 116 -231 104 -278 -17
8152a7j9k5K74l01K71k17J02l6N1K4j29j3L69k94J18k03Q7j92QO1j80K9K12n3
$$ -17 -36 -61 213 -88 183 -34 68 32 83 107 -22 -35 334 40 158 -45 42 -150 -142 -81 -261 -232 -20 -73
8176g3rQ3K8J08j25j72L85pK0m22L84k0k19Q0p5
$$ -73 -82 1 29 137 12 -160 225 218 238 -184 200 180 -39 41 -34
8191c4
$$ Imaginary data points
##PAGE= N=2
##DATA TABLE= (X++(I..I)), XYDATA
0@%%%%%%%%%%%%%%%%%%%%Qj6J6j6J6j6K0k8L2l2L6m4M9n4O2p0Q0r0J00j13J28
$$ 0 0 0 0 0 0 0 0 0 0 0 0 0 0 0 0 0 0 0 0 0 8 -8 8 -8 8 -8 12 -16 16 -16 20 -24 25 -29 33 -37 43 -47 53 -60 68
41F8j42J56j73J90k10K33k56K82l12L44l79M18m61N08n60O21o93P75q69R80j116
$$ 68 -74 82 -91 99 -111 122 -134 148 -164 180 -199 219 -242 266 -294 327 -366 409 -460 520 -596
62e96J288j508J803k223K872m030O733k4755j6526L1583J7680J4125J0474J9567
$$ -596 692 -816 987 -1236 1636 -2394 4339 -20416 -36942 -5359 12321 26446 36920 56487
76E6487Q639l309q247l499j2500k2214k4186j4906j3645j5480j0211L250Q717
$$ 56487 65126 61817 53570 50071 37571 15357 -8829 -23735 -37380 -52860 -63071 -59821 -51104
89e1104Q034R533J8737K0292J3710Q292J0181P868k96p881o158n363j0260j4086
$$ -51104 -43070 -33537 -14800 5492 19202 27494 37675 45543 45247 37366 31208 25845 15585 1499
103A499j0309m402m517o744k354L683L753l35J250P215O549J734J472O881P382
$$ 1499 -8810 -13212 -17729 -24473 -26827 -23144 -19391 -19726 -18476 -11261 -4712 -2978 -1506 5375 12757
118A2757J554O95N368N542k561o185k704k127r742j2368o880l171o820o186K876
$$ 12757 14311 15006 20374 25916 23355 17170 14466 12339 2597 -9771 -16651 -19822 -26642 -32828 -29952
133b9952Q985O226N825J1672J4187P450K432K829K500n661j1880j0170p365r952
$$ -29952 -20967 -14741 -8916 2756 16943 24393 26825 29654 32154 26493 14613 4443 -2922 -12874
147a2874j1238n592J146K518J888P464J1978J0921O297N880O528K233l790n615
$$ -12874 -24112 -29704 -28558 -26040 -24152 -16688 -4710 6211 12508 18388 24916 27149 23359 17744
161A7744m337n980q773q405m290r26k079r30K968N184L290J479L418N060J715
$$ 17744 13407 7427 -1346 -9751 -14041 -14967 -17046 -17976 -15008 -9824 -6534 -5055 -1637 3423 5138
176E138q74K31L075J139k009M43L929J601l067k129O44k330p080o825l265l724
$$ 5138 4264 4495 7570 8709 6700 7143 11072 12673 9606 7477 8121 5791 -1289 -8114 -11379 -15103
192a5103o287l538L026M815L029N904J0774J0643N962M639N171J958m836q106
$$ -15103 -21390 -24928 -21902 -17087 -14058 -8154 2620 13263 19225 23864 29035 30993 26157 18051
206A8051p053p286j1192j0880n438j938k376Q80N683R171P810O851P627P894L142
$$ 18051 10998 3712 -7480 -18360 -23798 -25736 -28112 -27232 -21549 -12378 -4568 2283 9910 17804 20946
221B0946l29j213k080m442p348n910l368k991l746j447J508K235P18J322K932
$$ 20946 20617 19404 17324 12882 5534 -376 -3744 -6735 -10481 -11928 -10420 -8185 -7467 -6145 -3213
236c213L218m12r37J142J925J36j100K346L274Q07m87J462J708j645m879k520
$$ -3213 5 -407 -1344 -202 1723 1859 759 3105 6379 7186 6699 8161 9869 8224 3345 825
252H25k500n025n989k581R69K00L85M076P966O187M327M753N186J965k818l397
$$ 825 -1675 -6700 -12689 -15270 -14301 -14101 -13716 -9640 -1674 4513 8840 13593 18779 20744 17926 14529
268A4529l239o252q616p435l758m039k492O20M535N608N089N950P269N852K844
$$ 14529 11290 5038 -3578 -11013 -14771 -18810 -21302 -20682 -16147 -10539 -5450 500 7769 13621 16465
283A6465J002J81j497m783n472m461l818m157l866j246J18Q71M02J785L415K275
$$ 16465 17467 17648 16151 11368 5896 1435 -2383 -6540 -10406 -11652 -11534 -10663 -10261 -8476 -5061 -2786
299b786Q71J203L014J763N66Q69K692J654l18j91O22n55l537m576k563l283n446
$$ -2786 -1915 -712 2302 4065 4631 5500 8192 9846 9528 9337 9959 9404 5867 1291 -1272 -4555 -10001
316a0001m791j352j21l97J074N093O912N235N292O416N618J440m47j218k638o307
$$ -10001 -14792 -16144 -16265 -16662 -15588 -10495 -3583 1652 6944 13360 18978 20418 19971 18753 16115 9808
332I808p700o143n214n485m205q13J394K442L209N486O079N360L875L066K843
$$ 9808 2108 -4035 -9249 -14734 -18939 -19752 -18358 -15916 -12707 -7221 -1142 4218 8093 11159 14002
347A4002M41j283k166j748k384l707l492k131j674j956k187l46L24q58n12Q20
$$ 14002 14443 13160 10994 9246 6862 3155 -337 -2468 -4142 -6098 -8285 -8631 -8307 -9165 -9677 -8857
363h857K630J939J011L093M417L029K181K527K296n0k405k649k560m436o120m714
$$ -8857 -6227 -4288 -3277 -184 4233 7262 9443 11970 14266 14216 11811 9162 6602 2166 -3954 -8668
379h668l295k811k593L20L384M270L638N325O079M616K666J646J255j082m003
$$ -8668 -11963 -14774 -17367 -17047 -13663 -9393 -5755 -430 5649 10265 12931 14577 15832 14750 10747
394A0747m170l390m220m419l342j252l97l81J601K293L230J809K044J900J710
$$ 10747 6577 3187 -1033 -5452 -8794 -10046 -10443 -10824 -9223 -6930 -3700 -1891 153 2053 3763
409C763P62r4N40J48l93p71k30k36k04j579q48q60j694k359j667j109j77p92N25
$$ 3763 4525 4431 4971 5119 4726 3955 3725 3489 3285 1706 858 -2 -1696 -4055 -5722 -6831 -7008 -7800 -7275
428g275K066K976K150K871L399L085R12n27m80j253l595m313l086k661l452k188
$$ -7275 -5209 -2233 -83 2788 6187 9272 10184 9657 9177 7924 4329 16 -3070 -5731 -9183 -11371
444a1371K87K359J760K668L788M451K699J693J450J42j643k942k659k715l304
$$ -11371 -11084 -8725 -6965 -4297 -509 3942 6641 8334 9784 9926 8283 5341 2682 -33 -3337
459c337k830j090k92L44R02K292K719K238J181J175Q89o0o28o76o35p11q50n77
$$ -3337 -6167 -7257 -7549 -7205 -6303 -4011 -1292 946 2127 3302 4191 4131 3503 2827 2192 1481 631 54
477E4L5P86m13j03J04k21q75j898j095q69q60n85L45J667K098K320K473L469K157
$$ 54 89 875 462 359 463 242 -633 -2531 -3626 -4495 -5355 -5940 -5595 -3928 -1830 490 2963 6432 8589
496H589J268K50l25k073l789l837l743l844l366k087L33J167J977L332N226M355
$$ 8589 9857 10107 9782 7709 3920 83 -3660 -7504 -10870 -12957 -12624 -11457 -9480 -6148 -922 3433
512C433L257K979K308K08j235k785k143l530l917l351j974j400k65M43J656K365
$$ 3433 6690 9669 11977 12185 10950 8165 6022 2492 -1425 -4776 -6750 -8150 -8415 -7972 -6316 -3951
528c951J690J858J883R11Q22k35k70k94o24n07P2O87J60P05k68L39o85j221j935
$$ -3951 -2261 -403 1480 2391 3213 2978 2708 2414 1790 1283 1355 2042 2202 2907 2639 2978 2293 1072 -863
547h63j249k045j991j353m41J231Q98K051L482L752K770J995K114P85j045k694
$$ -863 -2112 -4157 -6148 -7501 -7942 -6711 -5813 -3762 -280 3472 6242 8237 10351 11136 10091 7397
563G397l106l408l920m443k344j397n25J140K631L663L386L630L715K876J341
$$ 7397 4291 883 -3037 -7480 -9824 -11221 -11746 -10606 -7975 -4312 -926 2704 6419 9295 10636
578A0636m02j156j495l195l340l477j858j714j430K29J068J618J235J529K202
$$ 10636 10234 9078 7583 4388 1048 -2429 -4287 -6001 -7431 -7202 -6134 -4516 -3281 -1752 450
593D50J152N91J4J24k43l07l66O5N53M49J80K59L50k26j092j825j510j904k286
$$ 450 1602 2193 2207 2331 2088 1781 1415 1480 2033 2482 2662 2921 3271 3045 1953 128 -1382 -3286 -5572
612e572j576o23K54N25J590K827L530K733L108K636J821n25r20k264k920l997
$$ -5572 -7148 -7771 -7517 -6992 -5402 -2575 955 3688 6796 9432 11253 10728 9808 7544 4624 627
628F27l998l232k506j599l42R87K282K382L388L459L440J904J325M55m58j496
$$ 627 -3371 -6603 -9109 -10708 -11050 -10063 -7781 -5399 -2011 1448 4888 6792 8117 8572 8114 6618
644F618k591j783j995k043j476m07l38J54L47J129N29N25L87K44J49J19P8j7N19
$$ 6618 4027 2244 249 -1794 -3270 -3677 -4015 -3861 -3514 -2385 -1856 -1331 -944 -700 -551 -432 -354 -371 148
663A48P96N76J297P30J017l85lj179j353j882k137j470j246j269m19N70J747J839
$$ 148 944 1520 2817 3547 4564 4179 4176 2997 1644 -238 -2375 -3845 -5091 -6360 -6779 -6209 -4462 -2623
681b623K307K664K407J567N83J96l65j779k837k337k163k242j319j029J61J153
$$ -2623 -316 2348 4755 6322 6905 7101 6736 4957 2120 -217 -2380 -4622 -5941 -6970 -6809 -5656
697e656J585J976K568J942J265Q50R22n59q89j160j284j229j697j358L9n46m6
$$ -5656 -4071 -2095 473 2415 3680 4530 5452 4893 4004 2844 1560 331 -1366 -2724 -2685 -3231 -3277
714c277O89P44P18L03L58M93K81l1K16k81K05N76Q45K18Q85K25m73k44n35j195
$$ -3277 -2588 -1844 -1126 -823 -465 28 309 278 494 213 418 994 1839 2057 2942 3167 2694 2450 1915 720
734G20j625j531j045j380n05k47P58J664J461J744K306K212J258P56J05m08j595
$$ 720 -905 -2436 -3481 -4861 -5366 -5613 -4855 -3191 -1730 14 2320 4532 5790 6546 6651 6243 4648
751D648k060k026j980k347j351o19j51L39Q39J749J679J856J281J246J013N9o47
$$ 4648 2588 562 -1418 -3765 -5116 -5735 -5886 -5547 -4708 -2959 -1280 576 1857 3103 4116 4175 3528
768C528l21l96j169p87r40r4p58j07j26j69k14k38O6j24k8j45R6M47Q33Q11J170
$$ 3528 3207 2811 1642 855 -85 -179 -937 -1044 -1170 -1339 -1553 -1791 -1725 -1849 -1877 -2022 -1926 -1479 -646 165 1335
789A335J033P70R19p3l75m64q79j800j604j671j109j066l66R05N33J201J689J740
$$ 1335 2368 3138 4057 3984 3609 3145 2266 466 -1138 -2809 -3918 -4984 -5350 -4445 -3912 -2711 -1022 718
807G18J833J352Q41N86n59j138j324j453j673j666j347k16k12M43R78J207J223
$$ 718 2551 3903 4744 5330 4771 3633 2309 856 -817 -2483 -3830 -4046 -4258 -3815 -2837 -1630 -407
824d07J066P49J070Q0k82q6n39n39n84l55o42k25K17k56M02j84j75q4k05o44j43
$$ -407 659 1408 2478 2558 2276 2190 1651 1112 528 173 -469 -694 -477 -733 -331 -515 -690 -774 -979 -1623 -1766
845a766r9j00J62Q76Q99J231J117J210K37J64L96o29j252j503k011j625j675r84
$$ -1766 -1865 -1965 -1803 -927 -28 1203 2320 3530 3767 3931 4327 3698 2446 943 -1068 -2693 -4368 -5352
863e352m19M19R02J310J831K229J645J426J144P78k38j003j263j624j772j791
$$ -5352 -5771 -5352 -4450 -3140 -1309 920 2565 3991 5135 5913 5675 4672 3409 1785 13 -1778
879a778j174j066l05j43O28J012J264R74O06J247M81J27j6j35l39m70k25J50j16
$$ -1778 -2952 -4018 -4323 -4466 -3838 -2826 -1562 -588 18 1265 1746 1873 1857 1722 1383 913 688 838 722
898G22J60O3L01k27l07o90q82o60r83q39j51O1L11R70J192J598J367J134R29P75
$$ 722 882 945 1246 1019 712 22 -860 -1520 -2503 -3342 -3493 -3432 -3121 -2151 -959 639 2006 3140 4069 4844
918D844r8m01j354j311j831k056j171j001n62L4M46J386J583J626J589J438Q85
$$ 4844 4746 4345 2991 1680 -151 -2207 -3378 -4379 -4941 -4907 -4461 -3075 -1492 134 1723 3161 4046
935D046j5l37j41j311j671j180r57r21l67j95O53Q08O29R70P04M98M07k71m23
$$ 4046 4031 3694 3553 2242 571 -609 -1566 -2487 -2854 -3049 -2396 -1588 -959 11 715 1213 1620 1349 926
954I26k32k66o28k68j92j44L2O64M66M81j86J24k66k95q21n38l58p58N98L36J94
$$ 926 694 428 -200 -468 -660 -804 -772 -108 358 839 653 777 511 216 -605 -1143 -1501 -2259 -1661 -1325 -1131
975a131P72J156R86R76L02M47n95n71j223j636j255j172j164l41J19K44J583J140
$$ -1131 -359 797 1783 2759 3061 3508 2913 2342 1119 -517 -1772 -2944 -4108 -4449 -4330 -4086 -2503 -1363
993a363J744J467J496Q33O73j7n16j467j158j484j588j146r96m22K58J60O58J189
$$ -1363 381 1848 3344 4177 4850 4833 4317 2850 1692 208 -1380 -2526 -3522 -3944 -3686 -3526 -2868 -1679
1011a679Q30J216O51N04O81Q8k75k03m31l08R6m91o9p1j76j40k80o54l46j042
$$ -1679 -849 367 1018 1522 2203 2291 2016 1813 1382 1074 1170 679 610 539 363 223 -57 -711 -1057 -2099
1031b099l49j80l03k8P04M70J049J216J320J287O68N04J50m21p27j068j528j731
$$ -2099 -2448 -2628 -2931 -2959 -2255 -1785 -736 480 1800 3087 3755 4259 4409 3988 3261 2193 665 -1066
1049a066j378j135r99L5K91P94R12J458J455J243R83O68P8l1n80q77l92r86r90
$$ -1066 -2444 -3579 -4578 -4543 -4252 -3458 -2546 -1088 367 1610 2593 3261 3339 3308 2728 1851 1459 473 -517
1068e17o84m47L9k19N95n9L93N51o5K39j41R4K27K45P8J07K61K2K29N16l76J76
$$ -517 -1201 -1648 -1609 -1828 -1233 -1292 -899 -348 -413 -174 -315 -221 6 251 329 436 697 719 948 1464 1088 1264
1090A264m09n10m87n30n08o27l08j00M63N29O03Q06O94J023L45K59j70k68o61
$$ 1264 855 345 -142 -672 -1180 -1807 -2115 -2215 -1752 -1223 -620 186 880 1903 2248 2507 2337 2069 1408
1109A408o04j233o75q60k52j99j49L27Q31J061R16N33L02R65k21o8m13j90o95
$$ 1408 804 -429 -1104 -1964 -2216 -2415 -2564 -2237 -1406 -345 571 1104 1406 2371 2150 2082 1669 1479 784
1128G84p18o54n28l59l11K50M62j42K79M88L87J07O5M31J01K00j64L18J95km7
$$ 784 66 -588 -1116 -1475 -1786 -1536 -1074 -1216 -937 -449 -62 45 110 541 642 842 678 996 1191 1189 1142
1149A142j8k30j10m54l78n97o46j97o18k6K0N89M69P42O50R59O49L44J60o0k8
$$ 1142 1124 894 784 330 -48 -645 -1291 -1488 -2106 -2132 -2112 -1523 -1054 -312 338 1297 1946 2290 2450 2390 2362
1170B362p93p75q17r34p49j23k04k58r9Q35N96N56O72L63N97R2l7J65k09k03o07
$$ 2362 1569 794 -23 -957 -1706 -1829 -2033 -2291 -2390 -1555 -959 -403 269 632 1229 1321 1284 1449 1240 1037 430
1191D30j46k27l47j52j59L13l04M2j95K84Km5j01o8M94K3J67M81L99P56m30k08
$$ 430 284 57 -290 -442 -601 -288 -592 -550 -745 -461 -459 -504 -605 -673 -179 -156 11 492 891 1647 1217 1009
1213A009o0m13j98p83k81k05p23j12Q5j57Q16N31R22M96O00L03K34m4m16p37m56
$$ 1009 949 536 338 -445 -726 -931 -1654 -1766 -1681 -1838 -1022 -491 431 927 1527 1830 2064 2020 1604 867 411
1234D11o82p90n63k2k52k31O15J62P39P48M92M24L72j5K02l07m01k5n13m70q6
$$ 411 -271 -1061 -1624 -1646 -1898 -2129 -1514 -1352 -613 135 627 1051 1423 1408 1610 1303 902 877 364 -106 -192
1255a92l84j05N4l3%K1n0J99l54j5L20j10M74J53Q35Q9L92K34L43p3j29k09q40
$$ -192 -576 -681 -627 -660 -660 -639 -689 -490 -844 -859 -539 -649 -175 -22 813 902 1294 1528 1871 1798 1669 1460 620
1278F20p52o47q89k98m30j54J0N50O54O23J262M92J034K77K80j12l10p26p73r38
$$ 620 -132 -779 -1668 -1966 -2396 -2550 -2540 -1990 -1336 -713 549 1041 2075 2352 2632 2520 2210 1484 711 -227
1298b27l30q93l89m17K53J45M66O80L22N10K18N10K93j38l89K39m19K8q2n0J02
$$ -227 -557 -1450 -1839 -2256 -2003 -1858 -1392 -712 -390 120 338 848 1141 1003 614 853 434 462 380 330 432
1319D32j81ml49J76n23r1l11m73J82J1j4L36J96N61M79L03N55K59L47J85o13l95
$$ 432 251 247 -102 74 -449 -540 -851 -1324 -1142 -1131 -1145 -809 -613 -52 427 730 1285 1544 1891 2076 1463 1068
1341A068m99j028l68r08l06k01J53K76P01N18O10R93N22M76j17J30l32m21m61
$$ 1068 569 -459 -827 -1735 -2041 -2242 -2089 -1813 -1112 -594 16 1009 1531 2007 1890 2020 1688 1267 806
1360H06p39n10n15k25m56M00k4L86N37k1O11K66m7J14n8r6j21J6k15J97O4k60
$$ 806 67 -443 -958 -1183 -1639 -1239 -1263 -877 -340 -361 250 516 469 583 525 429 308 324 109 306 370 110
1382A10L95P4k94m9k95j43j37o42J04k00k36L03K90M99L07M09O15J50K31j91L9
$$ 110 505 579 285 236 -59 -202 -339 -981 -877 -1077 -1313 -1010 -720 -221 86 495 1110 1260 1491 1300 1339
1403A339n17m32l73m28n78m15P0k30M51J54N43N61N01R0L50k5Ol15m04q6l86j57
$$ 1339 822 390 17 -411 -989 -1404 -1334 -1564 -1113 -959 -416 145 646 736 1086 1061 1067 752 348 262 -124 -281
1425b81l48kj98K88j97M60K67K38J35k61N41j00k45N6k33m11n1NQ9j8Q8J45l09
$$ -281 -629 -631 -829 -541 -738 -278 -11 227 362 101 642 542 297 353 120 -291 -342 -337 -248 -266 -178 -33 -342
1448c42J35J15J3r2J5o8j59J24K50P4J46K72j18K21J91j32j34l19n19Q3m33k10
$$ -342 -207 -92 -79 -171 -156 -224 -383 -259 -9 65 211 483 365 586 777 645 511 192 -327 -244 -677 -887
1470h87k79R8J80O7L17K78N46L19M04K71j37r4j57j06m09m75l54l59k08J0l24
$$ -887 -1166 -1068 -888 -821 -504 -226 320 639 1043 1314 1177 1083 926 820 411 -64 -418 -777 -985 -975 -1299
1491a299J19M76j12N24K26L37J43O9L75n1j72l6J18j3o3m16k52J07k17k61k33
$$ -1299 -1180 -704 -816 -292 -66 271 414 483 858 807 635 599 717 704 641 225 -27 80 -137 -398 -631
1512f31l03r0Q6K16J45M2N35K11L56R2L70o3K98k91K10m44k70o01l82k31k71J75
$$ -631 -934 -1024 -938 -722 -577 -535 0 211 567 659 1029 966 1264 973 1183 739 469 -132 -514 -745 -1016 -841
1534h41l32K24N1M67K45L72K59O1M48k27J91j38r5m16N8k66p8k94k10J96m32P2
$$ -841 -1173 -949 -898 -431 -186 186 445 506 954 727 918 780 685 269 327 61 -17 -311 -521 -325 -757 -685
1556f85k2MJ57L13j90L43Q6L84j01L47P5M4j48q2K65n00m11j05l51n40q6Q3q8
$$ -685 -707 -703 -546 -233 -423 -80 6 390 289 636 711 755 607 525 790 290 -121 -226 -577 -1117 -1203 -1120 -1208
1579a208L84r1N95K64L84N23O9L66J5m68J27l32k89k91k78j84n78M96k06k70J82
$$ -1208 -824 -915 -320 -56 328 851 920 1286 1301 833 960 628 339 48 -230 -414 -992 -496 -702 -972 -790
1600g90K85J51J98K22J15K83N5J20n5K7j30j08M3rj30j28P1k23j27l54P8l89j43
$$ -790 -505 -354 -156 66 181 464 519 639 584 611 481 373 416 407 277 149 220 -3 -130 -484 -406 -795 -938
1623i38K71Q2L18N4M70J33K03L8o2N59j84k95l75j27o09k42P9r1n6l20L03O31
$$ -938 -667 -585 -267 -213 257 390 593 631 569 1128 944 649 274 147 -462 -704 -625 -716 -772 -1092 -789 -158
1645a58K4M16K41J67j63K34J22l80k33l7j92q4m37o7J19K46J4QM9L29j47K95j63
$$ -158 -134 282 523 690 527 761 883 503 270 233 41 -43 -480 -547 -428 -182 -168 -160 -111 218 71 366 203
1668B03rJ13m68J84Q9j60k8K77j21k08K22j50K9l58J20j20PQ6n33N19L40q1K04
$$ 203 194 307 -161 23 112 -48 -76 201 80 -128 94 -56 -27 -385 -265 -385 -378 -292 -825 -306 34 -47 157
1691A57L61K8R0q0L28k25o4n83k70kk07j36l39J42N4K42L23M11K13J07J83K48
$$ 157 518 546 636 556 884 659 595 12 -258 -260 -467 -603 -942 -800 -746 -504 -181 230 443 550 733 981
1713I81l22J7k43j98o1k85k39p8k9R1o8o2J19L19L76m3j47N7K58n33J57N0O4l7
$$ 981 659 676 433 235 174 -111 -350 -428 -457 -366 -434 -496 -377 -58 318 275 128 185 443 -90 67 117 181 144
1737A44K3L7k55J23j41K90j66q1r5k62J50j16l9M05J40l65L46R6P9J95j53N7k98
$$ 144 167 204 -51 72 -69 221 55 -26 -121 -383 -233 -349 -388 17 157 -208 138 234 313 508 355 412 114
1760A14K89l11m93J72l91J02Rk29M23K28J0M18K23J72l18K49k41Q6k07k60m34
$$ 114 403 92 -401 -229 -620 -518 -509 -738 -315 -87 -77 341 564 736 418 667 426 512 305 45 -389
1781c89j71m2j96L14j91M36n0J96j5K07J90J39L27j18J08m25N3J06n51N8O1l00
$$ -389 -560 -602 -798 -484 -675 -239 -289 -93 -108 99 289 428 755 637 745 320 373 479 -72 -14 47 -253
1803b53k27J04l44K5L95k74J47J78K47nK37K50J6J56K25j07q2J13l37k29j42l33
$$ -253 -480 -376 -720 -695 -300 -574 -427 -249 -2 -7 230 480 496 652 877 770 688 801 464 235 93 -240
1825b40j11l14k01J54j86J72j7M19J14J87L33L65k1J38J08R1l06j10j7k70j06
$$ -240 -351 -665 -866 -712 -898 -726 -743 -324 -210 -23 310 675 654 792 900 991 685 575 558 288 182
1846A82o61O2Jp7j00k15R5Q0N18l33L84J42j28M12Q4J35J37J6n6k90k49J50n28
$$ 182 -479 -417 -416 -493 -593 -808 -713 -633 -115 -448 -64 78 -50 362 446 581 718 734 678 388 139 289 -239
1869b39K20l31p4k53Q2m0L6K90K05K1J2K09K31j21R1K75k06O9k81k22N5j10k2
$$ -239 -19 -350 -424 -677 -595 -635 -599 -309 -104 -83 -71 138 369 248 339 614 408 477 196 -26 29 -81 -103
1892a03J34r0O4m86J01K50o2J66N3J31k58J75j4J6J71k91m67N26j11r6J50k06
$$ -103 31 -59 5 -481 -380 -130 -192 -26 27 158 -100 75 61 77 248 -43 -510 16 -95 -191 -41 -247
1914b47K53j24l1O1J15n8J30K1p4O7J83k9j54r1j20J61l83q3K2j16J72j59K39
$$ -247 6 -118 -149 -88 27 -31 99 120 46 113 296 267 113 22 -98 63 -320 -403 -381 -497 -325 -484 -245
1937b45K3L14J52M3J30KK02L0n07M3m0l14j11P9m7j75l3j56J73M38k83L51J23
$$ -245 -222 92 244 287 417 419 621 651 144 187 147 -167 -278 -199 -246 -421 -454 -610 -437 1 -282 69 192
1960A92J14k10O0J95l82J39J65R4R2m61Q7J01k66K01m12j29J83l1k81K91q8K50
$$ 192 306 96 156 351 -31 108 273 367 459 -2 85 186 -80 121 -291 -420 -237 -268 -549 -258 -346 -96
1982i6M4J19J04N9J05J88k75L7J70j32k45Q4n50P1j37n5M8J85J3J96R8R6J51K1
$$ -96 -52 67 171 230 335 523 248 285 455 323 78 162 -388 -317 -454 -509 -461 -276 -263 -67 31 127 278 299
2006B99j80p6L13k54J4m17K18j02Q6k9L4J00j07J95j35L00l15L59l96P7L79n20
$$ 299 119 43 356 102 116 -301 -83 -185 -99 -128 -94 6 -101 94 -41 259 -56 303 -93 -16 363 -157
2028a57R9j74j2J15K1J29J55r9q7K85k56j57J58m5k97L57j61K8mj00K60K21j69
$$ -157 -58 -232 -244 -129 -108 21 176 77 -10 275 19 -138 20 -25 -322 35 -126 -98 -102 -202 58 279 110
2051A10L69j39l61o5K17p05L32l61L28k39K40J60P4L8K42J3L5J01K18q6l38%r
$$ 110 479 340 -21 -86 131 -574 -242 -603 -275 -514 -274 -114 -40 -2 240 253 288 389 607 521 183 183 174
2074A74k16m56oo1l2K59K23l56L69J82j64K37J21o3k0l0R8k97K43j50q4k51n1
$$ 174 -42 -498 -504 -565 -597 -338 -115 -471 -102 80 -84 153 274 211 191 161 259 -38 205 55 -29 -280 -331
2097c31M70k67Jj93j07K9K86l52K36n0J70k6L91J75N7q0J29m7Mk98n4j44l77J2
$$ -331 139 -128 -127 -320 -427 -398 -112 -464 -228 -278 -108 -134 257 432 489 409 538 491 495 197 143 -1 -378 -366
2121c66K17k58P2j72J10K31J21P5K18J45k06K81j17j20k0J98m66k6j86J78J53
$$ -366 -149 -407 -335 -507 -397 -166 -45 30 248 393 187 468 351 231 211 409 -57 -83 -269 -91 62
2142F2k49k37O8J81M6r6n7L21m8N1q6l5J51j6J90j99K57m86M34J1k62j4j91R5
$$ 62 -187 -424 -356 -175 -129 -225 -282 39 -9 42 -44 -79 72 56 246 47 304 -182 252 263 1 -13 -204 -109
2166a09j18L7J56k01J71k7k14M23m2L37j20j20l02K76Q1p5Q9n86K67M5l33Q7K0
$$ -109 -227 -190 -34 -235 -64 -91 -305 118 76 413 293 173 -129 147 228 153 242 -344 -77 -32 -365 -278 -258
2189b58K6K79QK5J03Q4k16k3K85m35k7K17q7n4o6m9J83P3O0o9m1k0j63J99K88
$$ -258 -232 47 55 80 183 267 51 28 313 -122 -149 68 -19 -73 -139 -188 -5 68 128 59 18 -2 -165 34 322
2214C22j01k87J80j64L04k56j1J12l80K70j27P1k66J57j6pQ9J89l00L13L8N7P8
$$ 322 221 -66 114 -50 254 -2 -13 99 -281 -11 -138 -67 -333 -176 -192 -199 -110 79 -221 92 130 187 265
2237B65k4J59j27m39K47L1p8l78K74k9k69L19j82M5P6N5J36K04k44O8K91K6j99
$$ 265 241 400 273 -166 81 112 34 -344 -70 -99 -368 -49 -231 -186 -110 -55 81 285 41 109 400 426 227
2260B27k46m9M4m7J83n5l23J83k59O8L83j55p6J72l5j96M52k39J90k17J57K80
$$ 227 -19 -68 -24 -71 112 57 -266 -83 -342 -274 109 -46 -122 50 15 -181 271 32 222 5 162 442
2282D42j57j93M8j60Mm3K76l44k4K29l12K31k55J45J2L2J63J7K05j71Q6j07j19
$$ 442 285 92 140 -20 -16 -59 217 -127 -151 78 -234 -3 -258 -113 -101 -69 94 111 316 145 231 124 5
2305EL7l01J92nq7J74k60J33p2J90oK81l4l78K72l92L94j45LJ47j14j59J78k41
$$ 5 42 -259 -67 -72 -159 15 -245 -112 -184 6 0 281 247 -131 141 -251 143 -2 1 148 34 -125 53 -188
2329a88J89J97k22J42j17j11p4J79J0q5j8J00R9j02J32q7M1P1O6k18l03L19K31
$$ -188 1 198 -24 118 1 -110 -184 -5 5 -80 -98 2 101 -1 131 44 85 156 222 4 -299 20 251
2352B51m87m09N68J36l4j02J99K49l99K98J70j81k24J2J35O1k15k14J00k76K54
$$ 251 -236 -645 -77 59 25 -77 122 371 -28 270 440 259 35 47 182 243 28 -186 -86 -362 -108
2373a08m9k52L86q8P0MOL49k39J94J73j55j39j64M7Q5j26nj29J68J79o5m3j29
$$ -108 -157 -409 -23 -111 -41 -37 -31 318 79 273 446 291 152 -12 35 120 -6 -11 -140 28 207 142 99 -30
2397c0m9k06J50m4M0j43K60L58r6q3j79K99P5P0j70o7m2k73O8N9k36J99j60J27
$$ -30 -79 -285 -135 -179 -139 -282 -22 336 240 157 -22 277 352 422 252 185 143 -130 -62 -3 -239 -40 -200 -73
2421g3l66M83k18K63o3M4J0J69l03j56K12q4N9K1k16j61N17j75O2M6J54n5J4k12
$$ -73 -439 44 -174 89 26 70 80 249 -54 -210 2 -82 -23 -2 -218 -379 138 -37 25 71 225 170 184 -28
2445b8K07p2k97J87K23k38j4J12r1K49k50j76j44O50k63j15J2J32l58K81o2k5
$$ -28 179 107 -190 -3 220 -18 -32 80 -11 238 -12 -188 -332 318 55 -60 -48 84 -274 7 -55 -80
2467h0K76k5j30L4J35k03j11J16j85K82j59O3j27r4K4j73M26O0J30j1L0l46l8
$$ -80 196 171 41 75 210 7 -104 12 -173 109 -50 13 -114 -208 -184 -357 69 129 259 248 278 -68 -106
2490a06K79r8q6k2k94L13j45n7n6J69n0j8J96j78L28r2J74k36O3j48J51o0LQN0
$$ -106 173 75 -11 -33 -327 -14 -159 -216 -272 -103 -153 -171 25 -153 175 83 257 21 84 -64 87 27 30 38 88
2515H8L1L0j23J02m20J19J4K6nK50m15K4L32j46R5J37N9j72K04%j14p9J51P5k22
$$ 88 119 149 26 128 -292 -173 -159 -133 -138 112 -303 -279 53 -93 2 139 198 26 230 230 116 37 188 263 41
2540D1J3k09j17J14l94M37k06L60K5j95J32N1R4r6j06K30o6R2l96P3K37L9kl0
$$ 41 54 -155 -272 -158 -552 -115 -321 39 64 -131 1 52 146 50 -56 174 108 200 -196 -123 114 153 151 121
2564A21K20o41j00L40K36k33p2k5k9K99J13j33l20K73J51j08orq3L0k29R1P0P5
$$ 121 341 -300 -400 -60 176 -57 -129 -154 -183 116 229 96 -224 49 200 92 86 77 -6 24 -205 -114 -44 31
2588C1P1j62J93k66L86k52K01N3j88j6J79j22l22K47o3k08Q4NQ6n1O3J66N5o9
$$ 31 102 -60 133 -133 253 1 202 255 67 51 230 108 -214 33 -30 -238 -154 -149 -63 -114 -51 115 170 101
2612A01j23k9Q4o4rL26l05Rn3J49n2rJ11m76K71J6j07L96k29K6m0n5K13j95o9
$$ 101 -22 -51 33 -31 -40 286 -19 -10 -63 86 34 25 136 -340 -69 -53 -160 236 7 33 -7 -62 151 -44 -113
2637a13K19q1L55l93j78P0J66o2K00q5k54r5J77j0O3n0o9L07l98K57J54P7j98
$$ -113 106 25 380 -13 -191 -121 45 -17 183 98 -156 -251 -74 -84 -21 -71 -140 167 -231 26 180 257 59
2660E9O7q1n8j04M1K04jk63K63j53j47p6J41J68k14J60OR5m55K75K10m38K55J55
$$ 59 126 45 -13 -117 -76 128 127 -136 127 -26 -173 -249 -108 60 -154 6 12 107 -348 -73 137 -301 -46 109
2684A09j92rL94j72q9O4L2j34N5l09J19M1KL6J4M7K00m8k04r4l2L59k25L5j78
$$ 109 -83 -92 302 130 41 105 137 3 58 -251 -132 -91 -89 -53 -39 8 208 160 -44 -138 -170 189 -36 -1 -179
2709a79R5K67l51J79k74J75J58j11m2K27m3j55L86k87p9m3%K90k20j27%J81J1
$$ -179 -84 183 -168 11 -263 -88 70 -41 -83 144 101 -54 332 45 -34 -77 -77 213 -7 -134 -134 47 58
2732E8m15N46k86K02o2K4j43L05l56J61J95j84j09o1K62l38J45Q9Rj36n3K43p
$$ 58 -357 189 -97 105 43 67 -76 229 -127 34 229 45 -64 -125 137 -201 -56 33 42 -94 -147 96 89
2755H9l03K54j07n8lK83j65k6J87k29mj68K38K6k7K2j99J9k8J44J09l68K91q9
$$ 89 -214 40 -67 -125 -128 155 -10 -36 151 -78 -82 -250 -12 14 -13 9 -190 -171 -199 -55 54 -314 -23 -112
2779a12m1M12R9p4r8J2j50j16L34j02j2n06K33R1j95J80L1j08jJ84J92Nk33K65
$$ -112 -153 259 358 284 186 198 48 -68 266 164 152 -354 -121 -30 -225 -45 -14 -122 -123 61 253 258 25 290
2803B90l06J41M0j73M6q5J63R2l40o4J38P0j57J53n9j04J19l38L13o0J26o5q0
$$ 290 -16 125 165 -8 38 -47 116 208 -132 -196 -58 12 -145 8 -51 -155 -36 -374 -61 -121 5 -60 -140
2826a40J87j12J72J05k76J32KK9l64M97P1k51k25J34j9j96K34j0k11Q8M31m62
$$ -140 47 -65 107 212 -64 68 70 99 -265 232 303 52 -173 -39 -58 -254 -20 -30 -241 -153 278 -184
2848a84p5L91l32J69p2J0K79l17K81k34Q6J00m3lr8J34j4n0k0mR7k38p4K68k32
$$ -184 -259 132 -200 -31 -103 -93 186 -131 150 -84 2 102 59 56 -42 92 78 28 8 4 101 -137 -211 57 -175
2873a75J46pK6K3j56J97J4m0r7P1j10K92l39R3r6L18j45m9N21l45l49Q2J90k1
$$ -175 -29 -36 -10 13 -143 54 68 28 -69 2 -108 184 -155 -62 -158 160 15 -34 487 142 -207 -125 65 44
2897D4l06j3R5L59j26K7j06J78j79P4m7l3K31k24j18R3M6J16m7j36m1k40L0N07
$$ 44 -262 -275 -180 179 53 80 -26 152 -27 47 0 -33 198 -26 -144 -51 -5 111 64 -72 -113 -353 -323 184
2921A84k48L2J3l1J41J37j86l35L69M3k62J53P0o7n6J83k81L96j81j49qM3J70
$$ 184 -64 -32 -19 -50 91 228 42 -293 76 119 -143 10 80 13 -43 140 -141 255 74 -75 -83 -40 130
2944A30k04K37r3k51J94j10J11K8J45k57J38j0M1k32J39K10k93J02J1K2k47j13
$$ 130 -74 163 70 -181 13 -97 14 42 187 -70 68 58 99 -133 6 216 -77 25 36 58 -189 -302
2966c02J98L38k96j1j26M39l03kj18Q0l0Ql7M8J92j03kJ6R6k16K75r0R9k29K00
$$ -302 -104 234 -62 -73 -199 240 -63 -65 -183 -103 -133 -125 -162 -114 78 -25 -27 -11 85 -131 144 54 153 -76 124
2991A24k41J06jk6Q2k6L7m68L65j85N10j78k00J99j19O3K28l61P5K96k51k86N14
$$ 124 -117 -11 -12 -38 44 18 55 -413 -48 -233 277 99 -101 98 -21 42 270 -91 -16 280 29 -257 257
3014B57m45M53l76K46j08k37m7Q7J86mk83R7J27j79K33k64Q1J48N2O5j42J66l36
$$ 257 -188 265 -111 135 27 -210 -257 -170 16 12 -271 -174 -47 -226 7 -257 -176 -28 24 89 -53 113 -223
3037b23K36m5M4k43L30m7L8j96J14j56J62K58l19PP5k04m2L13M3k4L3q9m1P3L5
$$ -223 13 -32 12 -231 99 52 90 -106 8 -148 14 272 -47 -40 35 -169 -211 102 145 121 154 65 24 97 132
3062A32R0q6k02K7J02l87R4K32j06j52J34L1M2M7K27k97K69k06r4K50R6j55j94
$$ 132 222 136 -66 -39 63 -324 -230 2 -104 -256 -122 -91 -49 -2 225 -72 197 -9 -103 147 243 88 -106
3085a06K16l38K86J18k96n2L67k02j41K51q6j06K66q5l14J93p9R6K41l15J68r2
$$ -106 110 -228 58 176 -120 -172 195 -7 -148 103 17 -89 177 92 -222 -29 -108 -12 229 -86 82 -10
3107a0K43q0L0r2m3k2jP5j50j0J25q4qo1J05J43m47J25K38J21m83L78l0j67oJ67
$$ -10 233 153 183 91 48 26 25 100 -50 -60 65 -19 -27 -88 17 160 -287 -162 76 197 -286 92 62 -105 -111 56
3133E6kOmN8m5j57K00L1j64J6j0R3j99l7Q2rK13k68K95q8p2K49k77R3k14O6J18
$$ 56 54 60 56 114 69 -88 112 143 -21 -5 -15 78 -121 -158 -76 -85 128 -140 155 67 -5 244 -33 60 -154 -88 30
3160C0OJ21j87J93k8J2l55K53k91K64j14J91m9K57k85J08k46J08j00M6J06k3j20
$$ 30 36 157 -30 163 135 147 -208 45 -246 18 -96 95 46 303 18 126 -120 -12 -112 -66 40 17 -103
3183a03k9k02K99R4j42J72J18j64K0%Q8n4Kk95J29N6J18j95K30J7m07J59K96j8
$$ -103 -132 -334 -35 59 -83 89 207 43 63 63 151 97 99 -196 -67 -11 107 -88 142 159 -248 -89 207 189
3207A89l33J00J99k40K01m5j29k3K71k46lj34P9K51N1j31J9K1j96L3M6J62k48
$$ 189 -144 -44 155 -85 116 71 -58 -81 190 -56 -59 -193 -114 137 188 57 76 97 -99 -66 -20 142 -106
3230a06L13j89N4K65j81k10L42n08L31m8J02K40l63k24L63j92m8K82k55n3j09
$$ -106 207 18 72 337 156 -54 288 -220 111 63 165 405 42 -182 181 -11 -59 223 -32 -85 -194
3251a94k0M70l05M8Q9k64k5K07J42k61L1K28J3j03o2J6J21m4j73n4L79k70K2J29
$$ -194 -214 256 -49 -1 88 -176 -201 6 148 -113 -82 146 159 56 -6 10 131 87 -86 -140 239 -31 -9 120
3275A20m6j59J57k19J54L64k76L6j16j38K50m43J95L7N2qn3m0K53k91j03K17k28
$$ 120 74 -85 72 -147 7 371 95 131 15 -123 127 -316 -121 -84 -32 -40 -93 -133 120 -171 -274 -57 -285
3298b85K67Oo0m4J53r0N0K1O9j66Q3K09J6k39Q4Q3k52K81m02K36qj14n3O7j07
$$ -285 -18 -12 -72 -116 37 -53 -3 18 87 -79 4 213 229 -10 74 157 -95 186 -216 20 12 -102 -155 -88 -195
3323a95PJ19mJ32l4J31l01L15j99J21p5O6q1j09k7J82J29j46%j05K1L15k29l36
$$ -195 -188 -69 -73 59 25 156 -145 170 -29 92 17 83 2 -107 -134 48 177 31 31 -74 -53 262 33 -303
3347c03L12Q3j09J85j30J0j39J70N8p3j60K77j51M9Q4n45N35j92L05l11J5P2J40
$$ -303 9 92 -17 168 38 48 -91 79 137 64 -96 181 30 79 163 -382 153 -39 266 -45 -30 42 182
3370A82j41M5oj85K79j30J07q0j01O9m0k26N5L50k36J80j3j03J67j57O4J68k05
$$ 182 41 86 80 -105 174 44 151 71 -30 39 -1 -227 -172 178 -58 122 109 6 173 16 80 248 43
3393D3j02K7j09J88l35K10J43k42RR4KJ09jJ74k29qJ81j86J2M7j76R2J00k40J45
$$ 43 -59 -32 -141 47 -288 -78 65 -177 -168 -74 -72 37 36 210 -19 -27 154 -32 -20 27 -149 -57 43 -197 -52
3418e2k78M87k73N9J58Jj82K73M0j86j4J4q1j14J27q8J14q0J80p9M9j29P9k18
$$ -52 -330 157 -116 -57 101 102 -80 193 233 47 33 47 -34 -148 -21 -109 5 -75 105 26 75 -54 25 -193
3442a93M02K9l85J89r7L32l95k2K00J1j73M1J38K76k93j38J24q0r4J79J66K7l78
$$ -193 209 238 -147 42 -55 277 -118 -140 60 71 -102 -61 77 353 60 -78 46 -34 -128 51 217 244 -134
3465a34mJ83J6q7K18k24K29m19K15J33o2j26J71j2k16M22k57pK16j63J2j14J75
$$ -134 -138 45 61 -26 192 -32 197 -222 -7 126 64 -62 109 97 -119 303 46 39 255 92 104 -10 165
3488A65k15j81M91l18J40j31L6M6k20L04j65nl1R9J07M7l53m3L22j24J24r2j02
$$ 165 -50 -231 260 -58 82 -49 -13 33 -187 117 -48 -53 -84 15 122 169 -184 -227 95 -29 95 3 -99
3511i9K23j33J33k61K05j57K89m74N71j79j10o7J66J07m44L88k80L21k20j5N0
$$ -99 124 -9 124 -137 68 -89 200 -274 297 118 8 -59 107 214 -230 158 -122 199 -21 -36 14
3532A4J36k15L74n02K86l5J97k34r0m1k27M96j79P6k38P8q8K03M4j23M7K58p6
$$ 14 150 -65 309 -193 93 58 255 21 -69 -110 -337 159 -20 56 -182 -104 -192 11 55 -68 -21 237 161
3555A61l69K83j43N4J45j38J18k64L33k7k15N1r8M7P5Q5j16M7q7K36k82K75j98
$$ 161 -208 75 -68 -14 131 -7 111 -153 180 153 -62 -11 -109 -62 13 98 -18 29 -58 178 -104 171 -27
3578b7K20j75k0Mj84L33k56M3J56R7N6l49J94O2l2p4j84J93j96K72Jj56J16l29
$$ -27 193 18 -2 2 -182 151 -105 -62 94 191 247 -102 92 154 122 48 -136 57 -139 133 134 -22 94 -235
3602b35L50k2j16j05k4L13k49L70n79K35J07k27J54J61q4k1o4L19j72m16J09L15
$$ -235 115 93 -23 -128 -152 161 -88 282 -297 -62 45 -182 -28 133 49 28 -36 283 111 -305 -196 119
3624A19J06m64O1L98n58K96K4J19j90M01n18J02L02j63O0J09k82J07p5J8P6O3
$$ 119 225 -239 -178 220 -338 -42 -18 101 -89 312 -206 -104 198 35 95 204 -78 29 -46 -28 48 111
3646A11r7q0j34J88j8J01j80j09K49j57M0J07K6l2O2J07o0q8J46l65J85k49L17
$$ 111 14 -66 -200 -12 -30 71 -109 -218 31 -126 -86 21 47 15 77 184 124 36 182 -183 2 -247 70
3669G0k99M23k43L0J89p4j46K2K19l22K83k57k2K83p3%j40j20K95ok14M9J27J9
$$ 70 -229 194 -49 -19 170 96 -50 -28 191 -131 152 -105 -127 156 83 83 -57 -177 118 112 -102 -53 74 93
3693I3j72J35l6r5J92j53j33K57R1k45K36k04Q9J46j57o1K1j38L10k82J61R9l52
$$ 93 -79 56 20 -75 117 -36 -169 88 179 -66 170 -34 55 201 44 -17 4 -134 176 -106 55 154 -198
3716a98K30n5J30k66L4J91Pn8QKl1m3K19k97K1j64M15j02J50l4j91m1J29j2j81
$$ -198 32 -23 107 -159 -125 66 73 15 23 25 -6 -49 170 -127 -106 -270 145 43 193 159 -32 -73 56 44 -137
3741a37L71k53l4K53Nk19k12L68o1K0j56j05J42Pn8P6K07J1k53J92j52N6l54O9
$$ -137 234 -19 -53 200 205 -14 -226 142 81 101 -55 -160 -18 -11 -69 7 214 225 -28 164 12 68 -286 -217
3765b17K25M1l4k9K9O2k21j8J92k13J03R1q0j02R3j91L61q6m5J6mO2j55K10j83
$$ -217 8 49 15 -14 15 77 -144 -162 30 -183 -80 11 -69 -171 -78 -269 92 6 -39 -23 -27 35 -120 90 -93
3790i3N1m1M0J56k37L06M2m36M9J59Q5K7k8Q3k87O1K2K65j83q1N0Q0m7J69j24
$$ -93 -42 -83 -43 113 -124 182 224 -212 -163 -4 81 108 80 163 -124 -63 -41 224 41 -40 10 90 43 212 88
3815H8m1k73n3N39l20J31r2r3P9j12K23m5j31P8k46O86l53j13J62m7K67l61r0
$$ 88 47 -226 -279 260 -60 71 -21 -114 -35 -147 76 31 -100 -22 -268 418 65 -48 114 67 334 -27 -117
3838a17K85l08j03J78J31k0j78K62r0j26J14j87K67j34J51q3O0m8j02P5J30J81
$$ -117 168 -140 -243 -65 66 46 -132 130 40 -86 28 -159 108 -26 125 42 102 54 -48 27 157 338
3860C38m23o2Q1K03rk0j39j34K09n8lj59J51R6L1j27J47j09J36j70j13N2K48j59
$$ 338 -85 -147 -66 137 128 108 -31 -165 44 -14 -17 -176 -25 71 102 -25 122 13 149 -21 -134 -82 166 7
3884Gl11kK49J09q4o9l7J41n4n3R6k7L9l5J06p6P1j79R4J12%k69L26J3L0k65j7
$$ 7 -304 -306 -57 52 -32 -101 -138 3 -51 -104 -8 -35 4 -31 75 -1 70 -109 -15 97 97 -172 154 167 197 -68 -85
3911h5K3j55K44O4k48K92k85P9K49m54L47j87O0P1q4J93n35L48r5K95k28o3L19
$$ -85 -62 -217 27 91 -157 135 -150 -71 178 -276 71 -116 -56 15 -69 124 -411 -63 -158 137 -91 -154 165
3934A65k15l25N68k43K54j11J3J61l09p9K46o4P9k23j56M00m08K80l7l41L38O1
$$ 165 -50 -375 193 -50 204 93 106 267 -42 -121 125 61 140 -83 -239 161 -247 33 -4 -345 -7 54
3956E4k51K29pj05n3J89j00m4q9J2K36n0k46K50k36L75O8k80k94L43nJ32k01l8
$$ 54 -197 32 25 -80 -133 56 -44 -88 -177 -165 71 21 -225 25 -211 164 232 -48 -342 1 -4 128 -73 -111
3980a11L77j92l34N2K85k56L34k26O1J44J7k76K11m0j2j22Q6j42J15J49O7l51
$$ -111 266 74 -260 -208 77 -179 155 -71 -10 134 151 -125 86 46 34 -88 -2 -144 -29 120 187 -164
4002a64J22L2k5n7o8J82k38K72l1O4j11j29R0O9o7L1m6J52j19o5K09M7j61Q5l
$$ -164 -42 -10 -35 -92 -160 22 -216 56 25 89 -22 -151 -61 8 -59 -28 -74 78 -41 -106 103 150 -11 74 71
4027G1n8J63k07O7j9k63L4K48j45K33q2o1K93j77K9k02O1j01J06j71j4j40L70
$$ 71 13 176 -31 36 17 -246 -212 36 -109 124 42 -19 274 97 126 -76 -15 -116 -10 -181 -195 -335 35
4050C5m2k39N02m66L17J6k35K06k08K01k95P9o0K16J59J01m06K81p6M3K37l48
$$ 35 -7 -246 256 -210 107 123 -112 94 -114 87 -208 -129 -189 27 186 287 -119 162 86 129 366 18
4072A8nP1m6j28L03o1L7j07J5n4rJ85j51J73l15J93l0k44K81k33K5r8J86l3j02
$$ 18 13 84 38 -90 213 152 189 82 97 43 34 219 68 241 -74 119 89 -155 126 -107 -82 -180 6 -27 -129
4097a29Q5j67J58M2j60K43l0k5K2m07L39J01r6j53Q4r8J12O7N7q2J04j50J88j62
$$ -129 -44 -211 -53 -11 -171 72 42 17 39 -368 -29 72 -24 -177 -93 -191 -79 -12 45 -37 67 -83 105 -57
4121e7j32P8K58k65j31N31k99n6Q5j7K2m9J68l5j30R0p8j42M4L6j34K26Oj96N1
$$ -57 -189 -111 147 -118 -249 282 -17 -73 12 -5 17 -32 136 101 -29 61 -17 -159 -115 -79 -213 13 19 -177 -126
4146a26q2J72r1k6P7J0qNK00l23L95j84J92K5l3l04K98j92p3nOo8J48j16R0j6
$$ -126 -208 -36 -127 -153 -76 -66 -74 -69 131 -192 203 19 211 236 203 -101 197 5 -68 -73 -67 -135 13 -103 -13 -29
4172b9MJ08j21K32n0m96J15N1K69j52Q5j41J97j58NJ77k6o2N6N4m33K87j52K03
$$ -29 -25 83 -38 194 144 -352 -237 -186 83 -69 16 -125 72 -86 -81 96 70 8 64 118 -315 -28 -180 23
4196B3o6m5L1J43J66m98M04N0k46J85l53J73k14j01O32j91k89P9J28J98l4j84
$$ 23 -43 -88 -57 86 252 -246 158 208 -38 147 -206 -33 -247 -348 284 93 -196 -117 11 209 175 -9
4218io9l0J13J19r4m5j89J40K54j10M7j57j01K2rJ38L56n27J01k23J45J38N7M5
$$ -9 -78 -108 5 124 30 -15 -204 -64 190 80 127 -30 -131 -109 -118 20 376 -151 -50 -273 -128 10 67 112
4242A12j98q4J61P1p2J83j11l4k08J94J20j29Q3J18m08L21m4k07Q0P6k93M23o9
$$ 112 -86 -170 -9 62 -10 173 62 28 -180 14 134 5 88 206 -202 119 75 -132 -52 24 -269 154 85
4265H5j86Q3R2j90r7L17j01j21l7K54r0p7l00L55L54m63J59kJ66l10L1k7K11o6
$$ 85 -101 -18 74 -116 -213 104 3 -118 -155 99 9 -68 -368 -13 341 -122 37 35 201 -109 -78 -105 106 40
4289D0n6n3J8J21J25n53M36Pj55J8o4L5J39N7p6J62m02J96m0n1L6K66l00o0pL09
$$ 40 -16 -69 -51 70 195 -358 78 85 -70 -52 -116 -81 58 115 39 201 -201 -5 -45 -96 -60 206 -94 -154 -161 148
4315A48j63J34k7Q0j00k00P2m9Q8J98j77j9P6q3L21r6r8j03o4J06j5j44R1K32
$$ 148 -15 119 92 172 72 -128 -56 -105 -17 181 4 -15 61 -22 299 203 105 2 -62 44 29 -115 -24 208
4339B08j71l67K99M8J3k80K4L38j88P9J18m0N1k18K4j11K47l20M44K2j39k09M5
$$ 208 37 -330 -31 17 30 -250 -226 112 -76 3 121 81 132 -86 -62 -173 74 -246 198 220 81 -128 -83
4362h3R6k9k34K56p5J27Q5l4L8j88j5K17j98R5q3j03J10k32J14J13m9Q7j52K96
$$ -83 13 -16 -250 6 -69 58 143 109 147 -41 -56 161 -37 58 -25 -128 -18 -250 -136 -23 -72 15 -137 159
4386A59r9k4OK57k65m3JJ33J2N3L3m26M0%K27k63M46j79M0M0l11J44Q3m9R9J72
$$ 159 60 36 42 299 34 -9 -8 125 137 190 223 -203 -163 -163 64 -199 247 68 108 148 -163 -19 64 15 114 286
4412B86j05j12M0R8j25k49j00J84R7o8k0J29J31l68L00k83nQ5j92K08O3j39L07
$$ 286 181 69 109 207 82 -167 -267 -83 14 -54 -74 55 186 -182 118 -165 -170 -85 -277 -69 -6 -145 162
4435A62R2k16l2K8j23J88k01J2N6J57lkl17J82k91K99r2n6J50N1M3j08p2J50k2
$$ 162 254 38 6 34 -89 99 -102 -90 -34 123 120 118 -199 -17 -308 -9 -101 -157 -7 44 87 -21 -93 57 35
4460C5j10OL01k41R1l84K53J92j24k21J39J4l34M63l77L62l90M0K92j30mJ55j79
$$ 35 -75 -69 232 -9 82 -302 -49 143 19 -202 -63 -49 -383 80 -297 65 -325 -285 7 -123 -127 28 -151
4483a51J3K34j53Q5K8j6J62lk11L02j94JN4l55K01J00M4P6l48m3J29p6K9R9L41
$$ -151 -138 96 -57 28 56 40 202 199 -12 290 96 97 151 -204 -3 97 141 217 -131 -174 -45 -121 -92 7 348
4508C48m92l4K31J4l27J35L39n48J86J93k95K56l38M01m07J90R0J87L9j38k44
$$ 348 -144 -178 53 67 -260 -125 214 -334 -148 45 -250 6 -332 69 -338 -148 -58 129 168 30 -214
4529b14J01J84J27k63K77k33P5K01j44k5K1K68n00K15J2K02m22J56k89K58L84
$$ -214 -113 71 198 -65 212 -21 54 255 111 86 107 375 -125 90 102 304 -118 38 -251 7 391
4550C91k23p1l04O6J22N8p5M4j28o6J95j57M7N4L3k7j07Q3J55k12J15R5k0k53
$$ 391 168 97 -207 -141 -19 39 -36 8 -120 -186 9 -148 -101 -47 -14 -41 -148 -65 90 -122 -7 88 68 -185
4574a85Q7k2O7L8l76K60O9kK04l54M9K63l3j06j06M16k54R8k3j80Q7o5L5J57m6
$$ -185 -98 -120 -53 -15 -391 -131 -62 -64 140 -214 -165 98 65 -41 -147 269 15 113 90 -90 -3 -68 -33 124 78
4599G8L9j3n4j39m1O6KK06j48P2l12L59k36J2K44k01J0L6l73P11j20j01l18K78
$$ 78 117 104 50 -89 -130 -64 -62 144 -4 68 -244 115 -121 -109 135 -66 -56 -20 -393 318 198 97 -221 57
4623E7j77L7K47Q0j56J24m63M6N27j34j52J1L8p6J80j73p8k42J59L48q3N2P6k42
$$ 57 -120 -83 164 244 88 212 -251 -205 322 188 36 47 85 9 189 16 -62 -304 -145 203 120 172 248 6
4647FO7j26J86O0k47J14k11J91M1r2J78k68M3k21K16Ro2L1p9K48k02P3k02K33
$$ 6 73 -53 133 193 -54 60 -151 40 81 -11 167 -101 -58 -279 -63 -54 -116 -85 -164 84 -118 -45 -247 -14
4671a4lJ66m77K00l06L73K76l11J26K10k86L50k09N4j53J0J02k68P5k66N61qk64
$$ -14 -17 149 -328 -128 -434 -61 215 -96 30 240 -46 304 95 149 -4 6 108 -160 -85 -351 210 202 -62
4694f2P7k29K80R9j78j66K79l56L86j28K5L0j65N0J34l11K2K49j20J99K3l50J18
$$ -62 15 -214 66 165 -13 -179 100 -256 130 2 27 57 -108 -58 76 -235 -213 36 -84 115 138 -212 -94
4717i4Lk30K83k9J24j7r2l7M7JR5pj75K41J52k92m3m5K53j89O2J5K9k41K07p5
$$ -94 -91 -321 -38 -67 57 40 -52 -89 -42 -41 54 47 -128 113 265 -27 -70 -115 138 -51 11 26 55 -186 21 -54
4743e4o7j58L55M9J69l07kJ11Q1j07j13K07k74J65o1o0M0O3k1K2N5m26L02K51
$$ -54 -121 -279 76 125 294 -13 -15 96 177 70 -43 164 -110 55 -6 -66 -26 37 16 38 93 -333 -31 220
4767B20m28L28j50lRj77J25Q6O4k80K36K09m82K05O7J31j80j23L13j03r5L1L6
$$ 220 -208 120 -30 -33 -24 -201 -76 10 74 -206 30 239 -243 -38 29 160 -20 -143 170 67 -28 3 39
4790C9R7n45K61o2K72p8Q0M4j66P5J30j53Q6j21J85k10RJ95J73l48Q1L9j97K32
$$ 39 136 -409 -148 -210 62 -16 64 108 -58 17 147 -6 80 -41 144 -66 -57 138 311 -37 44 83 -114 118
4814A18k0n7k22J05j48K53J9j65K02q0j36J06L34l65L6j1J95j3q2p6j74J71L3
$$ 118 98 41 -181 -76 -224 29 48 -117 85 5 -131 -25 309 -56 -20 -31 164 151 69 -7 -181 -10 23
4837B3j24K63n3l6j93J08j4L5l0o7J17P3J20k85K21j69l3J63n4o6l17L52J01k32
$$ 23 -101 162 109 73 -120 -12 -26 9 -21 -88 29 102 222 -63 158 -11 -44 119 65 -1 -318 34 135 -97
4861i7J23j76R0J11J12l03L37l12m5Q8jN7O6J14j34N5k67L84l68Q7L9J66j91J63
$$ -97 26 -150 -60 51 163 -140 197 -115 -160 -72 -73 -16 50 164 30 85 -182 202 -166 -79 -40 126 -65 98
4885I8J53j44k02k5j36K70J59j81kO7JJ05j24k61L12j27J56Oq1p2n5J43J6k30
$$ 98 251 107 -95 -120 -256 14 173 -8 -10 57 58 163 39 -222 90 -37 119 125 44 -28 -83 60 76 -154
4909a54K57k59K94j21M5J75k48J11p2J36l44j0L05o3N1M1k35J28J81m71M50K19
$$ -154 103 -156 138 17 62 237 -11 100 28 164 -180 -190 115 52 103 144 -91 37 218 -253 197 416
4931D16m76K07j36M5Q6k41K85r8k61M6K35k56J86j39r3J92k03K6j09K99LJ23j81
$$ 416 -60 147 11 56 142 -99 186 88 -173 -127 108 -148 38 -101 -194 -2 -205 -179 -288 11 14 137 -44
4954d4j20o5M61k51K87m59n1K03M4P7J18k11K70j66Q5j02m4o5k42M49l70J02n0
$$ -44 -164 -229 232 -19 268 -191 -242 -39 5 82 200 -11 259 93 178 76 32 -33 -275 174 -196 -94 -144
4977a44J54J91l58L7K39j00J05l40K36k42L94R5l39L7K81k92J08j8R3j67K29k95
$$ -144 10 201 -157 -120 119 19 124 -216 20 -222 172 267 -72 -35 246 -46 62 44 137 -30 199 -96
4999i6J20J12j83J76J10j60n3j17K03K89n30K6R9j04K04j87J08J80k56l4K06j98
$$ -96 24 136 -47 129 239 79 26 -91 112 401 -129 -103 -4 -108 96 -91 17 197 -59 -93 113 -85
5021h5J6j22L76l55K04q0k3J83j49Jj14K34k44K90j40O8%l0l6k4k20J44L75k79
$$ -85 -69 -191 185 -170 34 -46 -69 114 -35 -34 -148 86 -158 132 -8 60 60 30 -6 -30 -250 -106 269 -10
5045a0r7m3l8J79Q4j0J20q4J02q7k83J74M5j06J8L9n6K33mm2j67M00k78l5r2Q4
$$ -10 -107 -150 -188 -9 75 65 185 101 203 116 -167 7 52 -54 -36 3 -53 180 176 134 -33 367 89 54 -38 46
5071D6j74K1j27K28k31K64O8j19J40P2j39L2Qj37r3K12l7N7K73l44q9K91l83J95
$$ 46 -128 -107 -234 -6 -237 27 95 -24 116 188 49 81 89 -48 -141 71 34 91 364 20 -69 222 -161 34
5095C4j5q1J97q3o8M5k68L3M49j36k0j38M4K96k87L18m20m9NK43J58r8J17j66
$$ 34 19 -62 135 52 -16 29 -239 -206 243 107 87 -51 -7 289 2 320 -100 -149 -144 99 257 159 276 110
5119A10k81L43n9l06K92j04J43r1k41J70j39K42k72K95j37J31k0j70J01l10L45
$$ 110 -171 172 113 -193 99 -5 138 47 -194 -24 -163 79 -193 102 -35 96 76 -94 7 -303 42
5140D2P2j8j14k0j60n7K29K32m19R6O2nK29K1j74O3Kp4L1k33J51JJ84j31P4K00
$$ 42 114 96 -18 -38 -198 -255 -26 206 -213 -117 -55 -60 169 190 16 79 81 7 38 -195 -44 -43 141 10 84 284
5166B84j33k90nN2O1j9j89K18l7J27L0l11J70R2k43J65K0j90n1L80j49j02K33
$$ 284 151 -139 -144 -92 -31 -50 -239 -21 -58 69 99 -212 -42 50 -193 -28 -8 -198 -249 131 -18 -120 113
5189A13K41l33R2j10k38L60Kl42M11J06o64L09O2q1j00J77j3L0N6N8k74J18l5
$$ 113 354 21 113 3 -235 125 127 -215 196 302 -362 -53 9 -72 -172 5 -8 22 78 136 -138 -20 -55
5212e5rK18k87J58K92k02k00n1K25n20L62K98k44J23l06J44Q6j44K23p6k95M87
$$ -55 -64 154 -133 25 317 115 -85 -136 89 -431 -69 229 -15 108 -198 -54 32 -112 111 35 -260 227
5234B27m20J34K31j40j93J26Q3q5J98j03O1j07j71K18K8k7OJ20k94n6J38L0j27
$$ 227 -193 -59 172 32 -161 -35 48 -37 161 58 119 12 -159 59 87 60 66 186 -108 -164 -26 4 -123
5257a23M8J69J53K0k84K6J96K4j35q5j61K02j45j20J49p3k79L74J26n0j42J42
$$ -123 -75 94 247 267 -17 9 205 229 94 9 -152 50 -95 -215 -66 -139 -418 -44 82 32 -110 32
5279C2J19k84k3k9K84K5N0l90K60pl16K91j14K69j78ol18L25n2q7L90m14K40j98
$$ 32 151 -133 -156 -185 99 124 174 -216 44 37 -279 12 -102 167 -11 -17 -335 -10 -62 -149 241 -173 67 -131
5303a31L1J56j83l1k0J95L8j78K18j11R3l5j04q7L0j5R3j30K8K44q6pj72K65l1
$$ -131 -100 56 -127 -158 -178 17 55 -123 95 -16 77 42 -62 -149 -119 -134 -41 -171 -143 101 15 8 -164 101 70
5328G0k0p5R7n2L57l31M7j08J60j04J27o0k40J63j76K63j4p5Q6l97K86J17k73
$$ 70 50 -25 72 20 377 46 93 -15 145 41 168 108 -132 31 -145 118 104 29 115 -282 4 121 -152
5351a52J52K37j46j69K73k44Q4j95ok2m6J98J09l8j73J16J09j22j4K95k22m0P6
$$ -152 0 237 91 -78 195 -49 35 -160 -166 -188 -234 -36 73 35 -138 -22 87 -35 -49 246 24 -16 60
5374F0N5j23k4Q1j21m9J50J58l9j38N0L1j18M0K0j27M69o7k28n1J95m6k14K30
$$ 60 115 -8 -32 49 -72 -121 29 187 148 10 60 91 -27 13 33 -94 375 308 80 29 224 178 -36 194
5398A94j76j9k85K85O7j63L47k93J46k14L69q6K8k69P4l0j64K69m0k06M8J12j40
$$ 194 18 -1 -286 -1 66 -97 250 -43 103 -111 258 172 200 -69 5 -25 -189 80 40 -166 -118 -6 -146
5421a46J26R1m6q4K70o8j48M6J25l02L7R3J37j82K40j47k39J33m9j30L31n7L0
$$ -146 -20 71 25 -59 211 143 -5 41 166 -136 -99 -6 131 -51 189 42 -197 -64 -113 -243 88 31 61
5444F1j45J89j73J8K29r3j62K12N3j4k16j35K66j91k55L89m2j05Q0Qj01Q1q2n7
$$ 61 -84 105 -68 -50 179 86 -76 136 189 175 -41 -176 90 -101 -356 33 -9 -114 -34 -26 -127 -46 -128 -185
5468a85K74n2n1L0P5j87K29j41J13k98J71K53o6j64J09oj58r4K72n6J09n5j01
$$ -185 89 37 -14 16 91 -96 133 -8 105 -193 -22 231 165 1 110 104 -54 -148 124 68 177 122 21
5491B1l2j6j05J38lM0j00J7j28J91l8J83j7j04j06K8k96J09M26l96K9J19j59L26
$$ 21 -11 -27 -132 6 3 43 -57 -40 -168 23 -15 168 151 47 -59 -31 -327 -218 208 -188 -159 -40 -199 127
5515A27l4oj71l6P5p2J0j81L87n5J40k74L86l45J83j62R8m0m2J7O7k67K62J08
$$ 127 93 87 -84 -120 -45 -117 -107 -288 99 44 184 -90 296 -49 134 -28 70 30 -12 5 72 -195 67 175
5539A75j62j46L77J6j55j73Q5l7J39j88J98p2m2M6k20K62JnQ6J7l96K54%k85L16
$$ 175 13 -133 244 260 105 -68 17 -20 119 -69 129 57 15 61 -159 103 104 99 185 202 -194 60 60 -225 91
5564I1k15Q4j24R2J33j4j53L79j73j98K19r9M49n56l58M94k9J91l01L8K51o0k07
$$ 91 -124 -40 -164 -72 61 47 -106 273 100 -98 121 22 471 -85 -443 51 22 213 -88 -50 201 141 -66
5587f6L44j31j10r1J00q7p4K08q0P8J59l99J76J06j60J43k39j4R8J97j01j88J93
$$ -66 278 147 37 -54 46 -41 -115 93 13 91 250 -149 27 133 -27 116 -123 -137 -39 158 57 -131 62
5610F2j28pK62m05K06j5k8J55O3rk23L27k35k42M09j59J6N8j29q5l7K84r6J37
$$ 62 -66 -73 189 -216 -10 -25 -53 102 165 156 -67 260 25 -217 192 33 49 107 -22 -107 -144 140 44 181
5634A81M9m68P6J89J47j84p6J67r1J9j1j71K71j48K84k28K7O1j71n9Q3J99k22
$$ 181 230 -238 -162 27 174 -10 -86 81 -10 9 -2 -173 98 -50 234 6 33 94 -77 -136 -53 146 -76
5657g6j32N3J23j26O1K02k53K31j99J64j99J76J03j90L07k26J74j74j84L02j00
$$ -76 -208 -155 -32 -158 -97 105 -148 83 -116 48 -151 25 128 -62 245 19 193 19 -165 137 37
5678C7j65J01P4K1P0J1j10l07K50J6Jj74P0K86m08J06O9nk2K84l22K99k09J42
$$ 37 -128 -27 47 68 138 149 39 -268 -18 -2 -1 -175 -105 181 -227 -121 -52 -57 -79 205 -117 182 -27 115
5702A15j50J23j77m1Q5P2j99L24k68p5L48j89k45K57J78k06N5j66OJ36o9j18K37
$$ 115 -35 88 -89 -130 -45 27 -172 152 -116 -191 157 -32 -277 -20 158 -48 7 -159 -153 -17 -86 -204 33
5725C3O6k7o4j23J14K92j76P5n1mk36k0L27m18K6L65k52N4J58k19J23j07J38j13
$$ 33 99 72 8 -115 -1 291 115 190 139 135 -101 -121 206 -212 -186 179 -73 -19 139 -80 43 -64 74 -39
5749c9j8J60m1k73L31K4l39K00R1j90jk7J69J45l08N0L79l27L5K24k76j72J88
$$ -39 -57 103 62 -211 120 144 -195 5 96 -94 -95 -122 47 192 -116 -66 313 -14 21 245 -31 -203 -15
5772a5j83N39l71K28j80J17l2l7p4q6J5K03k34J99J15l70N9K08P9l25M03q9J1
$$ -15 -198 341 -30 198 18 135 103 66 -8 -94 -79 124 -110 89 204 -166 -107 101 180 -145 258 169 180
5795A80k69J13l7P1j1p1N5j0Q5j42J90q8j68K29j25j81J91O4k4j95L47k16j5J35
$$ 180 -89 24 -13 58 47 -24 31 21 106 -36 154 66 -102 127 2 -179 12 76 52 -143 204 -12 -27 108
5819A08j9k86K26j98J91P0K7l5l26K84k5j45K05m8R8r5p1O9qQ5j43nj9J28j47
$$ 108 89 -197 29 -169 22 92 119 84 -242 42 17 -128 77 29 127 32 -39 30 22 107 -36 -41 -60 68 -79
5844g9L15k88L06o9l23L56k97O3j19K75N7j18O9j39J08k09j57L78k66J93J28j85
$$ -79 236 -52 254 185 -138 218 -79 -16 -135 140 197 79 148 9 117 -92 -249 129 -137 56 184 -1
5866aj4J63q5n0J20l33n1K92k40R8L20k42J6m5j21L10pn0M6O4j43Km3j1K8J32
$$ -1 -15 148 63 13 133 -200 -251 41 -199 -101 219 -23 -7 -52 -173 137 130 80 126 190 47 49 6 -5 23 155
5892A55n0m7K00k46q4J17n9J18O3l04K41m6p4Lj00l7J36n2J51n9J4J49k52J82
$$ 155 105 58 258 12 -72 45 -14 104 167 -137 104 58 -16 -13 -113 -150 -14 -66 85 26 40 189 -63 119
5916A19j94K9j24K41o2p2K30l49O0M11n21K76j03J50ML5j41J22M6l92K58J51J16
$$ 119 -75 -46 -170 71 9 -63 167 -182 -122 289 -232 44 -59 91 95 130 -11 111 157 -235 23 174 290
5939B90j40j95K65k04N9p8l7N2K7J17K91p17P4K75L22o07K25j80M4P8j28K62j61
$$ 290 150 -45 220 16 75 -3 -40 12 39 156 447 -270 -196 79 401 -206 19 -161 -117 -39 -167 95 -66
5962f6l6L5j25k84M00P6O0l6k90LJ35J67m1K4R8Jj42Q2j43j16N18l48J3P7l10
$$ -66 -102 -67 -192 -476 -76 0 60 24 -266 -263 -128 39 -2 22 120 121 -21 61 -82 -198 320 -28 -15 62 -248
5987b48M85j89k2O8k7j42J9J35N0l9j19J26q3o6j59J80K27R3k46k6j99J08J52
$$ -248 237 48 26 94 67 -75 -56 79 129 90 -29 97 14 -52 -211 -31 196 289 43 17 -182 -74 78
6010G8j86o0J3K88j95n1K70m74L68j57L00K3p5k6n6m1p5p0P1J90J08m97K26J47
$$ 78 -108 -168 -155 133 -62 -113 157 -317 51 -106 194 217 142 116 60 19 -56 -126 -55 135 243 -254 -28 119
6034A19m7j42J94j1Kl64L04K81m54J73K85q0l11J56k51K30n5j86jR9J19l46J40
$$ 119 72 -70 124 113 115 -249 55 336 -118 55 340 260 -51 105 -146 84 29 -157 -158 -59 60 -286 -146
6057a46j03M06j41O8k41L3L42l23p0J86J45j53k72L10M2J32L6k08J98j98J5j37
$$ -146 -249 157 16 84 -157 -124 218 -105 -175 11 156 3 -269 41 83 215 251 43 241 43 58 -79
6079g9K64j0k22Q3K39m33Q6K22k03K29p4n7p2J65j3j3J19k35j69J93J25r6k96
$$ -79 185 175 -47 36 275 -158 -72 150 -53 176 102 45 -27 138 125 112 231 -4 -173 20 145 49 -247
6102b47L22J24k31J32j10l4j47K87K8J34l66K78m11K62j9J32J55m27J98M6l50
$$ -247 75 199 -32 100 -10 -44 -191 96 124 258 -108 170 -241 21 2 134 289 -138 60 106 -244
6123b44K89j58K67l6j62K03m90L10p8o5L91k14j27O5k0q0lJ78j66L09l43K35J66
$$ -244 45 -113 154 118 -44 159 -331 -21 -99 -164 227 13 -114 -49 -69 -149 -152 26 -140 169 -174 61 227
6146B27k50q9l3M31r7k21M4N6j61qO3j8K30j24L1l28J03K39n7j46K24k24K08J91
$$ 227 -23 -112 -145 286 189 -32 12 68 -93 -101 -38 -56 174 50 81 -247 -144 95 38 -108 116 -108 100 291
$$ [...]
8191b98
##END NTUPLES=NMR FID
##END=
