##TITLE=1H_IPACAT-26
 CDCl3, 8 sc, 
 8.04.2021
##JCAMPDX= 6.0         $$ Bruker NMR JCAMP-DX V2.0
##DATA TYPE= NMR FID
##DATA CLASS= NTUPLES
##ORIGIN= UXNMR, Bruker Analytische Messtechnik GmbH
##OWNER= root
$$ XWIN-NMR		Version 3.5
$$ Thu Apr  8 16:32:36 2021 Russian Standard Time (UT+4h)  she@DPX200
##.OBSERVE FREQUENCY= 200.131506
##.OBSERVE NUCLEUS= ^1H
##.DELAY= (6, 6)
##.ACQUISITION MODE= SIMULTANEOUS
##.ACQUISITION SCHEME= undefined
##.AVERAGES= 8
##.DIGITISER RES= 18
##SPECTROMETER/DATA SYSTEM= spect
##.PULSE SEQUENCE= zg30
##.SOLVENT NAME= DMSO
##.SHIFT REFERENCE= (INTERNAL, DMSO, 0, 15.7039)
##AUDIT TRAIL= $$ (NUMBER, WHEN, WHO, WHERE, WHAT)
$$ ##TITLE= Audit trail, XWIN-NMR		Version 3.5
$$ ##JCAMPDX= 5.01
$$ ##ORIGIN= Bruker BioSpin GmbH
$$ ##OWNER= she
$$ F:/spectra/data/she/nmr/H-F/1/audita.txt
$$ ##AUDIT TRAIL=  $$ (NUMBER, WHEN, WHO, WHERE, WHAT)
(   1,<2021-04-08 16:27:22.06 +0400>,<she>,<DPX200>,
      <created by zg, POWCHK disabled, PULCHK disabled
       configuration hash MD5:
       00 E9 B6 7A A2 85 ED C7 34 08 36 98 17 FE 4E 26
       data hash MD5: 16K
       27 9D 80 71 94 B2 C5 1D DD 79 B2 6A 8F 2B 82 A5>)
$$ ##END=
$$ 
$$ hash MD5
$$ 9C D4 64 E0 BB ED B2 F0 8C D1 E1 E5 7F F2 C2 52
##$RELAX= 
##$RELAX= 
##$RELAX= 
##$RELAX= 
##$RELAX= 
##$RELAX= 
$$ Bruker specific parameters
$$ --------------------------
##$DU= <F:/spectra>
##$EXPNO= 1
##$NAME= <H-F>
##$PROCNO= 1
##$TYPE= <nmr>
##$USER= <she>
##$AMP= (0..31)
100 100 100 100 100 100 100 100 100 100 100 100 100 100 100 100 100 100 
100 100 100 100 100 100 100 100 100 100 100 100 100 100 
##$AQSEQ= 0
##$AQ_mod= 1
##$AUNM= <au_zg>
##$AUTOPOS= <>
##$BF1= 200.13
##$BF2= 200.13
##$BF3= 200.13
##$BF4= 200.13
##$BF5= 200.13
##$BF6= 200.13
##$BF7= 200.13
##$BF8= 200.13
##$BYTORDA= 1
##$CFDGTYP= 0
##$CFRGTYP= 5
##$CHEMSTR= <none>
##$CNST= (0..31)
1 1 145 1 1 1 1 1 1 1 1 1 1 1 1 1 1 1 1 1 1 1 1 1 1 1 1 1 1 1 1 1 
##$CPDPRG= <>
##$CPDPRG1= <>
##$CPDPRG2= <>
##$CPDPRG3= <>
##$CPDPRG4= <mlev>
##$CPDPRG5= <mlev>
##$CPDPRG6= <mlev>
##$CPDPRG7= <mlev>
##$CPDPRG8= <mlev>
##$CPDPRGB= <>
##$CPDPRGT= <>
##$D= (0..31)
0 1.2 0 0 0 0 0 0 0 0.06 0 0.03 0 0 0 0 0.0002 0 0 0 0 0 0 0 0 0 0 0 0 
0 0 0 
##$DATE= 1617884841
##$DBL= (0..7)
120 120 120 120 120 120 120 120 
##$DBP= (0..7)
150 150 150 150 150 150 150 150 
##$DBP07= 0
##$DBPNAM0= <>
##$DBPNAM1= <>
##$DBPNAM2= <>
##$DBPNAM3= <>
##$DBPNAM4= <>
##$DBPNAM5= <>
##$DBPNAM6= <>
##$DBPNAM7= <>
##$DBPOAL= (0..7)
0.5 0.5 0.5 0.5 0.5 0.5 0.5 0.5 
##$DBPOFFS= (0..7)
0 0 0 0 0 0 0 0 
##$DE= 6
##$DECBNUC= <off>
##$DECIM= 32
##$DECNUC= <off>
##$DECSTAT= 4
##$DIGMOD= 1
##$DIGTYP= 9
##$DL= (0..7)
0 120 120 120 120 120 120 120 
##$DP= (0..7)
150 150 150 150 150 150 150 150 
##$DP07= 0
##$DPNAME0= <>
##$DPNAME1= <>
##$DPNAME2= <>
##$DPNAME3= <>
##$DPNAME4= <>
##$DPNAME5= <>
##$DPNAME6= <>
##$DPNAME7= <>
##$DPOAL= (0..7)
0.5 0.5 0.5 0.5 0.5 0.5 0.5 0.5 
##$DPOFFS= (0..7)
0 0 0 0 0 0 0 0 
##$DQDMODE= 0
##$DR= 18
##$DS= 0
##$DSLIST= <SSSSSSSSSSSSSSS>
$$ [...]
##$SUBNAM2= <"">
##$SUBNAM3= <"">
##$SUBNAM4= <"">
##$SUBNAM5= <"">
##$SUBNAM6= <"">
##$SUBNAM7= <"">
##$SUBNAM8= <"">
##$SUBNAM9= <"">
##$SW= 16.9725357007746
##$SWIBOX= (0..15)
0 0 2 0 0 0 0 0 0 0 0 0 0 0 0 0 
##$SW_h= 3396.73913043478
##$TD= 16384
##$TD0= 1
##$TE= 0
##$TE2= 300
##$TE3= 300
##$TEG= 300
##$TL= (0..7)
0 120 120 120 120 120 120 120 
##$TP= (0..7)
150 150 150 150 150 150 150 150 
##$TP07= 0
##$TPNAME0= <>
##$TPNAME1= <>
##$TPNAME2= <>
##$TPNAME3= <>
##$TPNAME4= <>
##$TPNAME5= <>
##$TPNAME6= <>
##$TPNAME7= <>
##$TPOAL= (0..7)
0.5 0.5 0.5 0.5 0.5 0.5 0.5 0.5 
##$TPOFFS= (0..7)
0 0 0 0 0 0 0 0 
##$TUNHIN= 0
##$TUNHOUT= 0
##$TUNXOUT= 0
##$USERA1= <user>
##$USERA2= <user>
##$USERA3= <user>
##$USERA4= <user>
##$USERA5= <user>
##$V9= 5
##$VALIST= <valist>
##$VCLIST= <CCCCCCCCCCCCCCC>
##$VD= 0
##$VDLIST= <DDDDDDDDDDDDDDD>
##$VPLIST= <PPPPPPPPPPPPPPP>
##$VTLIST= <TTTTTTTTTTTTTTT>
##$WBST= 1024
##$WBSW= 4
##$XGAIN= (0..3)
0 0 0 0 
##$XL= 0
##$YL= 0
##$YMAX_a= 602318
##$YMIN_a= -620917
##$ZGOPTNS= <>
##$ZL1= 120
##$ZL2= 120
##$ZL3= 120
##$ZL4= 120
##$ABSF1= 10
##$ABSF2= 0
##$ABSG= 5
##$ABSL= 3
##$ALPHA= 0
##$AQORDER= 0
##$ASSFAC= 0
##$ASSFACI= 0
##$ASSFACX= 0
##$ASSWID= 0
##$AUNMP= <proc_1d>
##$AZFE= 0.1
##$AZFW= 0.1
##$BCFW= 1
##$BC_mod= 2
##$BYTORDP= 1
##$COROFFS= 0
##$CY= 11.3945322036743
##$DATMOD= 1
##$DC= 2
##$DFILT= <>
##$DTYPP= 0
##$F1P= 15.9154993809931
##$F2P= -4.1035820241983
##$FCOR= 0.5
##$FTSIZE= 0
##$FT_mod= 4
##$GAMMA= 1
##$GB= 0.15
##$INTBC= 1
##$INTSCL= 1
##$ISEN= 128
##$LB= 0.24
##$LEV0= 0
##$LPBIN= 0
##$MAXI= 10000
##$MC2= 0
##$MEAN= 0
##$ME_mod= 0
##$MI= 1.114404
##$NCOEF= 0
##$NC_proc= 0
##$NLEV= 6
##$NOISF1= 3.799351
##$NOISF2= 2.8
##$NSP= 1
##$NTH_PI= 0
##$NZP= 0
##$OFFSET= 15.70392
##$PC= 1
##$PHC0= -11277.81
##$PHC1= 9.600918
##$PH_mod= 1
##$PKNL= yes
##$PPARMOD= 0
##$PSCAL= 0
##$PSIGN= 0
##$REVERSE= no
##$SF= 200.130013532006
##$SI= 16384
##$SIGF1= 3
##$SIGF2= 2
##$SINO= 400
##$SIOLD= 16384
##$SREGLST= <1H.CDCl3>
##$SSB= 0
##$STSI= 0
##$STSR= 0
##$SW_p= 3612.71676300578
##$SYMM= 0
##$S_DEV= 0
##$TDeff= 0
##$TDoff= 0
##$TI= <>
##$TILT= no
##$TM1= 0
##$TM2= 0
##$TOPLEV= 0
##$USERP1= <user>
##$USERP2= <user>
##$USERP3= <user>
##$USERP4= <user>
##$USERP5= <user>
##$WDW= 1
##$XDIM= 8192
##$YMAX_p= 0
##$YMIN_p= 0
$$ End of Bruker specific parameters
$$ ---------------------------------
##NTUPLES= NMR FID
##VAR_NAME=  TIME,          FID/REAL,        FID/IMAG
##SYMBOL=    X,             R,               I
##VAR_TYPE=  INDEPENDENT,   DEPENDENT,       DEPENDENT
##VAR_FORM=  AFFN,          ASDF,            ASDF
##VAR_DIM=   8192,          8192,            8192
##UNITS=     SECONDS,       ARBITRARY UNITS, ARBITRARY UNITS
##FACTOR=    0.0002944,     1,               1
##FIRST=     0,             0,               0
##LAST=      2.4114304,     0,               0
##MIN=       0,             -620917,         0
##MAX=       2.4114304,     602318,          0
$$ Real data points
##PAGE= N=1
##DATA TABLE= (X++(R..R)), XYDATA
0@%%%%%%%qJ6j6J6j6J6k4L2m0N3o1P2q5R9j18J38j62J91k20K50k87L27l70M26
31B29m87N49o19O93p73Q63r62J072j192J321j462J614j778J961k162K381k622
48a374K884l172L491l846M242m684N185n761O423p191Q101r191J0526j2203J4366
63G796j7262K1317k7349L7118n5146R7570l38224j60448R39224q01140N36432
74B39888j84875o40742J188047o96636j37607N50975p92878Q65513k71727o40499
84e20541R77731o82006K07890L53555q66389Q81035l12529l96488Q23476p92510
94c26776L53087K36873p14445Q73095n00107k48864P52912p27344M61879k8958
104A31352o31890R67535n11435j73407M89014o65397P15979j57143o65799Q34259
$$ plain form
0 0 0 0 0 0 0 0 0 -8 8 -8 8 -8 8 -16 16 -24 29 -32 40 -45 54 -64 74 -88 103 -117 133 -154 173 -197 229
31 229 -258 291 -328 365 -408 455 -507 565 -627 694 -768 846 -932 1029 -1133 1248 -1374
48 -1374 1510 -1662 1829 -2017 2225 -2459 2726 -3035 3388 -3803 4298 -4893 5633 -6570 7796
63 7796 -9466 11851 -15498 21620 -33526 64044 -274180 -434628 504596 -296544 239888
74 239888 55013 -585729 602318 -94318 -231925 319050 -473828 391685 119958 -520541
84 -520541 457190 -224816 -16926 336629 -529760 351275 38746 -357742 465734 -326776
94 -326776 26311 263184 -451261 421834 -78273 -327137 425775 -301569 160310 131352
104 131352 -500538 466997 -44438 -217845 271169 -394228 321751 164608 -501191 333068
114C33068m41436J26078K49189p99547Q16712j02572m92915N89620n81851L97726
124I4072K48191q12565O80652j83009j92967N14472p21197M42433K00212o27621
134c57327O19089l59580l5787M78241o96994M71879N6786m96987N96998m18466
144a42148Q6297L52982o71403N25179j7448l68746M88483m93470K53229K99921
154C12876o62927M72306r2373j59009M36539o17283K97350K86728n16683M04823
164A62347k74059k255M70740o29037K63567J55335l37637M48226m21393L0856
174a33310M45844n32676K82881j6067k37890M82443m55817O5865L35468m40748
184b04007L32784j43684j60202M65906m61119J12839K28659l52251L57248k44027
$$ plain form
114 333068 -108368 17710 266899 -532648 284064 181492 -311423 278197 -303654 94072
124 94072 342263 -470302 210350 27341 -165626 348846 -372351 70082 270294 -357327
134 -357327 261762 -97818 -133605 344636 -352358 119521 176307 -320680 276318 -142148
144 -142148 -55851 297131 -374272 150907 133459 -235287 253196 -240274 12955 312876
154 312876 -350051 122255 29882 -129127 307412 -309871 -12521 274207 -242476 162347
164 162347 -111712 -113967 356773 -272264 -8697 146638 -190999 257227 -164166 -133310
174 -133310 312534 -220142 62739 46672 -191218 291225 -164592 -98727 236741 -204007
184 -204007 128777 -14907 -175109 290797 -170322 -57483 171176 -181075 176173 -67854
194f7854r3343M36944m24825J34939R8357k50238L96375l19405o6929L76970l44770
205a23779J85780m5393k05296M37411l16314n0658K58771k73428K70223j39566
215b249j98045M14215k72573J6693J26099k52525L43641j71866j81389L42028
225A64029k39287J04390L0459k50537L64062j66574j33260K41617k19711J90048
235H5236l4024k44974L42045j49782o0158J43428k22612K52467n2511k28214K74069
246A04970j30281K9711O5723k35636K69700m4355j74195J85836j41288J18004
256D8189L3323k47080K40172l2609r4805J14876j71954J66129L5362k23302J77079
267D5380m4640k742P5666k05355J73319M3139j67554J18722q2714O5640P4151
$$ plain form
194 -67854 -161197 275747 -149078 -14139 84218 -166020 230355 -89050 -155979 220991 -123779
205 -123779 62001 16608 -188688 248723 -67591 -118249 140522 -132906 137317 -2249
215 -2249 -200294 213921 -58652 -41959 84140 -168385 175256 3390 -177999 164029
225 164029 -75258 29132 59591 -190946 173116 6542 -126718 114899 -104812 85236
235 85236 51212 -193762 148283 -1499 -61657 81771 -140841 111626 59115 -169099 104970
246 104970 -25311 4400 70123 -165513 104187 59832 -114363 71473 -69815 48189
256 48189 81512 -165568 74604 41995 -52810 62066 -109888 56241 91603 -131699 45380
267 45380 740 -2002 73664 -131691 41628 84767 -82787 35935 -46779 18861 93012
278I3012k14859J37459L9928q7732P6433j26810R7524Q3305j84460Q7945P098
289H843j0061O8636j60157Q5813R0466j24196M5529l8243L6591Q0135j54610M5333
301b5921P0769m8228K9977q5215M6317R5051j17328O407K9901O735M2808j04101
313e2828J7828R3120n3972j6133k0210L1769O3320q8975j7665O2484M498o931
325A6305n7427J7675P6899m3104m6386J7962L9782J4308n9858j5348O0558J6122
337C7488m8485k8036M1978L5925l1029m8077K4774N9672l1105m5484J4391L4559
349A6571K4251o3968k1995P8221q482l2179j8820Q212P4367n4024n2827O1595
361A0922K842J2855m5392l3800J06771l5001n3375L1439j4431O7950m6419p5171
$$ plain form
278 93012 -121847 15612 55540 -32192 44241 -82569 14955 98260 -86200 1745 8843
289 8843 -1218 67418 -92739 -6926 83540 -40656 4873 -33370 3221 83356 -71254 -25921
301 -25921 44848 -3380 26597 -58618 -12301 82750 -34578 -28171 1730 8465 51273 -52828
313 -52828 -35000 58120 4148 -11985 -32195 -426 62894 -26081 -43746 18738 23236 16305
325 16305 -41122 -23447 53452 10348 -36038 -18076 21706 36014 -23844 -39192 21366 37488
337 37488 -10997 -39033 2945 38870 7841 -40236 -15462 44210 13105 -32379 -17988 16571
349 16571 40822 -23146 -45141 33080 24598 -7581 -26401 -18189 56178 2154 -50673 10922
361 10922 13764 26619 -18773 -52573 54198 19197 -34178 -2739 -17170 50780 4361 -70810
373g0810J07542j7953k2221P75n1007J12288l3818q9953Q6083k6983L3168j1428
385A5683r9287J33918j7074p5638N9194n9181Q5829m222j30171J26220j7111k8808
397a0648M0052j09120J24490J0327j33947J07509m3311K6280M2828j54855J33340
408C2945J9265j04114Q7554q9942P4896N5695j76759J25617J173n3490Q7236j47081
420h7005J01746P1095j70348J13155l9896k892J02116j89096J07525O5616j34744
431f2728J13344j02619L7456J24679k09784J06644L3993r0243J33347j63412N4937
442b4386J36645j96867J08610k4719m6677J63793k05550O1089J19256j64169J32183
453E9208r4171k3851J91689k15985O6169P3666j28601J67395j48136j3171J91314
$$ plain form
373 -70810 36732 18779 -3442 -2667 -53674 58614 24796 -65157 20926 -6057 27111 15683
385 15683 -83604 50314 33240 -42398 16796 -42385 43444 39222 -90949 35271 18160 -10648
397 -10648 29404 -79716 44774 55101 -78846 28663 -14648 11632 54460 -100395 32945
408 32945 52210 -51904 35650 -54292 20604 76299 -100460 25157 26330 -27160 60076 -87005
420 -87005 14741 85836 -84512 28643 -11253 -14145 87971 -101125 6400 72016 -62728
431 -62728 50616 -52003 -14547 110132 -99652 6992 40985 -49258 84089 -79323 -24386
442 -24386 112259 -84608 24002 -717 -47394 116399 -89151 -28062 91194 -72975 59208
453 59208 -34963 -58814 132875 -83110 -16941 56725 -71876 95519 -52617 -65788 125526
464A25526k01773Q9186R204j03130K05185j83604k955J68462j82000J25431n3440
475c908q9224K31224j95722J2140J20413j57962J74805j12101q4260K39138j90238
486e5695M7234N2790j51867K32582j42674q3090K09926j77381J09850j0431j63645
497a32401K62081j47468m7744J52490j89167J80221m4886j66860K53636j58194
507c8292J2173J07600k07349K18483o8808j39737K30159j76680O8611O3935k07998
518a37903K46799r7970j08890J99807j86055J28811J8208k16155K60787j03042
528D397o1656J42121k09343J97594K53k15988K29373j21111K9247J06894k60871
539a59090K22925P68j61299J89970j85627J00442J13264k65774K05307m7717q0932
$$ plain form
464 125526 -76247 12939 22143 -80987 124198 -59406 -62361 106101 -75899 49532 -3908
475 -3908 -93132 138092 -57630 -45490 74923 -83039 91766 -20335 -104595 134543 -55695
486 -55695 -8461 44329 -107538 125044 -17630 -100720 109206 -68175 41675 31244 -132401
497 -132401 129680 -17788 -65532 86958 -102209 78012 33126 -133734 119902 -38292
507 -38292 -26119 81481 -125868 92615 23807 -115930 114229 -62451 6160 70095 -137903
518 -137903 108896 10926 -97964 101843 -84212 44599 62807 -153348 107439 4397
528 4397 -57259 84862 -124481 73113 73366 -142622 86751 -34360 -5113 101781 -159090
539 -159090 63835 64603 -96696 93274 -92353 8089 121353 -144421 60886 13169 -67763
550f7763J92772k40626J24429Q9509k25171K18391j14274l9867J88632k46998
560a20966J57341L8561k01751K25968j41751J4116J48082k65824J94683J7598
570F6057j61222J93765j92097Q6731J47871k78172J72666k0025p1390J94816k62414
581a23414R5587J48468k11910J63969j21702k2675K37289k62199Q1282P1113j49931
592i4123K23499j81288l2827K13892k19018J32412j2346j48181K47993j82045
602e2032R070J50599k27492J84059m0902j18691K24192k17615O4673J33025k15199
613a06313J79959r8453n6933K36437k42250O4991Q2113j50135K17856j73712n7491
624a03931K35172j93246R4705j9125j40756K72902j63104n7096J48432j66665
$$ plain form
550 -67763 125009 -115617 8812 98321 -126850 91541 -22733 -62600 126032 -120966
560 -120966 36375 74936 -126815 99153 -42598 -28482 119600 -146224 48459 66057
570 66057 -95165 98600 -93497 -6766 141105 -137067 35599 15574 -55816 139000 -123414
581 -123414 -27827 120641 -91269 72700 -49002 -71677 165612 -96587 -15305 55808 -94123
592 -94123 129376 -51912 -84739 129153 -89865 42547 30201 -117980 130013 -52032
602 -52032 -42962 107637 -119855 64204 23302 -95389 128803 -88812 -24139 108886 -106313
613 -106313 73646 -24807 -81740 154697 -87553 -22562 59551 -90584 127272 -46440 -103931
624 -103931 131241 -62005 32700 13575 -127181 145721 -17383 -74479 73953 -92712
634i2712J82592o1511j65533K44304j38575K2822Q0733k04740K17229n3676j24407
645i3474J91692j75051Q7323O9207j98240K04228r4714o3828J83738j94437J08329
656B4773K2697j63456K28465j30910m5857J48414j75490J60108l0982j67086K25720
667I6396j17158Q915P7964j97134K09985k8340j46390J66114j37692R2704O3770
678H9134k23186J87076l0800o8188J32355j89421J20076O8828j84027J57444q4427
689b5136r591J37276k00752J18019L3474j37047J63193j20781J3950J16930j86803
700i7268J36366l926j08854J51810j38009N6508Q9576j88009J42430k5513o1571
711d6460J32851j72291Q5036Q4498j62461J23919o9995q246J37718j88898P9867
$$ plain form
634 -92712 89880 28369 -137164 107140 -31435 -8613 72120 -132620 84609 30933 -93474
645 -93474 98218 -76833 10490 79697 -118543 85685 -9029 -72857 110881 -83556 24773
656 24773 47470 -115986 112479 -18431 -64288 84126 -91364 68744 37762 -129324 96396
667 96396 -20762 -11847 66117 -131017 78968 50628 -95762 70352 -67340 25364 89134
678 89134 -134052 53024 22224 -45964 86391 -103030 17046 85874 -98153 59291 -25136
689 -25136 -34727 102549 -98203 19816 53290 -83757 79436 -41345 -27395 89535 -97268
700 -97268 39098 35172 -73682 78128 -59881 -3373 86203 -101806 40624 15111 -46460
711 -46460 86391 -85900 -864 83634 -78827 45092 -24903 -33149 104569 -84329 -4462
722d462N5767j08291J29919j22312Q688J39924j65142P9330K472p3153J47387
733I0127j38170J2263J09074j32406R7665m1522n4964J47081j36784K8104P2364
744E2832j11522J12762o9382l7806J37040j30236M1180L6379q6476J23792r3469
755b4906k4198J20715j13370N8171o554p0581J39174j00849j7747Q9546r2970
766d3569Q4583l9914o6780J36231q9511K357M6156q4235J10630n3941o1477J14207
778E4737p9056L1975J3913q4512J18583n2110m6160Q1607p2935N9653o949q1771
790f3025J11193m8387k1364N0552p4537Q0456j4697p6085R1947m3933O700K6191
802B5011p8727Q7554j3740n9497O5079m8056L6540J3585q3137Q1692j2285l4110
$$ plain form
722 -4462 51305 -56986 72933 -49379 -40691 99233 -65909 13421 15893 -57260 90127
733 90127 -48043 -35780 73294 -59112 38553 -2969 -57933 89148 -47636 -19532 52832
744 52832 -58690 54072 -15310 -53116 83924 -46312 -5132 31247 -55229 68563 -24906
755 -24906 -49104 71611 -41759 16412 9858 -60723 78451 -22398 -40145 49401 -43569
766 -43569 41014 1100 -65680 70551 -18960 -16603 29553 -54682 55948 2007 -59470 54737
778 54737 -24319 7656 21569 -62943 55640 3530 -42630 38977 -33958 25695 18746 -63025
790 -63025 48168 -219 -21583 28969 -45568 34888 20191 -55894 36053 -7880 -1180 25011
802 25011 -53716 33838 20098 -39399 25680 -22376 14164 27749 -55388 26304 14019 -20091
814b0091M2828n9171N4542J2899p6711O2797j6465l393K8201o9764N9082J3300
826B8054n7933M3697k9354K0815K6044p3494M8910J2247l2157K8680m2722L2129
838D916K7835o3208L2106K043n327K4099n3951L0112K9772m4210J8133j2560J0747
851E07K7506n3025J7094K4284j8975J1303k7954J5837L1633m1668M864J0400L96
864B202J5096l5800P709L1558k1076l885n411R914K1012l1400l913K1669l50k192
878E133j9265P352K5698j7019j4151P453J2477L976k0450l862K0822M077j7049
891d808q272J5508J0469j1489j4919Q973J9942j2070j5048O628J0979P314k2162
904h955o195K7994n749j0907m398K002K5887k0175j7809K3957j411L909j4777
$$ plain form
814 -20091 22737 -36434 18108 31007 -45704 17093 628 -2765 25436 -44328 14754 28054
826 28054 -29879 13818 -15536 5279 31323 -42171 6739 18986 -13171 15509 -27213 4916
838 4916 32751 -30457 1649 3692 -1635 22464 -31487 -1375 28397 -15813 2320 -10240 507
851 507 28013 -25012 -7918 16366 -2609 8694 -19260 -3423 28210 -13458 -8594 1806 2202
864 2202 17298 -18502 -10793 20765 -311 -4196 -9607 307 21319 -10081 -13994 7675 7325 5133
878 5133 -14132 -6780 18918 1899 -12252 -4799 7678 11654 -8796 -12658 8164 12241 -4808
891 -4808 -13080 2428 12897 1408 -13511 -4538 15404 3334 -11714 -5086 5893 13207 -8955
904 -8955 -15150 12844 7095 -3812 -8210 -6208 19679 -496 -18305 5652 4241 8150 -6627
917f627j1593L8525j5285j8107J4010p472K4412j7085k6601M1427j0237q081L249
930E35j9856M1183j4171l2104L4654j3238J2057l061l6704N1284r911k7643K5717
943H742k4545L1527j518m8386M9801r579j1635J7899m1522M6696J992n0168M4152
956A3456j9149Q757J7873n8981N2276M712m0767L7427l5784K7416K1280o7666
968c9150N1231k519k2092L6717n7630M0097K5458o7082M9063j8565k891M1849
980C4486p4476M4627K2587n4514M9152m2042J4358M7993q3220M7059R782l7860
992b2068N6109o5529K3494N1573p9913M8189j1381k0240O5263q1905K7776M4733
1004C6101o7491N6023l8290r053P5425q7842L0599K7908n3914O9443o0089m083
$$ plain form
917 -6627 -18220 20305 5020 -13087 923 -6549 17863 778 -25823 15604 5367 -2714 535
930 535 -19321 21862 7691 -24413 10241 -2997 9060 5999 -30705 20579 10668 -16975 8742
943 8742 -15803 15724 14206 -34180 15621 6042 -5593 12306 -29216 17480 19472 -30696 13456
956 13456 -5693 3064 20937 -38044 14232 18944 -21823 15604 -20180 7236 28516 -39150
968 -39150 12081 9562 -12530 24187 -33443 6654 32112 -34970 14093 -4472 -7363 34486
980 34486 -39990 4637 27224 -27290 21862 -20180 -5822 42171 -41049 6010 15792 -22068
992 -22068 34041 -31488 -7994 43579 -36334 11855 474 -19766 45497 -36408 -8632 36101
1004 36101 -31390 24633 -13657 -22710 52715 -35127 -4528 23380 -30534 38909 -21180 -25263
1016b5263P5625q3082M0073K315m3496Q4088p5146K342O5880p7765N6601k2478
1028c06l7516R3852q2789J1579M8015o9987P4660m6651l0572R6289q4937K6623
1040a740K1776o4166R6345o4297k6984Q7527p9758M8827o457o4295J09812o8225
1052a1635j4739O2712p9343P8154k4990o5393J06771p0256J0995M0456q7596R5748
1064D0884l2867n3732R3388p8888L6897K4698q7745J02804m6931l4956Q3469q7020
1076c9999N8139N660q4032J10850n7314j8584O4715r0134Q4453j1391q3121J05876
1088D5118o1575J3754M1222j06248J04752j3941o7897Q5722q0987N0854L7538
1099D8312j15585R7796k5455l0113P7280j08369O5064L4122r6297R2962n7205
$$ plain form
1016 -25263 50362 -32720 7353 9668 -33828 50260 -24886 -22544 43336 -34429 22172 -306
1028 -306 -37822 56030 -26759 -15180 32835 -37152 37508 -9143 -39715 56574 -28363 -1740
1040 -1740 20036 -44130 52215 -12082 -39066 48461 -31297 17530 11073 -53222 56590 -11635
1052 -11635 -26374 36338 -43005 35149 10159 -55234 51537 -18719 -7724 32732 -54864 40884
1064 40884 8017 -45715 47673 -31215 5682 30380 -57365 45439 -1492 -36448 47021 -39999
1076 -39999 18140 23800 -60232 50618 -6696 -25280 39435 -50699 33754 22363 -60758 45118
1088 45118 -16457 -2703 38519 -67729 37023 23082 -44815 40907 -40080 10774 48312
1099 48312 -67273 30523 5068 -25045 52235 -56134 8930 43052 -53245 39717 -17488
1110a7488m893Q1272j12965O9055J1054p6460J00906p4208P789O5559j07828Q6816
1122B8609r040o6104R3840q3504L7033N0539j16144R1101j7180l6541Q1181j10167
1134e6377N6595N2439j01139P8839n1225j023R3017j24764N0342L0785o5220R4139
1146E6408r0124R51R5470j03660N9576j3714n3625J14526r2673O275O2709r2662
1158e0543Q9529l4527n1760J03553r2585L5674M1591r6739R3598m3816k5060R1364
1170F0279j07798M8150L1309p4451R1964p5365p237R5888j00154M8820m761n3436
1182d6792J14119q8060j2119P1951p6739P8025l8901o0779J16382p3099J1163
1193d849L0639q4544J07026l8636n4911Q7919p8111M9672J8412r2760J00332m4036
$$ plain form
1110 -17488 -22381 58891 -54074 14981 26035 -50425 50481 -23727 -15938 49621 -58207 28609
1122 28609 19569 -46535 47305 -36199 834 51373 -64771 26330 9150 -27391 53790 -56377
1134 -56377 218 52657 -48482 30357 -20868 -21891 71126 -53638 -3296 27489 -37731 56408
1146 56408 -33716 -32765 62705 -40955 18621 4907 -48718 65808 -26865 -20590 42119 -50543
1158 -50543 38986 4459 -47301 56252 -36333 -659 40932 -55807 37791 -6025 -31085 60279
1170 60279 -47519 631 31940 -42511 49453 -25912 -33149 62739 -37415 11405 6644 -46792
1182 -46792 67327 -20733 -32852 39099 -37640 40385 1484 -59295 57087 -16012 -4849
1193 -4849 25790 -58754 48272 9636 -45275 42644 -35467 14205 32617 -60143 40189 -3847
1205c847k1541P2959r5140O2956R314p3691R7001o6822l558O7145q8838P1187
1217B7125j6568o1351J01688o8339Q103L9079q2373R3052k8093n7866Q3127o5402
1229b7818M0519J9312r3693R4557k3991l1873N8926q3325O3056K0925q5025P6618
1241B8188m0935K392N6302r6237O2691J0986n9177P4225o4389J5970N3219q7772
1253d4537O4843j1204m1447P4020p1469K8482L6039q0246P2353k4859k6135O4242
1265D0082p8390M4230K6743p3136O6364l6631k968N7549q5695M6759J7969n1521
1277b8645O1579n7270J0805N7967p9092M3559k296l1873O7041o7541J2096M7234
1289C3564o2435M8921k3929k2297O8101o6016J8251K8338n1924N7774l6689j5387
$$ plain form
1205 -3847 -25388 47571 -47569 15387 24701 -48990 48011 -18811 -22369 44776 -44062 27125
1217 27125 10557 -50794 50894 -17445 -9342 29737 -52636 40416 12323 -45543 37584 -27818
1229 -27818 12701 32013 -61680 32877 8886 -22987 35939 -47386 15670 36595 -48430 28188
1241 28188 -12747 -10355 45947 -50290 12401 23387 -35790 38435 -25954 -9984 43235 -44537
1253 -44537 20306 9102 -32345 41675 -29794 -1312 34727 -45519 26834 1975 -24160 40082
1265 40082 -38308 5922 32665 -40471 25893 -10738 -13706 43843 -41852 4907 22876 -28645
1277 -28645 32934 -24336 -13531 44436 -34656 8903 6607 -25266 41775 -25766 -13670 33564
1289 33564 -28871 20050 -3879 -26176 41925 -24091 -5840 22498 -29426 28348 -8341 -23728
1301b3728O1666o2416K6890J1645m2304O0796m5422o089N1600n6648L4830n762
1313E058l2640O3695n0536J1L8742m7699M3267k0495k7259O1459m6510P492K0099
1326A4684m0423N2290k8259k3260N1756m1128J9369M966l8710N5440k8042j6533
1338a7850L7414l7464L0423m497l5946N1286k6884n020K3416l7260L9037r286
1350G369l1900M3468k6105O910J2854l7557M1630j0494k3611L1949k7065J9059
1362F507N551l7050L9334j1316j2410K2007l0413K6622L614l3287L1410j2528
1374a959o4J4522l2671K8161K491k4386K2732j7085J0271J1819l2783K4140J576
1387F764j3903J6066k1225J4579J1385k7642J7092k293k627J2526k4562J4546
$$ plain form
1301 -23728 37938 -24478 2412 14057 -28247 32549 -12873 -18962 32638 -24010 10820 5058
1313 5058 -27582 36113 -14423 -14412 24330 -23369 19898 -597 -27856 33603 -12907 -5415 14684
1326 14684 -25739 26551 -1708 -24968 26788 -14340 5029 9995 -28715 26725 -1317 -17850
1338 -17850 19564 -17900 12523 8026 -27920 23366 -3518 -8538 14878 -22382 16655 7369
1350 7369 -24531 18937 -7168 -258 12596 -24961 16669 6175 -17436 14513 -12552 6507
1362 6507 12058 -24992 14342 3026 -9384 12623 -17790 8832 12446 -20841 10569 -1959
1374 -1959 -2023 12499 -20172 7989 10480 -13906 8826 -8259 2012 13831 -18952 5188 6764
1387 6764 -7139 8927 -12298 2281 13666 -13976 3116 823 -1804 10722 -13840 706
1399G06J0711j9644J1595q017M120J2913k3723R680Q251r348P975j3275O778J2854
1413A1576j8309M994K377j001Q339j5994M378J2196j0274J334l246L069R227j3266
1427d600j02P849j353O77q037L053R786p348m151K613L947K064p759j256P699
1442C082J220o268k769N825L171l731n407L087P632n071n039K768L126L589q738
1457c523k127J1124l891k540j489q23J1476q937o268J0415l210L399n602n557
1471g553J6478q248n335O435n973J2042p665j0757J8523p751j011K611j0844J8804
1485I756p493j2182J6047r288P191q10j6543K3348p523r589J2995j4294J5401
1498G016j230k0639K3532q338l081R585k0380K1986j597k0348K1934j3191N965
$$ plain form
1399 706 11417 -8227 3368 -4649 -529 12384 -11339 -1659 6592 -2756 5219 -8056 -1278 11576
1413 11576 -6733 -1739 638 -363 7976 -8018 -3640 8556 -1718 -384 -3630 -561 8666 -4600
1427 -4600 -4702 3147 1794 2471 -5566 -2513 7273 -75 -4226 -1613 2334 4398 -3361 -4617 3082
1442 3082 4302 -1966 -4735 1090 4261 530 -4877 -1790 5842 771 -4268 -1500 1626 5215 -3523
1457 -3523 -5650 5474 1583 -957 -2446 -3269 8207 -730 -6998 3417 207 3606 -1996 -7553
1471 -7553 8925 677 -4658 1777 -4196 7846 181 -10576 7947 196 -815 1796 -9048 9756
1485 9756 2263 -9919 6128 -3160 4031 3221 -13322 10026 2503 -7086 5909 -8385 7016
1498 7016 5786 -14853 8679 341 -2740 6845 -13535 8451 6854 -13494 8440 -4751 1214
1511A214Q475k7103K5738k320j6343J9878k0069J4122Q301k9943K6377o615p877
1524f165J8651k8731K0983P685k9060K6442j4054P23J9632l5141K3899N146k3489
1537a3479K6236k3286Q668K0021l7808K6139j495j6062K8348l2672J3906J9716
1549A8232l6583K7397j0053q427L0478l8927J7302J5515l1231L0277k1464j673
1561i157L2766m2133K0371P632k5076L5391l1346K304L1794m0339K4881m088j9051
1574a6051M0246l8174P200K5459l7549L2740j5669j4973M2659m1556J3194J6753
1586A4279l4210L9204k5226r406M0865m2973K0644N688k9759M5462l3994m402
1598a3828L6954m1473K8388o351k6362N0079l7466O59K6726l8465L9420j7063
$$ plain form
1511 1214 9689 -17414 8324 6004 -10339 9539 -10530 3592 11893 -18050 8327 1712 -6165
1524 -6165 12486 -16245 4738 12423 -16637 9805 -4249 -3526 16106 -19035 4864 10010 -13479
1537 -13479 12757 -10529 -1861 18160 -19648 6491 4996 -11066 17282 -15390 -1484 18232
1549 18232 -18351 9046 -1007 -9434 21044 -17883 -581 14934 -16297 13980 -7484 -9157
1561 -9157 23609 -18524 1847 9479 -15597 19794 -11552 -9248 22546 -17793 7088 3000 -16051
1574 -16051 24195 -13979 -6779 18680 -18869 13871 -1798 -16771 25888 -15668 -2474 14279
1586 14279 -19931 19273 -5953 -15359 25506 -17467 3177 8865 -20894 24568 -9426 -13828
1598 -13828 23126 -18347 10041 3690 -22672 27407 -10059 -9400 17326 -21139 18281 1218
1610A218k4849M9296l7758J1388J4608m0357M8354k1111k0038M1875m0618K4528
1622F536O721m0627M9757k6701q257L5391m5929L3868q91l5363N0782l5050J129
1635h634K9478m5577M1546j1740l0019N0559l8100J1584J7203m5912N1581j7849
1647D120k5020M2653m1227K7795R074m9684N1665j9647j0118L2807n0851L8133
1659I700P759m2862M4868l1423O498L2672n5926L7972m13k8946M6149m3420J1841
1672e531K8687m8809M2172j5314k1554M7107m5205K0434J5589m6912N0086k1334
1684e84j3805L8118m9549L4190R941m5183M5359k8317M489L3401n8331L6872N487
1697A2088k9664M2367m5626J3807L6388n2720L3896j2054j5820N0066n1824J2286
$$ plain form
1610 1218 -23631 25665 -12093 -705 13903 -26454 21900 789 -19249 22626 -17992 6536
1622 6536 13257 -27370 22387 -4314 -12571 22820 -23109 10759 9868 -25495 25287 -9763 -8634
1635 -8634 20844 -24733 16813 5073 -24946 25613 -12487 -903 16300 -29612 21969 4120
1647 4120 -20900 21753 -19474 8321 17395 -32289 19376 -271 -10389 22418 -28433 9700
1659 9700 17459 -25403 19465 -11958 -5460 27212 -28714 9258 8845 -20101 26048 -17372 -5531
1672 -5531 23156 -25653 16519 1205 -20349 26758 -18447 1987 17576 -29336 20750 -584
1684 -584 -14389 23729 -25820 8370 18311 -26872 18487 -9830 -5341 28060 -30271 6601 12088
1697 12088 -17576 24791 -20835 -7028 29360 -23360 10536 -1518 -17338 32728 -19096 -6810
1709f810K4895l9521M3783k7817j5181M9015m5785K1619P854l9227N1388k8877
1721d664q417L6438m7817L4075K607l5358M5519l6002P078L2718n1215L4698o248
1734C412k0976M6855m7753J0376K8740m0232L8089k4431j4922N1125m4544J3594
1746f67R800l3130N1329l1316j5377M0525l8523K9241l520l6919N1918k8066k983
1759g688K5775m3569L9807n344l0703M2940l5080J1660K2416m4650L8572j2772
1771A364j8332M1733m0885J5180J5014l5883M2244k3677j3445L8321l7352K3258
1783G540J219l4142M7258k4543p165K5875l7848L5361l523l3031M0055k5824Q435
1796c33J7710m3248L7969n335k1440L2881l5239J8435J6646m0053L4583j4010
$$ plain form
1709 -6810 18085 -21436 22347 -5470 -20651 28364 -17421 4198 12052 -27175 24213 -4664
1721 -4664 -13081 23357 -24460 9615 12222 -23136 22383 -13619 -6541 26177 -25038 9660 3412
1734 3412 -17564 29291 -18462 -8086 20654 -19578 18511 -5920 -20842 30283 -14261 -667
1746 -667 9133 -23997 27332 -3984 -19361 21164 -17359 11882 8362 -28557 23361 -4705 -7688
1759 -7688 18087 -25482 14325 8981 -21722 21218 -13862 -2202 20214 -24436 14136 1364
1771 1364 -16968 24765 -16120 -940 14074 -21809 20435 -3242 -16687 21634 -15718 7540
1783 7540 8759 -25383 21875 -2668 -9833 16042 -21806 13555 10032 -22999 17056 -8768 -333
1796 -333 17377 -25871 12098 6763 -14677 18204 -17035 1400 18046 -22007 12576 -1434
1808a434r392L1781l9121K0865R621l1434L5733k2440l125K7869l7485K5813J270
1821H521k6858L5135k5084M218K0816l7053K9284l101j9634L0149k9858J2883
1833e82J7179l5404K8148r371r494K8345l4739J5564J3375k7707K7112j8326k380
1846h280K7314l3697J7064M476k0183K9378k4236J170K3132k9971K0285l635j5287
1859a2470K9015k5730N337J6408k6043K2879r997j0051K6962k6747R259J0410
1871I232k1804K4124j4931n793K4209k5038J1667L466j6750K5072j8278k539J9445
1884A2082k1851J5264l367j3927K5372j8531M02J3229j8869J8381p541j1261K2325
1897A1708j7323M982O627j6993K0740j0061q210J8213j6467R398J729j5354K0475
$$ plain form
1808 -1434 -10826 20955 -18166 2699 12320 -19114 16619 -5821 -8946 18923 -18562 7251 8521
1821 8521 -18337 16798 -8286 -4068 16748 -20305 8979 5878 -13756 16393 -13465 -582
1833 -582 16597 -18807 9341 -30 -9524 18821 -15918 -354 13021 -14686 12426 -5900 -8280
1846 -8280 19034 -14663 2401 6877 -13306 16072 -8164 -6994 16138 -13833 6452 2817 -12470
1859 -12470 16545 -9185 -3848 12560 -13483 9396 -601 -10652 16310 -10437 -1178 9232
1871 9232 -12572 11552 -3379 -9172 15037 -10001 1666 5132 -11618 13454 -4824 -7363 12082
1884 12082 -9769 5495 2128 -11799 13573 -4958 -4556 8673 -10196 8185 644 -10617 11708
1897 11708 -5615 -633 5994 -10999 9741 -320 -8530 9683 -6784 2614 4343 -11011 9464
1910I464j0622m239J2824j5405J2982j799j3168J8369j0774K25Q161j4954J4910
1923E974l350j0686J4847j0419M185M393j3923J4444l806o692J0381j0752P819
1936B415K141j2611J2801m494k846P374j1036Q480J705r946R494m956J185M828
1950D534j0932Q724L20o231P078o822L981L853r921O914j55k888M519o764M202
1965D12L359p190M334j364K06L477p178L833K644l920K502k887J624L240n393
1980b301J483J777r67J062l094J574L061l035m88K42R87J091k568j13K468p4j587
1997d82n16J546M60o77j917J154K335j788j086N92Q54J487l439K89L224k333O95
2014C98j107p95M804m509n70L504k665L052l223j609O445m907N66J646l596O575
$$ plain form
1910 9464 -1158 -5397 7427 -7978 5004 3205 -9963 8406 -2368 -2143 6018 -8936 5974
1923 5974 2624 -8062 6785 -3634 551 4944 -8979 5465 1659 -5033 5348 -5404 2415
1936 2415 4556 -8055 4746 252 -2594 4780 -6256 2224 3929 -6017 3477 -1479 -294 4534
1950 4534 -6398 2326 2646 -3585 3493 -3329 652 4505 -5416 1498 1343 -1545 2974 -3790 412
1965 412 3771 -3419 915 -449 -243 3234 -3944 -111 2533 -1387 1115 -1772 -148 3092 -2301
1980 -2301 -818 959 -8 1054 -2040 -466 2595 -440 -928 -686 301 1392 -1176 -1289 1179 1105 -482
1997 -482 -998 548 1008 331 -1586 -432 1903 115 -971 -379 475 1962 -1477 -1188 2036 -297 398
2014 398 -709 -1504 3300 -1209 -1779 1725 -940 2112 -1111 -2720 3725 -1182 -616 1030 -2566 4009
2030D009m838k276O629n371K805k88n122R336n609k402O322o384O213k521n787
2045e284J0378o201m20M346p718R456l340o687J0385p394K909K508r565J1624
2059D997m251n271R670r554O657J186j1102J3139n597k843Q415j2335J0318J6
2073C445j0920J3506q534J357O972j4353J2957j710r462J3150j1435N509O002
2086F484j5807J4272l623o364J2677j4974Q704M828j5401J5350p297k629J2558
2099H778j7739J1224L224j4035J5802j1300J262J1928j9286J3458K4j0876J6302
2112H766j5083M784J1098j9728J5240m219p502J7569j9414P731R189j8282J7135
2125G284r630l769J7994k1191J0347M720j5276J9443j4801l12J6861k1476J3403
$$ plain form
2030 4009 -829 -3105 3524 -1847 958 670 -4452 4884 -725 -3127 3195 -3189 3024 503 -5284
2045 -5284 5094 -1107 -1527 2819 -4899 4557 1217 -5470 4915 -2479 430 2938 -6627 4997
2059 4997 746 -4525 5145 -4409 2248 3434 -7668 5471 -126 -2969 5446 -6889 3429 3445
2073 3445 -7475 6031 -2503 -1146 5826 -8527 4430 2720 -6742 6408 -5027 482 6484
2086 6484 -9323 4949 1326 -5038 7639 -7335 1369 6197 -9204 6146 -1151 -3780 8778
2099 8778 -8961 2263 5487 -8548 7254 -4046 -2784 9144 -10142 3316 3340 -7536 8766
2112 8766 -6317 -1533 9565 -10163 5077 858 -6644 10925 -8489 -758 8431 -9851 7284
2125 7284 -2346 -6115 11879 -9312 1035 5755 -9521 9922 -4879 -5191 11670 -9806 3597
2138C597m64j2887K1658j7821K123J4052k0986J7251n389j0550K1974k0449O543
2151a348J0443k0442K0184j0223p155K1760k2161R371O185j7911K2713j5066l970
2164g620K0335k2474J3796k34j5925K5868j8285j032J5703k1398J9283n649j4941
2177a2573K5078j8722M969J0041k2668K3753q509j1212K2080k2009J1475P103
2189H806k2745K4146j2347n270K0625k4669J4979K487j8946K5884j7957j340J8120
2202A1773k4124J9980l658j7792K7156j8785L158J1759k4345K4934o591j5122
2214a1657K3125k0744J1786P893k6921K5732q538p316J9605k6746J6545P334k3132
2227a3034K3282j5661M36J9990k8368J7172R50j6138K5849k1971K579J7223k5234
$$ plain form
2138 3597 3133 -9754 11904 -5917 -3794 10258 -10728 6523 1134 -9416 12558 -7891 -1348
2151 -1348 9095 -11347 8837 -1386 -8541 13219 -8942 429 6614 -11297 11416 -3650 -7620
2164 -7620 12715 -9759 4037 3803 -12122 13746 -4539 -5571 10132 -11266 8017 2368 -12573
2177 -12573 12505 -6217 -1248 8793 -13875 9878 1369 -9843 12237 -9772 1703 8806
2189 8806 -13939 10207 -2140 -7410 13215 -11454 3525 6012 -12934 12950 -5007 -6347 11773
2202 11773 -12351 7629 3971 -13821 13335 -5450 -2292 9467 -14878 10056 3465 -11657
2214 -11657 11468 -9276 2510 10403 -16518 9214 676 -6640 12965 -13781 2764 10098 -13034
2227 -13034 10248 -5413 -4977 15013 -13355 3817 4767 -11371 14478 -7493 -4914 12309 -12925
2240a2925K1510o662j4289K6366k1875P808R748k5313K5867q904j0060K1245k5199
2253a2683J5700P827k5323K3595j2890j004K0116k9901J6330N390j7231K2999
2265A2925k1723K859K1160k6675J6494m254j1971K7834k4354K946J4579k1893
2277a2073K3044j1254j1870K6012k2128R883O142k2807K6545j2354o636K0111
2289A2615k5450J6715M128k0611K3693j7129J387J8909k6866J6720j192j3002
2301a0083K5152k3344L197J6268k1873J9844j0060j1170K7203k1627N522P358
2313F387j9729K5981j2640j0312K1357k0206J3998J751k1608K5899j2443l320
2325d885J5679k3823J8412Q47j7725K2220j7077L657J4210k3886J8608m430j1557
$$ plain form
2240 -12925 8585 1923 -12366 14000 -7875 -67 9681 -15632 10235 1331 -8729 12516 -12683
2253 -12683 3017 10844 -14479 9116 -3774 -4778 15338 -14563 1767 7157 -10074 12925
2265 12925 -8798 -5939 15221 -11454 5040 786 -11185 16649 -7705 -4759 9820 -12073
2277 -12073 10971 -283 -12153 13859 -8269 1614 7756 -15051 11494 -860 -7496 12615
2289 12615 -12835 3880 8008 -12603 11090 -6039 -4652 14257 -12609 4111 2919 -10083
2301 -10083 15069 -8275 -5078 11190 -10683 9161 -899 -12069 15134 -6493 -971 6387
2313 6387 -13342 12639 -1 -10313 11044 -9162 4836 6587 -15021 10878 -1565 -4885
2325 -4885 10794 -13029 5383 6230 -11495 10725 -6352 -2695 11515 -12371 6237 1807 -9750
2338i750K2780k0739N999J0224k0376K1452r782r357K0875j9390J0667L656j9649
2351a3390K3586j0978m934J5271k0938J6526J468j8527K0683j2934K149J2447
2363A0429k3015J7265m21j2537J8213j7740O652J1340k1162J6871n570p320J8313
2376A1318j9704Q243P599j7497J7994r678m124J6216j9224J1238L034j5103J8346
2389H658j2245J6J3291j9574J3413J16j1434J6712j4922L970J1035j8109J3598
2402D525m040o611J6237j7232N868Q233j4937J4433q391l847J5647j6591P152
2415D46L701j1653J5531j0999j752J3022j5044R531n92r552J5797j2088N43R863
2429F754j3574J1174l621p304J4675j2307K990O174j1680J2473o361n010J3075
$$ plain form
2338 -9750 13030 -7709 -1710 8514 -11862 9590 -192 -9549 11326 -8064 2603 6259 -13390
2351 -13390 10196 -782 -5716 9555 -11383 5143 6611 -11916 8767 -4167 -2018 10429
2363 10429 -12586 4679 4258 -8279 9934 -7806 -1154 10186 -10976 5895 325 -6995 11318
2376 11318 -8386 -143 7456 -10041 7953 -1725 -5849 10367 -8857 2381 5415 -9688 8658
2389 8658 -3587 -3571 9720 -9854 3559 3675 -7759 8953 -5969 -1999 9036 -9073 4525
2402 4525 485 -6126 10111 -7121 -1253 6980 -7957 6476 -1915 -5762 9885 -6706 446
2415 446 4147 -7506 8025 -2974 -4726 8296 -6748 2783 2191 -7361 8436 -3652 -3109 6754
2429 6754 -6820 4354 733 -6571 8104 -4203 -1213 4961 -6719 5754 -607 -5617 7458
2442G458j1984N156K723j0098J3299p742l136J0281j0749P388n96q542J2976q156
2456a722o90O927j0040R462k527p296J1362p766J763M039r331J0118l433n309
2470d443Q898p688M377J755q788R952l856l042O522p779O019O21p648Q433l998
2485f65m02M181p708O842k16n843O581m631J967K930p594O446n48l635M695n105
2501b705L375K109o433N093j239j081L335n694L906J712m860L648k016O81K741
2516B572n393K983J367k540K138k806J704K352m290J880M71o97J766l274J337
2531d30K331k578N40m14O45J518k771L80J625n29r0j311Q93J643j577q61Q87Q69
2549G70l26j117l5J236N45j827k05J692k52m04j037N56K114k135m72J102l59J541
$$ plain form
2442 7458 -4526 630 3353 -6745 6554 -1188 -4324 5957 -4792 2596 2000 -6542 6434 -1722
2456 -1722 -2412 4515 -5525 3937 1410 -5886 5476 -2290 -527 3512 -5819 4299 866 -4443
2470 -4443 4455 -3233 1144 2899 -5889 4063 207 -2835 3687 -4092 1927 2548 -5100 3333 -665
2485 -665 -1067 3114 -4594 2248 2032 -3811 2770 -1861 106 3036 -4558 1888 1340 -2295 2400 -2705
2501 -2705 670 2779 -3654 1439 200 -881 2454 -3240 666 2378 -2482 1166 -850 -169 2572
2516 2572 -2821 162 1529 -1011 1127 -1679 25 2377 -1913 -33 438 -259 1507 -1767 -430
2531 -430 1901 -677 -137 -551 94 1612 -1159 -779 846 317 227 -1084 -191 1452 -125 -986 -99 770
2549 770 444 -673 -708 528 1073 -754 -959 733 481 77 -960 -404 1710 -425 -897 205 -154 1387
2567A387k409m24L396k248L5J12j003L399k847j171L344k184J536j302j787M959
2583B793l329q00K518k830L833k277k881N790l397K41J274l707N761k779l077
2598b867N376l956K517N6n063P326l203k426M614n118M779n63n916P669l657m54
2614h86L320o621P056j336n708P460n125K107K754q325Q363j745m616O718o831
2629c415M674K081q950Q858l144k237O191r130O873J665q869R032n102K84O080
2644D891j0915Q039P62p177Q684p796L135N883j1937Q971j292m888R213j0617
2658e044M950N504j1419R386m092k191R523j2545O464L749r766J0466p652K16
2672b451R677j3663P899J316p850J1434j0502K081R100j3383R090k042n433J2594
$$ plain form
2567 1387 -1022 -1446 1950 -298 -263 -151 -1154 2245 -602 -1773 1571 -613 923 -379 -2166 2793
2583 2793 -536 -1336 1182 -1648 2185 -92 -2973 2817 -580 -339 935 -2772 2989 210 -2867
2598 -2867 2509 -1447 1070 1126 -3937 3389 186 -2240 2374 -2744 2035 1472 -4444 3225 -432 -886
2614 -886 2434 -4187 2869 1533 -4175 3285 -1840 267 3021 -5304 3059 1314 -3302 3416 -3415
2629 -3415 1259 3340 -5610 3248 104 -2133 4058 -5072 1801 3466 -5403 3629 -1473 -1189 4891
2644 4891 -6024 2015 2777 -4400 4284 -3512 -377 5506 -6431 2540 1248 -3640 5573 -5044
2658 -5044 -94 5410 -6009 3377 -715 -2906 6617 -5928 536 4285 -5481 4985 -2667 -2451
2672 -2451 7226 -6437 1462 2778 -5072 6362 -4140 -2059 7041 -6342 2748 706 -4727 7867
2686G867j3189L756P604j2165J0832o016l615J3635j4093M902M503j0217J3051
2699F855r376k349J2945j3830P617M44r453J5430j1445o18J0757j3628J0662k765
2713A246q359J5658j2743K263P859j3311J3269o244o306J5657j4174M882M768
2726D465j2314J5696r359m757J4379j3749Q176P6j1716J8051j0671k667J0754
2739F364j3930J3089k907j2028J7460j0961J796P168j5811J5866l855r495J4879
2752G635j3512O842N444j6218J6286o569n359J4015j5957R358L003j4185J7163
2765G946r839k534J2194j6020J2861j030j3239J7785j1007J456Q262j7527J6512
2778E820k071j1463J4660j3263P706O582j9009J5842l830n132J2882j8202J0455
$$ plain form
2686 7867 -5322 -1566 6038 -6127 4705 -1311 -4926 8709 -5384 -482 4021 -6196 6855
2699 6855 -2521 -4870 8075 -5755 1862 2306 -7147 8283 -3162 -3780 6977 -6651 4011 1246
2713 1246 -7113 8545 -4198 -1935 5924 -7387 5882 -362 -6668 8989 -5185 -303 4465
2726 4465 -7849 7847 -1512 -6269 8110 -5639 2537 2613 -9103 8948 -1723 -4390 6364
2739 6364 -7566 5523 2616 -9412 8048 -2913 -1117 6051 -9760 6106 2251 -7244 7635
2752 7635 -5877 965 6409 -9809 6477 -92 -5451 8564 -7393 1965 4968 -9217 7946
2765 7946 -1893 -4427 7767 -8253 4608 3578 -9661 8124 -2883 -1427 6835 -10692 5820
2778 5820 3749 -7714 6946 -6317 1389 7971 -11038 4804 974 -4158 8724 -9478 977
2791I77O735j6215J4511r201m71J4209j9333J0169K780j1700J6374j3441R06J2554
2805H854j7463J2995k152j0286J6961j4244M325Q813j7813J5228l935o869J4392
2818H806j7103Q640P652j6615J4043q115j163J5021k0037Q702N126j1292J5195
2831H860j4246L00J5532j6990R233k134q099J8764j5665M13J0825j4225J4185
2844F753o582q603J7971j4358M534N758j4716J6501p757n419J4738j6040Q540
2857A320L618j3166J6109j1054j656J4116j6277R359m22r488J7511j3672p65J1106
2871F639j3316J2839n973r294J8542j2496K049N160j3303J7118o820q744J4389
2884F790j2000P945J777j4602J7014o980l870J0512j4490J1423Q70j2756J5122
$$ plain form
2791 977 7712 -8503 6008 -3193 -3664 10545 -8788 1381 4161 -7539 8835 -4606 -3700 8854
2805 8854 -8609 4386 2234 -8052 8909 -5335 -1010 7803 -10010 5218 1283 -5586 8806
2818 8806 -8297 343 7995 -8620 5423 -2692 -3855 11166 -8871 -169 4957 -6335 8860
2831 8860 -5386 -5086 10446 -6544 2689 555 -7544 11220 -4445 -4032 6793 -7432 6753
2844 6753 171 -8432 9539 -4819 -285 5473 -9243 7258 -499 -5918 8820 -7220 1320
2857 1320 4938 -8228 7881 -3173 -4829 9287 -6990 2369 1947 -7541 9970 -3702 -4467 6639
2871 6639 -6677 6162 189 -9105 9437 -3059 -1010 4150 -9153 7965 1145 -7599 6790
2884 6790 -5210 2735 4512 -10090 6924 -56 -3926 6586 -7904 3519 4389 -8367 6755
2897F755r440N00R040j4912J2227j755r650J4555j1191L145O241j3997J4264m287
2911A495p758J2722j1635O946L339j4213J4458m766m004R268j3356J0352K450
2924E298j2986J2418o965J073Q177j5492J0810J430r049J0825j0301M048P689
2937F975j4346J0151j692n085J0624j2404N508N994j2171J0289m651k425J0191
2950F958j3011O494L946r765R930p183L99R158j3043P073J706o840R780r697K036
2965b059Q626j1667O834j399l881J0201j0993K471O676q881P504m966k187J0569
2979F848j0716K937L762o730Q844o955j701R518q977L836L45n081R783p850q77
2994c014P323p433N564k495m355J0038p396k00M627n998P074m214l829R003o303
$$ plain form
2897 6755 -2685 -2185 6855 -8057 4170 2415 -7235 7320 -3871 -726 5515 -8482 5782 1495
2911 1495 -6263 6459 -5176 1770 5109 -9104 5354 588 -3416 5852 -7504 2848 5298
2924 5298 -7688 4730 -2235 -1162 7015 -8477 2333 3763 -5286 5539 -4762 -714 6975
2937 6975 -7371 2780 1088 -3997 6627 -5777 -269 5725 -6446 3843 -808 -3233 6958
2950 6958 -6053 441 4387 -5378 4552 -2631 -2232 6926 -6117 956 2662 -4178 5602 -4095 -2059
2965 -2059 6567 -5100 1734 335 -3546 6655 -4338 -1867 4809 -4072 3432 -1534 -3721 6848
2979 6848 -3868 -931 2831 -3899 4945 -2010 -3711 5807 -3170 666 1011 -4070 5713 -2137 -3014
2994 -3014 4309 -3124 2440 -55 -4410 5628 -1768 -1968 2659 -3339 3735 -479 -4308 4695 -1608
3009a608J441J477n292Q426m727l441P051n222L305o26n193Q537m166k233M193
3024A922m559N395j935n160P487l396l19J861m893O537j630m750N358k768J848
3039I98K18n166O405j241l085K984l127L842j62n370N166p51j088J388l880M510
3055A641L78m585L104r23J231N46m602M102Q51k873J354j732K502J009m490K365
3071a22J143o86J71k708K766J585l414O72L30J121M37l420J690K112j562o20p34
3088a239J875J104k872m2J752N01r29j788J438J830j460j502P47J708k69j915
3104a061j11K061N04k336l78J899M72q50j776J293K179j982j061O75J153R11l006
3121a414J69K877j264m64r89O42K912l191q92K279l77R61k641j71M131k735p38
$$ plain form
3009 -1608 -167 1310 -3982 4444 -283 -3724 3327 -1895 1410 784 -4409 4128 -38 -2271 1922
3024 1922 -2637 2758 823 -4337 3150 -246 -565 1296 -3597 2940 1310 -3440 1918 -850 998
3039 998 1216 -3950 2455 1214 -1871 1113 -2014 1828 1666 -3704 1462 711 -377 1011 -2869 1641
3055 1641 2019 -2566 538 -385 846 1392 -3210 892 1743 -1130 224 -1508 994 2003 -2487 -122
3071 -122 1021 335 506 -2202 564 2149 -1265 -593 -263 858 1295 -2125 -435 1677 115 -505 -1239
3088 -1239 636 1740 -1132 -1174 578 1079 150 -1638 -200 1630 170 -1332 -585 1123 854 -1061
3104 -1061 -1172 889 1393 -943 -1321 578 1050 200 -1576 -283 1896 -86 -1147 -472 681 1592 -1414
3121 -1414 -1245 1632 368 -96 -1085 -443 2469 -722 -1614 665 288 1249 -1392 -1563 2568 -167 -905
3138i05P36n23L250l413j424M312k045L77r57j318N019l326j834L103j733K539
3154A858k317k484N865k866j098J573k492M846k661l543N535k466O66p3l570O319
3170C092k452l329M183k980L286q62n153O978k119k097K823m392N609r26n830
3185d169O337k468L92J724o177O886n68n261N302l850K942J516p552P133p46l294
3201a853M118n831N116J708p905O593j975n77L880q121O165J949o923N857m074
3216a873J812M286r383O258J012m626N692o810L605M821r559O161q76k363O323
3231D480q922M146M635q166O009l525k08P017j0238M601L363o385O792o537J146
3246a792P791j0341M616R65m071Q096r000J487P586q886N494k632k658R836j0009
$$ plain form
3138 -905 -169 -692 2558 -855 -2279 2033 -12 365 -592 -1910 3109 -217 -2051 1052 -681 1858
3154 1858 -459 -2943 2922 56 -1042 531 -1961 2885 224 -3319 2216 -250 416 343 -3227 3092
3170 3092 640 -2689 1494 -1486 1800 938 -4215 2763 644 -1453 1370 -3022 2587 1661 -4169
3185 -4169 2168 -300 92 1816 -4361 2525 1957 -3304 1998 -1852 1090 2606 -4946 2187 1441 -1853
3201 -1853 2265 -3566 1550 3258 -4647 1946 -29 -606 3274 -4847 1318 3267 -3656 2201 -1873
3216 -1873 -61 4225 -5158 1100 2112 -2514 3178 -3632 -27 4794 -4765 1396 520 -1843 4480
3231 4480 -4442 -296 4339 -3827 2182 -1343 -1551 5466 -4772 -171 3192 -3193 3599 -2938 -1792
3246 -1792 5999 -4342 274 1239 -2832 5264 -3736 -2249 5337 -3549 1945 -687 -3345 6491 -3518
3261c518J691N489p243P518n505k405J0305r503K826K383o214R568p241j821R183
3276E513r049M965l95n771J0959q369r79P729q270O729l153n109J1792q794L68
3291a834M778p495R813n678n294J1421p881K725J198p949J2192n766m717Q497
3305D010p809O811q60r143J2189n595j643N821r565R475j344q316J0765o904J619
3320d89M456j0238J0314k786o238R932q253M223K436j0195J1661m034m707Q020
3334D102q715P263Q16j0758J1390m133j182N275j1052J0083J063r744Q894o198
3348b896L333N352j3143R248N66n503P756r984N318N831j1610Q369l056k235Q850
3363F196j1566N511M027r356R255n599p60Q039j1431P087J899q071R023p301K130
$$ plain form
3261 -3518 -1827 3662 -3581 3937 -1568 -3973 6332 -3171 -345 2038 -4176 5392 -1849 -3670 5513
3276 5513 -3536 1429 1034 -4737 6222 -2147 -3126 4603 -3667 3062 -91 -5200 6592 -2202 -1834
3291 -1834 2944 -4551 5262 -416 -5710 5711 -2170 555 1753 -6196 5996 230 -4487 4010
3305 4010 -3799 3012 2152 -6991 5198 -397 -2040 3781 -5784 3691 2347 -5969 4796 -2108 -489
3320 -489 3967 -6271 4043 1257 -4981 4951 -3302 921 3357 -6838 4823 789 -3918 4102
3334 4102 -4613 2650 3466 -7292 4098 -35 -1217 4058 -6994 3089 4152 -5592 3302 -2896
3348 -2896 437 5789 -7354 1894 2460 -3043 4713 -5271 47 5878 -5732 2637 -419 -2654 6196
3363 6196 -5370 141 4168 -5188 4067 -1532 -2292 5747 -5684 1403 3302 -4769 4254 -3047 -917
3378i17O999j2404P699O45n001Q282j0465M105P456j1119O501k942j313R885j2585
3393e174L392N838p410P900p492r09J1076j0770L499J318n479J0570q760j164
3407c565Q700q990O257j877n332J0955q859Q29O163q769P796l580l871J0371r550
3422c322K206M194p100Q764o352k659J0394q803L008O95n675J1005p582k955Q229
3437D047o782N866k800o393J1815o265j303M104o965R253l437o687R645n766K215
3452E47J884q242J0027l214m794P354o766M824P97q015R672m017k537N760p301
3467d021O654n53p530R129m190l70L502p741Q352j018o693P164m623K985J983
3482C030q973Q460o04m314M937o380N374K283q854O765j597p94M074q317O041
$$ plain form
3378 -917 6082 -6322 1377 2022 -2979 5303 -5162 -1057 6399 -4720 1781 -1161 -2474 7411 -5174
3393 -5174 -1782 4056 -3354 4546 -2946 -3855 7221 -3549 -50 1268 -4211 6359 -2401 -3565
3407 -3565 5135 -3855 2402 525 -4807 6148 -2711 -1882 4281 -4488 3308 -272 -4143 6228 -3322
3422 -3322 -1116 3078 -4022 4742 -1610 -4269 6125 -2678 330 1025 -4650 6355 -1227 -4182 4047
3437 4047 -2735 3131 331 -6062 5753 -512 -1815 2289 -4676 4577 1140 -5547 4098 -1668 547
3452 547 2431 -5811 4216 1002 -3792 3562 -3204 1620 2417 -5598 4074 57 -2480 3280 -4021
3467 -4021 2633 2080 -5450 3679 -511 -881 2621 -5120 3232 2214 -4479 2685 -1938 1047 3030
3482 3030 -5943 2517 1913 -2401 2536 -3844 1530 3813 -5041 1724 127 -667 3407 -4910 1131
3497A131K236o895N580l814J543M359q765N433J347m371M853n554K928M191q208
3512d006M876k29j959M766p235L549M035o784M229k241J98M975p816L075L088
3527B521m231L877m570J324N501p189K393J147k025M683o066R94N231n298K300
3542E92j323q15N583o227O14L789l448L161l401o54O080n293L29J715k034M369
3558C037m441j042N404l661R44o67j533N499m333j402L794k234K268k335j908
3573b610N684l153j170J556j527L790k871k448M740j836J20n24j901M913k299
3588D64k717L033j008J678j539k595M644j108j831Q59r90L210j553l187L509j81
3604F88k96n79j843L729m68k900J414J65J438j124k454K930N14j593j65n69K574
$$ plain form
3497 1131 3367 -3528 2052 -1762 -219 4140 -4625 808 2155 -2216 2637 -2917 11 4202 -4006
3512 -4006 870 641 -1318 3448 -3787 -238 3797 -2987 1242 -999 -801 4174 -3642 -567 2521
3527 2521 -1710 2167 -2403 -1079 4422 -2767 -374 773 -1252 3431 -2635 -1641 3590 -1708 592
3542 592 -731 -1546 4037 -2190 -1576 2213 -1235 1926 -1475 -2129 3951 -1342 -1013 702 -1332 3037
3558 3037 -1404 -2446 2958 -703 241 -426 -1959 3540 -793 -2195 1599 -635 1633 -702 -2610
3573 -2610 3074 -79 -1249 307 -1220 2570 -301 -2749 1991 155 275 -249 -2150 2763 464
3588 464 -2253 780 -228 1450 -89 -2684 1960 852 -979 -120 -1110 2100 547 -2640 869 688
3604 688 392 -187 -2030 1699 1231 -1669 -255 -90 1348 224 -2230 700 1214 -379 -544 -1113 1461
3621A461k81l186J691J141j09r00j616K544Q81k500pP06J461o71k460J638J642
3638A435j081j196k67K044M25k406n2J699O45j412j399J656J325j292j494R51
3654d19J635n01j839R9K005K27k112k79J733O05j166j519J487J730j703j154O98
3671d73J498Q2k531M61K299p47q90j025J473J817k692o26J757L87j0k296O68K729
3689A881j831q60J09Q78J718l056m06K850q80j54j491L89L221k681j148J696n1
3706A84J334k629o48L906j924p75O4k89L206k834j731L422j057M68j429j125M368
3723B511k215j858J929r49K478k206k304M602j514r06M27j713M124j916k998L658
3739A150j122Q80q30k814N019j340k644K250j747K973q77m079M782p75j224R16
$$ plain form
3621 1461 1180 -2006 -315 826 717 -183 -1799 745 1626 -874 -881 -175 1286 615 -1845 -207 1435
3638 1435 354 -842 -1109 935 1360 -1046 -1098 601 1246 -166 -1565 91 1416 124 -1370 -419
3654 -419 1216 715 -1124 -1025 980 1207 -905 -1184 549 1154 -12 -1531 -44 1686 -17 -1171 -473
3671 -473 1025 1107 -1424 -963 1336 589 -301 -1326 147 1964 -728 -1354 403 790 780 -1516 -848 1881
3689 1881 50 -810 -701 177 1895 -1161 -1567 1283 403 249 -1242 -853 2368 -313 -1461 235 184
3706 184 1518 -1111 -1759 2147 223 -552 -488 -777 2429 -405 -2136 1286 229 697 -732 -1857 2511
3723 2511 296 -1562 367 -582 1896 -310 -2614 1988 474 -432 -5 -1718 2406 490 -2508 1150
3739 1150 28 908 78 -2736 2283 943 -1701 549 -1198 1775 898 -3181 1601 826 -398 518
3755E18k908M329m77m230L697j109R09L84m511N028O1l536K597k313K789P50n469
3772c491M441J13j644J800m073M029J277n302L536r44M63J958n628M116J621m044
3788a772K756k648K042K545o240L677R42k124K735m684K906L116n930L112m87
3803e4l54L355o184K907L123m459K762k760J166M242o697K397K076k610L516m900
3819b474J266N001n828K106j30j204M941o127R63M272m354L038k576p78N892o072
3835b064R22K797l321M226m065o38N934n498J430P60k350N512n330o74N473m486
3851a372K418j629k113O987n399r67L715l213M363l534k723P138m240J67R76l470
3867b896O570l655l236N672l603K377o30m270P038l326j997L747m123M494j397
$$ plain form
3755 518 -2390 1939 1462 -2768 929 -180 729 1113 -3398 1630 1691 -1845 752 -1561 1228 1978 -3491
3772 -3491 950 1063 -581 1219 -2854 1175 2452 -2850 686 -258 205 2163 -3465 651 2272 -1772
3788 -1772 984 -1664 378 2923 -3317 360 1302 -822 1913 -2771 135 3251 -2679 433 -54
3803 -54 -408 2947 -3237 -330 2793 -1666 1096 -1664 -498 3744 -2953 -556 1520 -1090 2426 -2474
3819 -2474 -1208 3793 -2035 71 -59 -1263 3678 -2449 -1486 2786 -1568 1470 -1106 -1884 4008 -2064
3835 -2064 -1142 1655 -1666 2560 -1505 -2143 3791 -1707 -277 483 -1867 3645 -1685 -2359 3114 -1372
3851 -1372 1046 -583 -2696 4291 -1108 -2075 1640 -1573 2790 -744 -3467 3671 -569 -402 574 -2896
3867 -2896 3674 19 -3217 2455 -1148 1229 599 -3671 3367 41 -1956 1791 -2332 2162 765
3882G65m451O754l492m41K398m425N669k096m215O146l396J222N81m877P068k227
3898I83l676M258l424L904m33o160O797j382j706K227n062N900K24o056M999k164
3914g71J453J784o807N798M69l932L816m226L002K361o676M990n68k010L694n369
3930b992L831J747n976M905j686l57L075o312M762J584n157L864k850J952K928
3945C318p306M322J374k753L174n434L250L977o668K929n40j72M166o923K350
3960i36L727m327L155l429O08N201o445J984J603k650M267m704M18M929n446K441
3976C96j67j772M785n446R33M136m635K850j904p18N440n982Q01L034k979L574
3992B346l987o14O020m949P10N79j865N431m951j308N042l274K047j751k293O447
$$ plain form
3882 765 -3686 3068 -424 -865 1533 -2892 2777 681 -3534 2612 -784 438 1019 -3858 3210 983
3898 983 -2693 1565 -1859 2045 1612 -4548 2249 867 -839 1388 -3674 2226 2450 -3606 1393 -771
3914 -771 682 2466 -4341 1457 1926 -2006 1810 -2416 586 2947 -3729 1261 693 -1317 2377 -2992
3930 -2992 839 2586 -3390 1515 -171 -528 2547 -3765 997 2581 -2576 1288 -1562 390 3318
3945 3318 -3988 334 1708 -1045 2129 -3305 -55 3922 -2746 183 -357 -529 3637 -3286 -936
3960 -936 2791 -1536 1619 -1810 -1202 3999 -2446 -462 1141 -1509 2758 -1946 -1528 3401 -2045 396
3976 396 229 -1543 3242 -2204 -1271 2865 -1770 1080 -824 -1542 3898 -2084 -1283 1751 -1228 2346
3992 2346 -1641 -2255 3765 -1184 -474 105 -1760 3671 -1280 -2588 2454 -820 1227 -524 -2817 3630
4008C630m045j227K706k658L999k698k714N783l191J15Q25k876N165k780k575
4023b541M552k820J660n31l150N639k538k120K983k464L270j531l601N530k031
4038C07r53J210k941M798j426l794M037j523J115j17l914N209p84k892K372k198
4054a494L016j28m649M475n19j094J242l375L917L30m144L089r34Q22Q59m333
4070b920L907O26l018J972j970K278J023m622L134N52j253J151l143K939J547
4085B203m188K028k45O21J309m313K609J838k709J155j645J639J987m322J604
4100d29J314r42J210l090J797K553l590Q39O4M47J730l796J131K496k007N29j469
4117a213R74K649l701L27J568n36J139k758O49L049k523j59R0L44K061l209j9
$$ plain form
4008 3630 -415 -1642 1064 -1594 2405 -293 -3007 2776 -415 -300 525 -2351 2814 34 -2541
4023 -2541 2011 -809 851 320 -2830 2809 271 -1849 1134 -1330 1940 409 -3192 2338 307
4038 307 -646 564 -2377 2421 995 -2799 1238 -285 830 713 -3201 2008 1224 -1668 704 -1494
4054 -1494 1522 1394 -3255 1220 701 -393 849 -2526 1391 1721 -2423 666 -268 554 1413 -2920
4070 -2920 987 1613 -1405 567 -1403 875 1898 -2724 410 962 -291 860 -2283 656 2203
4085 2203 -1985 43 -202 419 1728 -2585 24 1862 -847 308 -1337 302 2289 -2033 -429
4100 -429 885 -57 1153 -1937 -140 2413 -1177 -338 -274 173 1903 -1893 -762 1734 -273 256 -1213
4117 -1213 -239 2410 -1291 -964 604 68 1207 -1551 -902 2147 -376 -535 -445 -101 1960 -1249 -1268
4134a268K553j131K22j455L87K788k528p75J461m7J034k275k48K924j361q18j50
4151f87M29K038k229j054K244k35o0j401l9K672j335j518R42N33Q89j738q92K356
4169I15j62r80o26L19K032j257j716J453P34l7j422m20K264j88j637j8R02J188
4187A344j407j336J672Q34r21j073K61J751m75j717M15J361K18j472o07J606O65
4204A119j405q40J130J161r16j384O73J523l95j624K17J482J93j406o69J550P82
4221A191j544n96Q35J198o82j764J072J283n76j048m00J791M43k200K10J162M38
4238H13n90j669J437J409j563n66J40J376K99k460P50J493m28m50j277J528J398
4255A640k403m7Q80N53L24k427R62K049j600k97m23J023J449k820J94J783n48
$$ plain form
4134 -1268 1285 154 376 -1079 -692 2096 -432 -1207 254 207 1241 -1034 -1282 1642 281 -537 -687
4151 -687 -258 1780 -449 -1503 741 506 446 -955 -994 1678 343 -1175 -233 300 1189 -549 -1441 915
4169 915 753 -227 -853 -534 1498 241 -1475 -22 712 675 -747 -1167 1097 909 -728 -746 156 1344
4187 1344 -63 -1399 273 1107 186 -887 -626 1125 650 -1067 -652 709 927 -545 -1152 454 1119
4204 1119 -286 -1126 4 1165 249 -1135 -462 1061 666 -958 -741 741 934 -472 -1141 409 1191
4221 1191 -353 -949 -114 1084 402 -1362 -290 993 417 -631 -1031 760 1203 -997 -787 375 813
4238 813 223 -1446 -9 1400 -163 -729 -589 787 1086 -1374 -624 869 441 -9 -1286 242 1640
4255 1640 -763 -810 70 623 947 -1480 -518 1531 -69 -366 -789 234 1683 -1137 -943 840 292
4272B92K46j856Q40K415k426l29P05L01J217k671J95K608j580O4q41L90K516k859
4290g73m72J926o13Q87k035j30L231k163n68O02k77K244k599q89L106j413J35
4307A99q07o12L440k450j233K126q95J472j801j315L899j873q73P76j106K995
4323A942j974k061L352j184L29n12j711L937j707k076K282j206J910j068k701
4338b448M123j143j161R16j908L385j049l021L341j019L69J55k891M029o36k706
4354a664K298j484J904m9l722L939l91j595J380k471L138J88l977L294o84N8R76
4371A138l854L739O75l424K312j615J673J236m681L394N11j830J873l261K662
4386E48J753m592K684l61k58K051m336K674J814l536K302j711R01K418m877K522
$$ plain form
4272 292 538 -1318 -478 1937 -489 -818 -113 188 1405 -1266 -1071 1537 -43 21 -820 -430 2086 -773
4290 -773 -1245 681 68 955 -1080 -1210 2021 -142 -710 -108 -385 1859 -740 -1629 1477 64 199
4307 199 -608 -1220 2220 -230 -1463 663 -232 1240 -561 -1876 2023 150 -723 53 -1053 1942
4323 1942 -32 -2093 1259 75 404 -108 -1819 2118 411 -1665 617 -589 1321 253 -2448
4338 -2448 1675 532 -629 287 -1621 1764 715 -2306 1035 16 385 540 -2351 1678 1042 -1664
4354 -1664 634 -850 1054 1005 -2717 1222 831 -764 616 -1855 1283 1471 -2506 788 104 162 1138
4371 1138 -2716 1023 1698 -1726 586 -1029 644 1880 -2801 593 1104 -726 1147 -2114 548
4386 548 2301 -2291 393 32 -226 1825 -2511 163 1977 -1559 743 -968 -67 2351 -2526 -4
4402dJ317k327K428l228J629K920m903K176L04q27K711m517J763L087l897J987
4418F19j545K78L744n154J171K372k362K651l381K64M390m379J104L90j385L978
4434B755m225l9L825l514K051j214j358M607m158J54K595k882L123k526j005M783
4450B972m110N21J339k207L978l455j103M715l415J294n63k240N561l749j352
4465a814L195k366K875k068k791N751k800m42R48k443M470k313k930M571k477
4480f34J364J1l563N258k090k025L142k997K725k97l776N020k090j067K264l252
4496b007L781j001l590M621k012J63J047l838M915r80l414L488k244K187K70m825
4512c439M954n36j961K049l505L765O55m819L689j056K27J808m858L786J024l564
$$ plain form
4402 -4 1313 -1014 1414 -1814 -185 2735 -2168 8 312 -515 2196 -2321 -558 2529 -1368 619
4418 619 -926 -648 3096 -2058 -887 1485 -877 1774 -1607 -1343 3047 -1332 -228 162 -1223 2755
4434 2755 -1470 -1509 2316 -1198 853 -361 -1719 2888 -1270 -1116 1479 -1403 1720 -806 -1811 2972
4450 2972 -1138 -617 722 -1485 2493 -962 -2065 2650 -765 529 -34 -2274 3287 -462 -1814
4465 -1814 1381 -985 1890 -178 -2969 2782 -18 -460 488 -1955 2515 202 -2728 1843 -634
4480 -634 730 741 -2822 2436 346 -1679 1463 -1534 1191 894 -2882 2138 48 -1019 1245 -2007
4496 -2007 1774 773 -2817 1804 -208 -45 1002 -2836 2079 1099 -2315 1173 -1071 1116 1386 -3439
4512 -3439 1515 979 -982 1067 -2438 1327 1982 -2837 852 -204 23 1831 -3027 759 1783 -1781
4528a781K898k420J527K042n017L416K45k107K814l590K221K022m753L206m90
4543B33q09K499m421K775J901l995K600j602O74K689n218K643J562k515K412l298
4559a870J440L333m824J746L96q58L005m405J180L080l459J933j516j35L854m559
4575a659Q72K087k276K511k652j86L930l924J080O11j449L303l479r7L470l141
4591i99J412p04j001L905l622k91K621k103K134k086j084M281l015j69J072j486
4607a135L263k711j436L846k210P30m21j704M105k390j418K416j703K055j283
4622Dk155M127j918p35J108j803L180j510k046L039j700N65R8k062L695j164k177
4639a454K103j438J822n92k730L582p17j267J061j715K589m11k858K715m94L1
$$ plain form
4528 -1781 1117 -1303 224 2266 -2751 665 910 -1197 1617 -1973 248 2270 -2483 723 233
4543 233 -576 1923 -2498 277 2178 -1817 783 -819 -145 2544 -2674 -31 1531 -984 1428 -1870
4559 -1870 -430 2903 -1921 -175 221 -637 2368 -2037 -857 2223 -1236 697 -819 -954 2900 -1659
4575 -1659 -787 1300 -976 1535 -1117 -1303 2627 -1297 -217 394 -1055 2248 -1231 -1328 2142 -999
4591 -999 413 -291 -1292 2613 -1009 -1300 1321 -782 1352 -734 -1818 2463 -552 -721 351 -1135
4607 -1135 2128 -583 -2019 1827 -383 347 -74 -1778 2327 -63 -1481 935 -768 1287 4
4622 4 -2151 1976 58 -677 431 -1372 1808 298 -1748 1291 -409 156 254 -1808 1887 723 -1454
4639 -1454 649 -789 1033 441 -2289 1293 576 -691 370 -1345 1244 833 -2025 690 196 227
4655B27K61k448L082k3k390J673j045J356K29k989K608N30j475N32j539K197L85
4672A171k920J828J41j45O03k382K231Q62k398Q68k60Q06O44k776J633J056r91
4689b9K16j215J314J142k548Q16N01K5N47k129J157J559j627N7l08P53J072k352
4707a049M56J421o47J04j305Q60J544j849k28P23L17M82j781L53J694r12l85m42
4725f44O85J164j733l39J280L3j78j149M36J547j000p88L49O99M75j440k27J406
4743E76J4p51n89O45J158j054q44P58P68k93j135J62J276j40j075j66J021M01
4761G32r60o11R34P34q02q49O86Q50l18j032jJ356j46j113jP74O34j017q74J319
4781B95L74o10o18k0J494m69j355P64N20J91p93q18J694J14j259J33O7J183n00
$$ plain form
4655 227 488 -1960 1122 1099 -1291 382 -663 693 922 -2067 541 1071 -404 128 -1411 786 1171
4672 1171 -1749 79 220 75 678 -1704 527 1389 -1009 -141 -401 405 1049 -1727 -94 962 -29
4689 -29 187 -1028 286 1428 -1120 -304 197 222 769 -1360 -203 1356 -271 -214 -522 231 1303 -1049
4707 -1049 -593 828 181 285 -1020 -160 1384 -465 -693 30 347 829 -952 -599 1095 183 -202 -644
4725 -644 41 1205 -528 -867 413 446 268 -881 -445 1102 102 -686 -337 362 837 -603 -830 576
4743 576 590 -161 -750 -105 1053 -1 -845 -87 681 388 -747 -585 691 551 -524 -690 331 732
4761 732 -228 -839 95 829 27 -822 -136 714 396 -636 -637 719 573 -540 -541 233 867 -150 -1024 295
4781 295 669 59 -559 -579 915 446 -909 -145 375 566 -227 -1045 649 763 -496 -363 -296 887 387
4800C87j690J519L29m23l43p79J815j5j867R42J98M52j69j772J783N27j356M28
4818c4o69J373K79k383J521N25n89L65j665J667Q84k278Q61M2M18N91k443J526
4836iJ153j680P32j063J024J380k983J160Q79q29J074k172J200J730k570R06n5
4853a23MJ663k962R07J823j840R97j266L74K368l082N94J253j125J650k341L54
4870g52K669k727P40P0o73K543k925j3K540k117J177j049o51L334l005J6J623
4887H00j655K263k055q84L571k680M20M55j520L334k516j085L074k112J240o74
4903b4j721L979k479q67K155k187K579j420k094L992k246o8J105k385L464j627
4919A56k108L506k149J042P2k805M269j651j863K616k310K379m12l282M178j449
$$ plain form
4800 387 -1303 216 545 122 -221 -1000 815 800 -1067 -125 73 525 356 -1416 367 894 -462 -34
4818 -34 -703 670 949 -1434 87 612 23 388 -1277 390 1274 -1004 -143 -101 317 908 -1535 -9
4836 -9 1144 -536 196 -867 157 1537 -1446 -286 593 -236 838 -1334 -134 1596 -974 -68 -123
4853 -123 -119 1544 -1418 -511 1312 -528 469 -797 -423 1945 -1137 -543 710 -415 1235 -1106 -752
4870 -752 1917 -810 -70 0 -673 1870 -1055 -1068 1472 -645 532 -517 -1168 2166 -839 -823 800
4887 800 -855 1408 -647 -1531 2040 -640 -220 235 -1285 2049 -467 -1552 1522 -590 650 -24
4903 -24 -1745 2234 -245 -1112 1043 -1144 1435 15 -2079 1913 -333 -401 704 -1681 1783 156
4919 156 -1952 1554 -595 447 519 -2286 1983 332 -1531 1085 -1225 1154 742 -2540 1638 189
4935A89p67J547l033L625n01l363L602j776P47J004l886L956l56k516K772k671
4951a427K048R78m139L768q67j276K423l525K776P96l942L561j440j11K090m234
4967b521L345O29l360L103k361J290K021m907L420L42k102K705l650K183K314
4982B451m663K812o56o00L091m740K113K084l446K855k303J62L588m853K115J059
4998A069k528L478l339M27L352m404K481j00j814L719m007R96K938m093K752j221
5014b94r81M129m688J149K377l096L111k764m93M532m332J141P81k157M261l733
5030a057p71M046l384K106j019k220N153l585m57K586l089L439j746k345M704
5045B361l281N58J518l307M178k160j797M139l471J598M28l012M639k737j364
$$ plain form
4935 189 -578 969 -2064 1561 1060 -2303 1299 -477 270 1274 -2612 1344 988 -1528 1244 -1427
4951 -1427 621 1599 -2540 1228 361 -915 1508 -2017 759 1555 -2387 1174 -266 -377 1713 -2521
4967 -2521 824 1453 -1907 1196 -1165 125 2146 -2761 659 1001 -1101 1604 -2046 137 2451
4982 2451 -2212 600 -56 -656 2435 -2305 -192 1892 -1554 1301 -1002 -840 2748 -2105 10 1069
4998 1069 -1459 2019 -1320 -893 2459 -1945 536 436 -1378 2341 -1666 -670 2268 -1825 927 -294
5014 -294 -1275 2854 -1834 -685 1692 -1404 1707 -1057 -1550 2982 -1350 -209 572 -1585 2676 -1057
5030 -1057 -1828 2218 -1166 940 -79 -2299 2854 -731 -1188 1398 -1691 1748 2 -2343 2361
5045 2361 -920 -362 1156 -2151 2027 -133 -1930 2209 -1262 336 764 -2248 2391 -346 -1710
5060a710L530l242K578p30l084N116k580q50K085l107L922j207l361M454k311
5075d97P08Q96l956M705r73k620L049k836K365O46m287M210j093j190K492l784
5091b165L070N61l801L846j872l1K132m139L485J53l184L395k407J078J621m360
5107b618L667j51k226K718l163K145J656m510L214n56p91K477m205K510J721l545
5123a657K586j845O01K662m585K254J130k282K714l098R89K858m028J998l2j273
5139a008L075l686J084K422l327K267j201n56L228l898J144J804k450K420k176
5154h58j34L315l616J120P25j586K913k966n8L046k836J323n17j102L471l048
5170h08k36K232k075K017j566j087L621k648Q1J007j705K859k010j218L095k063
$$ plain form
5060 -1710 1820 -1422 1156 426 -2658 2458 -122 -972 1113 -1994 1928 721 -2640 1814 -497
5075 -497 211 1107 -2849 1856 883 -1737 1312 -1524 841 1487 -2800 1410 317 -873 1619 -2165
5091 -2165 905 1466 -2335 1511 -361 -392 1740 -2399 1086 1239 -1945 1450 -957 121 1742 -2618
5107 -2618 1049 898 -1328 1390 -1773 372 2028 -2482 732 176 -615 1862 -2343 167 1888 -1657
5123 -1657 929 -916 -315 2347 -2238 16 1146 -1136 1578 -1520 -531 2327 -1701 297 265 -1008
5139 -1008 2067 -1619 -535 1887 -1440 827 -374 -930 2298 -1600 -456 1348 -1102 1318 -858
5154 -858 -992 2323 -1293 -173 552 -1034 1879 -1087 -1145 1901 -935 388 -129 -1231 2240 -808
5170 -808 -1044 1188 -887 1130 -436 -1523 2098 -550 -469 538 -1167 1692 -318 -1536 1559 -504
5186e04P02o3j589L225j940j052K206j711J621q11j796L287j633n82J133j669
5202a176K496j009k034K799j235K29K61j834K794q76j705J936j178J179j48k233
5218a734K732n22j071J088j510J933j47k237K054m64J1L92j971K170J28j883J349
5235C18o95Q33L47k291J821L69j109O71j125J313N30k191J299J46j68M61j809
5252a280J566P47j714O26l04O80N89k054J036P18q20M49j058J076Q65j905M24
5269c59L96K0N14j439O68J078q78j29j13M13L68j158M4J255m19j86p25N08J181
5288A039j114o94Q12J54K61j033J54R50k58n10j93N13O28r89k70P64K75m44o07
5307e62L63P87l17p54J74P31J4p80j69O99L96p74l79O47M00l42o69K78R40m91
$$ plain form
5186 -504 198 135 -1454 1771 -169 -1221 985 -726 895 84 -1712 1575 -58 -640 493 -1176
5202 -1176 1320 311 -1723 1076 -159 70 331 -1503 1291 415 -1290 646 -532 647 499 -1734
5218 -1734 998 476 -595 493 -1017 916 769 -1468 586 122 133 525 -1446 724 852 -1031 318
5235 318 -377 456 803 -1488 333 702 -407 264 -861 452 982 -1209 90 236 68 529 -1280
5252 -1280 286 1033 -681 -55 -359 321 910 -1144 -108 610 -210 239 -819 257 1122 -783 -359
5269 -359 37 57 571 -868 -200 878 0 -129 -242 171 539 -619 -575 680 261 75 -650 -142 1039
5288 1039 -75 -769 43 197 458 -575 -421 529 271 -239 -432 81 709 -280 -550 214 489 45 -562
5307 -562 -199 588 271 -483 -309 422 436 -344 -513 186 582 -192 -571 76 476 134 -535 -257 683 192
5327A92p66L88L97L63q26l87J136r7o07k02J93J020p65q36J033K3Nm84n88J542
5347G34l74r75N28k0P77o07j091J463n8n01N9o24J490l81j436J220r1J60j03j250
5367a080J658M2j250P02m53R86n9j758J638R2p45M94j157J397L95k016J298j04
5385H0J08M52j870J475O88j644R70q17P86Q28k399J420M84r26R64j659J059J253
5403A252k368J179K1k53J291k457J215J339k027J267j011K90J782k716R78R40
5419G22j218J355j790L78K245k736R82L26q96K001k394M01J987k140J127p02m60
5436h12K610k640J84J870j772J739j880l52K991k720O44N68j430K590k162o64
5452a236K787k270J142m04j372L228k367l91J939k036K047j097j682L514k224
$$ plain form
5327 192 -574 -186 211 574 -252 -639 497 400 -207 -409 -216 804 39 -797 236 259 264 -220 -808 734
5347 734 360 -615 -87 -107 670 63 -1028 435 377 -124 -65 -689 801 420 -1016 204 113 273 170 -1080
5367 -1080 578 620 -630 72 -381 605 546 -1212 426 518 -227 267 -890 507 902 -1114 184 80
5385 80 188 640 -1230 245 933 -711 259 -558 228 1056 -1343 77 561 -365 599 -1060 -1 1252
5403 1252 -1116 63 84 -169 1122 -1335 -120 1219 -808 459 -552 -262 1520 -1196 -218 722
5419 722 -496 859 -931 -553 1692 -1044 -62 264 -632 1369 -1025 -624 1363 -777 350 -352 -812
5436 -812 1798 -842 -658 1212 -560 1179 -701 -1053 1938 -782 -138 430 -1000 1590 -572 -1236
5452 -1236 1551 -719 423 19 -1353 1875 -492 -883 1056 -980 1067 -30 -1712 1802 -422
5467d22LJ140k072K869j571j490L010k081P92L19k253L438j693j288K530k187
5483i56J754l10k538L663j619q00J700k428K839o61k665L353j665L38R41l024
5499b078L420n63k336K686k208J596P41l435L322p88j301K304k933K151O74l255
5515b003L144j335l66K028l403K650M18k925K972j874O73J566l796L058J40k181
5531a234K486k666J582J761m051K743l24r39K369l649J917J832l384K500j557
5546f14KK840m091J768J230k389K818k656K81K917l738K032K1j651L110l173P28
5563e65K379l480K468p58j161L226l685J127K037k986K529j757m10L469l850J078
5579c39J161k048L143k876m93L610l204J403l07j728M059l129m37K570k628K502
$$ plain form
5467 -422 -419 721 -1351 1518 -53 -1543 1467 -614 178 497 -1756 1682 -11 -1299 1231 -956
5483 -956 798 488 -2050 1613 -6 -806 894 -1534 1305 644 -2021 1332 -333 5 946 -2078
5499 -2078 1342 779 -1557 1129 -1079 517 1258 -2177 1145 357 -944 1360 -1573 578 1252 -2003
5515 -2003 1141 -194 -560 1468 -1935 715 1133 -1792 1180 -694 -21 1545 -2251 807 947 -1234
5531 -1234 1252 -1414 168 1929 -2122 621 297 -642 1727 -1922 -5 1827 -1557 943 -614
5546 -614 -612 2228 -1863 -95 1135 -1254 1564 -1092 -811 2106 -1632 400 421 -1230 1880 -1293 -565
5563 -565 1814 -1666 802 44 -1117 2109 -1576 -449 1588 -1398 1131 -626 -1036 2433 -1417 -339
5579 -339 822 -1226 1917 -959 -1452 2158 -1046 357 50 -1678 2381 -748 -1185 1385 -1243 1259
5595A259j319j897M038k749K09J506k810L354j589j639L472k850J148P46k649
5610a770L518k004j099L049k829J742j22k415L942k245q38K265k561K688r71k487
5626b137L846j995J13J052k913L597r40k412K996k108J389O33l421L523q47j288
5642i12K126k821K275N35l153L049j270l50J938l182K485L12k666K864j859M77
5658a52J571l365K839j60k015K472k320J382J192l411K737m49j044K009k921J863
5674B28J271l043K244j109O3K041l456J821R45k048K143k085O43K141l277J688
5690B10K44j283K309k635P62J899k674J719p05n92K409k844R18J436k228J960
5706I05j425k33K430k763Q78Q52j521K107k004m2K383k522J179j22j040K541k338
$$ plain form
5595 1259 -60 -1957 2081 -668 -459 1047 -1763 1591 2 -1637 1835 -1015 133 879 -1770
5610 -1770 1748 -256 -1355 1694 -1135 607 485 -1930 2012 -233 -1071 1194 -1367 1321 350 -2137
5626 -2137 1709 -286 -173 879 -2034 1563 623 -1789 1207 -901 488 1121 -2300 1223 376 -912
5642 -912 1214 -1607 668 1203 -1950 1099 -171 -521 1417 -1765 720 1032 -1634 1230 -629 -152
5658 -152 1419 -1946 893 733 -1282 1190 -1130 252 1444 -1967 770 321 -723 1286 -1635 228
5674 228 1499 -1544 700 -409 -346 1695 -1761 60 1005 -1043 1100 -985 -342 1799 -1478 210
5690 210 454 -829 1480 -1155 -393 1506 -1168 551 -154 -746 1663 -1181 -263 1173 -1055 905
5706 905 -520 -753 1677 -1086 -208 644 -877 1230 -774 -816 1567 -955 224 102 -938 1603 -735
5723g35k8J854j769J398r45q70K726k145P4J026j464K014j412q49K458j743M47
5740C7K24j341K408j459q48J868j449J065m46j291K442j338m91J180j334J602
5756H29o22j455K191j076J4M77j352J922o74j209J628r61O54pj531K014n63q37
5774e58J018j051J124n4j596J660m30k19N11j333J534n3j479J280n23L54L14j543
5792a044J414J09r61P50p96P76L57j529J145J0l36M15j036R28M95j316O56r7J82
5811A22L69j273Q18M81p13K63m77N45N26j303N10L72k78L19q38N54O44r13J25
5830a47L5K04M33j065K67P19m45k9l56L82N72p98r4M47J09k0o06K11O67m46k60
5851b20L2L86J71o18n4N61k7k50l14L18L89l68l52K31M57k02m09LM42J06m97j57
$$ plain form
5723 -735 -763 1091 -678 720 -225 -1095 1631 -514 -440 586 -878 1136 -276 -1125 1333 -410 37
5740 37 261 -1080 1328 -131 -979 889 -560 505 59 -1232 1210 -128 -619 561 -773 829
5756 829 207 -1248 943 -133 -119 358 -994 928 254 -955 673 -288 366 359 -1172 842 279 -558
5774 -558 460 -591 533 479 -1117 543 113 -106 405 -928 606 553 -926 354 -169 185 499 -1044
5792 -1044 370 479 -482 268 -528 248 605 -924 221 231 -105 310 -726 202 697 -619 37 -60 122
5811 122 491 -782 36 517 -196 67 -410 135 661 -642 -132 240 -38 281 -557 -3 641 -272 -147
5830 -147 -112 92 525 -540 -273 446 1 -28 -384 -2 570 -228 -322 125 234 214 -392 -181 486 40 -220
5851 -220 -188 198 369 -249 -303 258 231 -19 -333 -15 374 6 -346 -115 342 140 -269 -266 176 282 -215 -372
5873c72N86jk45k59J95N37m67m08M43J62O2m73j14P65k14m16P1MO26n72l84P45
5895B71j03l5k52k70Q76l57n75N25q7L16k72o30J025k11m06J97l53Q40l18q85
5915g04R68j99j5J01q65J137p0q83O28l14N19J0j168J250q1o19N61q03Q85K01
5935E39j387J072j30j38M76j256J110L08j241Q58m35K85O05j669J166L21r53Q60
5953C91j051P23P26j652R93Pl05Q72j632R24Q46j517R47m53pJ166j848Q14O82
5972F26j161J079j063K80J340j882Q35K41p39J376j730L89J403j669R58l35m62
5989e14J659j886L73J101j306J117q54l11J860j974N44O42j035J553j396l41J906
6006A138j737P54l4r65K037j631k51J563j577J318o27j060K324j699L6J009j445
$$ plain form
5873 -372 214 213 -32 -291 -96 441 -26 -434 9 171 233 -240 -354 411 197 -219 -148 -144 482 -90 -474 271
5895 271 168 133 -119 -389 487 130 -445 80 -7 309 37 -593 432 221 -185 12 -341 499 181 -704
5915 -704 264 65 50 151 -714 423 353 -530 98 -216 303 313 -855 395 314 -305 256 -547 338 539
5935 539 -848 224 94 -44 432 -824 286 594 -647 211 -224 61 666 -1003 163 484 -469 391
5953 391 -660 63 789 -863 130 137 -168 704 -928 -4 842 -675 272 -181 -188 978 -870 -56 626
5972 626 -535 544 -519 -239 1101 -781 54 295 -444 932 -798 -409 994 -675 283 -52 -514
5989 -514 1145 -741 -368 733 -573 544 -310 -621 1239 -735 -191 451 -584 969 -427 -768 1138
6006 1138 -599 155 121 -844 1193 -438 -689 874 -703 615 -12 -1072 1252 -447 -411 598 -847
6023h47J815j035j002K184j657N19M33j516K232j272q01J915j669J069j6j634
6039a282K494j366m99J427j735J728m71j605K414j339N0Q37j927K270n61j640
6055a205K123j518Q92M58k174K280o41r82J619j937J616K66k254K359r62m29J425
6072I36k021J587Q7j896K253j290K73R79k476K163j25j423K004j908J080J198
6088A421k918K182n22j020J759k138J310J055k148J644p88l31K003k820J358O78
6104G25j801K188j737L59J533k390J404R3j183J921j852L35J761k534J855o41
6120C6q57K211k438Q70J316k263J868r77m39K128k580J065Q01j588J970j747m1
6137f65K225k495J116j2j088K448k151r8J798j904J555q32j036K670k103K70J013
$$ plain form
6023 -847 968 -67 -1069 1115 -542 -23 410 -1106 1126 -146 -947 968 -701 368 352 -1282
6039 -1282 1212 -154 -653 774 -961 767 296 -1309 1105 -234 -184 653 -1274 996 435 -1205
6055 -1205 918 -600 292 750 -1424 856 215 -767 852 -1085 531 797 -1457 902 -60 -489 936
6072 936 -1085 502 589 -1307 946 -344 -71 908 -1568 595 470 -953 1051 -857 223 1421
6088 1421 -1497 685 163 -857 902 -1236 74 1129 -1019 625 -163 -494 1509 -1311 47 725
6104 725 -1076 1112 -625 -266 1267 -1123 281 374 -809 1112 -740 -405 1356 -1178 677 36
6120 36 -821 1390 -1048 -178 1138 -1125 743 -234 -673 1455 -1125 -60 741 -847 1123 -624 -665
6137 -665 1560 -935 181 169 -919 1529 -622 -720 1078 -826 729 -103 -1139 1531 -572 -302 711
6154G11j833K208j177r61K285j980Q43M33j703K267j316n64J872j939J209Nj528
6171a168K487j687k92J639j813J583o31j395K551j611RR58j792K237q81j345K122
6188I71j522P96L00k032K442p37r98J581j751J437K17k041K180r98j93J264k091
6205a175J723O6j686J931j306L23R90k069J828k50j216J724j535P63O75k100K027
6222G13n01p80J394j755J232N33k005J704o61j44J201k073J404M07j487J466j243
6239e95M18J277k175J251J86r05J434j611N39J137j788J201l56n11J535j804O77
6256i0Q23j494J300q00j51J487j827O94N75j140J371j203J08J318j651P81O2p60
6274e97J554j439P7J220j396Q99l99n08J567j446J75P53j002J134q30m13J567
$$ plain form
6154 711 -1122 1086 -91 -1052 1233 -747 96 529 -1174 1093 -223 -787 1085 -854 355 360 -1168
6171 -1168 1319 -368 -660 979 -834 749 118 -1277 1274 -337 -328 630 -1162 1075 194 -1151 971
6188 971 -551 245 545 -1487 955 218 -780 801 -950 487 704 -1337 843 -155 -348 916 -1175
6205 -1175 548 614 -1072 859 -447 -124 866 -1203 625 375 -841 883 -652 111 786 -1314 713
6222 713 212 -568 826 -929 303 836 -1169 535 -126 -270 931 -1142 262 669 -818 648 -595
6239 -595 -177 1100 -1075 176 362 -543 891 -720 -181 956 -832 369 13 -498 1037 -767 -90
6256 -90 733 -761 539 -261 -412 1075 -752 -58 517 -623 748 -455 -347 971 -680 101 163 -597
6274 -597 957 -482 -405 815 -581 318 -81 -589 978 -468 -293 460 -542 592 -238 -651 916
6291I16j287L52K49q95J438r59l51J204j042N87j54p34J499r45k90Q49r42R25
6309D20l29q15J431q50lL90p86J103n46o70J164o91K60Q4q12J197m74n51Q26o92
6329c44N85k2r30J135l76k08M24p80R25j68p98Q00l48J32K37q59Q70j9o37N73
6349A92m50M56J24q82P81m0l34K99n36N72J76p92N62j12K3K87p33N31J55m84K80
6370G5j95K14K46p37M36J30j48J00m54L72L40o46J92J10j7J75n23K46L45m16J54
6391aj98K25K36m70J17K04k0j6k92J63L02k83r4J13J28O2l42Q2K52p5k15l2K15
6414F1J30k32j79K33J75j70k26J49K15m5k72M5K65m4j73r7J39K08k72j23K88k1
6436E4nk06K2L98k17k22J87k1J97k67k21M92j21p6n6r6M76k88k69L38p9J01j53
$$ plain form
6291 916 -371 -19 230 -665 773 -186 -537 667 -375 212 58 -676 823 -122 -412 437 -505 420
6309 420 91 -724 707 -143 -146 244 -542 561 15 -655 509 -182 78 162 -650 547 73 -478 348 -344
6329 -344 241 219 -711 424 48 -160 264 -516 409 241 -557 243 -105 27 264 -595 275 256 -381 192
6349 192 -258 198 322 -560 221 181 -153 146 -390 182 358 -434 128 16 39 326 -407 124 279 -205 75
6370 75 -120 94 340 -397 39 169 21 121 -333 39 379 -267 -75 35 18 193 -330 -84 261 -155 -1
6391 -1 -199 26 262 -208 -91 113 93 77 -215 -52 250 -33 -127 -14 114 176 -166 -84 168 93 -122 -154 61
6414 61 191 -41 -220 13 188 18 -208 -59 156 111 -161 -116 149 105 -68 -165 -26 182 -90 -213 75 54
6436 54 49 -157 -135 263 46 -176 11 -10 187 -80 -301 191 70 -6 -62 -158 318 30 -239 99 20 121 -32
6459c2l19O92k17l11K09k03M66k39m57O55k06q3R4m19O67j15n62N66k80J86L6
6480A28o24P90j78l66M04m28N51J5q04P30j75j09L10o66O50J10p77O10k44Q2K58
6501B67q39P65O4n75N91o02L88L89r67O64l0k92N54q59N27M38r27O00k36J4O20
6522E54j095N56M17p75O56n97J47Q02j269O79J30m74P61r32K73Q06j142O46j49
6541fl19R48j111K84O85r17P49n34j40J074j205M08L92p69R53p63j40J104j073
6560c80M50N0n61J147j015n2R42r96P16l52n05J343j097R9O11r19J037n70m75
6579e27J266j120L74L23q85J218p98l23J095j049O61l5r09J424r01k03Q45r85
6597e29R61l06q63J449r33N9N35j032J281m65q11J206q48M58J90j156J388m81
$$ plain form
6459 -32 -351 341 124 -187 22 -181 285 46 -411 244 38 -45 49 -370 297 182 -380 186 -94 92 128
6480 128 -496 294 116 -250 154 -274 277 292 -512 218 43 -66 244 -422 228 338 -439 171 -73 9 267
6501 267 -572 193 257 -318 273 -329 59 448 -519 145 115 -177 377 -482 45 483 -444 156 -80 -66 554
6522 554 -541 15 432 -343 313 -284 -137 665 -604 75 205 -269 492 -440 -167 639 -503 143 -6
6541 -6 -325 623 -488 -204 481 -436 313 -221 -361 713 -492 -84 308 -461 492 -271 -411 693 -380
6560 -380 70 120 -441 706 -309 -361 581 -415 301 -51 -556 787 -310 -211 400 -519 518 -52 -527
6579 -527 739 -381 -7 316 -569 649 -149 -472 623 -426 235 200 -709 715 -186 -389 456 -529
6597 -529 432 126 -737 712 -221 -162 373 -659 622 157 -654 552 -296 162 352 -804 584 103
6615A03n61R24j047Q67J08j256J411o49j48Q00j315J037J8j022J303q56J63O43
6633E23j280J199k47q36J260j056M86M59j392J349l43n28R45j170Q04M42j396
6650g81J178m99q1Q74j496R78L64j092J113r70L17R10j538R12no99J242j237L45
6669a65Q08j329J119m27m44J187j355N58N85j216J167o27k15J127j441P82L22
6686D36j050J198r79J15J124j452P60L8o31J212j236J86R61j149P97m34m58J419
6704H57j286L02M82r95J267p27m91J289j149M86K26r58J334p97k45J005j113P57
6722B44l8q42J339j013N0Q70j127Q76l36o26J323j007J12N76r49J161o28n95J269
6741F59j018N15J18r95J319n95m70Q69r12P84lr93J240o02j27O31j095J004o8
$$ plain form
6615 103 -458 466 -581 286 394 -862 549 -100 -248 552 -763 274 292 -730 573 -283 -120 523
6633 523 -757 442 195 -641 619 -437 49 508 -884 465 122 -406 539 -631 173 615 -781
6650 -781 397 -102 -183 691 -805 173 537 -555 558 -412 -95 815 -723 189 184 -515 727 -510 -165
6669 -165 643 -686 433 6 -438 749 -606 -48 537 -679 488 -139 -354 773 -668 114 436
6686 436 -614 584 -395 -280 844 -608 152 190 -441 771 -465 -279 682 -467 330 -104 -562 857
6704 857 -429 -127 355 -640 627 -100 -591 698 -451 35 261 -697 637 -160 -405 600 -513 244
6722 244 206 -636 703 -310 -260 610 -517 359 23 -603 720 -287 -175 401 -548 613 -15 -610 659
6741 659 -359 156 274 -721 598 3 -467 402 -510 274 271 -722 518 -84 -211 420 -675 329 261
6760B61q97J122p65K36N17j098R88j72p03J040r02M89J17q60J120m87l11P11p80
6779c74M80K34p97Q30n17p1O45q33P74m0q80R95p75L14N56j141P54J0m88Q00q71
6800c95M02M96r83O68k19j49P41j019N32K68p76P81m66jO69j002M70J83n47P08
6820C61o26J34N50q42N00Ql44P14p56J58M84p40O24k97j84P56q43K54L28n43O14
6841C10n09rO62p30K28J91m55P35n68m0N75o05L14o6l52P26n30o1M54n85N22k20
6863a3l20P12m82P6J85m38N56l39k21O17m96K25j4l09O19l99j45M22l89L36p3
6884A10l62N31k94l9K15l58M05j45l32M98l19J11J3l35M88j08k74L82l42K40L4
6905A19m20M89j69q5J68l29L27Ll38L40o0k3R9l28L10N6k93K35j70J51N9l24K53
$$ plain form
6760 261 -636 486 -279 -43 474 -624 364 192 -511 529 -373 116 233 -627 493 6 -305 406 -374
6779 -374 106 340 -457 373 -144 -215 430 -403 371 331 -549 446 -329 -15 541 -600 154 164 -324 476 -395
6800 -395 7 503 -480 188 -31 -180 561 -458 74 342 -434 347 -119 -120 549 -453 17 200 -347 361
6820 361 -265 -131 419 -423 77 85 -259 455 -301 -143 341 -399 225 -72 -256 500 -343 -89 239 -304 310
6841 310 -199 -208 454 -276 -48 143 -312 423 -145 -185 390 -215 99 33 -319 407 -123 -184 270 -315 207 -13
6863 -13 -333 379 -103 -27 158 -280 276 -63 -284 333 -163 62 48 -261 358 -41 -186 236 -153 183 110
6884 110 -252 279 -15 -54 161 -197 208 63 -269 229 -90 21 34 -301 187 79 -195 187 -155 85 119
6905 119 -301 188 19 -66 102 -227 100 103 -235 105 45 22 121 -207 103 159 -134 101 -69 82 141 -183 70
6928G0J9j51J30j81J19J19k97J80k3K9Pj58J49J15j60J0j04J16R8k19M6J25l1
6951HM5j37L5J52j51o0P0K0M1j10O2J59j38k7pO0N3j32rP7Q4r7q2J18O8n2j09
6978e9J3P6K4j52N6M9M3j69RJ78m4k4p0j9K18j72j1J23q2J29j64p8K31j27j2O0
7004B6j17K52k14kJ47j12J15r3j09K56j89kJ34j55J98r7k11K68j05k5O8k39L94
7027A88j84k20L41j90J23j9k43L50j72j44K78k50L08r1l34L91j10j8J25l53L84
7048A60j06j97K94k26P3R4l48M07p0k57L92l40J94J41n10L69p0r1K70m74L32J13
7070A50l66L55k35O0K72n51M01J06m12M03l14R9K88n18L72n2k30M25m72K04K61
7091B46n62M79j74r6M20n66K08K35m43M54l29qM59o13L55J40m03M80m40L8M23
$$ plain form
6928 70 89 -62 68 -113 6 125 -172 8 -15 14 21 -137 12 127 -33 -23 -127 -11 87 -132 -86 39 8
6951 8 53 -84 -49 103 -48 -108 -38 -18 23 -87 -25 134 -4 -31 -38 22 75 -57 -66 11 95 -2 -84 34 102 50 -59
6978 -59 -46 30 54 -98 -42 7 50 -119 -110 68 24 0 -70 -89 129 -43 -54 69 -13 116 -48 -126 105 -22 -34 26
7004 26 -91 161 -53 -55 92 -20 95 2 -107 149 -40 -42 92 -63 135 38 -173 95 -10 -35 33 -206 188
7027 188 4 -216 125 -65 58 39 -204 146 -26 -170 108 -142 166 75 -259 132 22 4 129 -224 160
7048 160 54 -143 151 -75 -2 92 -256 151 81 -176 216 -124 70 211 -299 70 0 -91 179 -295 37 150
7070 150 -216 139 -96 -36 236 -315 86 192 -220 183 -131 -32 256 -262 110 58 -172 253 -219 -15 246
7091 246 -316 163 -11 -107 313 -253 -45 190 -253 201 -128 -136 323 -290 65 205 -198 282 -158 -120 303
7112C03n89L60l1k69N74o04J76L60n34M36k76q5O05o98K69J81m30N81m66n7N78
7133C84n75K68N6m35O01m52pM72n82M19j04l28O54n39O3L66o09O07k60l23P16
7154C92n70J46K40n16O19l70k32O75o12L31K2n00P91l94j93M22n76N73j34m74
7174c60O44m12O5L05o35N87j49l60O40n92K61K80o86P10l19k39N50o12M66M5n99
7195d10P34l34j72N17o92N66m6n74P36l75l9L86p19O68o1n18N81n43L28K63p44
7216d48O47j75k33N98p29M27K42p08O09l92MN78p45L80J39n44O91n33P9M65o84
7237c32N29n5m24O01n54K47L08p32O29j70l01N85o75L65K83o44N78l80L3N39p64
7258c34L75J09m36O72n86L0N75p21M48n7l85P54o25O4M63p15O27k90k47O48o32
$$ plain form
7112 303 -286 74 43 -226 348 -256 -80 280 -254 182 -94 -179 426 -272 -3 178 -252 329 -137 -194 384
7133 384 -191 77 133 -302 299 -153 -160 312 -270 149 45 -283 371 -168 -105 261 -348 259 -1 -324 392
7154 392 -178 -32 208 -308 311 -59 -291 384 -228 103 125 -375 416 22 -171 251 -325 248 114 -360
7174 -360 284 -128 -63 242 -393 194 45 -315 325 -267 -6 274 -412 298 -21 -260 290 -322 144 189 -410
7195 -410 324 -10 -182 335 -357 209 163 -411 325 -50 -89 297 -422 246 185 -333 248 -295 33 296 -448
7216 -448 199 24 -209 389 -340 87 329 -379 230 -162 -158 420 -325 55 194 -350 341 -192 -113 352 -332
7237 -332 197 142 -282 319 -235 12 320 -412 217 47 -254 331 -344 21 304 -340 238 -142 -109 430 -334
7258 -334 41 150 -286 386 -200 -170 405 -316 132 75 -310 444 -181 -117 346 -369 258 -32 -279 369 -263
7279b63K08L26o10O14l06j90O11p21L74J95n92O70m59l4N48o78M32r4l67P80n94
7300a50J5L85n71M65j14l57O80n27J11K58n31O47k50l32O26o23L12J55n31O30
7320B98l54m5M21o58M78j1m55O58m61JM00o56N85j13l60N97m52P5K53n33N31j26
7342G3l13N08n11K83J29n23N37k20j53M63n59M18K7m11M42l05R1K88n60M07j0
7363A01l08M23m02J84K53n38L29N7k97M78n01J79K68m64L79j62j28M13m99K67
7383C2J21l70L52k03pK88m98L57P6l50L84l09O6L28m60L33r2j80L65m15J33K79
7405B30m59L14j16q8L90m08J40M9k04L19k45l6K95l91J91Q4k83M08k55QK67l37
7427a27J82m4j54L47l16M7J76k53L00j01j87K87k25L6J25k49K75j33j25L13k39
$$ plain form
7279 -263 -55 271 -339 275 -31 -221 390 -331 43 238 -354 316 -143 -177 371 -307 125 31 -336 444 -150
7300 -150 -135 250 -321 144 30 -327 353 -174 -63 195 -336 311 61 -271 355 -268 44 199 -332 298
7320 298 -56 -101 320 -338 140 129 -326 332 -129 -128 272 -384 201 88 -272 325 -127 -52 201 -332 199 73
7342 73 -240 268 -243 40 169 -354 183 -37 -190 273 -286 132 159 -252 190 -115 -24 264 -296 111 101
7363 101 -207 216 -186 -2 251 -287 42 99 -198 280 -221 -42 226 -238 141 -21 -149 264 -235 32
7383 32 153 -217 135 -68 -75 213 -285 72 148 -202 182 -127 -61 267 -193 140 48 -132 233 -182 -49 230
7405 230 -229 85 -31 -119 271 -137 3 52 -152 167 -78 -114 181 -210 -19 65 -218 190 -65 -57 210 -127
7427 -127 55 11 -143 204 -112 -65 111 -142 158 57 -130 157 -68 -32 93 -156 119 -14 -139 174 -65
7448f5R1K7k36L30j86p8K56l00K10lj99K43j31k9J12j70J87q9j07K01j23R0J0
7471D1j41K09j05j13J94j51P9R3k65K75p6l4J02k42J97Oj78J76j28J13M8j57J73
7494A16r9o4M7n3P2Mj15J12k2o4Q9p1Q7L7j36L8JL5K1m2j1J19j37O2n5N1Qk6m0
7523c6L0L0l4K7OL5k5k4Lkjj4l3P0pj25M4Q1m3M5oo3R5j37P3m1M6R6j10K6O8q0
7555fM0J2n4Q8j39Q9L3j26J86j69k6J75j20M5l4l3J03j00pJ33j16Q1m1j22K75
7580A67j88m8J42j58J24l6o9J75j50j1J00j87K69j33j28K76k35J08Q8j60K11j83
7602b6o5K37k34J70k4k11K93k02M8J42k98K36m1j73K38j93P4J19k44K57o2j66
7624a25K71k68J54J10l41L43j25j13K85l46K23M8l03L56k23m3L02l62K32J3k76
$$ plain form
7448 -65 26 53 -183 147 -39 -117 139 -161 49 46 -153 90 -41 -70 42 -128 59 -30 -137 64 -59 31 41
7471 41 -100 109 4 -109 85 -66 13 106 -159 116 40 6 108 -134 63 69 -109 67 -61 52 100 -57 116
7494 116 17 -47 0 -53 19 23 -92 20 -2 -66 23 -48 39 76 -60 -22 -21 14 35 -7 -18 101 -36 26 -29 22 30 4 -36
7523 -36 -6 24 -10 17 23 58 33 9 12 10 9 -5 -38 32 25 -100 -56 25 -18 27 21 -42 53 -84 -11 -52 -6 90 -20 6 74 -6
7555 -6 34 46 -8 80 -59 30 63 -63 123 -46 -72 103 -17 28 -6 -39 64 -36 -43 90 -26 55 14 -108 167
7580 167 -21 -69 73 -85 39 3 -66 109 -41 -52 48 -139 130 -3 -131 145 -90 18 106 -54 157 -26
7602 -26 -91 146 -88 82 58 -153 140 -62 -14 128 -170 66 25 -148 90 -103 -29 90 -154 103 41 -125
7624 -125 146 -122 32 142 -199 144 19 -94 191 -155 68 116 -187 169 -54 -97 205 -157 75 88 -188
7645a88M24l51N9K66m10K56K1k32L52l43J32J79l88L33j09j37L92m85K03J55l20
7666a91L92k56o3L48m58K44Q0k80M18m07R2K97m26K91k1k59M68m51J31K80m71
7687b42L92j13k28M40m63K05J54m25M99k75r0M06m65K61Q2m30M56k40K5K89n08
7708b70M04o5k64M25m14J36K96n10M50j38k17N57o19J91K18m13M44k50j50M65
7728B76m64K89L5m48N86l17p9L82m96L87j3m29N08l19K2L06n40N09r6l13M83m81
7750b12J60K86n10M58j69k29N45n19K18J26m41N94l08k38N58n83L77P0m59N18
7770B42k91J31J25m60L74L9m26N35n00J64L19n69N01j87k16N00n30J85L02n17
7790b79N17k92j55N65n96K76J30m41O07m02o7L90n94N18m3m08N30l93Q6L37n77
$$ plain form
7645 -188 236 -115 -56 210 -200 56 77 -155 197 -146 -14 165 -223 110 1 -136 256 -229 -26 129 -191
7666 -191 201 -55 -118 230 -228 16 96 -184 234 -173 -81 216 -210 81 60 -199 269 -182 -51 229 -242
7687 -242 150 37 -191 249 -214 -9 145 -280 219 -56 -146 260 -205 56 138 -292 164 -76 -51 238 -270
7708 -270 134 69 -195 230 -184 -48 248 -262 188 50 -167 390 -229 -38 180 -233 211 -39 -189 276
7728 276 -188 101 136 -312 274 -43 -122 260 -236 151 138 -291 217 -102 -80 226 -314 195 99 -214 269 -212
7750 -212 -52 234 -276 182 13 -216 329 -190 28 154 -287 307 -1 -239 319 -264 113 183 -276 242
7770 242 -49 82 207 -253 121 160 -266 269 -231 -67 252 -317 184 -3 -219 281 -249 -64 238 -279
7790 -279 238 -54 -209 356 -240 36 166 -275 332 -70 -137 253 -341 177 134 -274 256 -137 -51 286 -291
7811b91M37m7l27M96m56J20L25n96M60j55k00N40n44K35J64m77N79l45o8M47n63
7832b66M03%m03O10m76K4L61n84M54l8l02N16m19P0K55n03M87j49k21M82n85L22
7854C8J64m85M89k72j24M79n08K26J02l80N46l72p7M06n01L96m3l77N91l91M5
7875d8K56m78L84p8k68M91m31J73J87m63M30j90j23M21n29L18Q7m20M58k52NL04
7897B34m65L58n5l64N38m01N1K99m57L35k5k51L84l55J27K01m15M19j69j37L40
7918A92l83K43P8l76M41j67j52L54m53K31O3k88M19k66j2L05m12K83l9k59M16
7939B18l11P7K52m68L84j45j84M26l38M6J83l09L90k03j31L04l38J97J04l08L39
7960A85k50QK59l64K30k3k07L20k32l9L07l60K44q4j56K90k61N2J72k96L10j43
$$ plain form
7811 -291 146 99 -228 268 -188 -68 257 -339 121 -34 -234 306 -238 -3 161 -316 263 -82 -150 297 -266
7832 -266 137 137 -266 344 -132 -108 253 -331 123 85 -217 299 -120 -50 205 -298 189 40 -181 301 -284 38
7854 38 202 -283 206 -66 -190 289 -219 7 109 -271 275 -97 -174 232 -269 127 84 -293 298 -93 -48
7875 -48 208 -270 114 36 -232 259 -172 1 188 -275 155 -35 -158 263 -266 52 139 -281 177 -75 -70 234
7897 234 -231 127 72 -292 246 -155 -104 195 -262 73 48 -203 181 -174 -47 154 -261 158 -11 -148 192
7918 192 -191 52 130 -246 195 28 -124 230 -223 8 71 -217 202 -64 -76 229 -183 100 61 -198 218
7939 218 -93 -16 236 -232 152 7 -177 249 -89 -43 140 -169 221 18 -113 191 -147 50 154 -154 185
7960 185 -65 -57 202 -162 68 45 -162 158 -74 -113 194 -166 78 -6 -162 128 -133 -81 91 -205 105 -38
7982c8j40L30l07J74M8k65L28j69k7J74k19J54L6k06K93k00j8J48j34P8pj43K43
8005A33k40O1J45k57K07j5q3J67j76M7Q8k00J76p1k2R5j80J49J5j57K25j46j8
8028e7J91j96J22mq7J15p2l2J21j65J02l1o8J06o0K5O4j63J07j4J9J8o8P5k0p5
8054d7Q4j08O9N2%k3l1K9l4Kk3P7q9N2M1q6j5N7l6K1QJ1M3m7nK6k4j2O2l2m1N7
8086C8j16P6j7Q1k3o3K4Kk9O2q6M4O7q5J9M1n1P9p1l2R5r7P6m7m3J77j59L6M8
8115D6q2R2j05qJ34j09R6n9j03J84j01p6J21j21J31K5j20J26j19O3P6j36J12j3
8139E4j69K54k24J09O1k28K43j20m3J24j75J83L3k07J73p3j9J07j36Q4k0j65K13
8162E9p1o2J84k32K18j8j47J60j68N8J23k14J94r8q1K58l37J87O8k27K18p9m9
$$ plain form
7982 -38 -178 152 -155 19 67 -198 130 -39 -66 108 -111 43 79 -127 166 -34 -52 96 -38 40 33 -110 133
8005 133 -107 -46 99 -158 49 34 -49 118 -58 -11 77 -123 53 -18 -40 55 -125 24 39 -118 107 -39 -57
8028 -57 134 -62 60 56 -31 84 12 -20 101 -64 38 7 -61 45 -15 10 74 -89 18 4 23 41 -27 48 28 -47
8054 -47 37 -71 -2 50 50 27 -4 25 -9 -7 -30 47 -42 10 51 -35 -50 7 -29 -8 0 11 54 7 2 28 4 -8 54 22 -19 38
8086 38 -78 -2 -19 62 39 -24 0 2 -27 35 -51 -7 60 -25 -6 35 -16 63 -8 -40 55 -42 34 -13 -56 121 -38 -2 46
8115 46 -36 56 -49 -57 77 -32 64 5 -98 86 -15 -91 30 -91 40 65 -55 71 -48 15 91 -45 67 54
8139 54 -115 139 -85 24 85 -143 100 -20 -63 61 -114 69 102 -105 68 -5 -24 83 -53 31 11 -154 59
8162 59 -12 -74 110 -122 96 78 -69 91 -77 -19 104 -110 84 -14 -95 163 -174 13 81 -146 72 -7 -56
8185e6K17l09J54O5j96K69
$$ plain form
8185 -56 161 -148 6 71 -125 144
8191A44
$$ Imaginary data points
##PAGE= N=2
##DATA TABLE= (X++(I..I)), XYDATA
0@%%%%%%%%Qj6K4l2L2m0N6p2Q9j13J44j76K09k50K98l53M17m91N76o70P74q87
30d73J017j164J327j510J710j930K171k436K728l049L402l786M206m666N165n710
46b998O306o957P671q452R309j0252J1293j2446J3728j5163J6784j8628K0743
59A0938k3197K6087k9549L3782l9101M6009n5393O8967r0621J32382l38423O50471
71C92352l01343l42014O13739r56538R56122p7615q31001Q89519n29999J73602
81a3176M56208j063949Q85233r9612n15791P79192p78924L42963M07976r06578
91e06458Q30301l18181l20135P53080p85804M43048J75772p87788Q89547l92001
101a8619j84582N51037p98602O62936P6296p59597P53246m23453J23776M15480
$$ plain form
0 0 0 0 0 0 0 0 0 0 8 -8 16 -16 16 -24 32 -40 49 -64 80 -96 113 -137 161 -192 225 -266 310 -360 414 -473
30 -473 544 -620 707 -803 907 -1023 1148 -1288 1440 -1609 1793 -1993 2213 -2453 2712 -2998
46 -2998 3308 -3649 4022 -4430 4879 -5373 5920 -6526 7202 -7961 8823 -9805 10938
59 10938 -12259 13828 -15721 18061 -21040 24969 -30424 38543 -52078 80304 -258119 392352
71 392352 91009 -251005 362734 -593804 362318 284703 -546298 343221 -186778 -13176
81 -13176 443032 -620917 264316 164704 -351087 428105 -350819 -7856 400120 -506458
91 -506458 323843 5662 -314473 438607 -347197 95851 271623 -516165 373382 -18619
101 -18619 -203201 347836 -450766 212170 288466 -471131 282115 -141338 -17562 397918
111C97918r36844O86694Q3280m97646N80103o63699L39887M69978q82508N50667
121A27830j17400j92039O28853q17504L07186L91460o34229N59283l73406q9128
131b09094O44375p44334L30472J64559m92342O26045m63665j5523N23889o84335
141c19953M13067L2348l85827N77995n27553J11521M38749o32513M07607j02050
151A3391k11227N71491o18135J41996L63532m81072M25344k99044j28973O07974
161C85277n70663J39867J64407l45392N36125m08051j30602N23343m61538K50050
171H2823l2369l26004N92675l93373p7108L60992m13069L68003j28549k96883
181b62862N41539l76094L1890K21705l84201M30365j95754k34999M73521l59246
$$ plain form
111 397918 -538926 147768 231048 -266598 313505 -350194 -10307 459671 -422837 127830
121 127830 10430 -181609 447244 -370260 -63074 328386 -305843 253440 -119966 -209094
131 -209094 435281 -309053 21419 185978 -306364 319681 -143984 -159507 364382 -319953
141 -319953 93114 125462 -260365 317630 -209923 -98402 340347 -292166 115441 13391
151 13391 -197836 373655 -244480 -102484 261048 -220024 205320 -93724 -222697 385277
161 385277 -185386 -45519 118888 -226504 309621 -98430 -229032 294311 -167227 82823
171 82823 50454 -275550 317125 -76248 -153356 207636 -205433 162570 34021 -262862
181 -262862 278677 -97417 -65527 156178 -228023 202342 6588 -228411 245110 -114136
191a14136J19516R8475l42947M66267k30669j81904L68932l15729K20906j7334
201G1377l27797M69277k17377j01996K35000l12105L25424o0951l19195L99746
211A61403j98295K1062J30249l40991L67802o2019k52207K99983k27042J42854
221D2799Q2786l57148L50584p0067j51358K21833k70521K15104O4280l27891K95462
232I5863r6628l8223J63033l06200K46429N1194k63122K31446j42031N9146J38010
243A38917l20747K26256L7602j66603J72285j96105J20470J31484k91071J78434
253C0922o846o1778J50007k45345J31636J28330k24531J34333p0023J1783J54310
264A32798k53589J05209R7340j34355J15938j38249M7056J62953k23684P5826
$$ plain form
191 -114136 5380 103855 -239092 227175 -3494 -185398 183534 -132195 88711 71377
201 71377 -256420 212857 -4520 -106516 128484 -183621 141803 80852 -238343 161403
211 161403 -36892 -15830 114419 -226572 141230 79211 -172996 126987 -100055 42799
221 42799 125585 -231563 119021 48954 -102404 119429 -151092 64012 128292 -199599 95863
232 95863 -765 -38988 124045 -182155 64274 115468 -147654 83792 -58239 907 138917
243 138917 -181830 44426 82028 -84575 87710 -108395 12075 143559 -147512 30922
253 30922 24076 -37702 112305 -133040 -1404 126926 -97605 36728 -33295 -21512 132798
264 132798 -120791 -15582 81758 -52597 63341 -74908 -27852 135101 -88583 -12757
274a2757L9532n9076J27755j79310L9188J54512j58068N6565l0719j0486J46048
285A13184j79018J6594J11851q5227O6974r1895k476J57266j39241m782N0127
296A3357l1142R0387j14299k0867J35210p4711k308j8143r493J15131r9949m2619
308e9446Q7913k1096K3170n9060k3180J16941n1019n0383K4444R710N5058o5734
320a2682m5478Q7305M1k9640k8337M050P6202l5048o3174L6037L7262J680m9906
333b1688j7636O3675J3698n4137k1897M4973L2455l7297m0791K5836N5978k8087
345A5082n5645K7745L5725N956m5604l0651P8419M460n9935M405J0499N0986k6875
358A4567p5234P0485K1528k8297j1501l8571Q5432K148r4303N1149P861J6898
$$ plain form
274 -12757 26775 -32301 95454 -83856 -44668 109844 -48224 8341 -22378 -32864 113184
285 113184 -65834 -49240 62611 -22616 44358 -47537 -50013 107253 -31988 -36770 13357
296 13357 -17785 72602 -41697 -62564 72646 -2065 -4373 -22516 -32009 83122 -16827 -59446
308 -59446 28467 7371 30541 -28519 -51699 65242 14223 -36160 -11716 -2006 53052 -12682
320 -12682 -58160 29145 29186 -454 -28791 -24741 51461 16413 -46761 -10724 26538 28218 -21688
333 -21688 -39324 24351 38049 -16088 -37985 6988 39443 2146 -38645 -12809 43169 15082
345 15082 -40563 -12818 22907 28863 -16741 -47392 31027 35487 -24448 -20043 -9544 41442 14567
358 14567 -60667 9818 31346 3049 -8452 -47023 38409 40557 -53746 -2597 5264 22162
370B2162j511r2074R1984K8325p9822L1661l2273N9092K2785j25784Q1345K5717
382C1607l9959L3947r1136Q2091N3438j32502O6027m269L230N5527j39053Q1814
394G62O4364j05815O2108o0676L7878Q7647j65692P3107M6750o7494Q1089j18951
406f4923M7727J12623j58358O5878Q19k9431J13233j61572M5679J09811j30648
417d9162Q1881o1996j0346J50418j78345M0502P9642r8750J16007j17666p587
428e5402J67412j68894N2839K2011p6211J63852j58082j0293J58703j50545Q8484
439C3874m0512p3075K03526j69502m776J16612j31311J41846r4640p7776K16449
450A20715j64253K7064N6986j30914J97932j22471q0051J96430j54726P8458K009
$$ plain form
370 22162 20651 -71423 20561 48886 -30936 725 -31548 27544 50329 -75455 5890 31607
382 31607 -8352 25595 -65541 16550 69988 -62514 3513 -756 2474 58001 -81052 762
394 762 65126 -40689 21419 -39257 -1379 86268 -79424 -6317 40433 -27061 54028 -64923
406 -64923 -17196 95427 -62931 2947 3766 -25665 87568 -74004 -28325 81486 -49162
417 -49162 32719 -29277 -39623 110795 -67550 -27048 52594 -46156 69851 -47815 -55402
428 -55402 112010 -56884 -4045 17966 -58245 105607 -52475 -62768 95935 -54610 33874
439 33874 -6638 -79713 123813 -45689 -50465 66147 -65164 76682 -17958 -95734 120715
450 120715 -43538 -16474 40512 -90402 107530 -14941 -94992 101438 -53288 25170 27179
461B7179j39438K29357j31244n7380J51794j57077J40063l9923j46987K38121
471A14465j36249j6180J03380j69424J93405o4761j44487K20289j40077M4747
481E108N2671j90774K34779p6876j20973J81664j61843J20235K3543k16463K42027
492I3098q3273o3291J38817k04431J78931J4668k07318K19079j18686J4295J20140
503A02029k43946K02651k427j64133K02790j67815O9222J07423k48015K11151
513F8930l8972j12970J87492k03178J18230Q0974k42581K16639p1380n5711J63722
524A11195k41833J60314P0090k19838J93230j17743K1304J58776k79079J64531
534B0947M7760j49785J85887k00280O5669J75935k64570J53969k6369q3479K20802
$$ plain form
461 27179 -112259 117098 -14146 -71526 80268 -76809 63254 23331 -123656 114465
471 114465 -21784 -37964 65416 -104008 89397 24636 -119851 100438 -39639 5108
481 5108 57779 -132995 101784 24908 -96065 85599 -76244 43991 67534 -148929 93098
492 93098 9825 -53466 85351 -119080 59851 74519 -132799 86280 -32406 -18111 102029
503 102029 -141917 60734 58307 -105826 96964 -70851 -1629 105794 -142221 68930
513 68930 29958 -83012 104480 -98698 19532 100506 -142075 74564 3184 -52527 111195
524 111195 -130638 29676 99766 -120072 73158 -44585 -23281 135495 -143584 20947
534 20947 68707 -81078 104809 -95471 -29802 146133 -118437 35532 9163 -74316 146486
545A46486k47548O7227J42331k12187J87987j09021o0635K32475k45351R9803
555A567P4542j92957K24773j45178k8204K02039k53514J41685L5157j61033K18767
566A17644j92550K6083J91115k52183J44992k4192r6773K42168k44076K8145J67738
577A08111j92345J70892j18308q0941K74110k20574L5693P0107j57801K49009
587A37953j55115r7206K28597j85747J17065m448j86509K70028j38812m5914J56182
598I6074k12841J82245j8799j68085K38096j74736K6826J36262k23097J92675
608G4620o5790j15808K44849k04317M6222Q8920j84421K33657j22936j09223K25922
619A11695j74986J02794M112j96652K74059j08243q0853J41171j85989J91729
$$ plain form
545 146486 -101062 -33835 108496 -103691 84296 -24725 -85360 147115 -98236 1567
555 1567 76109 -116848 107925 -37253 -65457 136582 -116932 24753 59910 -101123 117644
566 117644 -74906 -48823 142292 -109891 35101 10909 -85864 156304 -87772 -59627 108111
577 108111 -84234 86658 -31650 -112591 161519 -59055 -23362 46745 -111056 137953
587 137953 -17162 -114368 114229 -71518 45547 41099 -145410 124618 -14194 -60108 96074
598 96074 -116767 65478 46679 -121406 116690 -58046 -31220 105042 -118055 74620
608 74620 8830 -106978 137871 -66446 -20224 68696 -115725 117932 -5004 -114227 111695
619 111695 -63291 39503 43615 -153037 121022 12779 -68074 73097 -112892 78837
629G8837q030k15333K23819j03116K0464R6447k41741K05946M729j49722J74595
640H6895j69974Q4282J09313k34697J80785m6843p9138J83416k03972R4328P3065
651G7460j91490K02048r8693n2853J63072j99192J41034K4174j87604K04130j07028
662b4942L660J17022k27193J75488K1100j49016J59294j52757P6936J19048k39082
673a20442J49587j1148o5347J58075k12696Q2639J20318j82016J36298q6388k3686
684e4806J80491k07810P3647O1913j30307J66922j29441j6711J60402j82748J01927
695B3479R596j13743J73551j40187J3351J25694j76104J20811k3169p7366J65284
706A01197j67568M0392J06470j51849J25842p3745m3631J75596j72033M2036O1382
$$ plain form
629 78837 70807 -144526 79293 -23823 -3359 93088 -148653 57293 62022 -87700 86895
640 86895 -83079 1203 110516 -124181 56604 9761 -69377 114039 -89933 4395 77460
651 77460 -114030 88018 -10675 -63528 99544 -99648 41386 65560 -122044 82086 -24942
662 -24942 -21282 95740 -131453 44035 65135 -83881 75413 -77344 -408 118640 -120442
673 -120442 29145 17997 -47350 110725 -101971 -19332 100986 -81030 55268 -31120 -54806
684 -54806 125685 -82125 -8478 53435 -76872 90050 -39391 -56102 104300 -78448 23479
695 23479 33075 -80668 92883 -47304 -33953 91741 -84363 36448 13279 -64087 101197
706 101197 -66371 -25979 80491 -71358 54484 -19261 -62892 112704 -59329 -17293 44089
717D4089j09667J52270j17119l8949J63128j42469O6707k242r7135J79172j19506
728b1721l0857J16181j22478J07315l6756r6091J68411j08516K465O9333j18921
739g1635J31886n2832p9280J44859j08206L5501L6797j12899J41877o4648n9656
750e8236J18298j02454O4894L834j05932J45824o8298l5155Q2070j01908R8945
761D1882j5283j04241J32219o5243J062M8565j11064J17398j8438q5637J01500
$$ plain form
717 44089 -65578 86692 -30427 -69376 93752 -48717 17990 15748 -81387 97785 -21721
728 -21721 -52578 63603 -58875 48440 11684 -84407 84004 -24512 -22047 47286 -71635
739 -71635 60251 7419 -71861 72998 -35208 293 37090 -75809 66068 1420 -58236
750 -58236 60062 -42392 22502 26336 -79596 66228 -2070 -37225 44845 -57063 41882
761 41882 26599 -77642 54577 -10666 -9604 38961 -72103 45295 26857 -58780 42720
$$ [...]
8191F2
##END NTUPLES=NMR FID
##END=
