##TITLE=1H_IPACAT-24a
 CDCl3, 8 sc, 
 27.2.2020
##JCAMPDX= 6.0         $$ Bruker NMR JCAMP-DX V2.0
##DATA TYPE= NMR FID
##DATA CLASS= NTUPLES
##ORIGIN= UXNMR, Bruker Analytische Messtechnik GmbH
##OWNER= root
$$ XWIN-NMR		Version 3.5
$$ Thu Feb 27 15:34:53 2020 Russian Standard Time (UT+4h)  she@DPX200
##.OBSERVE FREQUENCY= 200.1315
##.OBSERVE NUCLEUS= ^1H
##.DELAY= (6, 6)
##.ACQUISITION MODE= SIMULTANEOUS
##.ACQUISITION SCHEME= undefined
##.AVERAGES= 8
##.DIGITISER RES= 18
##SPECTROMETER/DATA SYSTEM= spect
##.PULSE SEQUENCE= zg30
##.SOLVENT NAME= D2O
##.SHIFT REFERENCE= (INTERNAL, D2O, 0, 15.7039)
##AUDIT TRAIL= $$ (NUMBER, WHEN, WHO, WHERE, WHAT)
$$ ##TITLE= Audit trail, XWIN-NMR		Version 3.5
$$ ##JCAMPDX= 5.01
$$ ##ORIGIN= Bruker BioSpin GmbH
$$ ##OWNER= she
$$ F:/spectra/data/she/nmr/H-F/1/audita.txt
$$ ##AUDIT TRAIL=  $$ (NUMBER, WHEN, WHO, WHERE, WHAT)
(   1,<2020-02-27 15:33:55.35 +0400>,<she>,<DPX200>,
      <created by zg, POWCHK disabled, PULCHK disabled
       configuration hash MD5:
       00 E9 B6 7A A2 85 ED C7 34 08 36 98 17 FE 4E 26
       data hash MD5: 16K
       D6 68 73 F0 D0 40 67 F5 C9 B1 F8 9C 72 DB AE 37>)
$$ ##END=
$$ 
$$ hash MD5
$$ 8D AF AC 23 3C DD 31 D4 C9 AC C6 83 A4 7F A1 03
##$RELAX= 
##$RELAX= 
##$RELAX= 
##$RELAX= 
##$RELAX= 
##$RELAX= 
$$ Bruker specific parameters
$$ --------------------------
##$DU= <F:/spectra>
##$EXPNO= 1
##$NAME= <H-F>
##$PROCNO= 1
##$TYPE= <nmr>
##$USER= <she>
##$AMP= (0..31)
100 100 100 100 100 100 100 100 100 100 100 100 100 100 100 100 100 100 
100 100 100 100 100 100 100 100 100 100 100 100 100 100 
##$AQSEQ= 0
##$AQ_mod= 1
##$AUNM= <au_zg>
##$AUTOPOS= <>
##$BF1= 200.13
##$BF2= 200.13
##$BF3= 200.13
##$BF4= 200.13
##$BF5= 200.13
##$BF6= 200.13
##$BF7= 200.13
##$BF8= 200.13
##$BYTORDA= 1
##$CFDGTYP= 0
##$CFRGTYP= 5
##$CHEMSTR= <none>
##$CNST= (0..31)
1 1 145 1 1 1 1 1 1 1 1 1 1 1 1 1 1 1 1 1 1 1 1 1 1 1 1 1 1 1 1 1 
##$CPDPRG= <>
##$CPDPRG1= <>
##$CPDPRG2= <>
##$CPDPRG3= <>
##$CPDPRG4= <mlev>
##$CPDPRG5= <mlev>
##$CPDPRG6= <mlev>
##$CPDPRG7= <mlev>
##$CPDPRG8= <mlev>
##$CPDPRGB= <>
##$CPDPRGT= <>
##$D= (0..31)
0 1.2 0 0 0 0 0 0 0 0.06 0 0.03 0 0 0 0 0.0002 0 0 0 0 0 0 0 0 0 0 0 0 
0 0 0 
##$DATE= 1582803234
##$DBL= (0..7)
120 120 120 120 120 120 120 120 
##$DBP= (0..7)
150 150 150 150 150 150 150 150 
##$DBP07= 0
##$DBPNAM0= <>
##$DBPNAM1= <>
##$DBPNAM2= <>
##$DBPNAM3= <>
##$DBPNAM4= <>
##$DBPNAM5= <>
##$DBPNAM6= <>
##$DBPNAM7= <>
##$DBPOAL= (0..7)
0.5 0.5 0.5 0.5 0.5 0.5 0.5 0.5 
##$DBPOFFS= (0..7)
0 0 0 0 0 0 0 0 
##$DE= 6
##$DECBNUC= <off>
##$DECIM= 24
##$DECNUC= <off>
##$DECSTAT= 4
##$DIGMOD= 1
##$DIGTYP= 9
##$DL= (0..7)
0 120 120 120 120 120 120 120 
##$DP= (0..7)
150 150 150 150 150 150 150 150 
##$DP07= 0
##$DPNAME0= <>
##$DPNAME1= <>
##$DPNAME2= <>
##$DPNAME3= <>
##$DPNAME4= <>
##$DPNAME5= <>
##$DPNAME6= <>
##$DPNAME7= <>
##$DPOAL= (0..7)
0.5 0.5 0.5 0.5 0.5 0.5 0.5 0.5 
##$DPOFFS= (0..7)
0 0 0 0 0 0 0 0 
##$DQDMODE= 0
##$DR= 18
##$DS= 0
##$DSLIST= <SSSSSSSSSSSSSSS>
$$ [...]
##$SUBNAM2= <"">
##$SUBNAM3= <"">
##$SUBNAM4= <"">
##$SUBNAM5= <"">
##$SUBNAM6= <"">
##$SUBNAM7= <"">
##$SUBNAM8= <"">
##$SUBNAM9= <"">
##$SW= 24.9337058887773
##$SWIBOX= (0..15)
0 0 2 0 0 0 0 0 0 0 0 0 0 0 0 0 
##$SW_h= 4990.01996007984
##$TD= 16384
##$TD0= 1
##$TE= 0
##$TE2= 300
##$TE3= 300
##$TEG= 300
##$TL= (0..7)
0 120 120 120 120 120 120 120 
##$TP= (0..7)
150 150 150 150 150 150 150 150 
##$TP07= 0
##$TPNAME0= <>
##$TPNAME1= <>
##$TPNAME2= <>
##$TPNAME3= <>
##$TPNAME4= <>
##$TPNAME5= <>
##$TPNAME6= <>
##$TPNAME7= <>
##$TPOAL= (0..7)
0.5 0.5 0.5 0.5 0.5 0.5 0.5 0.5 
##$TPOFFS= (0..7)
0 0 0 0 0 0 0 0 
##$TUNHIN= 0
##$TUNHOUT= 0
##$TUNXOUT= 0
##$USERA1= <user>
##$USERA2= <user>
##$USERA3= <user>
##$USERA4= <user>
##$USERA5= <user>
##$V9= 5
##$VALIST= <valist>
##$VCLIST= <CCCCCCCCCCCCCCC>
##$VD= 0
##$VDLIST= <DDDDDDDDDDDDDDD>
##$VPLIST= <PPPPPPPPPPPPPPP>
##$VTLIST= <TTTTTTTTTTTTTTT>
##$WBST= 1024
##$WBSW= 4
##$XGAIN= (0..3)
0 0 0 0 
##$XL= 0
##$YL= 0
##$YMAX_a= 80964
##$YMIN_a= -35287
##$ZGOPTNS= <>
##$ZL1= 120
##$ZL2= 120
##$ZL3= 120
##$ZL4= 120
##$ABSF1= 10
##$ABSF2= 0
##$ABSG= 5
##$ABSL= 3
##$ALPHA= 0
##$AQORDER= 0
##$ASSFAC= 0
##$ASSFACI= 0
##$ASSFACX= 0
##$ASSWID= 0
##$AUNMP= <proc_1d>
##$AZFE= 0.1
##$AZFW= 0.1
##$BCFW= 1
##$BC_mod= 2
##$BYTORDP= 1
##$COROFFS= 0
##$CY= 11.3945322036743
##$DATMOD= 1
##$DC= 2
##$DFILT= <>
##$DTYPP= 0
##$F1P= 16.9975609425685
##$F2P= -3.02152046262296
##$FCOR= 0.5
##$FTSIZE= 0
##$FT_mod= 4
##$GAMMA= 1
##$GB= 0.15
##$INTBC= 1
##$INTSCL= 1
##$ISEN= 128
##$LB= 0.24
##$LEV0= 0
##$LPBIN= 0
##$MAXI= 10000
##$MC2= 0
##$MEAN= 0
##$ME_mod= 0
##$MI= 1.114404
##$NCOEF= 0
##$NC_proc= 0
##$NLEV= 6
##$NOISF1= 3.799351
##$NOISF2= 2.8
##$NSP= 1
##$NTH_PI= 0
##$NZP= 0
##$OFFSET= 15.70392
##$PC= 1
##$PHC0= -9795.591
##$PHC1= 29.00082
##$PH_mod= 1
##$PKNL= yes
##$PPARMOD= 0
##$PSCAL= 0
##$PSIGN= 0
##$REVERSE= no
##$SF= 200.130013532006
##$SI= 16384
##$SIGF1= 3
##$SIGF2= 2
##$SINO= 400
##$SIOLD= 16384
##$SREGLST= <1H.CDCl3>
##$SSB= 0
##$STSI= 0
##$STSR= 0
##$SW_p= 3612.71676300578
##$SYMM= 0
##$S_DEV= 0
##$TDeff= 0
##$TDoff= 0
##$TI= <>
##$TILT= no
##$TM1= 0
##$TM2= 0
##$TOPLEV= 0
##$USERP1= <user>
##$USERP2= <user>
##$USERP3= <user>
##$USERP4= <user>
##$USERP5= <user>
##$WDW= 1
##$XDIM= 8192
##$YMAX_p= 0
##$YMIN_p= 0
$$ End of Bruker specific parameters
$$ ---------------------------------
##NTUPLES= NMR FID
##VAR_NAME=  TIME,          FID/REAL,        FID/IMAG
##SYMBOL=    X,             R,               I
##VAR_TYPE=  INDEPENDENT,   DEPENDENT,       DEPENDENT
##VAR_FORM=  AFFN,          ASDF,            ASDF
##VAR_DIM=   8192,          8192,            8192
##UNITS=     SECONDS,       ARBITRARY UNITS, ARBITRARY UNITS
##FACTOR=    0.0002004,     1,               1
##FIRST=     0,             0,               0
##LAST=      1.6414764,     0,               0
##MIN=       0,             -35287,          0
##MAX=       1.6414764,     80964,           0
$$ Real data points
##PAGE= N=1
##DATA TABLE= (X++(R..R)), XYDATA
$$ [...]
2044G81m19m5K86J58n64k96m36n6L94M29Q15r4K11K7p72r64N0P0K17N56jN07R3
2067I47N17r86m78P8J8K30n88N53OL29qq2LK54k0k04m11m99j74K64K48O06L24
2090I27P5j71k35q12jj26j08J60L21Q88k42J68j38o99J36j78j75r4L99O4k51J26
2112C4n4N41K5R3m21k44k70k48J19r1O66L23K78j30m07m57J76k50q43P23Q0N98
2134B41k32J67j05J10j90l44J31k52J35rm54r6O70P2Q06k38j37m75k62m05k62
2155a129M04K38M35J16N20k43r5o99m26k44N26J09L89j15j80M68J8L2k57K65k68
2176a36l79J0k51P1K75J82N16K50k19j11m98m14m64M93J21L89N32N9K45l10m73
2197a12l50K16J37j38k43M31k04M82M4l04N47R6m46p4k97m03M17j49M27M86N75
$$ plain form
2044 781 362 317 603 761 197 -99 -535 -591 -197 232 1047 953 1164 1191 419 -545 -495 -425 -208 348 347 854 947
2067 947 1464 478 0 78 96 326 -262 291 297 626 618 536 539 793 773 569 158 -341 -515 -251 -3 603 927
2090 927 1002 831 596 -216 -217 -343 -451 -291 30 918 676 844 706 7 143 -35 -210 -304 95 159 -92 34
2112 34 -20 521 546 639 218 -26 -296 -544 -425 -516 150 473 751 621 214 -243 -67 -317 -1160 -437 -357 241
2134 241 9 176 71 181 -9 -353 -222 -474 -339 -348 -802 -898 -228 -156 650 412 275 -200 -462 -867 -1129
2155 -1129 -725 -487 -52 64 584 341 246 -453 -879 -1123 -597 -488 -99 -214 -394 74 92 124 -133 132 -136
2176 -136 -515 -505 -756 -685 -410 -228 288 538 319 208 -290 -704 -1168 -675 -554 -165 367 426 671 361 -112
2197 -112 -462 -246 -109 -247 -490 -59 -263 219 263 -41 506 602 156 82 -215 -618 -201 -350 77 563 1138
2218A138l40k00m6p98k83j03M07N25J98L55j86j80k03l17M51m54l35L83M72m41
2238D3mL40R8K06K8q4m13P5l04m25m8J33P24K80R5J3l32k37k75j29k35L08O15
2261D72J16j38j21n7Q9k85k9m88M03L7j89L46j65o2P80l53jJ96k93p05k22K06
2283d63J52N32K67K65n63N86l72r88Kj2K79J01K61K75J34l93K54k23l95K89L0
2304A8k96K36l09K14j09K92J25O35p46O0m16l07k55L77k34R13QO9L27m44k30n29
2326f01k0j20J37L04K87o9J48Q7j96L17j42l80l26K16m7j62K01L84K39j27L48
2347D78n82m05k4K75m77K38N44n5M86j98l85P7J28l69j32p4J85j00K6L19L9L61
2369C55J23j6m66l24K01l97K69k20M02N12K63j35j71J20o91j17l52N8Q48L13K73
$$ plain form
2218 1138 798 598 552 -246 -529 -632 -225 300 498 853 667 487 284 -33 418 -36 -371 12 484 43
2238 43 39 379 477 683 711 627 214 289 -15 -440 -488 -355 369 649 744 757 425 188 -87 -216 -451 -143 472
2261 472 588 450 329 272 361 76 47 -441 -38 -1 -190 156 -9 -71 709 356 355 551 258 -447 -669 -463
2283 -463 -311 221 488 753 190 776 404 -584 -582 -594 -315 -214 47 322 456 63 317 94 -301 -12 18
2304 18 -278 -42 -351 -137 -246 46 171 806 60 120 -296 -603 -858 -481 -715 198 206 275 602 158 -72 -601
2326 -601 -621 -741 -604 -300 -13 -82 66 153 -43 274 132 -248 -574 -358 -405 -567 -366 18 257 130 478
2347 478 -104 -509 -533 -258 -735 -497 47 -8 478 280 -105 -28 100 -269 -401 -475 -290 -390 -364 -45 -6 355
2369 355 478 462 -4 -328 -127 -524 -255 -475 -73 439 702 567 396 516 -175 -292 -644 -586 262 575 848
2390H48k83j43R4m83j00K90k47K53j11o4L1J14O7PM65k72J4l58k29n17J76O77
2412B29J65L84l23L06m99k34l43j27K50N51m93M84l5J76j91nk00n3Mj97J82J53
2434A84j7Mn3O4K19K80l7n76m45k40K37k76K65P81Q4J95m06l0p91K56j05l34L68
2457c73K73L75p0L2l53o7k2k85K03m8l42L09j64K11J94L56K1j99n68j00R8J01
2479d18j23j04M84J58J32L0l21Pn03m50O08k99N08L72k87J7L19J49l60j04J84
2500am24p1L9M9K02L54P2l28j20N13j81k73j45k38j0Q46o0K84J93m2m86m46J46
2523a27r8L32J12j96k57J43L21m8O93k54l75J53r59L38K2L10L36j44L52nJ28m71
2545C06l17m43L19J33K15K24K26j21M1l27j69R2k76J45J47j83q9N27l41Q0K80
$$ plain form
2390 848 565 422 516 33 -67 223 -24 229 118 54 85 199 266 273 738 466 480 122 -107 -624 -448 229
2412 229 394 778 455 761 262 28 -315 -442 -192 359 -134 350 315 491 300 295 95 42 46 -151 31 184
2434 184 167 171 118 182 401 681 644 68 -377 -617 -380 -656 -391 390 474 669 263 233 -558 -302 -407 -741 -373
2457 -373 -100 275 205 237 -116 -183 -205 -490 -287 -335 -677 -368 -532 -321 -127 229 250 51 -517 -617 -519 -418
2479 -418 -541 -645 -161 -3 129 159 -162 -155 -658 -1108 -500 -799 -291 81 -206 -189 130 279 -81 -185 -1
2500 -1 -425 -496 -457 -408 -206 148 220 -108 -228 285 104 -169 -314 -552 -562 284 224 508 701 659 173 -273 -127
2523 -127 -225 107 219 23 -234 -91 230 182 875 621 246 399 -560 -222 -200 110 446 302 654 649 777 306
2545 306 -11 -454 -135 -2 213 437 663 542 583 256 87 179 -97 48 195 12 -77 450 109 189 469
2566D69N3j09J62q59p5J19k9J23J02Q25j79J2q8o06j5k38k43M2M35L77P5j74l64
2589a85L41L06m64j82l59j80N04K54M4K17p9k37J52j32j20m82J50k57J45K91L15
2610D2K85j22k56J27m28j60m63K46L00O3J31M3J16M37l70n65K16q1j50J60L8Q2
2632c09J64j11O23l42l68J54k82k0l28J74O25nK6K35P1l49J6j37k36K31N4K21
2654A07l80K42K33P9Jj54j24k19j5j51m51R19J46R1K63j10pk25k8n44O9K9M31
2677B02o9j25K31M57m3l71N3j7k16o0l34J69M77K17j8l45J45J72j51l4l73p1J34
2700C0oL63p8M69k07J15m22l19K39k19O8L47K5P0K2k89L93m12K98n79j84J85L05
2723B14r0k12L50Q3K5N2j56k71n7j05k23l22M41P96l17M39k39k56m3l54q7k58
$$ plain form
2566 469 522 413 575 -284 -359 -240 -269 -146 -44 781 602 614 526 -80 -95 -333 -576 -534 -99 278 353 179 -185
2589 -185 156 462 -2 -184 -543 -723 -219 35 79 296 217 -20 132 0 -120 -602 -452 -709 -564 -273 42
2610 42 327 205 -51 76 -352 -512 -975 -729 -429 -366 -235 -192 -76 361 -9 -574 -358 -439 -589 -429 -391 -309
2632 -309 -145 -256 367 25 -343 -189 -471 -491 -819 -645 -20 -25 1 236 307 -42 -26 -163 -399 -168 -114 107
2654 107 -273 -31 202 281 282 128 4 -215 -230 -381 -832 87 233 324 587 477 470 245 217 -327 -258 -229 202
2677 202 133 8 239 696 653 282 335 318 102 42 -292 -123 354 571 553 208 353 525 374 340 -33 -104 30
2700 30 24 387 309 778 571 686 264 -55 184 -35 33 380 405 475 497 208 601 189 487 -92 -276 -91 214
2723 214 124 -88 262 345 370 422 266 -5 -62 -167 -390 -712 -271 525 208 647 408 152 109 -245 -332 -590
2745e90K39J76J44L50J7j49j26n45K52j79N04m44J97l67M11k3L30l4m23J28R4
2766c8m86P0m92L33L13K56J89J2K4l27J05l13k42k69M36M9J06J33M02lm16l26
2788d84O94o57M4N8K15K32j77J40O6J70m16r7N3k50J37m5K70r5K30M9J10M3j84
2811A06R8m20K7l8J13l7L46L22l80lJ95O4l85M2k91K70p2N1L20J46K07j61n78
2834e8l8J24j44j89N6L65M31Lj46k25Q2j31j95j23K69j34J69j74J23J54K87p5
2856D31k20P9l61l21J46l3QP67O7j85n1j95j4K11o41M0j4L55j67k0L28K66j85
2879B91k43k03N7k80R6ol07M97L03j23ll0J44p2M5l02j18j64J6N18j77J63J55
2902B57q3l17k71j7L76j39R7M5L34j52M7j00j62m8l81M64j64j16J72K27k4J1j2
$$ plain form
2745 -590 -351 -175 -31 319 336 187 61 -484 -232 -411 93 -351 -154 -521 -110 -133 197 163 -260 -132 -38
2766 -38 -524 -454 -946 -613 -300 -44 145 157 181 -146 -41 -354 -596 -865 -429 -380 -274 -141 261 258 -158 -484
2788 -484 210 -447 -403 -345 -130 102 -75 65 131 301 -115 -212 -159 -409 -272 -317 -47 -142 88 137 247 290 106
2811 106 204 -216 -189 -227 -114 -151 195 517 137 134 329 393 8 50 -241 29 -43 8 328 474 681 520 -58
2834 -58 -96 28 -116 -305 -249 116 547 550 404 179 261 130 -65 -188 81 -53 116 -58 65 219 506 431
2856 431 211 290 -71 -392 -246 -279 -271 496 563 378 327 132 118 329 -312 -272 -286 69 -98 -118 210 476 291
2879 291 48 -155 -98 -378 -282 -288 -595 -98 205 82 79 49 193 121 166 -136 -254 -418 -402 116 -61 102 257
2902 257 174 -143 -414 -431 -55 -194 -97 -52 282 130 177 77 -85 -133 -514 -50 -214 -330 -158 69 45 56 44
2925D4L92m10J0n23M38j67j51M34M06k07j18K24k49j06j02l5k00J92p9N93n25
2946a39N86j37k97P5m73K12j44J96Mn6L59J58k9P3j44k72J0j63k89M8L35Q7J95
2969A95j25J88q8J0j88n1r3r5L45O9j82J80j28M05k59l22o4j0K23j49l4L38N1
2992B16J51j23j13j5j8j99l00k0M68K34k21J66O6M6j41n0m38K09j74J16k4K29
3014F5r7J46M10l43k09K48n32J00q1n3J54J61J3N5K89p6pm98N5l24K05PM18J8
3038A24N0J77l22l3J46r0k4Rp5lJ91j39n4P4J72M7k2m86J29k70K62OL41J80K7
3063D17N3l24o5p1r4R4k17J89J47j56j67N10K53o70jJ33l50K88j16pJ83N5L14
3086C98j85k80J56k73J21j12K74k13K49Q6J81k2k61m7K46j35m35j30R9R9K16L25
$$ plain form
2925 44 436 26 36 -487 -49 -216 -367 67 473 266 148 372 123 17 -85 -120 -320 -128 -207 386 -139
2946 -139 447 310 13 88 -385 -173 -317 -121 -117 -173 186 344 315 388 244 -28 -18 -181 -470 -422 -87 0 195
2969 195 70 258 170 180 -8 -59 -152 -247 98 167 -15 165 37 442 183 -139 -203 -213 10 -139 -173 165 216
2992 216 367 244 131 116 98 -101 -401 -421 47 281 60 226 292 338 197 147 -291 -82 -256 -140 -164 65
3014 65 -32 114 524 181 -28 220 -312 -212 -293 -346 -192 -31 -18 37 326 250 243 -255 -200 -524 -319 -312 106 124
3038 124 174 351 29 -4 142 52 28 37 -38 -41 150 11 -43 31 203 250 228 -258 -129 -399 -137 -131 210 390 417
3063 417 470 146 81 10 -84 10 -207 -18 129 -27 -194 316 569 -101 -102 31 -319 -31 -147 -154 29 84 398
3086 398 213 -67 89 -184 -63 -175 99 -114 135 221 402 380 119 72 318 183 -252 -382 -283 -184 32 357
3108C57r4l8j20P9m25L67k94K55k08P0K26k56K42K34m42J37J61l20n26O35oj53
3130a19K13n4K14l8J4k09m17K85k97J65L30j61J24K1N2K36l46n1j75m99J63L57
3152a92J75j87q4K57M51m06j00k81J84O1J70j45j07K79K66k8k14J5N3r7k49j20
3174b99J12K9J35J89L5j05K26l24l95R0K32l8K22k4j82L93O2l16L6Nk08J8M6r3
3198a54M93r3p6J5L5L4m33J22L70m90M8m7m1L45m0L27k18k22J84k59n0J7j50M45
3222A62K53k14k9M7L18n60J23m21j86L76P5J68j26j2N19l73n2l08L46k69j70n3
3244c86K2M33j52K53j36L6q1k94L38n5m10L59Q0j97K29K23j75Q1j99j39j38K14
3266i4j58L2Q1O2O9J5J72l39J60j00l89J57j49M05r2J1K02p1J22j1k24J26n9p8
$$ plain form
3108 357 263 225 105 184 -241 126 -168 87 -121 -51 175 -81 161 395 -47 90 251 -69 -595 40 34 -119
3130 -119 94 40 254 216 230 21 -396 -111 -408 -243 87 -74 50 71 123 359 13 -38 -213 -712 -549 -192
3152 -192 -17 -204 -288 -31 420 14 -86 -367 -183 -122 48 -97 -204 75 341 313 99 114 167 70 -179 -299
3174 -299 -187 -158 -23 166 201 96 322 -2 -397 -307 -75 -113 109 85 -97 296 358 42 78 83 -125 -107 -61 -154
3198 -154 339 246 170 185 220 254 -179 -57 313 -177 -129 -176 -217 128 88 415 197 -25 159 -100 -150 -133 -283 162
3222 162 415 201 172 219 537 -23 100 -321 -507 -131 -56 112 -14 -26 493 120 68 -240 106 -163 -333 -386
3244 -386 -364 69 -83 170 34 70 -11 -305 33 -22 -432 -73 7 -190 39 262 87 168 -31 -170 -308 -94
3266 -94 -252 -220 -139 -77 -8 7 179 -160 0 -100 -489 -332 -481 -76 -168 -157 45 -26 96 85 -139 -13 -72 -150
3290a50J67j23J90N0K26k27k16L7M8m6k00K4K09K55P7J71j81J93m42l05j34J32
3312b45J00L4J40o7P6M22k59q1j67r8K21m73M76j47Q0J97O3J6j34o6KP5n09L55
3336A1P0j83N28j61J34p8l97L46m43K30j52J85O5j89N58k91r5k14J63j36Q4j24
3358h9j39M95L3l37k9P4k8N61m98r8k97Q9K70l00L33K7P0J80m2l15L50m94j9l51
3382e54O12j93RJ8J12M28m18j17k4k4J03Kj37n3L99n4J07o1j15n4m3O5j11j13
3406b16Q9J61j37l5J85R9qk80o9k06J56J00P1L26k79j67N04l21j96K23j6j95l3
3429b44L37q5J50k31J27J56M0l42k31J45J7Q8N4K97m17M35m03K49k45j28J81m55
3451e05N93j53L25j73m7K07l91K77j5o2j73j63L21J68j11j30J96j9j96J50m1j41
$$ plain form
3290 -150 17 -106 84 134 360 133 -83 -46 2 -44 -244 -220 -11 244 321 492 311 504 62 -243 -377 -245
3312 -245 -145 -111 29 -38 38 460 201 120 -47 -145 76 -397 79 -68 12 209 272 288 154 88 90 165 -344 11
3336 11 81 -102 426 265 399 321 -76 270 -173 57 -95 90 155 -34 524 233 138 -76 87 -49 35 -89
3358 -89 -228 267 300 -37 -66 8 -20 541 43 -55 -352 -263 7 -293 40 67 137 317 275 -40 310 -184 -203 -554
3382 -554 58 -135 -126 -108 4 432 14 -103 -127 -151 -48 -46 -183 -236 163 109 216 155 40 -14 -57 8 -103 -216
3406 -216 -127 34 -103 -138 47 146 138 -142 -211 -417 -261 -161 -90 236 -43 -210 294 -27 -223 0 -16 -211 -244
3429 -244 93 8 158 -73 54 210 250 -92 -323 -178 -161 -73 -19 278 -139 296 -107 142 -103 -231 -50 -505
3451 -505 88 -65 260 87 40 247 -144 133 118 56 -117 -280 41 209 98 -32 164 145 -51 99 58 -83
3473h3J50l07J08K30J99k52J30j6j40J01r7j31L00j34j58o6J58N53j08m31K78
3494B84k39j67K81k75K64j7J26kj22J64k13O5k96m4k45R1M83J70p4j28K49m02
3516d7N8R0j19j18k18R9QK9N22Q0j91j31p2J12j80j50K1o7P5L18kk86K64K7j58
3541c6k63L11k77j41K70K16K14l11R8l99M44l62R3l9k3j81L21J12n6J27p9j32
3563i3j47J01M6l65J60J10k45M90K26J16Kn56K19l80K63o8J2K84M2K10k22J79
3585C84r0k82k40K18j44R0p2K07j45M52k45j13l1L2J47l21n3n4L00J63LM6n4R7
3609B95r5k07Q2l41K35K95J98l66L77R9l46ok13k45K76J05n7k75K77J5k13K58
3631A48l73L80k53K61k90K1N6K63k41K26J05k40Q1k19L20k60om62L73K4J10L9
$$ plain form
3473 -83 67 -240 -132 98 297 45 175 159 19 120 23 -108 192 58 -100 -166 -8 545 437 6 284
3494 284 45 -122 159 -116 148 131 257 255 133 297 84 149 -147 -191 -436 -345 138 308 234 106 355 -47
3516 -47 11 101 -18 -136 -354 -255 -247 -218 304 384 193 62 -10 102 -78 -228 -207 -274 -199 119 117 -169 95 122 -36
3541 -36 -299 12 -265 -406 -136 80 294 -17 81 -318 126 -236 -143 -182 -205 -386 -65 47 -9 118 39 -93
3563 -93 -240 -139 -93 -458 -298 -188 -433 57 283 399 401 -155 64 -316 -53 -121 -109 175 217 427 205 384
3585 384 294 12 -228 -10 -154 -64 -136 71 -74 378 133 20 -11 21 168 -153 -206 -260 40 203 206 252 198 295
3609 295 200 -7 75 -266 -31 264 462 96 473 572 226 220 7 -238 38 143 86 -189 88 103 -110 148
3631 148 -225 155 -98 163 -127 -106 -50 213 -28 198 303 63 144 -75 245 -15 -21 -483 -110 -86 24 63
3653F3k69K09O1m55K06j57J11j7R6K56P7j0p3n0J50l46j24K6J52L8J46L8Q4n2
3677A60p0k62K9L12l64n5P1L01J8Q2k78R3J68l28J54k02J97o7J53m12K54O6J08
3700A28j29M1p3l7J01l93K41k2P8K43J18l08j21L35l90K9Oq8O7j4M07K52n51J01
3724B1L5q4o8N5j86L5M7O0M52k38l62L77k61p0J45j20L58m51K9K75N8J86k34k
3748E7j35q3J38O4k71N7J37J14J16Q8k61j73M04l02k18K56L5k3K19k76Q9N3k85
3771b00N20l04k5L9j94K64k14P06o64M11j82K24k51j15Q0q1p0n8j27K87N7K28
3793C31j88k7k36j00M9QK21J54Q9l72J72j11mj10j2J76k74J06L18J14l80K03q4
3816D3l0J37k80K33k95m9O1j36K90L5K71Rq5n98J96j16L07j17j35K18nqp1M92
$$ plain form
3653 63 -206 3 64 -391 -185 -342 -231 -248 -152 104 181 171 98 48 198 -148 -272 -246 -94 -56 90 128 212 160
3677 160 90 -172 -143 169 -195 -250 -179 122 140 222 -56 37 205 -123 31 -171 26 -41 112 -300 -46 20 128
3700 128 -1 40 -33 -70 31 -362 -121 -143 -65 178 296 -12 -133 202 -188 -159 -153 -241 -174 -188 219 471 -80 21
3724 21 56 -28 -96 -41 -227 -192 -145 -85 367 129 -233 144 -117 -187 -42 -162 196 -255 -226 49 107 293 59 57
3748 57 -78 -161 -23 41 -230 -173 -36 78 194 282 21 -152 252 -50 -268 -12 23 0 219 -57 32 85 -200
3771 -200 320 16 -9 30 -164 100 -114 592 -72 339 157 381 130 15 95 14 -56 -114 -241 46 103 331
3793 331 143 116 -120 -220 -171 -163 58 212 301 -71 101 -10 -14 -124 -136 40 -234 -128 190 304 -76 127 43
3816 43 13 150 -130 103 -192 -241 -180 -316 -26 9 280 289 204 -394 -198 -314 -7 -124 -259 -41 -46 -54 -125 367
3840C67l89N9r0j99k2L46L0k95N5K53j05K36k18o3np9n9J83n8K41J09pj10J6R1
3865B87l61P9j16m2j89M72J55m9m3j19J11k49l15K59J54j72K13M1K67m16L9J37
3887A43k0k67K40k34L2L39k4j23k73J37J82j17j98M1K04n9k65J46J74nqm4n2J71
3911A20k62l7K14o6K4K07j39j41K34k44J36q6j64J30r1l8K09J67K25k28j14Qk53
3934a89K59k78m3K38P2NJ9N6lm48L55k22o9J95l47K15J1L9J98O0J54P3k45j18
3958a3q8l02K67J96O6j22J9N3j22K26K8k68m9r5J45K28l6k40L17l9m4K2L5j42
3982D2k54R2j36LK33J05J8k62J55J1j77l14L77K7J14k45N46R7k98J11k14j93L07
4005A45k89J50k01N8K0R5K20q1k24J78J3l18P6J02j37Q3J41J93j13J6r2K2k4L3
$$ plain form
3840 367 -22 37 -53 -252 -274 72 102 -193 -138 115 10 246 28 -35 -40 -119 -178 5 -53 188 297 290 180 196 287
3865 287 -74 5 -111 -153 -342 130 285 236 193 74 185 -64 -379 -120 34 -138 75 116 383 -33 6 143
3887 143 123 -144 96 -138 -106 233 209 86 -187 -50 132 15 -183 -142 62 3 -262 -116 58 53 45 1 -51 120
3911 120 -142 -179 35 -31 -7 200 61 -80 154 -90 46 -40 -204 -74 -165 -203 6 173 398 170 56 64 -189
3934 -189 70 -208 -251 -13 59 64 83 139 136 -312 43 -179 -248 -53 -400 -185 -174 -135 63 123 277 350 105 -13
3958 -13 -101 -403 -136 60 126 4 23 76 -46 180 208 -60 -109 -204 -59 169 133 -107 210 171 127 149 184 42
3982 42 -212 -120 -256 -253 -20 85 103 -159 -4 7 -170 -484 -107 -80 34 -211 335 432 134 245 31 -162 145
4005 145 -144 6 -195 -137 -117 -22 198 117 -107 71 84 -234 -158 -56 -193 -110 31 224 111 127 35 57 33 66
4029F6J9l75L00J46m59O41r4k43L4j57J81j17P2k14M21l59J90j65p4J12j93K33
4051c5J15j10K5m4N9l0K22L5R6l07L4k51Jl7NK14J94k6k35M58l08j15j56k46M29
4076a3N5Q2l22Q9M14j9j78R2j37L8k60L5j92J21L69J37k25k01L03k26p7J47m7
4099a5j08JlK51j49K44j95K77l51j36L29k90K04k1m01M85j99K14j66o5N4J48l35
4122b27K40m5q8M13l8j9M3l21J12K5k80J74m8L22k79k0QM3L4O3l74K94k12K65
4146H5m87N23Q3k01J8N3q6O2l7m14L80j58J82k05K2K48J06j91k84L25mPl12J64
4170a21j2P9R9j37J84N4k27J2j58J91j01k34K89M25j49P6r7j26k63L4L48m80K62
4193e2q1J86J92M7j02k77J74k83M10l23q6J59J67k60K79r9k9oj25K7Q3N3n0J10
$$ plain form
4029 66 85 -290 10 156 -303 338 244 1 35 -122 59 -58 14 -200 221 -138 52 -113 -187 -75 -268 -35
4051 -35 80 -30 -5 -49 10 -20 202 237 333 26 60 -191 -190 -227 -222 -8 186 160 -75 383 75 -40 -196 -442 -13
4076 -13 42 124 -198 -109 305 286 108 200 63 101 -159 -124 -316 -195 174 311 86 -115 188 -38 -115 32 -15
4099 -15 -123 -122 -125 126 -23 221 26 303 -48 -184 145 -145 59 38 -363 122 -77 137 -29 -94 -40 108 -227
4122 -227 13 -32 -120 293 255 236 279 -42 70 95 -185 -11 -59 263 -16 -36 -28 15 49 112 -262 32 -180 85
4146 85 -402 121 204 3 21 74 -12 50 13 -401 -21 -179 3 -202 -180 68 174 -17 -301 24 20 27 -285 -121
4170 -121 -133 -54 45 -92 92 146 -81 -69 -227 -36 -137 -371 -82 343 194 270 173 47 -216 -182 166 -314 -52
4193 -52 -133 53 245 292 190 -87 87 -196 214 -109 -195 -36 131 -129 150 51 22 16 -109 -82 1 54 4 114
4217A14k34L16j33J19LJ23k85J94j83j13K21J1l20L49n7K4k73K84K4q2j59J25
4239F8N0j53K19o4J24j50J93l35K14o2l16L35k46K72J73l65K43j46P2k08j95K30
4261d7P5K84K5j06J0k61k1N3J72j54nk59K82j71J8J40j74K19j84k3J89N9j68o6
4285a13R7j03K49l5q2k68K79k68J44p4J14K02l13K82j5R7L8k57j5J33m69N01j05
4308A9m3L6j76K96l39M61K8l60o8K4M9K58o26o7M01%j91L66K3k05m3Kl1K77m26
4333c35N18j24j27M3J65j06m3qK11k76m8k07K75J86K9l80K70j35KK5k39M62j15
4356D3L02m89M62m70K36l8K70k31K97m35k42J74K51K27K75n57K43j93O0p4k84
4377a73j45L05J62l93M57Q0j63k24K97K67m62l16K01J65j52K67m4k6l04M19q7
$$ plain form
4217 114 -120 196 63 182 185 308 23 217 34 -79 142 153 -167 182 125 149 -124 160 184 102 -57 68
4239 68 118 -35 184 120 244 94 287 -48 166 104 -212 123 -123 149 322 -43 200 54 126 -82 -277 -47
4261 -47 28 312 337 231 241 -20 -41 12 184 30 25 -234 48 -123 -105 35 -139 80 -104 -127 62 121 -47 -113
4285 -113 -16 -119 130 95 13 -255 24 -244 -100 -174 -60 142 -171 111 96 193 231 -26 -41 92 -377 124 19
4308 19 -24 12 -164 132 -207 254 282 -78 -146 -122 -73 185 -441 -508 -107 -107 -298 68 91 -114 -157 -155 -186 91 -335
4333 -335 183 59 -68 -25 140 34 -9 -17 194 -82 -130 -337 -62 124 153 -227 43 -92 -90 -65 -304 158 43
4356 43 345 -144 318 -152 84 46 316 85 382 -53 -295 -121 130 357 632 75 318 125 185 111 -173
4377 -173 -318 -13 149 -244 213 293 130 -94 203 470 8 -308 -107 58 -94 173 129 103 -201 218 131
4398A31p7j34M0n0j1L60K8j17N5l32P0j26p0k8K53l5j03M04j89KJ88j83l43J16
4422a51J92m17J45K60r5LJ86j22J65p7k04L01l69j81L14R6j80K89j96K25j32l55
4444c03L60p6L63k44QJ38P2k42j31q5J5j64L32l73L25N5O4k92R6R6J41k69j30
4467b44J02K49k98l2O8J71Q0k7J48m97L99k20R0J05k67N1J4j51J01J78p5K84k73
4490d4j36J32M1n4q5K50m3Q2m16K77L41l71M5R6l23l1K24N5J4J15O7k17K5j33
4514h9J19J01j5j65J60j19J88l04O26k01m55O3j27L70k83K69R5k52pJ50J86j05
4536B05r9M1k64J72p4Q6j4L7J01k06N1J55k50k52K27Lp8k45N39l6l32L76n6l5
4560E2j80klk87M53N3J94J5j52J25m69K92j32M9j59K92l26J78j69L02j68J1q0
$$ plain form
4398 131 54 -80 -40 -90 -101 259 287 170 225 -107 -37 -163 -233 -261 -8 -43 -146 258 69 71 259 76 -267 -151
4422 -151 41 -376 -231 29 -66 -63 123 1 166 89 -115 186 -183 -364 -50 46 -134 155 -41 184 52 -303
4444 -303 57 -19 344 100 108 246 318 76 -55 -140 -125 -289 43 -330 -5 50 114 -178 -82 14 155 -114 -244
4467 -244 -142 107 -191 -223 -155 16 96 69 217 -280 119 -101 -11 94 -173 -122 -108 -259 -158 20 -55 229 -44
4490 -44 -180 -48 -7 -61 -146 104 61 143 -273 4 345 -26 19 115 -208 -239 -15 40 54 169 236 19 44 -89
4514 -89 30 131 116 -49 111 -8 180 -124 502 301 -154 -91 -218 152 -131 138 233 -19 -26 124 310 205
4536 205 106 147 -117 55 -19 67 53 90 191 -15 36 191 -59 -311 -84 -81 -159 -404 135 99 -233 143 87 52
4560 52 -128 -130 -133 -420 33 86 280 295 143 268 -201 91 -41 8 -151 141 -185 -7 -176 126 -42 -31 -111
4583a11K10J30l27LJ86J18L6j18j29Q4o9J01l15L16k06k3J98K2n8M1J04j77J19
4606A35j24k10o1L46m7j94K75k3m2k02N4P6O1j81L18k44K2M1J39j58p8n6L23j14
4630E6o4j31m23M91J34n6k7K37l47K19l87M16k22M2o1O0rK87j45k05K71M0k49
4653g3j86j00L33mJ65k55L12N9K0n9j85j91r8K43j10j32N52k86j23J75o9j56Q8
4676h0j0j53L3J41j3J08j22R0J96J1jj86j29M8N5j27K28k6j51J62J29N1k13N4
4700I5M8l00r2K70j27K6L37l59K98k43j22L44k57n6K80J72j92k64L09l0j76l50
4722c89N65k21k9j97O22m46J2J28j83P7l4l9L1p2J47mj69K38j33K47l32K07j59
4745a33L48Q8j25l89J98j12K45j35K72r4l39K14O5j85L33n46K21k16M76j6j41
$$ plain form
4583 -111 99 229 -98 -95 91 209 245 127 -2 82 13 114 -201 115 -91 -114 84 106 48 89 193 16 135
4606 135 11 -199 -260 86 39 -155 120 97 55 -147 -93 -17 44 -137 181 -63 -41 0 139 -19 -97 -153 170 56
4630 56 -8 -139 -562 -71 63 7 -20 217 -130 89 -298 118 -104 -62 -123 -63 -72 215 70 -135 136 176 -73
4653 -73 -259 -359 -26 -30 135 -120 192 251 271 212 27 -164 -262 -19 -129 -261 291 5 -118 57 -12 -168 -80
4676 -80 -90 -243 -210 -69 -82 26 -96 -6 190 201 200 14 -115 -67 -12 -139 89 63 -88 74 203 254 41 95
4700 95 143 -157 -249 21 -106 -80 257 -102 196 -47 -169 175 -82 -138 142 314 122 -142 167 137 -39 -389
4722 -389 176 -45 -74 -271 351 -95 -83 45 -138 -61 -95 -134 -103 -175 -28 -32 -201 37 -96 151 -181 26 -133
4745 -133 215 303 178 -211 -13 -125 120 -15 257 163 -176 38 103 -82 251 -295 -74 -290 186 170 29
4766B9J42p3k53M3J11k0K08j83J16N2J6j33N0Pj3j40J9j55O4J30j65Q2j51L53
4790A36K2k4L6j33k28L90l71J39J09Q0l13J76k03J07K7K26k10j4m4L02l57Q7N2
4813hO9j85K48l54r8j13N77kPl4L3o1j34K37j23k52N5J82Q2l20K71K64j60N0j81
4838E0k41J49k40L38J7k86L06j19k7P9O2j99J26j18K07nj0j20P0j44k2J77N6j14
4862hJ93j88n7k6J80k74l9K4K65j66j6m3L43r8Q9j83Q5Q9j64J49O5m14j2K95l07
4887b18N87m91K65j74J7J48j38K95Rk46k70L84J01j90K00J04j22k20j13L40j82
4908H6k29R7N8N3K7K6m2J69m23J52k29N4J89m1L43j71J9j41J60j68R5k65K43R1
4932A53m60K21K47k9l34L26M9P8j57j42J47j95p9K50j90K14q7j35L84m8k39J94
$$ plain form
4766 29 171 98 -155 -112 -1 -21 187 4 120 172 188 55 105 112 99 -41 -22 -177 -113 17 -148 -66 -217 136
4790 136 158 134 170 37 -191 199 -172 -33 76 156 -157 19 -184 -77 -50 176 -34 -48 -92 210 -147 -60 -8
4813 -8 61 -124 124 -230 -328 -441 136 134 141 107 140 79 -55 182 59 -193 -138 44 126 -194 77 341 181 231 50
4838 50 -191 -42 -282 56 73 -213 93 -26 -53 26 88 -111 15 -103 104 99 89 -31 39 -105 -127 50 106 -8
4862 -8 185 -3 -60 -86 94 -180 -219 -195 70 -96 -112 -155 188 90 179 -4 81 170 6 155 220 -194 -206 89 -218
4887 -218 369 -122 143 -31 -14 134 -4 291 300 54 -216 168 269 79 279 383 261 41 -72 268 86
4908 86 -143 -46 12 65 92 118 76 245 -178 -26 -255 -201 -12 -53 290 119 138 -3 157 -11 84 -181 62 153
4932 153 -307 -86 161 132 -202 124 173 251 94 -48 99 -96 -175 75 -115 99 12 -123 261 213 -26 168
4954A68o6l42J50m8J18J59J10j54n5l13M38j92j96J63J02k5r5j09j10M93n18Q2
4976b40k7K43J42l15J07K69l31K91j63K03j99kJ28j88k88N60j41l6oJ56j00j49
4998h6O5j2Q1j69J22j09J68K00l57k35J87M07j20l17L41l51K77j4j64L07k84J04
5020D1j47J47n6j63L47j25j65J85l08J05K65q8J0l7L14k49k77K07k16Q2M06n27
5042b49J7L01j61L8M3j02J18N2l87M52K84m55l8m7K21k54L65l80J43k76R8K42
5064B5m0j44M5P1j99K00k34L90k23J32p7l7%K19j11P0j80q2J79K1J25k61K02j02
5088a1k45j41J72L38j47j77o2N8J79o7j48M19j40prJ65m07j54K08K10m3O1M3j9
5112G6J25j78M7l70L81j20p9K12l50J63J29j62J77J51j87j43j44M49j58r3Q5q6
$$ plain form
4954 168 102 -240 -90 -138 -20 139 249 95 40 -273 165 -27 -223 -60 42 17 -78 -187 -297 196 -322 -240
4976 -240 -267 -24 118 -197 -90 179 -152 139 -24 179 -20 -22 106 -82 -370 190 49 13 7 163 63 -86
4998 -86 -21 -33 48 -121 1 -108 60 260 -97 -332 -145 262 142 -175 166 -185 92 78 -86 221 -63 41
5020 41 -106 41 -15 -178 169 44 -121 64 -244 -139 126 38 48 11 325 76 -201 6 -210 -128 278 -249
5042 -249 -232 69 -92 -54 -11 -113 5 57 -330 122 406 -49 -87 -134 87 -167 198 -182 -39 -315 -217 25
5064 25 -15 -159 -114 -43 -242 -42 -276 114 -109 23 -54 -91 -91 128 17 87 -93 -175 4 25 150 -111 91 -11
5088 -11 -256 -397 -225 113 -34 -211 -273 -215 -36 -103 -251 168 28 21 12 177 -230 -384 -176 34 -9 52 95 76
5112 76 201 23 70 -300 81 -39 -118 94 -256 -93 36 -126 51 202 15 -128 -272 177 19 -74 11 -75
5134g5L05k46n1K25j38J6ml5n7K37o4J45k10k12L73p6P5l00Q6l3l5L8m4N2J38
5159A10l43J45L0n5J66j44J73J17j41l15J98J18m9O5l9o3Q8J50k56K96j27p5j2
5182C7k4j62M47j74m47M12k85J36L13o24J57O10l74k82L31k68K64k40K24M8k2
5203G7J38J46m70j24K52j05j2J52k48L32j83PJ88j50N6l4o5J92Q6l78J7L02l36
5226a60K05j43J83K18k14j19k30p2j17M73J34J17k84K20k13r6K21Jj67k8J7J56
5248A02n19L86P2m2k62K00j60M03j22n2J76k6k14J82j5k09j55R9K9J21k2j74J76
5271b6P7K4k2j11K98o7j24P5k69j03K06jj91J26J79J20j64J05m59n7M22o1J35
5294A12l12K50K44p6j62K26l85j15L39M9j89j7j73O44j48m12J83j65K06k60M9
$$ plain form
5134 -75 230 -16 -67 158 20 36 32 -3 -60 177 113 258 48 -164 209 133 208 -92 -6 -39 -74 -36 -80 -28 110
5159 110 -233 -88 -58 -113 53 -91 82 199 58 -257 -59 59 10 75 36 -27 61 211 -45 251 124 49 37
5182 37 13 -149 298 124 -323 89 -196 -60 253 -371 -214 396 22 -260 71 -197 67 -173 51 99 77
5203 77 215 361 -109 -233 19 -86 -98 54 -194 138 -45 -38 150 0 56 22 -43 149 235 -143 -126 176 -160
5226 -160 45 -98 85 303 89 -30 -260 -332 -449 24 158 275 -9 211 -2 -98 123 124 -43 -71 -54 102
5248 102 -417 -31 41 -1 -263 -63 -223 180 58 6 182 156 -58 124 109 -100 -255 -156 -127 -6 -28 -202 -26
5271 -26 51 75 53 -58 240 173 49 124 -145 -248 -42 -43 -234 -108 71 191 27 132 -327 -384 38 -23 112
5294 112 -200 50 294 218 56 282 -103 -218 121 170 -19 -36 -209 435 287 -125 58 -107 99 -161 -112
5315a12K37j81L24N2j35l30Q3Q2j01Q4j99n5M97l89M4J23P8J06k38K36J83l68
5337B1k2K03m23O0J90k90M30k88K19j0k78K64j21J37k88O5L07N9L9j4k39j21j25
5360b25K50O6m65K3L02J04j41J63j29J26j82R2M1Q8J06n75M45j24L20l93QJ24
5382B4l75J98R4k17J42R9K62j64Ok31p6K70j54RJ10q8J37o9J46j50%J0Q8j46J81
5407A06j90o4QJ71j43K00k01K19l28L11Q4n94K53j17K81R2J6Q8Q2j3Qm58p2K15
5431d6q6K2p2K70k49Q6M9k29J28J57k57J84j20J24K73k54M0J69Ll60j13n0K9L42
5455D0j2Jl19K56J96k49Q4O2k08J43j78J27J61j62J45q6K31o9j36j29Q9K7j91
5478a77L04m0m8j24J72j43m9L45k85k76L4K25k77N2j5J35J21M40l64L7n00L33
$$ plain form
5315 -112 125 -56 268 320 185 -145 -62 20 -81 3 -196 -251 246 -143 -99 24 102 208 -30 206 389 21
5337 21 -1 202 -221 -161 29 -261 169 -119 100 90 -188 76 -45 92 -196 -131 176 235 274 260 21 -100 -225
5360 -225 25 91 -374 -351 -49 55 -86 77 -52 74 -108 -16 25 113 219 -356 89 -35 285 -108 -100 24
5382 24 -351 -153 -59 -276 -134 -35 227 63 69 -162 -238 32 -122 -113 -3 -91 46 -23 123 -27 -27 -17 71 -75 106
5407 106 -84 -148 -140 31 -112 88 -113 106 -222 89 173 -421 -168 -285 -4 88 104 192 274 261 269 -189 -261 -46
5431 -46 -132 -110 -182 88 -161 -75 -26 -255 -127 30 -227 -43 -163 -39 234 -20 20 189 192 -168 -281 -331 -302 40
5455 40 28 29 -290 -34 162 -87 -3 59 -149 -6 -184 -57 104 -58 87 1 232 163 27 -102 -13 14 -177
5478 -177 127 87 39 -85 87 -56 -105 240 -45 -321 -287 -62 -339 -287 -302 -167 -46 394 30 67 -433 -100
5500a00K98l67J35l66L96J72k47J38Jlk35l6L6L51l88L82k0k68K90l3j0l10L8
5523a46m1O0K81j89J4k2q2K24j77j90L64j5J47m69J49J88n2m6N4kO3p7n7N1R5
5548A25k44K44L8j84p8N5N4j06J27l0L5l21K70K39k76L75j48j55P6j41K46k24
5570b3J32O3l74K91l7j20L28m5k40Q2l11M30m00L7M42j14q8j33J50q3Oj68n7J72
5594f0O5L08j87j85j3O7n0M4K09l72l0O4J6k52P28l96q8L37k16k3j45J66K96n01
5618b18K47J54n8j22o5J75l50J76P7k39Q1L29l11L67j54m3J08l72k6M3L59k54
5640i6j65J71J85%O8j93J22J91l16k4J62J37p8m33pM66j21O6l1m1j67K89k34P5
5664B6J36o8Nj03j91M22q9k60J62n3n1L8J16R1m77J70K50O6j09K08l57L21k11
$$ plain form
5500 -100 198 -169 -34 -400 -4 168 -79 59 60 57 -178 -214 -178 173 -215 167 147 -121 169 136 126 -184 -146
5523 -146 -187 -127 154 -35 -21 -43 -125 99 -78 -268 96 81 228 -241 -92 96 44 -2 52 50 113 36 -21 30 125
5548 125 -119 125 163 -21 -99 -44 10 -96 31 1 36 -285 -15 224 -52 323 175 20 96 -45 201 -23
5570 -23 109 172 -202 89 52 -68 260 215 -25 57 -254 176 -224 -187 255 141 53 -80 70 -13 -7 -175 -232 -60
5594 -60 5 313 126 -59 -72 -5 -55 -11 198 -174 -204 -140 -124 -376 352 -44 -132 205 -11 -34 -179 -13 283 -218
5618 -218 29 183 125 3 -62 113 -237 -61 16 -223 -142 187 -124 243 89 46 154 -218 -244 -201 158 -96
5640 -96 -261 -90 95 95 163 -30 92 283 -33 -57 105 242 164 -269 -276 190 69 135 104 63 -104 185 -49 26
5664 26 162 94 99 -4 -195 227 138 -122 40 -13 -64 -26 90 181 -296 -126 124 190 81 289 -68 253 42
5687D2o4K01k18p8L59Q8r7l95J74pk58J73l5K12r4J46j77Q5K09l98J88j75J99
5710H0j62K67L7k29m6J48j92K14J18p0r7j08M7j28K27k02K40j89j05p5R2K05l03
5733b31J46J13L0J27P9j17m2j02n5L9j1J55R9l50j12K44K28m32L36j45j27j41
5755b69q6M73k04K24p4j65N8o3K74k18k3l5p7K43j78O08m28J60k04j03rJ57l59
5778b98J57L69k70J22R8l27Q9J23K6k25J14J62p3m4J15o8r0q2j08J53J16j30j3
5801h4K03J04r9k7j38k33M74J44l74J61q6r6J46R7l13K33Q5j23q2J23j12m3r3
5824a33l3K73j30K41K01j84N9L2k20l25l6K46J34l07N88l51r0L63l08R2m06K75
5846a9o5j37J00j9K51j9J42k23l4K35k14rl8R5j52q2K23m2K07k45p8p4n2L05l7
$$ plain form
5687 42 -22 179 -39 -117 242 330 233 -162 12 5 -253 -80 -115 97 3 149 -28 57 266 -132 56 -119 80
5710 80 -82 185 222 -7 -53 95 -97 117 235 165 68 -40 7 -121 106 -96 144 -45 -150 -225 -133 72 -231
5733 -231 -85 28 58 185 264 147 105 3 -52 -13 -24 131 230 -120 -232 12 240 -192 144 -1 -128 -269
5755 -269 -355 118 -86 138 64 -101 -43 -106 168 -50 -73 -108 -185 58 -120 488 60 220 16 -87 -96 61 -298
5778 -298 -141 228 -42 80 178 -149 -60 63 89 -136 -22 140 67 23 138 70 -20 -102 -210 -57 59 -71 -84
5801 -84 119 223 124 97 -41 -274 200 344 -30 131 45 -51 95 192 -121 112 197 74 -8 115 3 -40 -133
5824 -133 -166 107 -23 218 419 235 294 326 106 -219 -255 -9 125 -182 406 55 -35 328 20 112 -294 -19
5846 -19 -84 -221 -121 -140 111 92 234 11 -23 212 -2 -11 -49 46 -106 -188 35 -7 200 -45 -123 -197 -249 56 19
5871A9k29K37J12qj57N1j31r8N38l8m24J4K14n8j47K58j62R9l33J8J15N7K52l90
5895a91M30k64rJ75l7m84M23lj30J88o1J91l13JP3J36k50J73Nr4q4M7j28K84K48
5920C26m76J82J40J21r6k75p2K31J96m01K77j21K39O9P4l50J01r2j91j17J35J36
5942C6O0j45j78M95k4l11K09R2l07J43j91%J49JL3K09n09K95o5l3J10K6o9k8k8
5967c0J16N4m41J59J40P8J67k42j63J15p1Q5j06J09J44j19J38j35O7k13r1J83
5989e6j8J14J89J70n18j08n2J81K92j72L0r8j55L58k11L3J29R0l57n7J71L6k24
6012b33L40j90K33k13J78K4k47K04j32J8j93L18rJ6p0N8J20l47J84k34O6J1J69
6035G1j14J23N4k9k69L43j81j98K82j44L3J62m53K00N5Q6o4K16k04ok33J11K3
$$ plain form
5871 19 -210 27 139 131 -26 25 -106 -204 334 296 -128 -114 100 42 -105 153 -9 90 -243 -225 -110 -53 199 -191
5895 -191 239 -25 -34 141 104 -380 43 40 -90 98 37 228 -85 -84 -11 125 -125 48 53 -41 -125 -78 -206 78 326
5920 326 -150 32 172 293 197 -78 -150 81 277 -124 153 32 271 340 414 64 165 73 -118 -235 -100 36
5942 36 96 -49 -227 268 244 -67 142 234 -73 70 -121 -121 28 29 62 271 -238 57 -8 -41 69 95 26 -2 -30
5967 -30 86 140 -301 -142 -2 76 243 1 -162 -47 -118 -33 -139 -30 114 -5 133 -2 65 -148 -239 -56
5989 -56 -74 40 229 399 -119 -227 -279 -98 194 22 52 -46 -201 157 -54 -21 108 198 -159 -216 -45 -9 -233
6012 -233 107 -83 150 -63 115 139 -108 96 -36 -18 -211 107 98 114 44 102 222 -125 59 -175 -109 -98 71
6035 71 -43 80 134 105 -164 179 -2 -200 82 -62 -29 133 -320 -120 -65 21 -43 173 -31 -37 -270 -159 -136
6058a36K74k04K13l02L24m1pJ06l21J47j70K17j05J2J0L6L5N5q2p9o3m5K15k57
6082a68J37QL34j01l03Q5N2K07j53k22QJ75j23K72j66l4l93L01J45r1j08K9J70
6105F1j88K63j04K36k71J2N4l32j53O48m18L71l26L45lr9p0k71J32J99k58K21
6127D9Ml00L27n3k37pK32j47J46jnM7J0j07K72k62P6j89K47k49K66j45P5j34M6
6152c9PM6K41k09n6l9j04o3K26k16J0K55k18L9J52P4j40J06j90M05o9k41j5J97
6176A59k57J73Nj32J68o7k38p2j2O27k04j86K91j01R9M3k90j38J6L33k68r6N3
6199i4J21R7k57J87M31o07L5J29n4j51J00LN2J20j63J54l1j59L2J75k21K04r8
6222EN4p3q0J73p7O4j00L01l70j4K38Qj85j44Q4J71J06l26k1K00n6J87m34K36
$$ plain form
6058 -136 138 -66 147 -155 169 128 121 227 -94 53 -117 100 -5 7 17 53 88 143 61 -18 -81 -126 89 -168
6082 -168 -31 -23 311 210 -93 -8 44 251 98 -124 -116 59 -64 208 42 8 -385 -84 61 -30 -138 -109 61
6105 61 -127 136 32 268 -3 9 63 -269 -422 226 -192 179 -147 198 195 96 26 -245 -113 86 -172 49
6127 49 53 -247 80 27 -210 -217 15 -132 14 13 8 55 65 -42 230 -32 44 -145 102 -147 119 -26 49 -85 -39
6152 -39 -32 14 255 46 -10 -49 -153 -216 10 -206 -196 59 -159 -120 32 106 -34 72 -118 287 218 -23 -38 159
6176 159 -98 75 80 -52 116 49 -189 -261 -273 354 150 -36 255 154 253 296 6 -132 -116 217 -51 -147 -94
6199 -94 27 124 -133 54 485 -122 -87 42 -12 -163 -63 -60 -8 112 -51 103 72 -87 -55 120 -101 103 5
6222 5 59 -14 -94 79 2 66 -34 267 -103 -117 121 129 -56 -200 -116 55 161 -165 -186 14 -42 145 -289 -53
6246e3j85M99k79k9K18j2j6k85M7L87m33j4K42k03J68K33k71j79J7o6RK6OK08
6270C5J88l34J25l63K08J68j25o6K44N2k38Q7O5j13K6p1J56k62M7M1k52K01J51
6293c0P4M0j91j46K92l2J75j47k9J05j1j62J97KJ36p2j66j64P3J55k6j44o1j01
6317b33N25j80k79L32m10K77n4o7j1J9L16k38J09N4j57J34l3l16Q4O3k1J70L9
6340A23l45P5M35m80J3L62pn02J50J28K10k06J31L81p07L32J16l09j1M19l68Q3
6362B3o0J5P4j71k7j44M92l82J14mL9pK83q7k67J0k06K50p7K21r2k0J14l15L47
6387A23j76m3J66n4j64J7o8K21p1L0J77L9l91Q6J84m17J19P1J97K59n14L26l04
6410a87J93lj05M3KK54j43P2n6k3J64j47j08J02j32J91L8j40J89o4k54R1k60L78
$$ plain form
6246 -53 -238 261 -18 -47 171 159 143 -142 -95 292 -141 -155 87 -116 52 285 14 -165 -148 -214 -205 -179 -173 35
6270 35 223 -111 14 -349 -141 27 -98 -164 80 132 -106 -19 46 -67 -41 -112 44 -218 -171 -130 -382 -181 -30
6293 -30 44 84 -107 -253 39 7 182 35 6 111 100 -62 135 137 273 201 35 -129 -56 99 73 -71 -132 -233
6317 -233 292 112 -167 165 -245 32 -22 -89 -100 -81 235 -3 106 160 3 137 104 -212 -128 -65 -86 84 123
6340 123 -222 -147 288 -192 -179 183 176 -326 -176 -48 162 -44 87 468 -239 93 209 -100 -111 308 -60 23
6362 23 -37 -22 52 -119 -146 -290 202 -180 -66 -70 -31 -38 245 158 -109 -99 -305 -55 -132 89 -3 -23 91 -224 123
6387 123 -53 -96 70 16 -148 -131 -199 22 -49 -19 158 197 -194 -108 76 -341 -222 -151 46 305 -209 117 -187
6410 -187 6 3 -102 -59 -57 197 54 126 70 47 211 64 -44 58 -74 117 155 15 204 140 -114 -23 -283 95
6434I5j6l54J75M22k56r3j8O9k00K97j14k8K0J41j35j92M89n40L27J44j84j23
6456g4q1J80J42p6k4m11K10lk4J64%j18J08J3j40K66k08O7J85k3k89P4K2Q0l40
6481c00J71j9j1K55k55K43k50J04M25k96j40j77K98j49J84j74M29k79K2l0r3J31
6503H9r8j8j6Q4k22M69n02L06q2L4J47j22O8n57J89j13L83Rq3j09JK70J17m35
6527a91K02q5Lo4k6J86J21k32K0R0K04j46J4R5j87j17J13n6J04j02k00k1N83m56
6551a48L4J37j46l9J52M2k66P6K47l5M4j54j19L99l19J82J80p3j67R1k17j28J69
6574e8mm0M9J20l50O13k30Q0j72J28j78L20l83N2O1j15M01k88k3j4K98k68J37
6597A36q4j23J85j48l42M31L4J3j37K04j01k18J60n4nq1q0J23j0J13L45k58J13
$$ plain form
6434 95 79 -275 -100 322 66 -27 -45 24 -176 121 7 -21 -1 140 5 -187 302 -238 89 233 49 -74
6456 -74 -155 25 167 91 67 -344 -134 -137 -161 3 3 -115 -7 6 -134 132 -76 -9 176 153 -136 -62 -40 40 -300
6481 -300 -129 -148 -159 96 -159 84 -166 -62 363 67 -73 -250 48 -101 83 -91 338 59 81 51 -42 89
6503 89 -9 -27 -43 41 -181 288 -214 92 10 44 191 69 137 -420 -231 -344 39 48 -35 -144 -143 127 244 -191
6527 -191 11 -74 -71 -135 -161 25 146 -86 -66 24 228 82 96 191 4 -113 0 -56 48 -54 -254 -275 308 -148
6551 -148 -114 23 -123 -162 -10 32 -234 -158 89 54 98 -56 -175 224 -95 87 267 194 27 118 -99 -227 -58
6574 -58 -62 -102 -53 67 -283 330 100 180 8 136 -42 278 -105 -53 8 -107 294 6 -17 -31 267 -1 136
6597 136 52 -71 114 -34 -376 55 89 102 -35 169 68 -150 10 -44 -49 -130 -210 -87 -97 16 361 103 216
6620B16n07J86J9p2J38j10J31K55j16j21J60k33j9N35k67k89P0l00O68m33j21
6641b10N3K4J1K22l79kM02K5r5k17LN4r4M1K52k64J05nJ1m0J46j89K76k76L0k7
6667a43J37J64k37j63J12L10lo8q9m35M05j71J4K08K13l24Q7Q0j22k87K89O0r2
6690e5k00M75l57KJ1J74m2k71PK50j58j2J39p8L24j71k0QR0j28J41l26Q6J24k30
6715b17J42J48k99K10K65j78K01l75J02K24k18m14P75k86j91J28J24J22j15j66
6735a8j25L9jK90n27M2O93m42q5Q0KJ61K0p3L37l85k79J26Q6o1j1M37j71p2j29
6760f6J5o6k09M13L5j37M5K0L24l84K34n19J62J13j39L36j53j88M26j64P5J06
6782B79m38L6J09J58j65pk09L40j38k9J06Q0J43m91L42k19j60K72PK17j95j15
$$ plain form
6620 216 -291 -105 -86 -158 -20 -130 1 256 140 19 179 -54 -73 462 195 -94 -24 -324 344 -89 -210
6641 -210 -157 -133 -122 100 -279 -281 121 146 51 -166 -163 -109 -203 -162 90 -174 -69 -74 -63 -103 43 -146 130 -146 -116 -143
6667 -143 -6 158 -79 -242 -130 180 177 109 20 -415 -10 -181 -167 41 254 -70 17 97 -25 -312 -23 37 -55
6690 -55 -255 220 -137 -135 -124 50 8 -263 -256 -6 -164 -176 -37 -115 209 38 18 26 116 -12 129 -197 -111 13 -217
6715 -217 -75 73 -226 -16 249 71 272 -103 -1 223 5 -409 366 80 -111 17 141 263 148 -18
6735 -18 -143 -104 -105 185 -342 -300 393 -49 -134 -54 -52 109 129 56 393 8 -271 -145 -59 -120 -131 306 135 63 -66
6760 -66 -51 -117 -326 87 122 -15 30 50 374 -10 224 -295 -133 -20 -159 177 24 -164 262 98 173 279
6782 279 -159 -123 -14 144 -21 -28 -237 103 -35 -64 42 122 265 -226 116 -103 -263 9 16 233 38 -77
6804g7J06O2k18J68o4o8Q8J22J07m07K25j18J61m3J33n32K33M15m95K95j85N5
6826c7J92l7q0j25L06l62n7L04j27J30k54L02o8p8j69K07r2J26p4K8m1j18J16
6849hJ7J08j0m48L46n0L10j97o2J74pm70K50o8l5J39k7K13l14K71l7J29l73J70
6873B1o6K35k19k7k8J23j94j00n7L66N1q9r9j10J3K27N4j9P5l36K61R1k07K97
6897B63j81j99j6j0Q1J51j25K0k9K66j38j14N1k61K16n3L0J83K6k19O2K20J81
6920D05m27J99j2j43j50J49J39k84j21K35j15O4J57N1k48J55j10J15l75M31k45
6941a30Q7K1j0P9J73l33L1j10l4J37M09j71j12j5n0k10k04J78N23l91J59N1j78
6964a00J80k1Q7o3k15k7K69m01J74k2j19J90jJ32O9m8K49j53n84J91J68j2L4M9
$$ plain form
6804 -77 29 91 -127 41 -23 -91 -3 119 226 -181 44 -74 87 44 177 -355 -122 293 -202 93 -92 -37
6826 -37 155 118 38 -87 219 -143 -200 104 -23 107 -147 155 87 9 -160 47 -45 81 7 35 -6 -124 -8
6849 -8 9 117 107 -341 5 -45 265 68 6 180 173 -297 -47 -115 -150 -11 -38 175 -139 132 95 224 -149 21
6873 21 -45 190 -29 -56 -84 39 -155 -255 -312 54 105 16 -83 -193 -180 47 101 82 157 -179 82 173 -34 263
6897 263 82 -117 -133 -143 -62 89 -36 -16 -45 221 83 -31 20 -241 -25 -78 -48 135 161 -58 4 224 405
6920 405 -22 177 165 22 -128 21 160 -124 -245 -10 -125 -61 96 147 -101 54 -56 59 -316 115 -130
6941 -130 -43 -22 -32 47 220 -113 -82 -192 -226 -89 320 149 37 22 -28 -238 -442 -264 259 -132 27 78 -100
6964 -100 80 59 146 83 -132 -159 110 -291 -117 -139 -258 -68 -69 63 132 84 333 180 -404 -213 -45 -57 -23 26
6988B6O2k56K60M9l26J81N7k6L42Rm28J02j30K83m71J50j31L20r5j55J78j50J06
7011d3K20j35k3q5L38l1n16L25j23k10M58l18mK08k43J0rK11j73J07R8K67n52
7034b23k1L77j27m1j80J68l9K46J23o85K81J01L26m18M4qJ51j21j90K10m0m0M5
7057f1m6N3M5J5l87K22L08l4j86J21k3R2k20J39k71P7J61N0r5K30M5l05R7r0K27
7082A64l06J49j27j49Q0J27J43o7q2QJ08j50j21L21j4l3r9L45j68o9k19J45l69
7105c83M32k5l8k61J45L53k63K52j68K0K79j39N9l50K24r3j25K08j83j0J30o6
7127bJ15j60N9j58L17j11j33l1J37k98K67L60m46N01n35J04r7J12j45K10Jk85
7149b18J53J55l2J48j10K5o3L1k79N0J37j51J48J87k82j38K88m18L20jK26K1j10
$$ plain form
6988 26 88 -168 92 141 -185 -4 53 27 369 378 -50 52 -78 205 -266 -116 -247 73 -22 -177 1 -149 -43
7011 -43 177 42 19 -66 272 241 -275 50 -73 -283 175 -143 -147 61 -182 -172 -181 30 -143 -36 62 329 -223
7034 -223 -244 133 6 -35 -215 -47 -86 160 283 -402 -121 -20 306 -112 -68 -76 75 -46 -236 -26 -66 -106 -61
7057 -61 -107 -54 -9 6 -381 -159 149 115 -71 50 27 119 -101 38 -233 -156 5 55 -40 190 235 -70 27 -63 164
7082 164 -142 7 -120 -269 -189 -62 81 14 -68 -60 48 -102 -223 98 84 51 -48 297 129 60 -159 -14 -383
7105 -383 49 24 -14 -275 -130 223 -40 212 44 64 343 204 263 -87 137 44 -81 127 -56 -66 64 -2
7127 -2 113 -47 12 -146 171 60 -73 -104 33 -265 2 362 -84 417 -118 -14 -111 1 -144 66 67 -218
7149 -218 -65 90 58 206 96 121 58 89 -190 -140 -3 -154 -6 181 -101 -239 49 -369 -49 -50 176 197 87
7172H7k48O47n31L99n9m48L46j98J63P8m9K8l74M27k04j23K42l17kM20k22p4m8
7195f0J08M6o4pj2K67m34J16r0L32k84O2K8L4r4J94k75J57J07j96J47k07L15j6
7219A74j62j7j48P4J35j68LK13l34L05j36K77k20l74N25lr8j49P6R4j03J57k01
7242h0n6J7K19q6l9J7j09Mj31J87o0K13k5N4k12O9oK2m01L38K44k16L16n09J78
7267e2q5K67l01J96r4K6L26m95M25j77J29K7P8l34Q5J13k76J53Q2l12K75l09K6
7290b27K9M06m83K81j55K53N5k85J19p1K97m1l03J81k19K09q0n1Q0n5Q0J0L6O
7314G2oj81M6j19L57m30L75j85K44k8m35N81l35k88K40J25J67k28R7n7q8K84j42
7337F6M8j76J11j33J24l24M65n0l5j32O2N5j97N6j48R4J82l08L76K42n01J11O6
$$ plain form
7172 87 -161 486 -45 354 295 -153 193 -5 158 236 187 215 -159 268 64 -59 183 -134 -136 284 62 -12 -60
7195 -60 48 94 30 23 11 278 -156 -40 -130 202 -82 -20 8 42 -52 142 -133 24 131 -65 82 -125 190 174
7219 174 12 -5 -153 -79 56 -112 -109 104 -230 75 -61 216 -4 -378 147 144 46 -103 -27 67 -36 121 -80
7242 -80 -136 -119 100 14 -25 -8 -117 -113 -244 -57 -117 96 71 125 -87 -18 -24 -2 -403 -65 179 -37 279 -230 -52
7267 -52 -137 130 -171 25 -69 -43 283 -212 213 36 165 192 270 -64 21 134 -142 11 93 -219 56 -253 -227
7290 -227 -198 208 -275 6 -149 104 159 -126 -7 -78 219 178 -125 56 -163 46 -34 -85 -5 -60 20 30 66 72
7314 72 66 -115 -69 -188 169 -261 114 -71 173 145 -290 291 -44 -332 -92 33 200 -28 69 12 -76 208 66
7337 66 114 -62 49 -84 40 -284 181 131 96 -36 26 81 -116 -60 -208 -114 68 -240 136 378 -123 -12 54
7360E4j46K40j27l1K08l23l6L5K34o1J0k10J42k82M56m03J54J88k28J26J95l2
7382A63m98L44J42j22P5k39O9K76l52R0K19R1k82k29j26M73J70l22l4K22L7m16
7404b49J86j80J88k7J63j24J05l6j51K30Nj63Ql4r2J34J1K0j3K48l7k54j28K81
7428I1O7j07J23k07K85m27l54L72k0PK22J39k59K06j70J88k89j15R6J45M8P9r9
7451B1o2j95K59k33K34r4R4k79O32k94q7L67l35k67K18R4k52K02q7L6j14J49L84
7474C91l06j28J96Mq5O7j72j09L19l33J03J46m8l44N06l1k43l4L29m52J88p5L94
7497B83m24K25l65K46K31k75L6K4p7j56L30k7P9O7j21n5j0j35J24J45j87K42l19
7520a19k66L29m5K14K2n10L71o5n1J46J3K1K2k41r9N95n01R7N3j07J57l09K33
$$ plain form
7360 54 -92 148 21 -10 198 -125 -161 -126 108 47 57 -153 -11 -293 163 -240 -86 102 -126 0 195 163
7382 163 -335 9 151 29 104 -135 -66 210 -142 -52 167 258 -24 -253 -379 94 264 -58 -92 130 167 -249
7404 -249 -63 -243 -55 -82 81 -43 62 26 -125 105 110 -53 -45 -79 -171 -37 -26 -6 -19 229 192 -62 -190 91
7428 91 158 51 174 -33 252 -175 -529 -157 -177 -170 52 191 -68 138 -32 156 -133 -248 -152 -7 41 120 21
7451 21 -41 -236 23 -210 24 -70 24 -255 377 83 -4 363 28 -239 -21 73 -179 23 -64 -28 -142 7 391
7474 391 85 -43 153 157 72 139 -33 -142 177 -156 -53 93 45 -299 207 176 -67 -101 228 -224 -36 -111 283
7497 283 -141 84 -281 -35 196 -79 -43 -19 -96 -252 78 51 130 197 76 21 11 -124 0 145 -42 200 -119
7520 -119 -385 -56 -101 113 135 -375 -4 -69 -120 26 39 60 82 -159 -258 337 -164 -67 -14 -121 36 -273 -40
7543d0J30m00L12j26N8k7R7j62K15J12o6r7R0J01k88K68J72l43J96l45Q2P3J67
7566A79k14j07J63n2J56l47K65m3j66k9P6K10M9j46j46J29P1k6m10M28k7J1M4
7589F8O1J46N0l32J62l99L44J07j40J01j61k05K86l94N14j38J39k48K8J7N8N0
7611A14j62j61N4K49N0Q0j14o2l54K24R3j34k5K05N3j50J65k41J33k13j25J64
7633a57L08pk64J20pK70k33n6j64j02j1J33L67n2j68r0J42k56K95l2n3n6J93k77
7657a57p6N49k42J02n18L02J1j42M22k10j88oL20k61K49K2j71j74o7J73J82j4
7679A06q2k03J69j39J2R3JK65k79L2k33L31L8j50J18L3L1J6k26J58J07k79J05
7702B4j31J65J33n01Q7M55k08l8K35j12k66q7M34k49P1O9j84Q3j01K70j06j6L7
$$ plain form
7543 -40 90 -310 2 -124 -66 -93 4 -158 57 169 103 6 96 197 -91 177 349 6 202 -143 -61 12 179
7566 179 -35 -142 21 -31 125 -222 43 0 -166 -195 -119 91 140 -6 -152 -23 48 22 -388 40 13 24 68
7589 68 129 275 325 -7 155 -244 100 207 67 168 7 -198 88 -306 208 70 209 -39 -11 6 64 114
7611 114 -48 -209 -155 94 144 224 110 48 -306 -82 11 -123 -148 57 110 -40 125 -116 17 -196 -321 -157
7633 -157 151 144 -120 0 -7 263 30 -26 -190 -292 -303 -170 197 145 -23 -113 29 -227 68 36 -17 -73 120 -157
7657 -157 -233 316 74 176 -342 -40 -29 -171 251 41 -147 -153 167 -94 155 177 6 -168 -235 -62 120 106
7679 106 24 -179 -10 -149 -137 -44 -43 222 -57 -25 -258 73 111 -39 79 112 143 159 -67 91 198 -81 24
7702 24 -107 58 191 -310 -223 232 24 -14 221 109 -157 -244 190 -59 12 81 -103 -20 -121 149 43 27 64
7725F4k50M08k01M30k25l93K71k72J35J23p4NJ4q0k7J15R3j31NJ58K1l58L90o5
7749A56j8j96J6K4j72L7R9K07j26l6k1j0j71J86j4K90j75L8M4k28j22J39J35R0
7773A72O6l21j01J17L06l88J74m4m3Q6n4k28K60l22M54j99k0L58m42J22M5J39
7795A37j33J73l5j90K0m63N26k85J78K6P1nm8j5R4K03m90K62j04O7J05k40M68
7818C22m10j37mL04j8R1k54p4J20pj98L7J88K63m14K53K87k57o4j71j07J58j76
7841b68N79l99L09m3k2k89K62j82J02j1j34L93j58m3j94J97r7r0k2O2J65k24K90
7864A83N8j85nm0N5k59K37P9q2l86L14p5Q2j02M06k26k41J42k3j78L18k04K10
7887G8m36J80K69k78L08Q1k09k07L45j47n5J82M0m1J61Ll46j63J97m7j39J77J47
$$ plain form
7725 64 -186 222 21 451 226 -167 104 -168 -33 90 16 21 35 -45 -72 43 136 5 10 168 189 -169 221 156
7749 156 138 -58 -42 -18 -190 -153 -54 153 27 -9 -30 -40 -211 -25 -39 251 76 114 158 -70 -192 -53 82 172
7773 172 238 -83 -184 -67 239 -149 25 -19 -62 24 -30 -258 2 -320 134 -65 -85 273 -169 -47 -2 137
7795 137 4 177 142 -48 -28 -491 35 -250 -72 -46 25 20 -28 -43 51 254 -236 26 -78 -11 94 -146 322
7818 322 -88 -225 -229 75 57 148 -106 -180 -60 -67 -265 -228 -40 223 -191 62 349 92 28 -143 -250 -92 -268
7841 -268 311 -88 221 178 156 -133 129 -53 49 38 -96 297 139 96 -98 99 2 -88 -110 -48 117 -107 183
7864 183 241 56 51 11 66 -193 44 123 41 -345 -31 -106 -24 -126 280 54 -187 -45 -68 -246 72 -132 78
7887 78 -358 -178 91 -187 121 202 -7 -214 131 -16 -71 111 151 110 271 274 -72 -235 -38 -85 -224 -47 100
7910A00l6r9Q8j79J57j29k33M08j39k2q6L28N2j07j01j82K49k14M97l36k74K18
7932d0J40k62K31k49Q3L33q7l82J73m7j47J41j57M12k95Q5L93l96M61k57l19K46
7954F0k58L58k17Q6N9l4l76K39p3P6K33j43o8J34M1k07Q3O3L5J59l31q5P7l3L32
7979B10l10K67pj61j79O0J95K38l31m2M9K23Q8m70M5K16l0O2j69N7j03K06j33
8002a9J46J24j92r3Jl3j43K28j32J92J0l50k6K03l8K01J05k48m1L67n48L08k89
8025b67L86j72k54J07M30l56J71J4l32J11K21J14k09j04K31L1l7l29M24Qm01K10
8047cK72k18k49K9L11Kj93J80r9K2p5J92j89J14l00J03J04K13n38K58m03M53K53
8070B39m84L18j24J56j5l1Q8K0k39J25k11K82l03JJ34j15L35k69p1K59l38N28
$$ plain form
7910 100 64 -35 53 -126 31 -98 -331 77 -62 -84 -170 158 210 103 2 -180 69 -145 352 16 -258 -40
7932 -40 100 -162 69 -180 -97 236 149 -233 -60 -107 -254 -113 -270 142 -153 -68 325 -71 390 133 -186 60
7954 60 -198 160 -57 29 88 54 -322 -83 -156 -80 153 10 -58 76 117 -90 -7 56 91 250 -81 -166 -89 -122 210
7979 210 -100 167 160 -1 -180 -120 75 313 -18 -60 -11 212 300 -170 -125 91 61 123 -46 11 -92 114 -19
8002 -19 127 251 59 -34 -33 -66 -209 19 -113 79 89 -261 -287 -84 -122 79 184 -64 -105 262 -286 22 -267
8025 -267 119 -53 -307 -200 230 -126 45 59 -273 -162 59 173 -36 -140 91 122 85 -244 180 188 -213 -3
8047 -3 269 51 -198 -169 142 144 -49 131 32 54 -21 171 -18 96 -204 -101 3 216 -322 -64 -467 -14 239
8070 239 -245 73 -51 105 90 59 147 167 -72 53 -158 124 -179 -178 -44 -159 176 -93 -164 95 -243 285
8092B85k70R6N5J44j98O4j64j2k2J3L7Q8j89L67p15M49L4M6k17M5J91k94R3J95
8116A21J83j10l06j00K11K24k2j66J83l50MJ00J73j55J57j27L46j25l03nL43k63
8138A3j20M11m90J30P5K28L5p7j39n2J93k13k19J55K28k98K28l23L66j13L07m37
8160a12K62l30l6K53j57K14j06J64K1j36j8j3L57l13j36j08K50j87J37Q2j99K03
8182I2L0j53J00M0lj77K90j57k8
$$ plain form
8092 285 15 111 166 310 112 176 12 0 -22 -9 28 116 -73 294 -421 28 62 108 -109 -64 127 -167 -74 121
8116 121 304 194 -112 -212 -1 223 201 35 218 -132 -128 -28 145 -10 147 20 366 241 -62 -67 276 13
8138 13 -107 304 -186 -56 19 247 282 205 66 14 207 -6 -225 -70 158 -140 88 -235 131 18 325 -112
8160 -112 150 -180 -216 37 -120 94 -12 152 173 37 19 6 363 50 -86 -194 56 -131 6 88 -111 92
8182 92 122 -31 69 109 106 -71 219 62 34
8191C4
$$ Imaginary data points
##PAGE= N=2
##DATA TABLE= (X++(I..I)), XYDATA
0@%%%%%%%%%%%qJ6j6J6j6K1k9L2l7M5n1N9o9P8r0J03j16J33j50J71j94K16k41
34a27K69k99L34l73M14m60N09n63O23o88P63q47R41j048J167j307J473j669J909
53A021k207K591l109L848m998P065j1938M4520M4171m1963j5237p408K450k914
67A5892J8388J7938M37j8583m097N386K446o446M6K364m72k274N973L266p752
82C2512j3857l228Q050J1557O142o08q867j3560j2949l908R226J5334O736n786
96B6794q911k318k334o307m468N74J22j541L479Q844J354j0467j0768m182L53
111i776L635Q295M586q260j4880n738M782O920N939M316j034j0644j0935k189
125b4983K981K018K113K864J179J09J391K01p366r267l60N661M562K504K909j445
$$ plain form
0 0 0 0 0 0 0 0 0 0 0 0 0 -8 8 -8 8 -8 13 -16 16 -21 24 -27 32 -37 41 -49 54 -62 71 -79 92 -102 114 -127
34 -127 142 -157 177 -196 218 -242 267 -296 327 -361 402 -445 496 -552 615 -692 781 -888 1021
53 1021 -1186 1405 -1704 2144 -2854 4211 -7727 36793 80964 39001 23764 16356 18806 15892
67 15892 34280 52218 52655 34072 29975 35361 37807 31361 31407 33771 33299 31025 36998 40264 32512
82 32512 18655 15427 23477 35034 41176 40568 31701 18141 5192 1284 10510 25844 32580 26794
96 26794 17883 15565 13231 6924 2456 3030 3152 1611 5090 13934 15288 4821 -5947 -10129 -9776
111 -9776 -6141 2154 6740 -1520 -16400 -22138 -17356 -10436 -4497 -181 -1215 -11859 -22794 -24983
125 -24983 -22002 -19984 -17871 -15007 -13828 -13719 -12328 -12127 -19493 -28760 -29120 -23459 -18897 -16393 -13484 -14929
141a4929q279n795N563R767L316l540n835o732l706L667R413P680O73l349l701
156a5787k553j339J100J525J93m49J104M215N673J920m586o328j176M257K967
171i264R72K235R15m674m695L829R795M630k301k760j943m441l802L442O660K563
187A161L91N105M046l572p788l486N48m40K200Q692Q400j402q498n716J592K277
203C510K812L591K427k336n621l910J508M764L779K590Q60j84k537m571l712k035
219I35N52L323P138P195L05n387n908m681k932l39N827P850J353m574m040K33
235F850O58r78P88K446L69k768k019p42q4o79P20K708K904K479n59m278o644n040
253c869M85L981N616M630J790k168m666n412l114J63L162L281J157o62r96j1j899
$$ plain form
141 -14929 -23208 -29003 -23440 -13673 -10357 -13897 -19732 -26464 -30170 -26503 -17090 -9410 -8737 -12086 -15787
156 -15787 -18340 -19679 -18579 -17054 -16861 -17310 -16206 -11991 -6318 -4398 -8984 -15312 -16488 -12231 -9264
171 -9264 -8292 -6057 -5142 -9816 -14511 -10682 -887 3743 1442 -1318 -3261 -7702 -11504 -8062 -1402 1161
187 1161 1552 6657 10703 7131 -657 -4143 -3595 -4035 -1835 6857 15257 13855 5357 -359 1233 3510
203 3510 6322 9913 12340 10004 4383 473 1981 6745 10524 13114 13974 13790 11253 6682 2970 935
219 935 1487 4810 11948 19143 19448 14061 8153 3472 540 201 6028 13878 15231 10657 6617 6850
235 6850 7508 6530 7318 9764 10133 7365 5346 4604 4520 3841 4561 7269 10173 12652 12093 7815 1171 -3869
253 -3869 -3384 597 6213 10843 12633 10465 5799 387 -2727 -2564 598 3879 5036 4374 3378 3367 1468
270A468k615O80L180K068j830l440k010j018r79O57M215M991J427l635n319l409
286e569j617q90J499L565L508J011p93j771k527l428o98J481J389N99j2O96n83
303d140l015m56L881L315j604l694j521o15k048j491L455N005K379j298q36r00
319c583k659l741j361J901K900K560K706J032j929l658j693J543J083M85J134
334c280J096j398l268m79M104L925P19r41j15j079l877l598O95L628L702K405
350B239K896Q42k810m877l392l91J921L549L655J784j436k570j098L95J226K12
366B145J118R03j573k394r03J403K269J222P18J947Q56j579l936l821r52J497
382a080L051L353L885J202k530m237l505j002J282K102J757O32L83k8o13j109
$$ plain form
270 1468 -1147 -467 2713 4781 2951 -489 -2499 -3517 -4496 -3839 376 5367 6794 3159 -2160 -5569
286 -5569 -7186 -8076 -6577 -3012 496 1507 714 -1057 -3584 -7012 -7710 -6229 -4840 -4241 -4253 -3557 -4140
303 -4140 -7155 -7611 -3730 -415 -2019 -5713 -7234 -7849 -9897 -11388 -7933 -2928 -549 -1847 -2683 -3583
319 -3583 -6242 -9983 -11344 -9443 -6543 -3983 -1277 -245 -2174 -5832 -7525 -5982 -4899 -4414 -3280
334 -3280 -2184 -3582 -6850 -7329 -3225 700 1419 478 363 -716 -4593 -8191 -7496 -3868 -166 2239
350 2239 5135 5977 3167 -1710 -5102 -5493 -3572 -23 3632 5416 3980 1410 312 707 1933 2145
366 2145 3263 4166 2593 199 -704 699 2968 4190 4908 6855 7711 6132 2196 -1625 -2577 -1080
382 -1080 1971 5324 9209 10411 7881 3644 139 -863 419 2521 4278 4910 5293 5265 4652 3543
398C543l88N8N83J59k55j148q94o40k35P05K367K932K116k665m528l722n99M60
416b151J215L196M080P11l069k350j358N3j295o48M35J085R28M38N07m36j059
433B82k35P59j70j454j299j19o12j081J345M158K547j257l289k049k61j483j041
450e259J693K961J038j384k57J029K47j572j436m91m9k86M91Q32J22l5J082J392
468A18O05j525j575j437k125j375J493M527L109J13j756j167r17k208k030J100
484e050K001J737j08j35M32P1j024j151P15R13N72n02j681j511o04J224K222K710
502H31J845k2j893l862l498r28K013L890K465J979O07q83k403k821j662O96J791
519a855J458J049J366M67j026j858m43J256J904R30r87j210j386q65J75J394L055
$$ plain form
398 3543 3155 3213 3796 3955 3700 2552 1658 1018 783 1488 3855 6787 8903 6238 1710 -2012 -2611 -2151
416 -2151 -936 2260 6340 7051 3982 1632 274 327 -968 -1616 -1181 -96 832 1270 1777 1341 282
433 282 47 806 636 -818 -2117 -2236 -2848 -3929 -2584 1574 4121 2864 -425 -2474 -2735 -4218 -5259
450 -5259 -3566 -605 433 -951 -1208 -179 68 -1504 -2940 -3431 -3480 -3766 -3275 -2443 -2321 -2356 -1274 118
468 118 723 -802 -2377 -3814 -5939 -7314 -5821 -1294 1815 1928 172 -995 -1912 -4120 -6150 -5050
484 -5050 -3049 -1312 -1420 -1555 -1123 -1052 -2076 -3227 -2512 -1599 -1027 -1529 -3210 -4721 -5325 -4101 -1879 831
502 831 2676 2654 761 -3101 -6599 -7527 -5514 -1624 841 2820 3427 2544 141 -2680 -4342 -3646 -1855
519 -1855 -397 652 2018 2485 1459 -399 -842 414 2318 3248 2261 1051 -335 -1200 -1025 369 3424
536C424K719Q25j074k623k984j567L55J000K165K448K664N88j223l078k209n94
552H36k62L81K011K832R91j874j727k15O62O5L32P40o22j756j749j79J108J691
570C265J696J021j47j960j988j528j349o99L83K959K534L94r07r73j234k017j880
587b430J68J922O59q24m51J195P73l3j164l38l53j397j120n12J301K76J094Q83
605c51L15n78k2o72j165k332p29J270J324N96L63J088P01j383j285p97J78k43
623c722r26j94P87J479J011O44n7j83o03p80j874j032P76J200J192Q68R88P95
641C69o92j488k107n35R15J000M08L39N99M42rm41M21P04J4j031j578p12P33R20
661a729J014J754J243Q02j408j963j629j66L23k32R95K111J953P26j174p79j567
$$ plain form
536 3424 6143 6968 5894 3271 287 -1280 -925 75 2240 4688 7352 7940 6717 3639 1430 836
552 836 574 955 2966 5798 6789 4915 3188 2973 3635 3700 4032 4772 4150 2394 645 466 1574 3265
570 3265 4961 5982 5835 3875 1887 359 -990 -1689 -1306 1653 4187 4581 3674 2701 1467 -550 -2430
587 -2430 -2262 -340 319 -505 -956 239 1012 979 -185 -523 -876 -2273 -3393 -3905 -2604 -2328 -1234 -351
605 -351 -36 -614 -636 -1308 -2473 -4805 -5534 -4264 -2940 -2344 -1981 -893 -192 -1575 -2860 -3657 -3479 -3722
623 -3722 -4648 -4842 -4055 -2576 -1565 -921 -978 -1161 -1764 -2544 -4418 -5450 -4674 -3474 -2282 -1414 -426 369
641 369 -323 -1811 -3918 -4453 -3538 -2538 -2130 -1791 -1192 -750 -759 -1200 -779 -75 -61 -1092 -2670 -3382 -2649 -1729
661 -1729 -715 1039 2282 3084 1676 -287 -1916 -2082 -1759 -1991 -996 1115 3068 3794 2620 1841 274
678B74q14k78P99M84N16P85Q57n92o11J148Q64k51j566p14J99n60n89K75K143
697B369K100J91k34n95j133j776k062J64J342K261J543M86l69j163j016p37m07
714I64m04P49M14J76j85N3R68J169l82j331q31J02j74j645p95J394J604M80L8
733B364P17L43j644j819j240k37J55R07J321P26m2L30Q0q34j473r61O8l45l59
752a943N59J308P75q2k37j14o52o0j185j033m84Q26N65O87J290M52N4j522j520
771b316p01K57M9J10qR25L70O34K40r2n13j86j108j471m29O67J172P86L82R20
791c12Q31n44j012j977q28j90P54J228J199N16Q47m96j436m39O28N54j163q97
809b737O60K61J041L54R24M59Mr73j74q51o10K62M11l17P37K249K001n40j926
$$ plain form
678 274 -540 -818 -19 465 981 1766 2623 2031 1420 2568 3432 3181 1615 901 1100 540 -49 226 2369
697 2369 4469 4660 4426 3831 2698 922 -1140 -976 366 2627 4170 4656 4287 3124 2108 1371 964
714 964 560 1309 1723 1899 1714 1767 2735 3904 3522 2191 1360 1462 1288 -357 -1152 242 1846 2326 2364
733 2364 3081 3424 1780 -39 -1279 -1516 -1361 -454 867 1593 1551 1881 1961 1127 -346 -1307 -1239 -1584 -1943
752 -1943 -1384 -76 699 617 380 266 -386 -446 -1631 -2664 -3148 -2322 -1757 -1070 220 672 726 -796 -2316
771 -2316 -3017 -2760 -2711 -2601 -2609 -1684 -1314 -680 -440 -532 -1045 -1231 -2339 -3810 -4239 -3572 -2400 -1614 -1232 -312
791 -312 519 -25 -1037 -3014 -3842 -4032 -3278 -2050 -851 -335 512 16 -1420 -1859 -1231 -677 -1840 -2737
809 -2737 -2077 -1816 -775 -421 503 962 966 -7 -181 -1032 -1642 -1380 -969 -1286 -549 1700 3701 3161 1235
828A235r90r62n02m59J192J529J119J51k90k02M14l47r23j217J71P90O16k62K12
847A275Q93J15M28K91j19q79j243j435j87M79J875K113O48j493p71l48j01j362
865A79o13M67M11K9K77J621R67k70j430j512n08n3N48k52o27M09J154R54K91k99
885A743k09j392j842p08Q14J201N95K63p08p3R05P58m05j344j508l41k82J26J357
904a050J764L01r17q84M02L81l67j198j204q57P20J880J371J228L58j162k250
921a484j928K92R98J039M42l30L44N50L75l6p28r39K70J24m6k40L40J7o08M17
941a131J591K238J80j941k201j697j32R79K095K030P26r51n25r46l09L7q81m53
959a291l71R38J755J267l1q87j280m0j32O59K35j43r26r61Q5J286J965J057n77
$$ plain form
828 1235 245 -717 -1219 -1678 -486 1043 2162 2313 2023 1821 2235 1888 965 -252 -81 709 1325 1063 1275
847 1275 2168 2283 2711 3002 2883 2004 761 -674 -861 -382 1493 3606 4254 2761 1990 1642 1541 179
865 179 -434 33 444 473 750 2371 3338 3068 1638 126 -382 -435 113 -139 -766 -357 797 1751 2042 1743
885 1743 1534 142 -1700 -2408 -1594 -393 202 465 -243 -316 589 1347 942 -402 -1910 -2251 -2533 -2407 -1050
904 -1050 714 1015 98 -786 -384 -3 -370 -1568 -2772 -3629 -2909 -1029 342 1570 1928 766 -1484
921 -1484 -3412 -3120 -2122 -1083 -641 -971 -627 -77 298 262 -466 -1405 -1135 -1011 -1057 -1297 -957 -940 -1548 -1131
941 -1131 460 2698 2878 937 -1264 -2961 -3093 -2114 -19 2011 2737 1786 1261 315 6 43 -838 -1291
959 -1291 -1662 -724 1031 2298 2267 1380 100 60 -72 587 822 679 -247 -1208 -1123 163 2128 3185 2608
978B608j330j132l87o5m99p6J09J225R97J503M20j046j722k125j113N65K309K075
996B316k4j081j711P43K29L15O32m89j342j467k51Q99J887J218k05q96p15L17
1014C75L4o68j250q6K63P75J132J486K2q16j721j093L22N57L15j22r59m2J289
1033a87J569L98m31j399j740j86m2R26J035K99o50m80R10J340L26j446j688j435
1051b881L54Q83J248J061P26o83j127o55Q02J044m15j301j354K29M33J842J060
1068A266k21m37m54k56m98k95k18l43p55M36K021K222N43j488j758k026K23O06
1086a432N79J527Q3r23o26J67Q99J417K88j638j505p37N16Q37M26M55O22L03p2
1105A186J08k13p92o63j751l60J325K518J053n4r60r50m84k75l10J63O02J30k64
$$ plain form
978 2608 1278 146 -241 -306 -805 -881 -772 453 1450 2953 3373 2327 605 -1520 -2633 -2068 241 2316
996 2316 2292 1211 -500 243 472 787 1419 930 -412 -1879 -2130 -1231 656 1874 1669 773 58 375
1014 375 409 -259 -1509 -1595 -1332 -557 575 2061 2083 1267 -454 -1547 -1225 -668 -353 -475 -1434 -1476 -187
1033 -187 1382 1780 1349 -50 -1790 -1976 -2018 -1092 -57 242 -408 -888 22 1362 1688 242 -1446 -2881
1051 -2881 -2527 -1644 -396 665 1391 708 -419 -1074 -272 772 357 -944 -2298 -2069 -1636 206 1266
1068 1266 1045 608 154 -102 -600 -895 -1113 -1456 -2211 -1775 246 2468 3011 1523 -235 -2261 -2038 -1432
1086 -1432 -853 674 757 -166 -792 -625 274 1691 1979 341 -1164 -1901 -1385 -548 -122 333 955 1258 1186
1105 1186 1294 1081 289 -374 -2125 -2485 -1160 1358 2411 2357 1397 447 -37 -312 -622 -459 143 273 9
1124IP31N15N23j54q25p86o8L95on37l92M92N20J311N3O28l84j151j815q96M12
1145a425J525Q06O30k3kj01n44m65n14o46K7K16L43P04O86k79k49m62M79M17l46
1166G77j529q41pO34P71J230P73J6p05j412q62n04L38M04J97R5P37O19M08k73
1186H66j010m15n02l84p7M08Q97j40J95j64J115M58n62j144p53l59l8L91M00R02
1206H4L73P62l39r97l79m77k89m16L36Q74J111L31l90j73m5J89m91n70m47K99
1226f54n1J28M71P89M60M95p92l87r28l61k76m80M35J123J091L14m8n57q0q59
1246a67p39k88K00J220K56L1p5J61N38k72l18l49j28n14p3n15N78Q93N72K36j15
1267A132l67J48r61j278k27O64O49O66K61N09J25J7j346n85p5l05L84l5K74M97
$$ plain form
1124 9 740 1255 1778 1624 799 13 -55 340 334 -203 -595 -103 417 1728 1781 2409 2025 874 -941 -1837 -1425
1145 -1425 100 906 1536 1513 1511 1410 866 401 -113 -759 -732 -516 -173 531 1217 938 689 227 706 1123 777
1166 777 -752 -1593 -1600 -966 -195 1035 1808 1824 1119 -293 -1155 -1659 -1321 -917 -720 -625 112 731 1139 866
1186 866 -144 -559 -1061 -1445 -1522 -1114 -217 -357 -162 -326 789 1247 685 -459 -1212 -1571 -1609 -1218 -818 84
1206 84 457 1219 880 -117 -496 -973 -1262 -1678 -1342 -468 643 974 584 411 366 555 64 -506 -953 -654
1226 -654 -705 -577 -106 683 1143 1638 846 459 -469 -830 -1106 -1586 -1151 -28 1063 1377 1329 772 692 -167
1246 -167 -906 -1194 -994 226 482 513 438 599 1137 865 547 198 70 -444 -517 -1032 -454 439 1011 1247 1132
1267 1132 765 913 -48 -1326 -1553 -889 -240 426 687 1196 1321 1338 -8 -593 -668 -973 -589 -624 -350 147
1287A47P30j85j41k3j38m67m77n28k32N91M25J25O89Q79j76o95j180k03m56K71
1307a044J45L47R81K71J05m4o96q8n33j65m47Q8L4R43M67l67K48N83k73p89n39
1328g73p59R5K57L00N22J058L01n35p23Pm06j31p6n89L98M65R70J26n1J61j32
1349D85m59n80p24L02J89J19L00L05P90O61m36m97n45n31o42M09p8J238P50j26
1369I30M33n18j65k94n96k85n68P53O58M85o9q7Q4K3m02j92K22k91p36o29M64
1390g80R68J261M20l60m43n39q19k77k41K22M28N45N66RO49pr18r20n81N35L09
1411B7J11p9L51R6L32p2j72K97k71q88p31j52O52O37L11k84O5Q57j93j57j159
1432d22m05n22m1M56Q55J149Q73p16r08p43j04J45k83Nj81M55O29L16M4J04k11
$$ plain form
1287 147 877 692 551 528 390 -77 -554 -1082 -1314 -723 -298 -173 516 1395 1219 524 -656 -859 -1315 -1044
1307 -1044 -899 -552 429 700 805 761 65 -23 -556 -721 -1168 -1080 -1046 -103 364 -3 245 828 555 -234 -773
1328 -773 -1532 -1437 -1180 -880 -358 700 1001 466 -257 -250 -656 -787 -863 -1452 -1054 -589 381 507 456 617 485
1349 485 26 -554 -1278 -976 -787 -668 -368 -63 727 1388 952 455 -90 -621 -1263 -854 -932 306 1056 930
1369 930 1363 845 680 386 -210 -495 -1063 -310 348 833 764 677 761 784 382 190 412 121 -615 -1244 -780
1390 -780 188 1449 1869 1509 1066 527 -292 -569 -810 -588 -160 385 951 960 1609 1602 684 -236 -817 -282 27
1411 27 138 59 410 506 838 766 594 891 620 -268 -999 -1151 -499 138 449 165 230 1087 894 737 -422
1432 -422 -827 -1349 -1390 -934 -79 1070 1943 1227 319 -424 -528 -383 -666 -661 -842 -387 242 558 602 706 495
1453D95n26n51j90K71l2K36o1L45M06O58o4n38j42m16q63k92M35O52R38r9m71
1474A91M97J8p6k34j317k71J39O68O51N22O16n9o50p70j1j40J05l10J96l82L60
1495b57Q65K93J02N6m55q61o81K32J86J11M70LK84O59K65l62o69p71q1m25J56
1516h80K46N57N16L01J38o52J24r0j050n16l60O52N33P30P7L12j30o27q33K40
1536g12J29j71l73l08M21N03J219Q9o30m00l75k45m38j34M39K89K98J37O67K47
1556F52j23l21o72n41j27q6O39K96M97J79J94k27k17k67J0m43p11K23P82P52M95
1577I84l02k28j70J19k94n80Q3j44o5M80P59L52L35N3r56l23m10L43o1k05J85
1598d5J57J031L4J69K11n81n05l16k80j89P64K62n9J35M60J8rm98k61l13m25k29
$$ plain form
1453 495 -31 -582 -772 -501 -533 -297 -358 -13 393 1051 987 449 307 -109 -972 -1264 -829 -177 761 662 191
1474 191 688 706 630 396 -921 -1192 -1053 -385 266 788 1404 1345 695 -75 -86 -226 -121 -431 -235 -617 -257
1495 -257 608 901 1003 1059 604 -257 -938 -706 -520 -409 61 64 348 1007 1272 910 241 -530 -611 -1036 -880
1516 -880 -634 -77 439 740 878 226 350 260 -790 -1306 -1666 -1014 -481 249 326 638 508 -119 -952 -712
1536 -712 -583 -754 -1127 -1435 -1014 -511 708 797 167 -233 -608 -853 -1291 -1425 -986 -697 -399 -262 405 652
1556 652 529 208 -464 -1005 -1132 -1218 -579 -283 214 393 587 360 143 -124 -114 -557 -1268 -1045 -263 489 984
1577 984 682 454 284 403 109 -471 -388 -532 -597 -117 642 994 1329 1382 426 103 -307 36 -25 -230 -45
1598 -45 112 1143 1177 1346 1557 976 471 155 -125 -314 450 712 653 788 1248 1266 1257 759 498 185 -240 -469
1620d69J36P42O24L09k01j59j32k20l66m53j91R6L43N0P51J57L03l72p17n48k22
1641e39M4r0m7J85O79Q03l31m00m81J35o76n76l4n6P78K10L91m47L69M0k18n04
1663g65l59r5l52k56Q39N50N43L06q97j14J3j08o51l47o5O92M89J39J95L05k10
1684a48Pj039j44L22K43j66l72O03J94P85N4k61k87k96K9p19J16L89P46N03J49
1705G08q1p3K12m60q02j63J88M21L20L30L20K64j99K2n44m2J54j85k58l71N32
1726B93N36L30K68nr6j40j082n82L59J77L10J74N73O20J7k2j148l95l77qQ3M39
1748C24M08K87j51j87J18L3j4j95n79n33J45J27L67K84L23L57k10l08l78n93k99
1769f74l00K53M87M20O03P5l08m24o66k32j30p8P32pJ55MJ42L00J1j63m91m24
$$ plain form
1620 -469 -333 409 1033 1342 1141 982 850 630 264 -189 -380 -284 59 109 860 1017 1320 948 231 -317 -539
1641 -539 -495 -585 -632 -447 232 1035 704 304 -177 -42 -718 -1294 -1328 -1384 -606 -396 -5 -452 -83 -43 -261 -765
1663 -765 -1124 -1219 -1571 -1827 -988 -438 105 411 -486 -600 -587 -695 -1346 -1693 -1758 -1066 -577 -438 -243 62 -148
1684 -148 -141 -1180 -1324 -1002 -759 -925 -1297 -694 -500 285 339 78 -209 -505 -476 -1195 -1079 -690 56 559 708
1705 708 627 554 766 306 -496 -659 -471 -50 270 600 920 1184 985 1007 463 421 575 390 132 -239 293
1726 293 829 1159 1427 1422 1326 1186 104 -478 -119 58 368 542 1115 1735 1752 1730 582 187 -190 -198 -115 324
1748 324 732 1019 868 681 799 832 818 623 44 -489 -344 -217 150 434 757 1114 904 596 218 -375 -674
1769 -674 -974 -721 -234 186 789 864 556 132 -534 -766 -896 -974 -242 -249 -94 -90 52 352 363 200 -291 -715
1791g15n8k36N31o05J04O57K37N97p4k75l71o02j013J40Q73N86L35M6k38m1n00
1812f22j93k70n0J25M24k62L13J15N48j47j84j66J02l8p20k19j25N45L76N60L43
1833D55K8m0o40m10p62K53P32j17K54O16L68rq4l64o06M5K30k23L77J61K94o6
1855D92O0K26%K83l04q66J48k03N29K95N4N61K79k19k37o17j98J33l68K83M98
1876H29M30L22k66j64k14N9m17K00o52J43J78m3J75N66M05J20m90o88l67k54o1
1897a89K56J2L18N25J75j46q9m52k76k05o29L78K3N73j41j72J70L6L13Lp17l43
1919e77K77n62P8J61O57K68L59l80j52l06l64q86o5K53N96O74J30j26K05m95p83
1940a038l90J68M57j85N43k75j62J14L43L65j81m30M36o13n34o38N45Q03L5O63
$$ plain form
1791 -715 -773 -1009 -478 -1083 -979 -322 -85 512 438 163 -208 -810 -1823 -1683 -810 -224 111 157 -81 -122 -622
1812 -622 -815 -1085 -1135 -1010 -586 -848 -535 -420 128 -19 -203 -369 -267 -305 -1025 -1244 -1369 -824 -448 112 455
1833 455 483 443 -197 -607 -1369 -1116 -384 -501 -247 369 737 728 644 280 -326 -281 -51 -274 103 264 558 492
1855 492 552 778 778 1061 757 -109 39 -164 365 660 714 1275 1554 1335 1098 481 283 416 48 331 829
1876 829 1259 1581 1315 1151 937 996 579 779 127 270 448 405 580 1146 1551 1671 1181 493 126 -128 -189
1897 -189 67 79 397 922 1097 951 862 410 134 -71 -700 -322 -299 274 133 -39 131 167 480 483 -234 -577
1919 -577 -300 -862 -784 -623 34 302 661 281 129 -177 -541 -1427 -1492 -1239 -643 31 161 35 240 -255 -1038
1940 -1038 -1428 -1260 -803 -988 -445 -720 -882 -768 -425 -60 -241 -671 -235 -848 -1382 -2020 -1475 -672 -637 26
1960B6j10M1l2p03p63J33Q4N05M84L18N18m17k76l55k49O9J11J32k78J98K64L36
1982C6k17J76J73J55r9m69r7m42L43k5M48K00P75K5l36p52l8l28k38M84J90N10
2004D74M78M8k83n9j16m2n78r4L30P0L16m92N92J17L57L34n03l74k93m02k10k81
2026f11Q68M30O07L1l68r7l80k76j42j81L12N38K71k33k8J4rM6n72L63l50j03
2048A30k92k31N67O46j36J88l3r3l01l66q35K24L63N57L03p6K26n0o88l49m78
2069g24M96n7K38M36l56L92J64l20k28J10J4j27l22o33J76M03P9Q00l92M26J72
2090G47p78p45j83O5K27J51M60M32L63k06m95l31l86j16O0J12J18L17k41K51q
2111a86j91N22j91k85m28M6k45J10L79L53M81j11K13o30k74j05k64k47K30M59
$$ plain form
1960 26 -84 -43 -75 -778 -1541 -1408 -1324 -819 -335 -17 501 84 -192 -547 -796 -727 -616 -484 -762 -564 -300 36
1982 36 -181 -5 168 323 224 -245 -342 -784 -441 -466 -18 182 957 982 646 -106 -144 -472 -710 -226 -36 474
2004 474 952 1000 717 658 542 500 -78 -172 158 228 544 52 644 761 1118 1452 949 575 282 -120 -330 -611
2026 -611 257 687 1294 1325 957 860 480 204 62 -119 193 731 1002 769 741 755 746 792 220 583 233 130
2048 130 -162 -393 174 820 684 872 839 746 445 79 -756 -532 -169 388 691 615 841 791 103 -246 -724
2069 -724 -228 -285 -47 389 33 425 589 269 41 151 165 38 -284 -917 -741 -338 -259 541 149 575 747
2090 747 -31 -776 -959 -894 -667 -516 -56 376 739 533 38 -293 -679 -795 -735 -623 -505 -188 -429 -178 -186
2111 -186 -377 145 -46 -331 -759 -713 -958 -848 -469 -116 365 254 467 -163 -437 -542 -806 -1053 -823 -364
2131c64N27L26l78j82j13k25j87K82l52J49M2J59N5j28P46N9l5o36k04l5M5l96
2153h45M89M58L33Q1J16k46j07o67k87K40n1K81N30m1O4l29L82k91n26L67j71
2174b20K71k14j72j02O50K12L06l19O7J89n97k03n77K91N18M28K99l3K7k13k69
2195C39m38l28M97M4M59m54N42L5n7L7k31N0J7m59l59K0K34J36M57K10K79Jj64
2218H67p58m44k34J15L27M84M22K57j19n67m69k71K86Q3m7l10N24P2N3k85R6J91
2240B73Q9l79J3k41n98M80N3j13P33K32M63p42m47k35k94j62J25N78L52N53k04
2261E29l65m47J44j46o8l55L32K45J25J07k20K41K71k65p7j19k76l48M2L4M45
2282a71J76N72J06m38M3m27l67m40N8N19K75L46J03k42J91k88k14l39P2n0K16
$$ plain form
2131 -364 163 489 111 -71 -184 -409 -596 -314 -666 -517 -475 -316 -261 -389 357 416 381 -255 -459 -494 -449 -845
2153 -845 -356 102 435 516 632 386 279 -388 -675 -435 -486 -205 325 284 348 19 401 110 -416 -49 -220
2174 -220 51 -163 -335 -437 213 425 731 412 479 668 71 -132 -709 -418 100 528 827 794 821 608 339
2195 339 -99 -427 70 114 573 119 661 696 639 676 445 495 512 53 -306 -286 -52 84 541 751 1030 1031 867
2218 867 109 -335 -569 -454 -127 357 779 1036 917 350 -119 -390 -104 -21 -68 -378 146 218 271 -14 82 273
2240 273 362 -17 -4 -245 -843 -363 -310 -423 310 542 1005 263 -184 -419 -713 -875 -750 -172 180 733 529
2261 529 164 -283 -139 -285 -353 -708 -376 -131 -6 101 -119 122 393 128 51 -68 -344 -692 -650 -616 -171
2282 -171 5 577 683 245 288 -139 -506 -946 -888 -369 -94 252 355 113 304 16 -198 -537 -465 -515 -299
2303b99j3j4N3J65L59j59J24r3l56j30o85K88N4M26K56L71J83j57o00k88k52q8
2325h55M50o2L15L77j09J25k37k98M21l18J59l56j70p6O90p4L58O9M3p4n45j5
2347a82m21K28J10K30K94L54p2n8l36k01N0j13O7k40K66N38k04j6pL12m0J04n46
2370A17l73QK07J45j91N62J77J17J61n91k12n22K41k11M85J63L17O47m11m72m02
2391c8M16m62j19O1O42n53K44j08r4N34L9l19j8m00L69m20o4q0N06P77l44J69
2413G38l78j95n69j63J57k1K50M32K57l63O3J26k39n35l25L51P4J88l61M00J59
2434D6O7j47j01o5J15l53l65j06L86K49J87L80k67L57n35m17k57Q7K73j3p5K12
2456c42K05L41r8p31j26K37n2J04q9K37l11O43j75R6J84M33o50k05l17j4n3M47
$$ plain form
2303 -299 -312 -326 -273 -108 251 92 216 123 -233 -363 -1048 -760 -706 -280 -24 347 530 373 -227 -515 -767 -855
2325 -855 -405 -467 -152 225 116 241 4 -294 127 -191 -32 -388 -558 -634 56 -18 340 409 452 378 -167 -182
2347 -182 -603 -375 -265 -35 259 613 541 483 147 -54 -4 -117 -50 -290 -24 514 310 294 287 599 559 663 117
2370 117 -256 -248 -41 104 -87 475 652 769 930 339 127 -395 -154 -365 120 283 600 1247 836 364 -38
2391 -38 378 -84 -203 -142 500 -53 191 83 -11 523 562 243 225 -175 194 -226 -290 -370 136 913 569 738
2413 738 360 165 -404 -567 -410 -431 -181 251 508 145 208 334 95 -440 -765 -414 -340 -152 -513 -113 46
2434 46 113 -34 -135 -200 -85 -438 -803 -909 -523 -274 -87 293 26 383 -152 -569 -826 -739 -466 -479 -554 -342
2456 -342 -137 204 106 -625 -751 -514 -566 -462 -551 -314 -625 18 -157 -61 123 556 -94 -299 -616 -630 -683 -236
2478b36n5M33L89j37m30pk30m8M0n0j33P18O6k4Q2l37K60k80J18k23K39k09K74
2501B20j64N8N95R8j61j42l14j05m6M4m6n4J77L91L45nm77k02j09j04J33K2K65
2524D19K01l83L3L5L82M6m39m8j82l94J64L25M6K96N5m52N22k22m47j15m05j19
2546f82L89M06M96k71m4K50k71r09M43j73K70pm7P2m1J28K03O6m34K81n9m85J22
2569b97l09K98K8M07j0K27k30l58l53l3l15L13K40R3P45m01p7k50J2j7m2l22J65
2592d86j99M53J19q2R7J22J55k85k96j98j00M28j77l06O57M41k29J96m23j06m11
2613f30m70O32J13J58L07j16J25j66J42o2p2m64L30j01J80L8J94J06J37J27m02
2634A06j86Ko6J46m65L80K69K04K14j87j33j95N2k47k55K09M69L1j72R2j16K63
$$ plain form
2478 -236 -291 142 531 394 -36 -43 -273 -321 -281 -331 -464 254 320 296 378 41 301 21 139 -84 155 -54 220
2501 220 56 114 709 807 646 504 190 85 39 83 37 -17 160 551 896 891 414 212 103 -1 132 154 419
2524 419 620 237 270 305 687 733 294 246 64 -330 -166 159 205 501 556 104 626 404 -43 -158 -563 -682
2546 -682 -293 113 609 338 294 544 273 -636 -193 -366 -96 -103 -150 -78 -119 9 212 278 -156 125 66 -419 -297
2569 -297 -606 -308 -280 127 117 344 114 -244 -597 -630 -945 -632 -392 -299 446 45 -32 -282 -270 -287 -329 -651 -486
2592 -486 -685 -232 -113 -195 -98 24 179 -106 -402 -600 -700 -272 -449 -755 -98 343 114 310 -113 -219 -630
2613 -630 -1100 -468 -355 -197 110 -6 119 -47 95 33 -39 -503 -173 -274 -94 -56 138 244 381 508 106
2634 106 -80 -78 -144 2 -463 -83 186 390 604 417 284 89 141 -106 -361 -152 317 348 176 268 152 415
2656D15j48k5j69j11k0J21j71J49L09L02m0k95r5o1j09j67N6J01O7L32j96J93
2678D38j04p8k9k41o5o5J16P5j21K92L17l16K00M8l39J22l35k3j88n7J62M19J61
2701C89mr3j25r5n50n7J51K62J1J10M24j37j00j69l32K61k6m70K03K39j36N08
2723B64j91j31K74j73K34o25k36m11M96j9J84M85j09K97l86k77j54j40K1N02r7
2744a92J0J79m0j29L43m39K80j69k72O0J14K57l24R8M10k07J74k6l18K34o11J92
2766c76N0L09J82J11lJ09l19Jk63j88N0N5L54j40M30L11k31j46m14K05k72K03
2788A8k51K94k87J89K89K1j87J83n4k08l0n2j85L26J21K0j5J73J24L7m19m69O0
2811c02J93K24Q0Q8j5J77k79kj23k38K10j63qn3L57J43J57l6kl55j59j67j26K92
$$ plain form
2656 415 267 242 73 -38 -58 63 -108 41 350 652 612 317 222 161 52 -115 -59 42 109 441 245 438
2678 438 334 256 227 -14 -79 -144 -28 47 -74 218 535 219 419 467 128 250 -85 -108 -296 -353 -191 228 389
2701 389 385 292 167 72 -478 -535 -384 -122 -111 -1 423 286 186 17 -315 -54 -80 -550 -347 -108 -244 264
2723 264 73 -58 216 43 277 -348 -584 -995 -499 -518 -334 151 42 339 -47 -324 -478 -618 -597 -95 -192
2744 -192 -182 -3 -43 -172 171 -268 12 -157 -429 -369 -255 2 -322 -224 186 -21 153 127 -191 43 -568 -376
2766 -376 -326 -17 165 276 273 382 63 64 -199 -387 -337 -282 72 -68 362 673 442 296 -118 87 -185 18
2788 18 -233 61 -226 -37 252 273 86 269 215 7 -23 -75 -260 66 187 207 192 365 489 526 107 -362 -302
2811 -302 -109 115 195 283 268 445 166 164 41 -197 13 -150 -158 -211 146 289 446 410 408 53 -106 -273 -399 -107
2835a07k2M65k77J97K02r0j81L7n05Q8J37j39R7j10K18R9K23n8k8j68k32r7J4
2858b37P7j27j2K97K56J68m28m4j65J63j10o2O3J59L71l63Q3J46o5l08k13J0k7
2881c68j19K24o7K74L14k17M29l37l1l96J08J32l17K54K27J89K92k90j81K58q44
2902d66K97m06J13K06M95k86K65P2R4o19PN6J08j39OR0J27K00q2k3k2nj92K0m70
2927e54M36o0J06K48q8J76N1N2o33K8J07j14N3Q8J82J04K29k31q0k56J38l7l99
2950d54L96j39K30L10Pk03J4J1K68n36j61l8P4k30L5P62k94N00l47J03l61k69
2972c22K39p0N5n5M46l6k91K13j28J09k89j77q1K69j87P3M03k58O20j61l59k18
2994b05j99J08O5P3rL52kk8J97m97J75R9l51N4m04M02Q5q0L48K08p6O5l86o6J4
$$ plain form
2835 -107 -129 336 59 256 458 368 187 224 -281 -193 -56 -195 -98 -208 10 109 332 274 246 78 -154 -251 -237
2858 -237 -160 -287 -299 -2 254 422 -6 -50 -215 -52 -162 -224 -161 -2 369 6 89 235 170 -138 -351 -341 -368
2881 -368 -487 -263 -330 -56 258 41 470 133 102 -294 -186 -54 -371 -117 110 299 591 301 120 378 -466
2902 -466 -169 -575 -462 -256 239 -47 218 290 384 -235 -228 -172 -64 -203 -197 -107 20 220 138 115 93 88 -104 -84 -554
2927 -554 -118 -178 -72 176 88 264 315 367 -266 -238 -131 -245 -192 -104 78 182 411 180 100 -156 -18 -55 -454
2950 -454 -58 -197 33 343 350 147 161 172 440 -96 -257 -295 -221 -451 -416 346 52 552 205 308 -53 -322
2972 -322 -83 -153 -98 -153 293 257 -34 179 51 160 -129 -306 -387 -118 -305 -232 171 -87 533 372 13 -205
2994 -205 -404 -296 -231 -158 -167 185 183 155 352 -145 30 129 -222 -168 -572 -170 -85 -165 183 391 315 380 -6 -72 -58
3019e8j47j59J21K62K19j25K71m08L20j63m29K1l9K46K36K2L18n8l60K14l51j24
3041a71J6N2K58j62ko7kN99l44k30q1K71k84j44J04K13o8J61L38p4j35l27k5R
3065i5p6r1J66n0J97J73Ql3j11j92J73L2n45J69J73K55K23l34N7Q7J18k69j48
3088a13l31J09K48q8J17L12K07k09k16l35K30l94L63k55L8N68p8J96j70k47O1
3109A3K0n7k14J15m7k8J52J53J67j32j68p6J06j9m67L12j38J09M95k08j21Q3J73
3132B23k80k03k84K82L3Q9N16m69L33q1K13j83m11l3j10J95q8K85K18L13m28l9
3154I1L23l91k59j37L53J3j7J84J74j68J40o9L9j38k76J32l56L46J57q7J26M06
3176E86n02K14j03j53k13l9J81j57M4O26k26K03k11jm71j16J31O2P1n6p0M70Q
$$ plain form
3019 -58 -205 -364 -243 19 238 113 384 -24 296 133 -296 -275 -314 -68 168 190 508 450 90 304 -47 -171
3041 -171 -155 -103 155 -7 -9 -76 -78 521 177 -53 -134 137 -147 -291 -187 26 -42 119 457 383 248 -79 -104 -95
3065 -95 -171 -262 -96 -146 51 224 232 199 88 -104 69 101 -444 -275 -102 153 376 42 99 186 304 35 -113
3088 -113 -444 -335 -87 -175 -58 254 461 252 36 -299 -69 -463 -100 -355 -317 251 173 369 199 -48 13
3109 13 33 -24 -238 -123 -170 -198 -46 107 274 142 -26 -102 4 -15 -482 -170 -308 -199 296 88 -33 50 223
3132 223 -57 -260 -544 -262 -229 -140 376 -93 240 159 372 189 -222 -255 -365 -170 -258 27 245 558 130 91
3154 91 414 23 -236 -373 -20 -7 -24 160 334 166 306 237 276 138 -138 -6 -362 -16 141 54 180 586
3176 586 84 298 195 42 -171 -210 -29 -186 -142 484 258 461 250 249 -222 -338 -207 -145 -74 -130 -200 270 278
3199B78j86k09O3l7k02O9m9K22J46j5J54J04r7p5k91p7k40J85M65m37K87K19N8
3222C35k00k20N1k63M0j04j3j02M84R2n3k3R5k01k36L77m73J06j32K63L23m55
3244c09M89k07K6j26J03k81L27k63K22k41O7M43K8k43J97k85P6m18j01L30L03
3265A37o9j43L92k91L21m95K38q1q9j25L2K44K35K17k73j33K72k79j50m0J40j55
3287i5N5J03J35J7j63M03j16j76k74K6L65k96j64L14L98j09k38l6j16k27L38k27
3309h3j54KN57j94K13r9r9K10l09j18j06K27N9j37k5M52k85k57P8q0K11k57k1
3332b15J78j85J40J45lM8N7l8p1j08j86l07K97RK1N63j68q0K46k76mk09j70K34
3356h2L5n1J24O2l1J79l63N8o7K6K14j64P1k26L90R4k02J97K3m57J96O0k87k30
$$ plain form
3199 278 92 -117 -54 -91 -293 -224 -273 -51 95 80 234 338 241 166 -125 -202 -442 -257 208 -229 58 277 335
3222 335 135 -85 -34 -297 -257 -361 -374 -476 8 100 47 24 119 -82 -318 59 -414 -308 -440 -177 146 -309
3244 -309 180 -27 -1 -127 -24 -305 22 -241 -19 -260 -193 250 278 35 232 -53 23 -395 -496 -166 137
3265 137 68 -75 317 26 347 -148 90 9 -80 -205 -173 71 306 523 250 117 389 110 -40 -80 60 -95
3287 -95 -40 63 198 215 52 455 339 163 -111 -85 280 -16 -180 134 532 423 185 149 33 -194 144 -83
3309 -83 -237 -235 322 128 341 242 143 353 44 -74 -180 47 106 -31 -56 396 111 -146 -68 -148 63 -194 -215
3332 -215 -37 -222 -82 63 60 108 165 127 56 -52 -238 -545 -248 -239 -218 345 177 97 343 67 63 -146 -316 -82
3356 -82 -47 -98 26 88 57 236 -127 -69 -136 -110 104 -60 11 -215 175 269 67 264 287 -170 26 86 -201 -431
3380d31K90R4j0M19ll18L64k77k36N5j10J01r3K86J32o3J07m23M5pj4K8LK20j18
3405D1K91k56M4P9q4j1j13j8l38j2K99R4l0M10j16M8j88j22m6m2J59l01J97K70
3429B55K3k9j38qJ22l25j67K96r8J56mJ17l3l1K24L5m57Q4j08j4k66M86k93K35
3453F2J96nm5Q4m99K90k33n0K57m2o8K68k36K00l88J40p5l7L46m09J79K22j0j29
3477A8J48l50K44k48k4r2j23M35j27J72J88K9L9n35K73j74k72J53J95j94K37N
3499ck88M56j89J84k44k06K6p5M17j18J41p7J75j45Pn8j29j59j09M96p7o6J53
3522A12J41j44k2j94p1L20q2k36L38k18K52K32l21j44K84j14k96j8k1L73k4K7
3544A74k02J69j02K51l97j9K4l7J54J50k45L37j90L58m41J64j82O7J13k52K94
$$ plain form
3380 -431 -141 -47 -57 362 359 41 405 128 -108 -53 -163 -62 -155 131 263 200 307 -116 -71 -78 -92 -64 -61 159 41
3405 41 332 76 120 199 115 104 -9 -27 -365 -377 -78 16 -14 396 280 328 140 18 -28 -70 89 -212 -15 255
3429 255 278 249 111 103 225 -100 -267 29 -69 87 83 200 167 136 360 395 -62 22 -86 -100 -366 120 -173 62
3453 62 258 253 208 292 -207 83 -150 -200 57 15 -53 215 -21 179 -209 -69 -144 -181 165 -244 -65 157 147 18
3477 18 166 -184 60 -188 -212 -304 -427 8 -119 53 241 270 309 -226 47 -127 -399 -246 -51 -245 -8 -3
3499 -3 -291 165 -24 160 -84 -290 -264 -339 78 -40 101 24 199 54 61 3 -126 -285 -394 102 25 -41 112
3522 112 253 109 87 -107 -178 142 60 -176 162 -56 196 428 107 -37 247 133 -163 -181 -202 171 147 174
3544 174 -28 141 39 290 -107 -126 -102 -139 15 165 -80 257 67 425 -16 148 -34 33 146 -106 188
3565A88m30O39k68K51j4o6m4l07N6q7L4M9M43j49q1L2j41J63j21K4l48J58k48
3588b67M23j46K87J45l43j01J07n5j37M7J0o8J34l00K72L2J55J58k28p8k97k31
3610d81L89K10m3j15J80p4J03j40M1m52L36j41o0n0K18j8M24l94J84m87K24j81
3632c27P4L0j50M0M06j04o6m6M7J2o0Q1k28J68N4OJ6J12nK24j55m35j7K50k97
3657c70K50k00N86M7l24K6L1j62L42l46N9j25J36Q5L0K55k1n29J87K24n70K60
3679a29N3R7o6m3J44N3K5j15l4J23J51l51k19J43K11J14P4m6j10mP9j33K12j99
3703C0j79j11J99J29M0J41P4l19q9j37O2o6J03J57k16j8N07l41P6j7K4R3k27M3
3727d2J84K45n6k74L04l67K64q3j20l27K14J54O8j55m2KJ88j5p7N7j27l6J59o3
$$ plain form
3565 188 -242 397 129 380 366 300 256 -51 5 -82 -48 1 444 295 214 246 105 268 147 171 -177 -19 -267
3588 -267 156 10 297 442 99 -2 105 50 -87 -40 -30 -98 36 -264 8 40 195 353 125 47 -250 -481
3610 -481 -92 118 75 -40 140 66 169 29 70 -382 -46 -187 -247 -297 -79 -97 327 -67 117 -370 -146 -327
3632 -327 -253 -223 -373 -333 73 -31 -97 -143 -96 -84 -144 -63 -291 -123 -69 -63 -47 65 60 284 129 -306 -323 -73 -370
3657 -370 -120 -320 266 313 -11 15 46 -116 226 -120 -61 -186 -50 35 65 320 299 -230 -43 181 -389 -129
3679 -129 -76 21 -45 -88 56 109 134 19 -15 108 259 -92 -311 -168 43 157 231 185 75 71 150 17 229 30
3703 30 -149 -260 -61 68 108 249 323 4 -85 -222 -160 -226 -123 34 -182 -200 307 -34 42 25 49 142 -85 -42
3727 -42 142 387 331 57 361 -6 258 175 55 -272 -58 96 164 9 -33 -31 157 142 65 122 -5 -41 118 55
3751E5J90j95K57l65K74M6n7m94l50P64l77Q7J04M16k36R7k63K01l48J94k97l7
3773c34L87j69K78l52K08M1j05K46k18o4n8K93M8l81J26J91q4K41jl24J5j92L33
3796A25k80K90j96j28J46Q2O6k4M6k07l2j37M8J62J1R8O1J08n72K37K97m5j92
3819c6k81M95k44J93l31L30l87M74k62j13O5k8oL12j41L20k28k79J73%p6o4j4
3842a28p6K94mN9j76J77N1l25L33k23j61J64j89N7P1J23J01j24k1K9k59K98k36
3865a65K87m94L33P5L30k53J62j4k62k77N29l20J05r7n7L47j31J50n33L55q4k9
3887d3J9l17M37P3J26j55N8q0j82R1j03L73n48k3K39O0k9J58J78l50p0K55j72
3910eK9R5k32L11j43o2l5J0J48r7K81m18N2j1J30l8J97j3N4M2k11q2k69L0L03
$$ plain form
3751 55 245 50 307 -58 216 262 205 -289 -639 125 -252 -165 -61 355 119 216 -47 154 -194 0 -297 -334
3773 -334 53 -116 162 -190 18 59 -46 200 -18 -82 -140 153 201 -180 -54 137 53 294 293 -31 -16 -208 125
3796 125 -155 135 -61 -189 -43 39 105 81 127 -80 -112 -249 -201 -39 -28 70 131 239 -333 -96 201 156 -36
3819 -36 -317 178 -66 127 -204 126 -261 213 -49 -162 -97 -125 -131 181 40 360 132 -147 26 26 -50 -114 -128
3842 -128 -204 90 86 145 -31 146 197 -128 205 -18 -179 -15 -204 -147 -76 47 148 24 3 32 -227 71 -165
3865 -165 122 -372 -39 36 366 113 275 261 -1 -278 251 -69 36 -61 -118 229 98 248 -285 70 -14 -43
3887 -43 -24 -341 96 169 295 140 198 118 -64 27 -76 297 -251 -274 -35 25 -4 154 332 -18 -88 167 -5
3910 -5 24 119 -113 198 55 -7 -42 -32 116 19 300 -118 -66 -77 53 15 212 199 253 295 84 2 -267 -237 66
3935F6l53K27k5J36J35j34p9J97k84j99L07mj38K41k27J42N88l76k41J48j23j02
3957i8p3J52O2q9L24O6l39j10j49J45mJ11J72r1J77n2J35l83K08j3ok49Q9o1k34
3982c10L06L3q1J80r0L5k94M88m54j46L15l54M76k29L8K08K12k85j87O0nj69l9
4005b92R6L40J29j68n7o7O9l62J82m7k3Q0J03k54M10j3J50j74j59p8q2pL74m68
4029c18J22Q5L72j29k24O4r1j78L57j39O3l3k3K40q7j47j66L32oJ8k80L14l8K42
4053C50l26q8K87m20L72l7l28K26N0N3l30K77J47k4L90m93M5K8j66n6j64L64k41
4076h4J32J69j77M14n89L82m63K32J47k48K15lJ2K26r2m23K94q9l7k36k25N75
4098A32q4o2j7L35r8n3k13K51m04J78k3J26J04l44K33J78m17K64Kk38K76r7k46
$$ plain form
3935 66 -287 -60 -85 51 186 52 -27 170 -114 -313 -6 -10 -148 93 -134 8 596 220 -21 127 4 -98
3957 -98 -171 -19 43 -46 278 344 5 -105 -254 -109 -113 -2 170 79 256 204 339 -44 164 151 145 -104 -15 -76 -310
3982 -310 -4 29 -52 128 38 73 -221 267 -187 -333 -18 -372 104 -125 -87 121 333 48 -139 -79 -84 -253 -292
4005 -292 -196 144 273 105 48 -19 50 -312 -130 -177 -200 -120 -17 -271 139 126 276 102 -57 -135 -217 -224 150 -318
4029 -318 -196 -111 261 132 -92 -28 -119 -297 60 -79 -16 -49 -72 168 81 -66 -232 100 94 112 -168 146 108 350
4053 350 24 -64 223 -197 175 138 -190 36 86 139 -191 86 233 209 599 106 151 179 13 -43 -207 157 -84
4076 -84 48 217 40 454 -135 247 -216 16 163 -85 130 127 139 365 273 -150 144 55 18 -218 -443 132
4098 132 48 -14 -31 304 206 153 -60 191 -213 -35 -58 68 172 -172 61 239 -178 86 88 -150 126 29 -217
4121b17J50oJ91m7l5K35l13J27k61K5N2o6J86J08K62l55N6qk39M12m65L0N2P1
4145e5K29j13MK19J0j64m43L26Qj37O9j5K75o9JJ00k03r4k43P1J23Rr0M74k79
4170A3k1N5J31o8k34P2J44j67K21k96K51K00l46J02k68N2Q2L3m32M77R8k9J97
4193B67k13%lL91o59N29k55j54J48j72K34n1L5%J65K8p26L64j41O5M1j6J08J41
4217A26J10J61m41Q5j58K33j81J73j29N9K5k14K52k19N55m69P8k09j1J49j43J80
4239A2J42J53r2Q9o04M26j88q5J85k24K44J22k96Q6L25l72n4J17p1j89N3R1J82
4262E2n3J82oK1k12k9j49j71J76J31n6L00r6k77R1n4L63j42k33k3qp9L35q3J25
4287A05j07M0j77J75j48pL86o59L45N9p6L52j44k98K2J59K03l59K39l92J38J38
$$ plain form
4121 -217 -67 -73 118 71 36 271 -42 85 -176 -151 -99 -165 21 129 391 36 92 84 -155 257 -208 -178 -126 -55
4145 -55 174 61 65 284 294 130 -313 13 21 -116 -47 -62 213 144 145 245 42 -52 -295 -224 -101 -92 -182 292 13
4170 13 -8 47 178 110 -124 -52 92 -75 146 -150 101 301 -45 57 -211 -159 -77 -44 -476 1 99 70 267
4193 267 54 54 51 442 -217 312 57 -97 51 -121 113 62 97 97 262 290 -436 -72 -213 -148 -107 -123 -15 126
4217 126 236 397 -44 41 -117 116 -65 108 -21 38 63 -151 101 -118 437 -32 46 -163 -174 -25 -168 12
4239 12 154 307 215 304 -300 126 -62 -147 38 -186 58 180 -116 -30 295 -77 -131 -14 -85 -274 -221 -130 52
4262 52 -1 181 175 196 -16 -45 -194 -365 -189 -58 -114 186 90 -187 -96 -150 213 71 -162 -185 -193 -272 63 -20 105
4287 105 -2 38 -139 36 -112 -119 267 -392 -47 12 -64 288 144 -154 -132 27 230 -129 110 -282 -144 -6
4309f%K95k05R2j75p4K2o3j11J00K77Pl66L56K23k57k89J65l21K30n0M51R7m15
4333a7K27j94J76k77N6k41K64N3m0j09mL96l37J97m0J07j76L4k12K72J33j84k8
4356E6m1J20l22K73k56J61N9r2n8J76P6N4p9o5m0j80L48m92N79l54Q3L30K36n73
4380ak3O0P4j35J35j28k13L87o2k7K8K49m00j34j02M23j94J20M4l86J66L53j19
4403A15k70L27n32J3L22j23N0p7K15l66Q8O35k90K5n3j69J34j41Kj9K9j26P0n8
4427a99l1J86J91j45j47MQ1K73n4k62L54k45j69K9L71m00K39LM2J50l46L13k12
4450B6j41J99j61P1K2n1j65K27l9lO1l68P17k92j58J9q0l18K53J58L32l43K14
4473A80k04M0J10l05M7m4L57k69L39k49J09J00l14j78K48J47l01L70j5j97m9j49
$$ plain form
4309 -6 -6 289 84 176 1 -73 -51 -114 -225 -125 152 159 -207 149 372 115 -174 -9 -330 -100 -150 301 398 -17
4333 -17 210 16 192 -85 -29 -270 -6 47 7 -102 -106 290 -47 150 110 217 41 75 -137 135 268 84 56
4356 56 15 135 -187 86 -170 -9 50 -42 -100 76 152 206 127 62 22 -158 190 -302 277 -77 6 336 572 -1
4380 -1 -24 36 110 -25 110 -18 -231 156 94 67 95 344 -56 -190 -292 131 -63 57 101 -285 -119 234 115
4403 115 -155 172 -360 -347 -25 -148 -98 -175 40 -326 -238 397 107 132 79 -90 44 -97 -95 -114 -85 -211 -141 -199
4427 -199 -230 -44 147 2 -145 -141 -60 213 159 -103 251 6 -163 -134 237 -163 76 79 121 271 -75 238 26
4450 26 -115 84 -77 -6 16 -35 -200 27 -12 -15 46 -322 395 103 -55 -36 -116 -434 -181 -23 309 -34 180
4473 180 -24 16 126 -179 -132 -176 181 -88 251 2 111 211 -103 -281 -33 114 -187 183 168 -29 -78 -227
4495b27M22Q4k71JJ05j06k38j53K83n1K16l3K10o9Lrk44o3K0K40n2k34M74k20
4519H8K01l61J64m5l03J96K14j51n1K89p8k29J19r1n2l8R0J42k49J06J22J19l42
4542a40K56L67p10J3J92kn5J7J29M4l2o0J37j33j19J84R9l88L81k51O6J9m6N0
4566A8J15m20L10r3o6j00Q9J85P3J73l78K09j10kl50J63K45j49L04m7k94K26l48
4589b47J26J97j88q7K6N9J52q1Q2p4J29j18jJ46r7j85k9j65L74J94n9R0k4r8j9
4614A03j87k47K4K33J00q2j63M26j70j7l1J18j80m2jq9K2L01j24J0n2R0K63l09
4638dk4k5O8K61k85N8l4J83p8j65n9N4j17M1m0mK75l24L19k73K12m2J82j44j03
4663f8J09j70M3J73l42L82k1Q2k91j3M7J19m19K98j21K11K19k95L51j66j13O3
$$ plain form
4495 -227 195 279 8 9 114 8 -230 -383 -100 -151 65 32 242 173 176 167 -77 -140 -120 120 68 -166 308 88
4519 88 289 -72 92 47 -256 -60 154 3 -48 241 163 -66 53 -38 -90 -128 -38 104 -145 -39 83 202 -140
4542 -140 116 483 -227 -214 -22 -24 -79 -62 67 111 79 19 156 23 -96 88 187 -201 180 -71 -5 14 -32 18
4566 18 133 -287 23 -70 -136 -236 -147 38 111 284 -94 115 5 3 -347 -184 61 -88 216 169 -125 101 -247
4589 -247 -121 76 -112 -199 -173 -114 38 -43 39 -35 94 -24 -25 121 24 -161 -190 -355 19 213 154 244 220 122 103
4614 103 -84 -331 -307 -74 26 -56 -219 207 37 20 -11 107 -73 -115 -116 -205 -183 118 -6 4 -48 42 305 -4
4638 -4 -28 -53 15 276 -9 49 15 198 120 -45 -104 -50 -167 -126 -166 -170 105 -219 100 -173 39 -3 179 35 -68
4663 -68 41 -129 -86 87 -255 127 106 188 -103 -116 -69 50 -369 -71 -192 19 238 -57 294 128 15 78
4685G8j26J00j98K52k75m0K52n7M3J12m76N24j11k23j93K67J11M2j20K17N1o0
4707A70k85k1J04k8k02L05l43M09j86L52l0o9N0l37mN5P0rJ26N5k22R2K6j68L50
4732B60k19P5q1O1M3k06K18j21J08l50J29q6J19k83K36R2j87M75j84O7j96j79
4754b09J33L47m02j15L54j44k2j06Q2M10k78k04p0k8L74m54M42L2r0K06m28j42
4776c12J60j76K38R4l5j23p1L58k19J76j86R8j37O2o9J18q9P6j50K21MR6l1K9
4800A32k46kJ0j9J00k76L20N8J61m09OK59l78K66p4j6K2L70l38m4M5K49j23j18
4824d5J1PQ2N8p7l49J88K12M5j91J30n9J8K8J02j87J42k87L57l5J33k92K42l80
4848a47K67j47j47M7J06K36j23M39m45R6j34J35j64k54L74l75M20q1K2J61l89
$$ plain form
4685 78 -48 52 -146 106 -169 -209 43 -14 29 141 -335 189 78 -145 -338 -71 40 82 -38 179 230 170
4707 170 -115 -136 -32 -60 -262 43 -300 109 -77 275 245 176 226 -111 -115 -60 10 1 127 182 -40 52 78 -90 260
4732 260 41 116 35 96 139 -67 151 30 138 -212 -83 -169 -50 -333 -97 -5 -192 283 99 166 -30 -209
4754 -209 -76 271 -131 -246 108 -36 -58 -164 -82 328 50 -154 -224 -252 122 -332 110 142 52 258 -170 -312
4776 -312 -152 -328 -90 4 -31 -154 -225 133 -86 90 -96 2 -135 -73 -142 -24 -113 -37 -187 34 38 134 103 132
4800 132 -114 -116 -106 -125 -25 -301 19 77 238 -171 -165 94 -284 -18 -92 -108 -86 284 -54 -98 -53 196 73 -45
4824 -45 -34 -27 55 113 36 -313 -125 87 132 -59 71 12 30 58 160 -27 115 -172 185 150 283 -9 233 -147
4848 -147 120 -27 -174 -127 -21 215 92 531 86 182 48 183 19 -235 139 -236 184 103 125 286 -103
4869a03Ok19K40Kl4o8K79l7R9L1j58J81j60r5P7k87M36Kk97P8K56l13K01Q0m33
4894b36J76l45M46r4k40K78J30K3J60m75L48l51l25P13l89o1j29K58J31J0N2k26
4916a46K56k95L9K7J29j29J59Q0J54l80K30j84J0r7L33j85j20M16l74N8Q5j04
4938c8j99J21J52k09k13K54L23k20K70k11N7k03K08m7k21M26p3k89L33J39m48
4959h8M38k02j39J03lk88P2k27M05j61o2L45l45K4J43j01J67l43J63J83J29j04
4981A09k01K48N4k36K64n26K81j03L30K7j40k19j01M37q4k16j54l3J96M4j1L2
5003bL44j65J1j11l0j96R8K99j46l92K05L33k24J62k47K33o5J33m8j17j68M00
5025C07n33R2K42J11j83j8M5k87J49K1o7M3R3j1r8Q8o1j53L49j1m39J18K86M6
$$ plain form
4869 -103 -97 -316 -76 -74 -108 -176 103 66 165 196 38 219 59 -36 41 -246 190 192 -105 -27 229 -84 117 197 -236
4894 -236 -60 -405 41 -53 -293 -15 115 138 298 -177 171 -180 -505 208 -181 -242 -371 -113 18 28 80 -146
4916 -146 110 -185 -146 -119 10 -119 40 120 274 -106 124 -60 -50 -147 186 1 -119 297 -77 -19 66 -38
4938 -38 -237 -116 36 -173 -386 -132 191 -29 241 30 87 -116 92 45 -176 250 177 -112 221 360 -88
4959 -88 350 148 9 112 109 -179 -107 -334 71 -90 -152 193 -152 -128 15 -86 81 -262 -99 84 213 109
4981 109 -92 156 210 -26 238 -288 -7 -110 220 247 107 -112 -213 224 140 -76 -230 -263 -67 -23 -34 -2
5003 -2 342 177 188 77 47 -149 -51 248 102 -290 -85 248 24 186 -61 172 107 240 192 75 -93 307
5025 307 -226 -134 108 219 36 18 63 -224 -75 -54 -121 -78 15 4 -94 -6 -67 -220 129 118 -321 -203 83 129
5049A29j54k33L02J99l17K44j96L6j73J34j21L5K63j2K77l92lO7q7j26Q0j11L43
5072A84j85j10J65j61N77o27R4k7J45j96OK13R7l23L05R8j65p3J91k6r3k61l4
5095b06M25k25K0J87j36m7K23n8P5k94K84k65K89o3j31R9l39J75K8m1j27o5J26
5118f6J00K6O7j75j55J76k87K63j17K7K22o3j56L04n4j86k65M05J46K01l76lJ69
5141B03k26P7l8O0j65L84k50k46j57L28j92O25p16M95l58O13k48k24Jo7N03n94
5163a92J27J3j0r7K75M3J03n08K74k01J51M0j99J96n5M4j6K26o40L18n70P05k32
5186b05k82M54k0o1K9j69P0n7j38M65l12j52L35L51o61N95r0l99O9J45p0L62m84
5209b25K84k74L20l08L62k23J15p4l19J64k9J22n7J12J13M2Rp1q1p1o0L0P1p5
$$ plain form
5049 129 -25 -258 44 243 -74 170 -26 10 -163 -29 -150 -115 148 136 413 21 18 85 -2 -128 -48 -159 184
5072 184 -1 -111 54 -107 470 -157 -63 -90 55 -141 -135 78 175 -148 157 255 90 17 208 182 89 -172 -206
5095 -206 219 -6 14 201 65 18 241 183 258 -36 248 -17 272 209 78 177 -162 13 41 0 -127 -192 -66
5118 -66 34 60 127 -48 -203 -27 -314 -51 -168 -141 81 18 -138 166 112 -74 -339 66 212 413 37 34 203
5141 203 -23 54 16 76 -89 295 45 -201 -358 -30 -222 403 -313 182 -176 437 189 -35 -34 -101 402 -192
5163 -192 -65 -52 -62 -159 116 159 262 -246 28 -173 -22 18 -181 15 -40 4 -12 214 -426 -108 -678 27 -205
5186 -205 -487 -33 -53 -114 -85 -254 -184 -241 -379 86 -226 -378 -43 308 -353 242 152 -247 -178 -33 -103 259 -225
5209 -225 59 -215 105 -203 159 -64 51 -23 -342 -178 -207 -85 -142 -30 83 125 134 63 -18 -89 -149 -119 -48 -123
5233a23N2J86k81L04J26l78q1j9K5Q0P6M7J37k7J6k64J66Q3j48l49M29r9M0n9
5257f1KL4K14k69K97n49L26j60K03k95m5L55K70l75J85K68l50p6J10N8R4k67J09
5280G8j96J29M4J24j52k48L28k15j09P3p0O8l2l9Q0P0M09k56j31Q4j62nK85o7
5304I0P1k26J99O1j33O9j94J2k23Q0L32k04L73m27J66o6L4N3J47k75M44k55P7
5327B05o8m21K86J06j63j62J25N5j46K35k6k32J88J3O6j42L0L52n06L57j27j05
5349h0nK33k63K38l36N8K76J74l87N7J57l15J88M35l27Oj11n0j22j40L79k95L42
5372A12j15l1m1k20K47J77j13J43j37k55K07k11NL85J48l95R9n5K61l64J13J59
5394A19l21K07K5q0M10l28J79l70L70j56k50K77j50j29K14j2mq3j66K89j64qO5
$$ plain form
5233 -123 -71 115 -166 138 264 -114 -195 -214 -189 -109 -33 14 151 124 140 -124 42 125 -23 -372 57 -42 -2 -61
5257 -61 -59 -25 189 -80 217 -332 -6 -166 37 -258 -303 52 322 -53 132 400 50 -26 84 142 236 -31 78
5280 78 -118 11 55 179 27 -221 107 -108 -217 -144 -214 -146 -178 -217 -137 -67 342 86 -45 39 -123 -128 157 90
5304 90 161 -65 134 195 62 131 -63 -51 -274 -194 138 -66 307 -120 46 -20 14 67 214 -61 383 128 205
5327 205 137 -284 2 108 -55 -217 -92 -37 -183 52 26 -206 -18 -5 61 -81 -51 301 -205 152 25 -80
5349 -80 -85 148 -115 123 -213 -155 121 295 -92 -35 122 -193 -5 430 103 109 -2 -52 -174 -314 65 -230 112
5372 112 -3 -34 -75 -295 -48 129 16 159 22 -233 -26 -237 -232 153 301 -94 5 -50 211 -153 -40 119
5394 119 -202 5 30 -50 360 32 211 -159 211 55 -195 82 -68 -197 17 5 1 -82 -248 41 -123 -131 -66
5417f6J58j01m7M2L1j42K51o0M3k17L8o4K56q3k07J23O6Q5l43J44M59n37k33N89
5441A85l17K68l28L30K5K3l99J57L52k76J63l76K57L79k13j15q0J56o7l16k4M16
5463B00j00r0P5j33K03K07m80j15M82k31J10j17K01l5l95K88j72K03l7j45l23
5484d04J70J44K62o4j31L58k72J2k96K78m6l01J54J69p9K30K7k90J69M2K5l29
5506a72K86K09l74j05J13J61j53J8k3Kq5J54K1k0k38k5J21K24R0k52L5k3J45j90
5530h1j0j6K28j29j03J7M04l6k16j03j3k4j1j0J20j32k52N25N5k5QL4l60J29J86
5555A85j16j12J63k63j03K29o9K39k93J03J8n3j29M27m70J57L11j19j89R9j87
5576a72m6J99q2K25j55J57j39M9r8K02j78P7j53J05j32J54R7K6j63j59J88K7p9
$$ plain form
5417 -66 92 -9 -56 -14 17 -125 126 66 109 -108 -70 -134 122 39 -168 -45 21 106 -237 -93 366 -171 -404 185
5441 185 -132 136 -192 138 163 186 -213 -56 296 20 183 -193 64 443 230 115 35 191 124 -192 -216 200
5463 200 100 10 85 -48 155 362 -118 -233 249 18 128 11 212 177 -218 70 -102 101 64 -81 -404
5484 -404 -234 -90 172 108 -23 335 63 75 -221 57 11 -290 -136 33 -46 184 211 -79 90 132 157 -172
5506 -172 114 323 -51 -156 -43 118 -35 -17 -40 -38 -123 31 52 32 -206 -231 -110 114 204 -48 -13 -36 109 -81
5530 -81 -91 -107 121 -8 -111 -94 310 274 58 -45 -58 -82 -93 -103 17 -115 -367 158 213 188 196 230 -130 -1 185
5555 185 69 -43 120 -143 -246 -17 -86 153 -140 -37 -19 -72 -201 226 -244 -87 224 105 -84 15 -172
5576 -172 -218 -19 -101 124 -31 126 -13 36 -62 140 -38 39 -114 -9 -141 13 110 136 -27 -186 2 29 -50
5599e0R7K77j54j14m0l0J51l41M68j27m3k83J61mk85J18J56K07j49K91k07k5M8
5622A22n5l06J12L82n99J19J67K37r6q0n7qM7J81j19j66LK14N7q6JqJ6k8Ml28
5648b74J38K5R9l3J79r4k03K29j05K19l58J77j68O40l38J69l04L6k50O3J29k42
5670b66O28l96r2k3K55J87j49m8n2N0j57J91N2k83O26n19J8J05l64L05j66P9q0
5693i9j8j00J17P8O9L1j54K20j68N2l2j45M44m41K31l3Q7l19O3l0K26m0N6k08
5717a13L85l62r9K25k09K71ON6Nk79M08k00k4k10L52m86M42j42J01l65Q0J82N7
5740H1J04m07M70j59K2KM6J33k74j4j70K02k33J11J89J80k99K4M05k27j07oo9
5763DNj7l11L96J03k13m8J23L7J05j00J10l72J81J15l8k25M51j74j89jk3K24j83
$$ plain form
5599 -50 47 324 170 56 16 -14 137 -204 264 137 94 -189 -28 -32 -317 -199 -43 164 15 306 99 74 122
5622 122 67 -239 -127 255 -344 -225 -58 179 83 3 -54 -62 -15 166 47 -119 -116 98 155 69 70 62 78 50 54 -274
5648 -274 -136 -111 -12 -45 134 40 -163 66 -39 180 -178 -1 -169 471 133 302 -2 34 -216 -153 -24 -266
5670 -266 362 -34 -126 -149 106 293 144 96 44 94 -63 128 180 -103 523 4 22 127 -237 68 -98 -19 -99
5693 -99 -117 -217 -100 -22 47 78 -76 144 -24 28 -4 -149 295 -146 85 52 139 -180 -117 -147 79 39 95 -113
5717 -113 272 -90 -189 36 -173 98 104 160 165 -114 294 94 70 -140 212 -274 168 26 127 -238 -158 24 81
5740 81 185 -222 248 89 111 113 159 292 18 4 -166 36 -197 -86 103 283 -16 8 413 186 79 73 4
5763 4 9 -8 -319 77 180 -33 -81 42 79 184 84 194 -178 3 118 80 -145 306 132 -57 -58 -81 143 -40
5787d0K60l17J05J77j39k26J42j06J31p7RRj61L92o5k86L67l16M4L76k18k33K54
5810H2n8J20Lk73L4J52J3Lq3r7K07L5k00p2J33mK24j88P4k24R9K54m03J95k5j10
5836a09K42J2Q7j59n0j44J01K4M3k28K10J45k5j17J93r9m2m12K35J92r9k41K62
5859B1j92M72j06l25N32n00J60N7j44p8J01l03J09J94M7k3K99j53l56K10J65K0
5881B07k76J60q2j12K30k21K76j70j78J8M4j44M77J7l96L65n7J2j95j74j66K51
5903a14J20J79k08J61Mj25j13K28p3qk86J59K26k62J38J43q1k9k15L10j74j1J93
5926A62k04k70Q7K37j8o3K37p0k05m5j0K07K1p2J96k95R8J61k44J51j17n3K3J00
5950A4J8j51j98K32K49k82M72l36k82J5L07r4J84l98K81q3kL29k94jR3k8j6o0
$$ plain form
5787 -40 220 -97 8 185 46 -180 -38 -144 -13 -90 -81 -72 -233 159 94 -192 175 -141 -97 279 61 -172 82
5810 82 24 144 147 -126 -92 60 73 76 -7 -104 103 138 -62 -134 -1 -5 219 31 105 -119 -20 234 -169 26 1 -109
5836 -109 133 145 232 73 23 -121 -20 4 47 -181 29 174 149 32 225 126 84 -328 -93 99 0 -241 21
5859 21 -171 301 195 -130 402 -98 62 119 -25 -103 -2 -305 -196 -2 45 22 321 168 -188 22 187 207
5881 207 -69 91 9 -103 127 -94 182 12 -166 -148 -104 -248 229 246 -150 215 158 170 -25 -199 -365 -114
5903 -114 6 185 -23 138 142 17 -96 132 59 51 -235 -76 150 -112 26 169 88 59 -156 154 -20 -31 162
5926 162 -42 -312 -225 12 -6 -69 168 98 -107 -152 -162 45 66 -6 190 -105 -7 154 -90 61 -56 -109 -86 14
5950 14 32 -119 -317 -85 164 -118 354 18 -264 -249 58 -36 148 -250 31 -52 -54 275 -19 -20 73 45 29 -31
5974c1l22O35k93J42K8k89K7J35j79J27m0L02k70r2L39j43j12j44N8j68M29k56
5996a17K85m5N8l76nK66j84K49k59R1P1j51m7J79J95mj67j44J53J4j59K41J1j91
6020c6K8J13l93M79j5j55N9j53J6j61J90J61l19J73J46K7J29k21j50m6j13N17
$$ plain form
5974 -31 -353 282 -11 131 159 -130 -103 32 -147 -20 -60 242 -28 -120 219 76 -36 -180 -122 -290 139 -117
5996 -117 168 123 181 -195 -200 66 -118 131 -128 -37 34 -117 -164 15 210 206 39 -105 48 62 -97 144 155 -36
6020 -36 -8 105 -288 191 176 21 80 -73 -57 -218 -28 133 -186 -13 133 160 289 68 -82 -128 -241 276
$$ [...]
8191A01
##END NTUPLES=NMR FID
##END=
