##TITLE=1H_IPACAT-22
 CDCl3, 108 sc, 
 7.5.2019
##JCAMPDX= 6.0         $$ Bruker NMR JCAMP-DX V2.0
##DATA TYPE= NMR FID
##DATA CLASS= NTUPLES
##ORIGIN= UXNMR, Bruker Analytische Messtechnik GmbH
##OWNER= root
$$ XWIN-NMR		Version 3.5
$$ Tue May  7 14:41:13 2019 Russian Standard Time (UT+4h)  she@DPX200
##.OBSERVE FREQUENCY= 200.1315
##.OBSERVE NUCLEUS= ^1H
##.DELAY= (6, 6)
##.ACQUISITION MODE= SIMULTANEOUS
##.ACQUISITION SCHEME= undefined
##.AVERAGES= 108
##.DIGITISER RES= 18
##SPECTROMETER/DATA SYSTEM= spect
##.PULSE SEQUENCE= zg30
##.SOLVENT NAME= CDCl3
##.SHIFT REFERENCE= (INTERNAL, CDCl3, 0, 15.7039)
##AUDIT TRAIL= $$ (NUMBER, WHEN, WHO, WHERE, WHAT)
$$ ##TITLE= Audit trail, XWIN-NMR		Version 3.5
$$ ##JCAMPDX= 5.01
$$ ##ORIGIN= Bruker BioSpin GmbH
$$ ##OWNER= she
$$ F:/spectra/data/she/nmr/H-F/1/audita.txt
$$ ##AUDIT TRAIL=  $$ (NUMBER, WHEN, WHO, WHERE, WHAT)
(   1,<2019-05-07 14:37:58.46 +0400>,<she>,<DPX200>,
      <continue with go, POWCHK disabled, PULCHK disabled
       configuration hash MD5:
       00 E9 B6 7A A2 85 ED C7 34 08 36 98 17 FE 4E 26
       data hash MD5: 16K
       B5 E6 B9 F6 1B C7 3E B9 6B 25 14 E1 01 2A 07 48>)
$$ ##END=
$$ 
$$ hash MD5
$$ B6 B7 55 AC B9 FC 5F D2 B3 0C DD 5A DB 30 0D B5
##$RELAX= 
##$RELAX= 
##$RELAX= 
##$RELAX= 
##$RELAX= 
##$RELAX= 
$$ Bruker specific parameters
$$ --------------------------
##$DU= <F:/spectra>
##$EXPNO= 1
##$NAME= <H-F>
##$PROCNO= 1
##$TYPE= <nmr>
##$USER= <she>
##$AMP= (0..31)
100 100 100 100 100 100 100 100 100 100 100 100 100 100 100 100 100 100 
100 100 100 100 100 100 100 100 100 100 100 100 100 100 
##$AQSEQ= 0
##$AQ_mod= 1
##$AUNM= <au_zg>
##$AUTOPOS= <>
##$BF1= 200.13
##$BF2= 200.13
##$BF3= 200.13
##$BF4= 200.13
##$BF5= 200.13
##$BF6= 200.13
##$BF7= 200.13
##$BF8= 200.13
##$BYTORDA= 1
##$CFDGTYP= 0
##$CFRGTYP= 5
##$CHEMSTR= <none>
##$CNST= (0..31)
1 1 145 1 1 1 1 1 1 1 1 1 1 1 1 1 1 1 1 1 1 1 1 1 1 1 1 1 1 1 1 1 
##$CPDPRG= <>
##$CPDPRG1= <>
##$CPDPRG2= <>
##$CPDPRG3= <>
##$CPDPRG4= <mlev>
##$CPDPRG5= <mlev>
##$CPDPRG6= <mlev>
##$CPDPRG7= <mlev>
##$CPDPRG8= <mlev>
##$CPDPRGB= <>
##$CPDPRGT= <>
##$D= (0..31)
0 1.2 0 0 0 0 0 0 0 0 0 0.03 0 0 0 0 0 0 0 0 0 0 0 0 0 0 0 0 0 0 0 0 
##$DATE= 1557225100
##$DBL= (0..7)
120 120 120 120 120 120 120 120 
##$DBP= (0..7)
150 150 150 150 150 150 150 150 
##$DBP07= 0
##$DBPNAM0= <>
##$DBPNAM1= <>
##$DBPNAM2= <>
##$DBPNAM3= <>
##$DBPNAM4= <>
##$DBPNAM5= <>
##$DBPNAM6= <>
##$DBPNAM7= <>
##$DBPOAL= (0..7)
0.5 0.5 0.5 0.5 0.5 0.5 0.5 0.5 
##$DBPOFFS= (0..7)
0 0 0 0 0 0 0 0 
##$DE= 6
##$DECBNUC= <off>
##$DECIM= 24
##$DECNUC= <off>
##$DECSTAT= 4
##$DIGMOD= 1
##$DIGTYP= 9
##$DL= (0..7)
0 120 120 120 120 120 120 120 
##$DP= (0..7)
150 150 150 150 150 150 150 150 
##$DP07= 0
##$DPNAME0= <>
##$DPNAME1= <>
##$DPNAME2= <>
##$DPNAME3= <>
##$DPNAME4= <>
##$DPNAME5= <>
##$DPNAME6= <>
##$DPNAME7= <>
##$DPOAL= (0..7)
0.5 0.5 0.5 0.5 0.5 0.5 0.5 0.5 
##$DPOFFS= (0..7)
0 0 0 0 0 0 0 0 
##$DQDMODE= 0
##$DR= 18
##$DS= 0
##$DSLIST= <SSSSSSSSSSSSSSS>
$$ [...]
##$SUBNAM2= <"">
##$SUBNAM3= <"">
##$SUBNAM4= <"">
##$SUBNAM5= <"">
##$SUBNAM6= <"">
##$SUBNAM7= <"">
##$SUBNAM8= <"">
##$SUBNAM9= <"">
##$SW= 24.9337058887773
##$SWIBOX= (0..15)
0 0 2 0 0 0 0 0 0 0 0 0 0 0 0 0 
##$SW_h= 4990.01996007984
##$TD= 16384
##$TD0= 1
##$TE= 0
##$TE2= 300
##$TE3= 300
##$TEG= 300
##$TL= (0..7)
0 120 120 120 120 120 120 120 
##$TP= (0..7)
150 150 150 150 150 150 150 150 
##$TP07= 0
##$TPNAME0= <>
##$TPNAME1= <>
##$TPNAME2= <>
##$TPNAME3= <>
##$TPNAME4= <>
##$TPNAME5= <>
##$TPNAME6= <>
##$TPNAME7= <>
##$TPOAL= (0..7)
0.5 0.5 0.5 0.5 0.5 0.5 0.5 0.5 
##$TPOFFS= (0..7)
0 0 0 0 0 0 0 0 
##$TUNHIN= 0
##$TUNHOUT= 0
##$TUNXOUT= 0
##$USERA1= <user>
##$USERA2= <user>
##$USERA3= <user>
##$USERA4= <user>
##$USERA5= <user>
##$V9= 5
##$VALIST= <valist>
##$VCLIST= <CCCCCCCCCCCCCCC>
##$VD= 0
##$VDLIST= <DDDDDDDDDDDDDDD>
##$VPLIST= <PPPPPPPPPPPPPPP>
##$VTLIST= <TTTTTTTTTTTTTTT>
##$WBST= 1024
##$WBSW= 4
##$XGAIN= (0..3)
0 0 0 0 
##$XL= 0
##$YL= 0
##$YMAX_a= 708914
##$YMIN_a= -645053
##$ZGOPTNS= <>
##$ZL1= 120
##$ZL2= 120
##$ZL3= 120
##$ZL4= 120
##$ABSF1= 10
##$ABSF2= 0
##$ABSG= 5
##$ABSL= 3
##$ALPHA= 0
##$AQORDER= 0
##$ASSFAC= 0
##$ASSFACI= 0
##$ASSFACX= 0
##$ASSWID= 0
##$AUNMP= <proc_1d>
##$AZFE= 0.1
##$AZFW= 0.1
##$BCFW= 1
##$BC_mod= 2
##$BYTORDP= 1
##$COROFFS= 0
##$CY= 11.3945322036743
##$DATMOD= 1
##$DC= 2
##$DFILT= <>
##$DTYPP= 0
##$F1P= 18.9103706918063
##$F2P= -1.10871071338519
##$FCOR= 0.5
##$FTSIZE= 0
##$FT_mod= 4
##$GAMMA= 1
##$GB= 0.15
##$INTBC= 1
##$INTSCL= 1
##$ISEN= 128
##$LB= 0.24
##$LEV0= 0
##$LPBIN= 0
##$MAXI= 10000
##$MC2= 0
##$MEAN= 0
##$ME_mod= 0
##$MI= 1.114404
##$NCOEF= 0
##$NC_proc= 0
##$NLEV= 6
##$NOISF1= 3.799351
##$NOISF2= 2.8
##$NSP= 1
##$NTH_PI= 0
##$NZP= 0
##$OFFSET= 15.70392
##$PC= 1
##$PHC0= -8854.23
##$PHC1= 14.60026
##$PH_mod= 1
##$PKNL= yes
##$PPARMOD= 0
##$PSCAL= 0
##$PSIGN= 0
##$REVERSE= no
##$SF= 200.130013532006
##$SI= 16384
##$SIGF1= 3
##$SIGF2= 2
##$SINO= 400
##$SIOLD= 16384
##$SREGLST= <1H.CDCl3>
##$SSB= 0
##$STSI= 0
##$STSR= 0
##$SW_p= 3612.71676300578
##$SYMM= 0
##$S_DEV= 0
##$TDeff= 0
##$TDoff= 0
##$TI= <>
##$TILT= no
##$TM1= 0
##$TM2= 0
##$TOPLEV= 0
##$USERP1= <user>
##$USERP2= <user>
##$USERP3= <user>
##$USERP4= <user>
##$USERP5= <user>
##$WDW= 1
##$XDIM= 8192
##$YMAX_p= 0
##$YMIN_p= 0
$$ End of Bruker specific parameters
$$ ---------------------------------
##NTUPLES= NMR FID
##VAR_NAME=  TIME,          FID/REAL,        FID/IMAG
##SYMBOL=    X,             R,               I
##VAR_TYPE=  INDEPENDENT,   DEPENDENT,       DEPENDENT
##VAR_FORM=  AFFN,          ASDF,            ASDF
##VAR_DIM=   8192,          8192,            8192
##UNITS=     SECONDS,       ARBITRARY UNITS, ARBITRARY UNITS
##FACTOR=    0.0002004,     1,               1
##FIRST=     0,             0,               0
##LAST=      1.6414764,     0,               0
##MIN=       0,             -645053,         0
##MAX=       1.6414764,     708914,          0
$$ Real data points
##PAGE= N=1
##DATA TABLE= (X++(R..R)), XYDATA
$$ [...]
3454F429j854n220k48N100M492r88o625j311M072N465k216m495j563M19N522O07
$$ 6429 4575 -645 -893 4207 8699 7711 1086 -225 3847 9312 7096 2601 1038 1457 6979 7586
3470G586k620k380q78K078L875K32k905n853L656O610J916o889m965K423O310
$$ 7586 4966 2586 1708 3786 7661 7893 4988 -865 2791 9401 11317 4428 -537 1886 8196
3485H196J418m188l326m47M454K358j757l694j818J709M070J981l604m545k42
$$ 8196 9614 5426 2100 1653 6107 8465 6708 3014 1196 2905 6975 8956 5352 807 565
3500E65P114J052l094m975j10M643J847j267l293j444Q15K639J819j690m628k111
$$ 565 7679 8731 5637 662 552 5195 7042 5775 2482 1038 1853 4492 6311 4621 -7 -2118
3516b118N380L584j686o550j360L194O203l280l900l228L385M699j902l607j966
$$ -2118 3262 6846 5160 -1390 -2750 444 6647 3367 -533 -3761 -376 4323 2421 -1186 -3152
3531c152J918O81K648j178m701l527K818O014Ln838l870K580O410m21m715m257
$$ -3152 -1234 -553 2095 917 -3784 -7311 -4493 1521 1524 -4314 -8184 -5604 806 385 -4330 -8587
3547h587K095L327M35q79k928j625J347L413J638m444m354P50N200K256m131l862
$$ -8587 -6492 -3165 -2730 -3609 -6537 -8162 -6815 -3402 -1764 -6208 -10562 -9812 -4612 -2356 -6487 -10349
3563a0349K63M875J324q88n456o48L630K514p47j902k178j33L352K342o01m652
$$ -10349 -10086 -5211 -3887 -4775 -10231 -10879 -7249 -4735 -5482 -7384 -9562 -9695 -6343 -4001 -4602 -9254
3579i254k913N742L221j116m838j951N022L482j83l808p52l38L432J924l23m338
$$ -9254 -12167 -6425 -3204 -4320 -9158 -11109 -6087 -2605 -2788 -6596 -7348 -7686 -4254 -2330 -2653 -6991
3595f991j940L644N390O27o060k882L476O489J282o585j997J920M987K958k877
$$ -6991 -8931 -5287 103 730 -5330 -8212 -4736 1753 3035 -3550 -5547 -3627 1360 4318 1441
3610A441k545J97L303K386J233k841m930K702N576K049m305m003J297O009K882
$$ 1441 -1104 -907 2396 4782 6015 3174 -1756 946 6522 8571 4266 263 1560 7569 10451
3625A0451l597k385O49K652K248J49k478k118J092K678L384o71o421l13N097N235
$$ 10451 6854 4469 5118 7770 10018 10167 7689 5571 6663 9341 12725 12054 5633 5320 10417 15652
3641A5652l247n011j484N545M277k801l204k176K612J967J389k031k789k031M046
$$ 15652 12405 7394 5910 11455 15732 12931 9727 7551 10163 12130 13519 11488 8699 6668 10714
3656A0714L094J98o595j644J697N290j058m569j170m17N276l79l043l887P00J836
$$ 10714 13808 14006 7411 5767 7464 12754 11696 7127 5957 5540 10816 10437 7394 3507 4207 6043
3672F043K373n07l752l241P95L846R91m187m204L33M518J927m275m038R31J649
$$ 6043 8416 7909 4157 916 1711 5557 6548 2361 -1843 -1510 3008 4935 660 -3378 -2447 -798
3688g98K722j587m319j576M48K909J021l542k982j247L449L878l989o888R4M227
$$ -798 1924 337 -3982 -5558 -5110 -2201 -1180 -4722 -7704 -8951 -5502 -1624 -5613 -12501 -12407 -8180
3704h180M161l518m087j899K789K161K03k458k942j255L407K375j807l229k634
$$ -8180 -4019 -7537 -11624 -13523 -10734 -8573 -8370 -10828 -13770 -15025 -11618 -9243 -11050 -14279 -16913
3719a6913L880M859j002n837j937K788M704k87l378j566R90J657K999k032l080
$$ -16913 -13033 -8174 -9176 -15013 -16950 -14162 -9458 -9745 -13123 -14689 -13699 -12042 -9043 -11075 -14155
3734a4155J03J141M645J455m081l469J258P556J456m063l557K238L753J974k191
$$ -14155 -14052 -12911 -8266 -6811 -10892 -14361 -13103 -5547 -4091 -8154 -11711 -9473 -5720 -3746 -5937
3749e937j274j513L289K821J421l090q19j030M813M461l704k833r05O592M255
$$ -5937 -7211 -8724 -5435 -2614 -1193 -4283 -5102 -6132 -1319 3142 -562 -3395 -4300 2292 6547
3764F547l270m481J084L088L900R1k329n23J26L994L240j896m512l76L910M835
$$ 6547 3277 -1204 -120 2968 6868 6959 4630 4107 4233 8227 11467 9571 5059 4683 8593 13428
3780A3428l51n942q34L049N236l12k328k542J378L174K343k660k773j392K963
$$ 13428 13077 7135 6301 9350 14586 14274 11946 9404 10782 13956 16299 13639 10866 9474 12437
3795A2437J951J683k741n669K881N567J524m187n241K196M241J924m723l512Q54
$$ 12437 14388 16071 13330 7661 10542 16109 17633 13446 8205 10401 14642 16566 11843 8331 9185
3810I185K479K106j189k061m117M51M357J434k973m091q83M229J432k142n020
$$ 9185 11664 13770 12581 10520 6403 6854 11211 12645 9672 5581 4698 8927 10359 8217 3197
3825C197r87M172J566j715m090o23p50J895J013m90m219l295L472K391r69m656
$$ 3197 2210 6382 7948 6233 2143 1520 770 2665 3678 3188 -1031 -4326 -854 1537 568 -4088
3841d088l503M426L537j598m497l226K868L421j97l795k598O19R58K245l99m573
$$ -4088 -7591 -3165 372 -1226 -5723 -8949 -6081 -2660 -2857 -6652 -9250 -8631 -7673 -5428 -5827 -10400
3857a0400k549K288M859N72m966n635K947M100Q39l408l100L45L089J799l37l025
$$ -10400 -12949 -10661 -5802 -5230 -10196 -15831 -12884 -8784 -7945 -11353 -14453 -14108 -11019 -9220 -9557 -12582
3873a2582k465K336L214J651l356l974J320M635L037m421l536P40L748K215n22
$$ -12582 -15047 -12711 -9497 -7846 -11202 -15176 -13856 -9221 -6184 -10605 -14141 -13401 -9653 -7438 -7960
3888g960l346q89K808K049J935j764k784j1L972L476n57m805j326M375M678j169
$$ -7960 -11306 -12195 -9387 -7338 -5403 -7167 -9951 -9962 -5990 -2514 -3071 -7876 -9202 -4827 -149 -1318
3904a318l475j753M196L315R65k972j379P58K555L340j329k182k398K270N572
$$ -1318 -4793 -6546 -2350 965 1930 -1042 -2421 -1663 892 4232 2903 721 -1677 593 6165
3919F165J795n371j299K454M424J482l624m172K747M481O40l4m140M19P94L639
$$ 6165 7960 2589 1290 3744 8168 9650 6026 1854 4601 9082 9722 9688 5548 5967 6761 10400
3935A0400J427k570l479N63M997J652l481m106K07N292K511k294m013j97K152
$$ 10400 11827 9257 5778 6341 11338 12990 9509 5403 5610 10902 13413 11119 7106 6909 9061
3950I061L305j524N5l892L5J547L317j374m699q37L204K836j658m433k274M302
$$ 9061 12366 10842 10897 7005 7040 8587 11904 10530 5831 4994 8198 11034 9376 4943 2669 6971
3966F971K241n97l105k052Q44J843J401j895m483q53J615L409k23n956k427K719
$$ 6971 9212 8615 5510 3458 4302 6145 7546 5651 1168 315 1930 5339 5116 -840 -3267 -548
3982e48M786J55m006m536L399K359q61k021k980k27K600J964j74m381l463J332
$$ -548 4238 4393 387 -4149 -750 1609 748 -1273 -4253 -4480 -1880 84 -90 -4471 -7934 -6602
3998f602L780L170l662n781Q44N661L79k197m263K9K594J081j51j400k001J000
$$ -6602 -2822 348 -3314 -9095 -8251 -2590 -2211 -4408 -8671 -8642 -6048 -4967 -5118 -6518 -8519 -7519
4014g519J918K684l324m681l55M849L391k497m225j698M379K799o74k424j927
$$ -7519 -5601 -2917 -6241 -10922 -11277 -6428 -3037 -5534 -9759 -11457 -7078 -4279 -4953 -7377 -9304
4029i304J884K695K17j122k733q93K970L285P22m666j607K915M025N56n239j034
$$ -9304 -7420 -4725 -4508 -5630 -8363 -9256 -6286 -3001 -2279 -6945 -8552 -5637 -1612 -1056 -6295 -7329
4045g329L130L590L67j988l223J181J304L249R93k666l439K217L771J590l347
$$ -7329 -4199 -609 -242 -2230 -5453 -4272 -2968 281 1274 -1392 -4831 -2614 1157 2747 -600
4060f00l466K512L309J533q41m152N14K498L359l34l517j418N17M689J12j606
$$ -600 -4066 -1554 1755 3288 2447 -1705 -1191 1307 4666 4332 815 -603 -86 4603 4715 3109
4076C109k134l98L455K508j670n222Q18M145K400j72n727K77L020P27J030k157
$$ 3109 975 577 4032 6540 4870 -352 466 4611 7011 6839 1112 1389 4409 5136 6166 4009
4092D009j990q99K801L383q36m884n65L181M212j975l496l073L483L580p18k746
$$ 4009 2019 1120 3921 7304 6468 1584 1019 4200 8412 6437 2941 -132 3351 6931 6213 3467
4108C467j520N26J208K560j158k108k496J799L342Q12l355l492K190K528J133
$$ 3467 1947 2473 3681 6241 5083 2975 479 2278 5620 6432 3077 -415 1775 4303 5436
4123E436j438n253J724L104J189j729k459k029K626J532Q48j509k425K53K935
$$ 5436 3998 -1255 469 3573 4762 3033 574 -1455 1171 2703 3551 2042 -383 -130 2805
4138B805J790k680l768j328M836J894k025k549j450K237J567Q77k781j361J008
$$ 2805 4595 1915 -1853 -3181 1655 3549 1524 -1025 -2475 -238 1329 2206 -575 -1936 -928
4153i28n53M645j835l293j682J966M720p98l880k643K052M752j152k474l290J566
$$ -928 -1481 3164 1329 -1964 -3646 -1680 3040 2242 -1638 -4281 -2229 2523 1371 -1103 -4393 -2827
4169b827L425J35j131l118p92J217L646M04l402k964J736M607M02m020k327J051
$$ -2827 598 733 -398 -3516 -4308 -3091 555 959 -2443 -5407 -3671 936 1338 -2682 -5009 -3958
4185c958K849L87r45l458R72J166J565L96j671l256K048J283J721j348m574K95
$$ -3958 -1109 -722 -1667 -5125 -4153 -2987 -1422 -1026 -2697 -5953 -3905 -2622 -901 -2249 -6823 -6528
4201f528L534L087k070m783K73L303L093j369l207j307K95L151J421j791k521
$$ -6528 -2994 93 -1977 -6760 -6487 -3184 -91 -1460 -4667 -5974 -5679 -2528 -1107 -2898 -5419
4216e419p87K478L231n36k953l217L115M231k153j938j231J095K964l53m53l195
$$ -5419 -6206 -3728 -497 -1033 -3986 -7203 -4088 143 -2010 -3948 -5179 -4084 -1120 -1473 -1926 -5121
4232e121K97J772K803o01k941j174J079L724J756m002l486K713M271k10j438k416
$$ -5121 -4824 -3052 -249 -850 -3791 -4965 -3886 -162 1594 -2408 -5894 -3181 1090 880 -558 -2974
4248b974m13L843J980j327k345o40P65M073N74j801k943p44N411L057m445k234
$$ -2974 -3387 456 2436 1109 -1236 -1876 -1111 2962 3536 1735 -1208 -1952 3459 6516 2071 -163
4264a63M37L004K827j663l437K34K108K214Q09k442j602o15K494L432n98l566
$$ -163 274 3278 6105 4442 1005 1239 3347 5561 6370 3928 2326 1711 4205 7637 7039 3473
4280C473j733L463L134j020l750j258L993R93J249k557k502L60J817K288k68k924
$$ 3473 1740 5203 8337 7317 3567 2309 6302 7295 8544 5987 3485 3845 5662 7950 7682 4758
4296D758j292J41M434Q12m085r91P55L003J233m512r11j92L275q17K05j659j687
$$ 4758 3466 3607 8041 8853 4768 3777 4532 7535 8768 4256 3345 3153 6428 5611 5816 4157 2470
4313B470O22K853J878l527l374R3L479J166k355m353J87M531R01l599j441j121
$$ 2470 3092 5945 7823 4296 922 1015 4494 5660 3305 -1048 -861 3670 4571 972 -469 -1590
4329a590K378K043j247j399k520K63J191K823k310l750r03K915L070k071l968
$$ -1590 788 2831 1584 185 -2335 -2072 -881 1942 -368 -4118 -5021 -2106 964 -1107 -5075
4344e075j423M084P71j505j842k129J723J656Q67q54k684j492R06M081pm792k263
$$ -5075 -6498 -2414 -1643 -3148 -4990 -7119 -5396 -3740 -2873 -3727 -6411 -7903 -6997 -2916 -2923 -7715 -9978
4361i978M085K177k37l861q49Q10K758R1k164p82N2P29K787K45l037l100J354
$$ -9978 -5893 -3716 -3953 -7814 -8663 -7853 -5095 -5004 -7168 -7950 -7898 -7169 -4382 -4137 -7174 -10274 -8920
4378h920M891R3r47m518J720L990J253l239j414Q4K980P32J44j561q90J484J605
$$ -8920 -4029 -3936 -4883 -9401 -7681 -3691 -2438 -5677 -7091 -7007 -4027 -3295 -3151 -4712 -5602 -4118 -2513
4395b513J818k241j359j011L506L782j525l763j54M116K067j277k266j667L345
$$ -2513 -695 -2936 -4295 -5306 -1800 1982 457 -3306 -3460 656 2723 1446 -820 -2487 858
4410H58J212J812o67k177n62K221L166j00l109k054L525L052n36l838J12J739
$$ 858 2070 3882 3215 1038 476 2697 5863 5763 2654 600 4125 7177 6641 2803 2915 4654
4426D654K876j05j417k491J057K457N64r2j301j407N17L670N16k276k411Q83L065
$$ 4654 7530 7425 6008 3517 4574 7031 7595 7503 6202 4795 5312 8982 9498 7222 4811 5694 8759
4443H759P29j702l904L4L196K467q48l330o96O5K626J679k527k335j422L120K656
$$ 8759 9488 7786 3882 3916 7112 9579 8731 5401 4705 4770 7396 9075 6548 4213 2791 5911 8567
4460H567k088m271M29K229K660k014l742j006J373J815M94l034j269n59J928K540
$$ 8567 6479 2208 2637 4866 7526 5512 1770 764 2137 3952 4446 1412 143 -416 1512 4052
4476D052j303m097p21J484M056j965n366n55K296J731N66j050m726J735K17K477
$$ 4052 2749 -1348 -2069 -585 3471 1506 -3860 -4415 -2119 -388 178 -872 -5598 -3863 -3646 -1169
4492a169r50l140mL04J794J564k975m240J877K681J946l298m078K070J948J580
$$ -1169 -2119 -5259 -5263 -4959 -3165 -1601 -4576 -8816 -6939 -4258 -2312 -5610 -9688 -7618 -5670 -4090
4508d090j906k444p1J224K435k19j589j900l45K960K104j614m096l4L907J860
$$ -4090 -5996 -8440 -8511 -7287 -4852 -5071 -6660 -8560 -8905 -5945 -3841 -5455 -9551 -9585 -5678 -3818
4524c818j020m206K25K601K278K21j211n34j612K380K435m61l390j052L775L026
$$ -3818 -4838 -9044 -8819 -6218 -3940 -3719 -4930 -5464 -7076 -4696 -2261 -2722 -6112 -7164 -3389 -363
4540c63L5n033L93K886J843O6k346j681K318J056J966j565j660k21J524L942m07
$$ -363 -328 -5361 -4968 -2082 -239 -173 -2519 -4200 -1882 -826 1140 -425 -2085 -2306 -782 3160 2753
4557B753j547k975K190L469N10k000l149K722K847N55j159r34o11J584J268n90
$$ 2753 1206 -1769 421 3890 4400 2400 -749 1973 4820 5375 4216 3282 2671 4255 5523 4933
4573D933m11j635L79L750P25j767j672n23L411K062k213k560n28J447L318j597
$$ 4933 4522 2887 3266 7016 7741 5974 4302 3779 7190 9252 7039 4479 3951 5398 8716 7119
4589G119k349N93q70K079J507j521k073o46J133K353N49l396j523J920L275o53
$$ 7119 4770 5363 4493 6572 8079 6558 4485 3839 4972 7325 7874 4478 2955 4875 8150 7497
4605G497l867j404J333K014N10k657r92j210K105J591l6k798k315J20M236Q50
$$ 7497 3630 2226 3559 5573 6083 3426 2434 1224 3329 4920 4884 2086 -229 -109 4127 4977
4621D977m364j796J028K707J217l605j469Q59J395l51j152p03j039p38K316K991
$$ 4977 613 -1183 -155 2552 3769 164 -1305 -446 949 598 -554 -1257 -2296 -3034 -718 2273
4637B273l503j846k403L428J621j132l939N90L384Q45j335k464l72M55K077o0
$$ 2273 -1230 -3076 -5479 -2051 -430 -1562 -5501 -4911 -1527 -682 -2017 -4481 -4853 -4398 -2321 -2381
4653b381p15l828Q01K644Q15l83l753K31J474L602j665k676o08K864J443m60k105
$$ -2381 -3096 -6924 -6123 -3479 -2664 -3047 -6800 -6569 -5095 -1493 -3158 -5834 -6442 -3578 -2135 -2595 -4700
4670d700j039M90Q43J939k45j280k401N35L887J035k813k209J751K702l07j049
$$ -4700 -5739 -5249 -4406 -2467 -2712 -3992 -6393 -5858 -1971 -936 -3749 -5958 -4207 -1505 -1812 -2861
4686b861k486J270J320L090k313j024j47K02K217J036k121j408N31L487J219k559
$$ -2861 -5347 -4077 -2757 333 -1980 -3004 -3151 -2949 -732 304 -1817 -3225 -2694 793 2012 -547
4702e47k538P35K928J964k162k268J89J535J539J073j446j643J27K108J613k69
$$ -547 -3085 -2350 578 2542 380 -1888 -1699 -164 1375 2448 1002 -641 -514 1594 3207 2938
4718B938l069m3K038K443j069k480j114K644K228l51l308j03J330M32J186J20
$$ 2938 -131 -174 1864 4307 3238 758 -356 2288 4516 4165 857 754 2084 2516 3702 3822
4734C822k779o53J827J505J103k985k415K262K656L07k290j759K296mJ686j876
$$ 3822 1043 390 2217 3722 4825 1840 -575 1687 4343 4650 2360 601 2897 2893 4579 2703
4750B703p14q91J354J400N65k885j192k14L880P95l271k101J008L638q3j490l017
$$ 2703 1989 1098 2452 3852 4417 1532 340 126 4006 4801 1530 -571 437 4075 3992 2502 -515
4767e15P13J161J967j204o23j892J065K016J114k059m010N04L581J535l81n145
$$ -515 198 1359 3326 2122 1499 -393 672 2688 3802 1743 -2267 -1763 1818 3353 2972 -2173
4783b173J250K388l65J5j195n19R54J730L33k742o52j48J306J313J148m015k060
$$ -2173 -923 1465 1100 1115 -80 -599 355 2085 2418 -324 -976 -1124 182 1495 2643 -1372 -3432
4800c432J614L512K1l177n65P31J686Q44r90j251j202K235J557m86j502k319J899
$$ -3432 -1818 1694 1715 -1462 -2027 -1296 390 1234 244 -1007 -2209 26 1583 1097 -405 -2724 -825
4817h25J536Q58k730k724J936K156R40k227j716O25K799Q49j554n22j926J027
$$ -825 711 1569 -1161 -3885 -1949 207 1147 -1080 -2796 -2171 628 1477 -77 -599 -2525 -1498
4833a498J357N75m21j838o37J069K666q40m119J88K238K020q92k341j162J337
$$ -1498 -141 434 13 -1825 -2462 -1393 1273 433 -3686 -3498 -1260 760 -132 -2473 -3635 -2298
4849b298K264M73j618j127N0P44K042q48l198q98K467J961j47k498j278K255K823
$$ -2298 -34 439 -1179 -2306 -2256 -1512 530 -318 -3516 -4414 -1947 14 -133 -2631 -3909 -1654 1169
4866A169l02l175j223J590J544KQ84k287k196O37K255J146j884k392J401K144
$$ 1169 867 -2308 -3531 -1941 -397 -395 489 -1798 -3994 -3357 -1102 44 -1840 -4232 -2831 -687
4882f87J717k844j233L87K433J042r67l009L44J347K055k78J05l294j98M175Q88
$$ -687 1030 -1814 -3047 -2660 -227 815 -152 -3161 -2817 -1470 585 307 412 -2882 -3080 1095 1983
4899A983j291k705J345J134K226j274m185J574J988J796p50j147p28p83K036K134
$$ 1983 692 -2013 -668 466 2692 1418 -2767 -1193 795 2591 1841 694 -34 -817 1219 3353
4915C353j134j805k724L408K657m45k707j176K220K099k29k003j846Q45K609J73
$$ 3353 2219 414 -2310 1098 3755 3310 603 -573 1647 3746 3517 1514 -332 513 3122 3295
4931C295p96q37q15Q71J566J390k051j424N75L162K9k314k338J718K783N48k230
$$ 3295 2499 1662 847 1718 3284 4674 2623 1199 1774 4936 4965 2651 313 2031 4814 5362 3132
4948C132q25k30O57J890r97j078j788j17K091J642j235l523j62L723K055k276
$$ 3132 2307 2077 2734 4624 3627 2549 761 644 2735 4377 3142 -381 -543 3180 5235 2959
4964B959k532l5J437J306J77j866j705J384L27J612j114l011l90K399K209j601
$$ 2959 427 392 1829 3135 3312 1446 -259 1125 1452 3064 1950 -1061 -1451 948 3157 1556
4980A556j774j535J272K916j813j819r10J259J407K03k861p26J486J42L048r39
$$ 1556 -218 -1753 -481 2435 622 -1197 -2107 -848 559 762 -2099 -2825 -1339 -1197 1851 912
4996I12k621k362J526K537N1k489j711Q26K812M01k775j557o86L220n18k88j76
$$ 912 -1709 -4071 -2545 -8 43 -2446 -4157 -3331 -519 -118 -2893 -4450 -5136 -1916 -2434 -2722 -2898
5013b898j567J124J634O91k282j320k71K980J391k071l214R78K363J414q88j866
$$ -2898 -4465 -3341 -1707 -1016 -3298 -4618 -4889 -1909 -518 -2589 -5803 -4825 -2462 -1048 -1936 -3802
5029c802l97J592J380j27m26j396o89K244J366q72k853p9K084K313j133j365j932
$$ -3802 -4199 -2607 -1227 -1354 -1780 -3176 -3865 -1621 -255 -1127 -3980 -4059 -1975 338 -795 -2160 -4092
5046d092K541R33K85q41j423K36J988J488J88k105j019J208L006J62k085j857
$$ -4092 -1551 -618 -333 -1174 -2597 -2361 -373 1115 1303 -802 -1821 -613 2393 2555 470 -1387
5062a387J373K628J516l226m04j30J456J532j260j366M88K59K206N28j795r47
$$ -1387 -14 2614 4130 904 500 370 1826 3358 2098 732 1220 1479 3685 4213 2418 1471
5078A471n23K546K109k179k904l61L252J310n93k924O36Q01J207O08j213j941
$$ 1471 948 3494 5603 3424 520 159 3411 4721 4128 1204 1840 2641 3848 4456 3243 1302
5094A302M54K689J438k691k833J374J367J365n89k723j458L313O11j861k33oL3
$$ 1302 1756 4445 5883 3192 359 1733 3100 4465 3876 1153 -305 3008 3619 1758 1525 1519 1552
5111A552O58k62j022L88k210K154K405q06k383k484J932K400L2l216j840J952
$$ 1552 2210 1948 926 1314 -896 1258 3663 2857 474 -2010 -78 2322 2354 -862 -2702 -750
5127g50N40J135j302j752J77Q26J738o50k814n83P62J830J64j675j807O91J333
$$ -750 -210 925 -377 -2129 -1952 -1126 612 -38 -2852 -3435 -2673 -843 -679 -2354 -4161 -3470 -2137
5144b137K128j546k868O85R31J518j38k92j053J62M59O31j204j001o15K159J165
$$ -2137 -9 -1555 -4423 -3738 -2807 -1289 -1427 -1719 -2772 -2610 -2151 -1520 -2724 -3725 -4340 -2181 -1016
5161a016o25k406j225K085K424M85m071K82P08J318J244j466l45j707K051K449
$$ -1016 -1641 -4047 -5272 -3187 -763 -278 -4349 -4067 -3359 -2041 -797 -2263 -2608 -4315 -2264 185
5177A85j365k154j314K544K286L90j919j913K136J664R97k856p82m38K366L42
$$ 185 -1180 -3334 -4648 -2104 182 572 -1347 -3260 -1124 540 1537 -1319 -2101 -2539 -173 169
5193A69M52o36j255k32K478J700j489k679J355L501n97o99l111J847L04K209p10
$$ 169 621 -15 -1270 -1502 976 2676 1187 -1492 -137 3364 2767 2068 -1043 804 1108 3317 2607
5210B607j122j72p91K541m81r94q79q32L348J356r32k869P5J793K217j053k239
$$ 2607 1485 1313 522 3063 2582 1588 709 -123 3225 4581 3649 780 855 2648 4865 3812 1573
5227A573K13O91J501q19l53j409m08K961o5l80k520j205K026K324m87l102l96
$$ 1573 1786 2477 3978 3159 2806 1397 989 3950 3885 3505 985 -220 1806 4130 3643 541 145
5244A45R88J605K76j512m37M72L96R5L75j876m25l72K487Q24j996k523J191J918
$$ 145 1133 2738 3014 1502 1065 1537 1933 2028 2403 527 102 -270 2217 3041 1045 -1478 -287 1631
5262A631J165k857k351J445K105l78j029j202j290K087J040Q1p86k845J141J798
$$ 1631 2796 -61 -2412 -967 1138 760 -269 -1471 -2761 -674 366 447 -339 -3184 -2043 -245
5278b45J114j904j612Q87P06J56J93j722j117J715J104j56k372l1K81J516M36
$$ -245 869 -1035 -2647 -1760 -1054 -898 -705 -2427 -3544 -1829 -725 -881 -3253 -3284 -3003 -1487 -1051
5295a051m68j532j929L121J425n11j940k597K535J773J66l313Q35J006O61J103
$$ -1051 -1519 -3051 -4980 -1859 -434 -945 -2885 -5482 -2947 -1174 -1008 -4321 -3486 -2480 -1819 -716
5311g16j519j147l81J213J728L30j548j255K39L671K01k166j971J105K088L59
$$ -716 -2235 -3382 -3763 -2550 -822 -492 -2040 -3295 -3056 615 816 -1350 -3321 -2216 -128 231
5327B31j297j453Q05J453nR67l8j291m91J244J000j234j270n78K780Q32l89j886
$$ 231 -1066 -2519 -1714 -261 -266 701 663 -628 -1119 125 1125 -109 -1379 -1957 823 1655 1266 -620
5345f20R13J506K83m57j250L84K57J248L74j068j191P09O73J582o97j434j989
$$ -620 293 1799 2082 1625 375 759 1016 2264 2638 1570 379 1088 1761 3343 2646 1212 -777
5362g77J949K754m7k608j257K214P64K05j041n67j206J734J449n1k720K94O90
$$ -777 1172 3926 3879 1271 14 2228 2992 3197 2156 1589 383 2117 3566 3515 795 1089 1779
5379A779J290O05j838j448M15L251K27k242j374k12J834p5r99k9j643M76J732
$$ 1779 3069 3674 1836 388 803 4054 4281 2039 665 453 2287 2212 1213 1184 -459 17 1749
5396A749K97j930r28k4J058J690j021j693j9K765j135J1j282q71J054J047k37
$$ 1749 2046 116 -812 -836 222 1912 891 -802 -821 1944 809 820 -462 -1333 -279 768 531
5413E31j40j873q26L500J034k775l79k027K076K122j491j734o41J046J082R82
$$ 531 391 -1482 -2308 1192 2226 -549 -928 -2955 -879 1243 -248 -1982 -2623 -1577 -495 487
5429D87j198m71p53J156J582j566r90k91p34K490J11k267j832K241K334j204j581
$$ 487 -711 -1182 -1935 -779 803 -763 -1753 -2044 -2778 -288 -177 -2444 -4276 -2035 299 -905 -2486
5446b486n27l1J736J593j959j84j486K504K72L74j161j391J161R01J079j705j999
$$ -2486 -3013 -3044 -1308 285 -1674 -1858 -3344 -840 -568 -194 -1355 -2746 -1585 -684 395 -1310 -3309
5463c309j44K816J235j180r72L43J311M73O33q54j337q03L016j13R8k205q55K785
$$ -3309 -3453 -637 598 -582 -1554 -1211 100 573 1206 352 -985 -1788 1228 1115 1213 -992 -1847 938
5481I38L27j1k179q29J346J910M71k545p42J016P03J916L72l293n73K549J237
$$ 938 1265 1254 -925 -1754 -408 1502 1973 -572 -1314 -298 405 2321 2693 -600 -1173 1376 2613
5498B613k1l002P82m65K923p01k12k456J231J886L97j107j843L94N44P09P11j602
$$ 2613 2592 -410 372 -93 2830 2129 1917 -539 692 2578 2975 1868 25 419 963 1672 2383 781
5516G81o15n75K300J442j709j872J277J97J221j475j898J57J773M41Q12l90k083
$$ 781 166 -409 1891 3333 1624 -248 1029 1226 2447 972 -926 -769 1004 1445 2257 1867 -216
5533b16j48J328J650k265k23j424K481J547o64l375m32M359r99K81k575K79O98
$$ -216 -364 964 2614 349 126 -1298 1183 2730 2066 -1309 -1741 2618 1619 1900 -675 -396 302
5550C02J112r30J058k026n41J304J49n91j673r9J047J267P04k164j177J389R65
$$ 302 1414 484 1542 -484 -1025 279 428 -163 -1836 -1935 -888 379 1083 -1081 -2258 -869 96
5567I6L13j326j011Q79L66L03l05m83j110O78K218M57k484j716R59K848m52j774
$$ 96 409 -917 -1928 -1049 -683 -380 -685 -1168 -2278 -1600 618 1075 -1409 -3125 -2166 682 230 -1544
5585a544j559J476R03Q26p66j331q9P48R61j1q30o50P9J271Q35q45j869n02K457
$$ -1544 -3103 -1627 -724 102 -664 -1995 -2084 -1336 -375 -386 -1216 -1866 -1787 -516 319 -526 -2395 -2897 -440
5604d40R87j14l078Q11R84N86k7o3q10r60J207P00R01j400k495K087K713P38k007
$$ -440 547 433 -2645 -1834 -850 -264 -291 -354 -1164 -2124 -917 -217 684 -716 -3211 -1124 1589 2327 320
5623C20k595J148L272j691o45j036J041M43J407m60m40j687N51J816M71k090j364
$$ 320 -2275 -1127 2145 454 -191 -1227 -186 257 1664 1204 764 -923 -372 1444 1915 -175 -1539
5640a539L81K463Q69j717j246L22P53M83K03j951k42K263j16P3k5k045L96K669
$$ -1539 -1158 1305 2174 457 -789 -467 286 769 972 -979 -1221 1042 926 999 974 -1071 -675 1994
5658A994N42j874j975O55K23K529j454j268k39K307J730k155p01L0n9J158P9p66
$$ 1994 2536 662 -1313 -658 -435 2094 640 -628 -867 1440 3170 1015 314 344 285 1443 1522 756
5676G56k207l2K221K247q84k936K10J369J125J92j420j437Q21R65K95N90q27j541
$$ 756 -1451 -1483 738 2985 2101 -835 -625 744 1869 2061 641 -796 25 990 1285 1875 1048 -493
5694d93J241J312K18j301j978K118L95J903k204k779O82L089n69n03j205L38Q3
$$ -493 748 2060 2278 977 -1001 1117 1512 3415 1211 -1568 -886 2203 1634 1131 -74 264 347
5711C47J028O14j197j294P45J131n6r72j893J28L102n12j27j727n02J049J021
$$ 347 1375 1989 792 -502 243 1374 1318 346 -1547 -1419 1683 1171 1044 -683 -1185 -136 885
5728H85O01j143r50l18K264j51k00j830p36J289J925k562q57M86J481J738j069
$$ 885 1486 343 -607 -925 1339 1188 988 -842 -1578 -289 1636 -926 -1783 -1297 184 1922 853
5745H53j665j351R03J922m75L57j348P31j023J396o49n38j421K123J182q01n99
$$ 853 -812 -2163 -1260 662 187 544 -804 -73 -1096 300 -349 -887 -2308 -185 997 196 -403
5762d03k280J125K629p60j473j718J965M88n73Q11M21k187k7J919R03j752j843
$$ -403 -2683 -1558 1071 311 -1162 -2880 -915 -427 -1000 -189 232 -1955 -1982 -63 840 -912 -2755
5779b755Q52J746N18k110O4k31O39J431j262j484P55J231k27J386r79q43j588
$$ -2755 -1903 -157 361 -1749 -1685 -1916 -1277 154 -1108 -2592 -1837 -606 -833 553 -426 -1269 -2857
5796b857J758K464k849J7j172K386J759j530k067L0J014K740j164q40m40O12N64
$$ -2857 -1099 1365 -1484 -1467 -2639 -253 1506 -24 -2091 -2061 -1047 1693 529 -311 -751 -139 425
5813D25M07L40k245J90M48J453J29j606p52L53K144P21k856p69K388N08N27j081
$$ 425 832 1172 -1073 -883 -435 1018 1147 -459 -1211 -858 1286 2007 -849 -1618 770 1278 1805 724
5831G24q09m8L6J982m15q47j313K78J963O85p03j616O48Q74Q66j446L8P2K03J194
$$ 724 -85 -133 -97 1885 1470 623 -690 -412 1551 2236 1533 -83 565 1439 2305 859 897 969 1172 2366
5851B366r47l16p08q53J045J669k94j267j567J990R56j557n70M53J167O21m64
$$ 2366 1419 1103 395 -458 587 2256 1962 695 -872 1118 2074 517 -53 400 1567 2188 1724
5868A724k172J396j127P39R42M9j406r49M49K201j115j273l03K29L294R1k620
$$ 1724 -448 948 -179 560 1502 1551 145 -804 -355 1846 731 -542 -845 -616 2678 2769 149
5885A49k493J940O52O53k18p96j169N55J642r1j046q66o33L511m8k753j763O46
$$ 149 -2344 -404 248 901 683 -113 -1282 -727 915 824 -222 -1088 -1721 1790 1742 -1011 -2774 -2128
5903b128J894L47p00j003J0O07J767m56j316L3r27J198J117j701j487j70J977
$$ -2128 -234 113 -587 -1590 -1580 -973 794 338 -978 -945 -1872 -674 443 -1258 -2745 -2915 -938
5920i38J088q35k080K11K089P24q00n51j340O16J868J290k664L3n12P45J088k50
$$ -938 150 -685 -2765 -2554 -465 259 -541 -1092 -2432 -1816 52 1342 -1322 -1289 -1801 -1056 32 -218
5938b18k038m40J343J882o46j623m8J553M64O55j775j014J314j15K111p34q36
$$ -218 -2256 -2696 -1353 529 -117 -1740 -1788 -235 229 884 -891 -1905 -591 -706 1405 671 -165
5955a65l09J29J520P56j491k384J285J610Q90j366k13j98J461o1N19j983J022
$$ -165 -474 -345 1175 1931 440 -1944 -659 951 1841 475 262 64 1525 1464 1983 0 1022
5972A022o90J822l9j370j228Q86J946Q65k163r48n91K776M43j248m99p83J348
$$ 1022 332 2154 2115 745 -483 403 2349 3214 1051 103 -488 2288 2731 1483 984 201 1549
5989A549J135j074m71j014J30l55K956j177j451O40L48J760m06k317j96K040M91
$$ 1549 2684 1610 1139 125 255 -100 2856 1679 228 868 1216 2976 2570 253 57 2097 2588
6006B588j164j334p21N40Q32K92Q3m03j575J087K300j86j517k512L05K037N05
$$ 2588 1424 90 -631 -91 741 1033 1116 713 -862 225 2525 2339 822 -1690 -1385 652 1157
6023A157j761M61j7J035M53j437j203N28O13p4J144k173jl11K070p80l35j737
$$ 1157 -604 -143 -160 875 1328 -109 -1312 -784 -171 -245 899 -1274 -1275 -1586 484 -296 -631 -2368
6041b368J050J093N73q72j709P37J92J463j088m37N42j000J327M73j301r28j60
$$ -2368 -1318 -225 348 -524 -2233 -1496 -1304 159 -929 -1366 -824 -1824 -497 -24 -1325 -2253 -2413
6058b413J349P83J79k956M2J618J428Q9j766j721J092J585j16l90r29l84J232
$$ -2413 -1064 -281 -102 -3058 -3016 -1398 30 119 -1647 -3368 -2276 -691 -807 -1197 -2126 -2510 -1278
6075a278J975o60j648r70j2K573J015k121p06k12K217M73k170R53r38J825N84
$$ -1278 697 37 -1611 -2581 -2593 -20 995 -1126 -1832 -2044 173 646 -1524 -571 -1509 316 900
6092I00k71q97j305K84K305J570j981j280j320L764P99j960q79J186K59O23J44
$$ 900 629 -268 -1573 -1289 1016 2586 605 -675 -1995 1769 2568 608 -271 915 1174 1797 1941
6109A941k345n36O30J498L01J212j650m09J008J95J76k768J441P77J283q47j679
$$ 1941 -404 -940 -310 1188 1489 2701 1051 642 1650 1845 2021 -747 694 1471 2754 1907 228
6126B28J78P59P78O32k019O2P3L47J565O43l489J65M74J620J039k516j61J04K185
$$ 228 406 1165 1943 2575 556 618 691 1038 2603 3246 -243 -78 396 2016 3055 539 378 482 2667
6145B667m46j857l68O55K63J591j400o21l41l41N55J589j012k578N48J647Q28
$$ 2667 2221 364 -4 651 914 2505 1105 484 143 -198 357 1946 934 -1644 -1096 551 1379
6162A379r63j409o7O07j90Q45j987K766j831K144j466q10k86m51J345J284N65
$$ 1379 416 -993 -1060 -453 -643 202 -1785 981 -850 1294 -172 -982 -1268 -1719 -374 910 1475
6179A475l204l00J003N79L34k038m1J341p05O94n13o50o00J191O47m04k299J612
$$ 1475 -1729 -2029 -1026 -447 -113 -2151 -2192 -851 -1556 -862 -1375 -2025 -2625 -1434 -787 -1191 -3490 -1878
6197a878M95J576n03o47k014K018N58K3j116q22J014j085K585m59j321j099J067
$$ -1878 -1383 193 -310 -957 -2971 -953 -395 -372 -1488 -2310 -1296 -2381 204 -255 -1576 -2675 -1608
6214a608J653L16j700p85J180J019R9q67r33L46J502J076o40k544N17K52J476
$$ -1608 45 361 -1339 -2124 -944 75 174 -693 -1626 -1280 222 1298 658 -1886 -1369 -1117 359
6231C59l5n1o14m19O35K303k144j010R02Q77O24j022m26q26O07J827k00n17o20
$$ 359 324 273 -341 -760 -125 2178 34 -976 -74 803 1427 405 -21 -847 -240 1587 1387 870 250
6250B50N01K23M54L97j544j300J458J773O37k664q1O22J845m33j928j76L12P22
$$ 250 751 974 1428 1825 281 -1019 439 2212 2849 185 104 726 2571 2138 210 34 346 1068
6268A068Q63r49R02N3j527J526N02k176j454J681J641l00r31q43r33K718n29m71
$$ 1068 1931 982 1884 1937 410 1936 2438 262 -1192 489 2130 1830 899 56 -877 1841 1312 841
6286H41r41q7J640q99l2m69P4k52J136R54j233j014j67J056J717j885j003k27
$$ 841 -100 -187 1453 554 522 53 127 -125 1011 1965 732 -282 -449 607 2324 439 -564 -791
6304g91j18K815k93j512p98O07K97o1J006k117j484K131O28o66m07j360J237J596
$$ -791 -909 1906 1613 101 -697 -90 207 146 1152 -965 -2449 -318 310 -356 -763 -2123 -886 710
6322G10K57k349k93K26J431j53m19l24l73K54K237k94k478n45J277J044k25o24
$$ 710 967 -1382 -1675 -1449 -18 -171 -590 -914 -1287 -1033 1204 910 -1568 -2113 -836 208 -17 -641
6340f41m96O31n96Q27J18j963M69J517N93j578K6O03r83K683r82p61j503M32K496
$$ -641 -1137 -506 -1102 -275 -157 -2120 -1651 -134 459 -1119 -1093 -490 -1473 1210 228 -533 -2036 -1604 892
6359H92l11j17k146N09J062O54m45L58j909J539P13p45K66J57j225J478J08n55
$$ 892 581 464 -1682 -1173 -111 543 98 456 -1453 86 799 54 320 477 -748 730 838 283
6377B83j320l41J985J024q52j823l12K084q84J378j168L02j152J083J146j301
$$ 283 -1037 -1378 607 1631 779 -1044 -1356 728 -156 1222 54 356 -796 287 1433 132
6393A32K67m70m73K318N59k091q67l75L101j059j011K06j594J439J526n22k272
$$ 132 399 -71 -544 1774 2333 242 -625 -1000 2101 1042 31 237 -1357 82 1608 1086 -1186
6410a186K38J014K82J048j93j256j136J657P84k041r67M89J214N49J78j557K10
$$ -1186 -948 66 348 1396 1203 -53 -1189 468 1252 -789 -1756 -1267 -53 496 674 -883 -673
6427f73n19J093q82J209o34L53O38j87q39r31K68Q83J345l81q0j232m52J189J076
$$ -673 -1192 -99 -981 228 -406 -53 585 398 -441 -1372 -1104 -221 1124 743 663 -569 -1021 168 1244
6446A244j163j702J680j002J333J07k141J184J164m64o11k33r20K171O1L92j297
$$ 1244 81 -1621 59 -943 390 497 -1644 -460 704 240 -371 -604 -1524 647 708 1100 -197
6463a97j237N42O76J025j286r76J407q3J009r59L24l82l53J892J150l435r75J430
$$ -197 -1434 -892 -216 809 -477 -1453 -46 -129 880 -79 245 -137 -490 1402 2552 -883 -1858 -428
6481d28K30K002j664j011L27J054L15k63p29J418k219K421O1j107k12l64J027
$$ -428 -198 1804 140 -871 -544 510 825 562 -167 1251 -968 1453 1514 407 195 -169 858
6498H58J550j312n72j168J346J975o40j357k70l34J480p21P37j380j53J228J007
$$ 858 2408 1096 524 -644 702 2677 2037 680 410 76 1556 835 1572 192 39 1267 2274
6515B274o72p11j811K273m92J392k041Q7Q3J41P76j396j018J146J081m43L8j74
$$ 2274 1602 891 -920 1353 861 2253 212 299 382 523 1299 -97 -1115 31 1112 669 707 533
6533E33n19P9O08J76J242k388p9Q47J001k363m70R00M03K56N1q33j034J173J04
$$ 533 14 93 701 877 2119 -269 -348 499 1500 -863 -1333 -433 -30 226 277 -556 -1590 -417 -313
6552c13M63m37j738R02J742n06r25m42M65j10Q71O31j163j565J258J731o48j271
$$ -313 150 -287 -2025 -1123 619 113 -812 -1254 -789 -899 -28 603 -560 -2125 -867 864 216 -1055
6570a055R9M61j017J041p61P74j538J490L16P72k728k27M00K828q57k66l37j356
$$ -1055 -956 -495 -1512 -471 -1232 -458 -1996 -506 -190 582 -2146 -2373 -1973 855 -2 -268 -605 -1961
6588a961J583l32O70l80j069J115N92P50k227l90R14J528J18l133J579l20J092
$$ -1961 -378 -710 -40 -420 -1489 -374 218 968 -1259 -1649 -735 793 911 -2222 -643 -963 129
6605A29P61n12k92p36N73J194K22r5k404K44J714j08q63k56M08O52N20m84p22
$$ 129 890 378 86 -650 -77 1117 1339 1244 -1160 -916 798 690 -173 -429 -21 631 1151 667 -55
6624e5j31J521O44j326m12n10M44J615Jj002j097N69m91R02N44j513O8P16P01
$$ -55 -186 1335 1979 653 241 -269 175 1790 1791 789 -308 261 -230 672 1216 -297 -229 487 1188
6643A188m9j153N56l42J447o71p20O88m72q48J984n95Q22j721M49J096m11q65
$$ 1188 1139 -14 542 200 1647 976 256 944 472 -376 1608 1013 1835 114 563 1659 1248 383
6661C83j194J095K42J51n73r46n3Q39J361p93o15m33J763n82M41p58j154R15J244
$$ 383 -811 284 526 677 104 -842 -895 -56 1305 512 -103 -536 1227 645 1086 328 -826 89 1333
6680A333j36j74k532M38K037m2q22j611J210j750L344p14q83p87k10O61K019j108
$$ 1333 1197 1023 -1509 -1071 966 924 102 -1509 -299 -2049 1295 581 -302 -1089 -1299 -638 1381 273
6698B73j697J54R62J014j055N72o25k63J362r31j181K92K1J937m03m46o75j037
$$ 273 -1424 -1270 -308 706 -349 223 -402 -665 697 -234 -1415 -1123 -1102 835 432 -14 -689 -1726
6716a726J228Q87j55N51k700J834L00L84k81k320N21J770jq45q3k10K46R21J841
$$ -1726 -498 389 234 785 -1915 -81 219 603 322 -1998 -1477 293 292 -553 -636 -846 -600 321 2162
6735B162k011q90j3J093N32m77r26n06J398P3k24j201K17K71J369m18m62q91Q43
$$ 2162 151 -739 -752 341 873 396 -530 -1036 362 435 211 -990 -773 -502 867 449 -13 -904 -61
6754f1l08K349k012K36r39N55J652j022j75q63J412K18j061o42q24J230R42N85
$$ -61 -369 1980 -32 204 -735 -180 1472 450 275 -588 824 1042 -19 -661 -1485 -255 687 1272
6772A272n57j858N27J787l80j58j716j38O10J333L49k023n82m9K055k96q45J48
$$ 1272 715 -1143 -616 1171 791 633 -1083 -1221 -611 722 1071 -952 -1534 -1583 472 176 -669 -521
6790e21k09J112m89q1o94p88J783M0J23Q7j638O93P11M56k106p23Q7K113K95M17
$$ -521 -730 382 -107 -188 -882 -1670 113 153 276 363 -1275 -582 129 585 -1521 -2244 -2157 -44 251 668
6810F68j067nr75J255J31j49p83K69O34RJ349j958j356R22J433K71j649m39J099
$$ 668 -399 -404 -1379 -124 7 -142 -925 -656 -22 -13 1336 -622 -1978 -1056 377 648 -1001 -1440 -341
6829c41q87K548j923k16n94J028R32L51j853p58L91K485r54n18P27o80N91J9j119
$$ -341 -1228 1320 -603 -819 -1413 -385 547 898 -955 -1713 -1322 1163 209 -309 418 -262 329 348 -771
6848g71J90O83O98j078J056m4q72l60J295M06j87j631m73K896L3j023L00n27j4
$$ -771 -581 102 800 -278 778 734 -138 -498 797 1203 1016 -615 -1088 1808 1841 818 1118 591 577
6867E77J203o65J57j671J477R83j73k796J765j251J425R49k43q45j083J968m5
$$ 577 1780 1115 1272 -399 1078 2061 1888 -908 857 -394 1031 1980 1737 892 -191 1777 1732
6884A732q3o32l37N27K14J91M24j659J366n62j91L1R89j891l1R47R06j242m23
$$ 1732 1649 1017 680 1207 1421 1612 2036 377 1743 1181 990 1021 2010 119 88 1035 1941 699 276
6903B76Q62j15K5j974J121P56l54Q8r54k40L27l0J319O91j357j463j47J968o74
$$ 276 1138 1023 1048 -926 195 951 597 685 -269 -509 -182 -212 1107 1798 441 -1022 -1169 799 125
6922A25o54j037J155K443j775m16j242r9L11Q95K22L84k594J52Q31J098j047n82
$$ 125 -529 -1566 -411 2032 257 -159 -1401 -1500 -1189 -294 -72 312 -2282 -2130 -1299 -201 -1248 -1830
6940a830Q98p26J857k37j916q82K701m83j354P41M69j643J064J226j188p70RR96
$$ -1830 -932 -1658 199 -38 -1954 -2836 -135 -618 -1972 -1231 -762 -2405 -1341 -115 -1303 -2073 -2064 -1068
6958a068J079p89j199k57L55K167j187j430M51J571L99j583N12m50Q69J15m91
$$ -1068 11 -778 -1977 -2234 -1879 288 -899 -2329 -1878 -307 92 -1491 -979 -1429 -560 -445 -936
6975i36L41p17l32n27J578P26l69k054Q72J097J592j913M60K67j270J578j011
$$ -936 -595 -1312 -1644 -2171 -593 133 -236 -2290 -1418 -321 1271 -642 -182 85 -1185 393 -618
6992f18J854j956p55J017J103l60j086o44K370R83j055q12n43J234J168k96m89
$$ -618 1236 -720 -1475 -458 645 285 -801 -1445 925 1908 853 41 -502 732 1900 1604 1115
7009A115j177J022j27J435q82q84O29R75L19j112L46k53M11Q45r59q48j08J145
$$ 1115 -62 960 833 2268 1386 502 1131 2106 2425 1313 1659 1406 1817 2662 1703 855 747 1892
7027A892p11J028j315N01p00M10M67J48j89o24K56R73R03j975K20J389j244J87
$$ 1892 1181 2209 894 1395 695 1105 1572 1720 1531 907 1163 2136 3039 1064 1284 2673 1429 1616
7045A616j11j46L64l29j076J272J31j149N71P9J774j185j456j131P14R56q34r8
$$ 1616 1505 1359 1723 1394 318 1590 1721 572 1143 1222 2996 1811 355 -776 -62 894 60 -38
7063c8n57J974m50j391K35m18K75J13Q36P65k716K43J62J316P9q95j633J197J630
$$ -38 -595 1379 929 -462 -227 -645 -370 -257 579 1344 -1372 -1129 -967 349 428 -467 -2100 -903 727
7082G27J38k368J70k47P38l55N66l99j05P20qN5j082j13l86M19J626j901m29M25
$$ 727 865 -1503 -1333 -1580 -842 -1197 -631 -1030 -1135 -415 -423 -368 -1450 -1563 -1949 -1530 96 -1805 -2234 -1809
7102a809N93o4K40j305O53J479k04p56q54J51P89J64r90J070j049P61k75J538
$$ -1809 -1216 -1280 -1040 -2345 -1692 -213 -417 -1173 -2027 -1876 -1087 -923 -1913 -843 -1892 -1131 -1406 132
7120A32q04j149k71J035J085p47O62j022Q26n16q2J54m70J132j81M92q25j131
$$ 132 -672 -1821 -2092 -1057 28 -719 -57 -1079 -253 -769 -851 -697 -1167 -35 -216 276 -549 -1680
7138a680J432Q7J24N41j164j032R18J924J13j390p61J990J75m35o22M64j599J987
$$ -1680 -248 -161 -37 504 -660 -1692 -774 1150 1263 -127 -888 1102 1277 842 220 684 -915 1072
7156A072k3J397j170j669J716J65J265k215n52J36J717n37J63j159K25N1j53K424
$$ 1072 1049 2446 1276 -393 1323 1488 2753 538 -14 122 1839 1302 1465 306 531 582 429 2853
7174B853k508L9k14J432L12m92j860K28J153O37j125J77o36R22m00Q40R2J10r64
$$ 2853 345 384 170 1602 1914 1422 -438 -210 943 1580 455 632 -4 918 518 1358 1450 1560 596
7193E96l14J269k21j347l20R20Q49m68k006M28J507k06M43l43j017J042j163J301
$$ 596 282 1551 1330 -17 -337 583 1432 964 -1042 -614 893 687 1130 787 -230 812 -351 950
7211I50j123m67j83r3J852k88k52j731J052k05L46P12j633J88J869j55k473J611
$$ 950 -173 -640 -823 -916 936 648 396 -1335 -283 -488 -142 570 -1063 -875 994 839 -1634 -23
7229b3o45m92L02P22j458Q38q77J167J448j303j15j622K517j460J394j015M81
$$ -23 -668 -1160 -858 -136 -1594 -756 -1633 -466 982 -321 -436 -2058 459 -1001 393 -622 -141
7246a41o9m54L03o9J05j87J40L67j441J704j927J238N26j04n90o2k1M97N14j144
$$ -141 -210 -664 -361 -430 -325 -512 -372 -5 -1446 258 -1669 -431 95 -9 -599 -661 -682 -185 329 -815
7266h15l24J105l16P87o67m25L16M66m89k04L38p25R79R85n55j477K32P60P91
$$ -815 -1139 -34 -350 437 -230 -655 -339 127 -362 -566 -228 -953 26 1011 456 -1021 -789 -29 762
7285G62J50j694P76r44Q94N49N38j051r89R72P05K33j284k64k21Q37J590j502
$$ 762 912 -782 -6 -950 -56 493 1031 -20 -1009 -37 668 901 -383 -647 -868 -31 1559 57
7303E7n74M2J168m76R02j224J01Q22k26m79n46L55N06Q70j656Q18k69j363J971
$$ 57 -517 -475 693 217 1119 -105 -4 818 592 113 -433 -78 428 1298 -358 460 191 -1172 799
7322G99J019j445p65p3J026L44p14o39R18l66P93p83J340j331j323J193N59L03
$$ 799 1818 373 -392 -465 561 905 191 -448 470 104 897 114 1454 123 -1200 -7 552 855
7340H55j86j137K80J756j053j216r4Q91Q72k25k48k24m48R5l89K131k359n99J071
$$ 855 669 -468 -188 1568 515 -701 -795 96 968 743 495 271 -177 -82 -471 1660 -699 -1298 -227
7359b27N20P75j078p36O94R93O8j358l30P09J40j97O93j292J081j89j56L09r3
$$ -227 293 1068 -10 -746 -52 941 1009 -349 -679 30 170 -27 666 -626 455 266 110 419 326
7378C26J93j554J140L43N12j782R60k54O46j72l47l48k7N77N59l47j043L35K71
$$ 326 519 -1035 105 448 960 -822 138 -116 530 358 11 -337 -364 213 772 425 -618 -283 -12
7397a2J290j201o8q27K53J114M8q84p7K11N96j76k54m32j0j2L98O33k316K59Q74
$$ -12 1278 77 9 -818 -565 549 597 -287 -364 -153 443 267 13 -419 -429 -441 -43 590 -1726 -1467 -593
7418e93L80J384j936M27o30q3J377N66k536N85Q84J367k052J64p23J792M06j11
$$ -593 -213 1171 -765 -338 -968 -1051 326 892 -1644 -1059 -175 1192 -860 -696 -1419 373 779 668
7436F68j628q55J638L5l44J015p00r81K039j747m52J004r08L05O77J7J56j316
$$ 668 -960 -1815 -177 -142 -486 529 -171 -1152 887 -860 -1312 -308 -1216 -911 -234 -217 -61 -1377
7454a377J168M7j55J080j956K06J420RJ85j830o79L34J938J8l93j442L20J013
$$ -1377 -209 -162 -317 763 -1193 -987 433 442 627 -1203 -1882 -1548 390 408 15 -1427 -1107 -94
7472i4LO12q65J916k520J235Q45j157q98L20J087l45k98k25J040m15J906j566
$$ -94 -91 521 -344 1572 -948 287 1132 -25 -923 -603 484 139 -159 -384 656 241 2147 581
7490E81k22m77P45J385n61r82j11j301J301L32j374j59P05N71J96J682j622p12
$$ 581 359 -118 627 2012 1451 469 358 -943 358 690 -684 -843 -138 433 629 2311 689 -23
7508b3J299q62m89P57j14j63N21J141q63q07r3N36L55K73p61k09J16J937j390
$$ -23 1276 414 -75 682 568 405 926 2067 1204 397 304 840 1195 1468 707 498 614 2551 1161
7527A161J01j189K50O16M09O91k216O16l38Q63N06q09K7O0r6J861j654o43p72
$$ 1161 1262 73 323 939 1348 2039 -177 439 101 964 1470 661 688 748 652 2513 859 216 -556
7546e56J150J498j740q57J068k85K38j328J35l90P86J002k94k98j336Q78K86O6
$$ -556 594 2092 352 -505 563 278 516 -812 -677 -1067 -281 721 427 129 -1207 -329 -43 23
7564B3k50p78q54K597q02K54r73%R0O78O59o25j391k53K84J438j92j653p19N55
$$ 23 -227 -1005 -1859 738 -64 190 -783 -783 -693 -15 644 19 -1372 -1625 -1341 97 -95 -1748 -2467 -1912
7584a912K507j450k80j79m94R53k47J59R10j095Q5Q34q04o86n74Q87Q24Q4k42
$$ -1912 595 -855 -1135 -1314 -1808 -855 -1102 -943 -33 -1128 -1043 -209 -1013 -1699 -2273 -1386 -562 -478 -720
7603g20o36M23O96m19N42j011L5J64K98Q8M80N4k82M96l82j7k27j023J049J322
$$ -720 -1356 -933 -237 -656 -114 -1125 -1090 -926 -628 -540 -60 -6 -288 208 -174 -191 -418 -1441 -392 930
7623I30j188l68N04J172j107M95k4m88p23J657J98q15n25Q44m45J617o4j013q59
$$ 930 -258 -626 -122 1050 -57 438 414 -74 -797 860 1058 243 -282 562 117 1734 1670 657 -202
7642b02J212R20j175Q85o10p45L63R01j481K1J524o22Q41k09n49n44p06J616n58
$$ -202 1010 1930 755 1640 1030 285 648 1549 68 89 1613 991 1832 1623 1074 530 -176 1440 882
7661H82k71N25L57K95P7j15o42M59m67M77r0r50J46j111J306l4p02J009j214K167
$$ 882 611 1136 1493 1788 1865 1750 1108 1567 1100 1577 1487 537 683 -428 878 844 142 1151 -63 2104
7681B104l73j362m71L02J63J242m20j908k4J209o16j07P78j838P5J922O38j550
$$ 2104 1731 369 -102 200 363 1605 1185 -723 -747 462 -154 -261 517 -1321 -1246 676 1314 -236
7699b36p72L94M16K68j98j264p44J080m42J172j290P60n66J067r79J099j042l
$$ -236 -1008 -614 -198 70 -128 -1392 -2136 -1056 -1498 -326 -1616 -856 -1422 -355 -1334 -235 -1277 -1280
7717a280n46J234n20j056O88K60R53j256O28r85J56J329q69o34J71L88k87Q35
$$ -1280 -1826 -592 -1112 -2168 -1480 -1220 -267 -1523 -895 -1880 -1724 -395 -1264 -1898 -1727 -1339 -1626 -791
7735g91m58q91R08j215J757k25M58j789J197j183O59P21j522J175K45P7K11o19
$$ -791 -1249 -2140 -1232 -2447 -690 -915 -457 -2246 -1049 -2232 -1573 -852 -2374 -1199 -954 -877 -666 -1285
7753a285J96n61J312M57j10j021R18r1M23Q22r74l92J123r80J84K24n28K59Q86
$$ -1285 -1089 -1650 -338 119 9 -1012 -94 -185 238 1060 86 -306 817 -163 21 245 -283 -24 862
7772H62k43j75j85Q8J68J642r38j030P57J89p3O60j607N31M31J60P41k04j399
$$ 862 619 444 259 347 515 2157 1219 189 946 1135 1062 1722 115 646 1077 1237 1978 1774 375
7791C75J440j088J312O8l52p16p17J849k37k10j044N4R33Q01L77k593R04J315
$$ 375 1815 727 2039 2107 1755 1039 322 2171 1934 1724 680 734 1667 2468 2845 252 1156 2471
7809B471j00j316m62J66M63L86M87o75j452O24J835j403J186j318o32M61O40L36
$$ 2471 2371 1055 593 759 1222 1608 2095 1420 -32 592 2427 1024 2210 892 260 721 1361 1697
7827A697j533n17R58r1J70N86j238m62P51L41j193P5m53J167P41j427N79o77k44
$$ 1697 164 -353 605 514 684 1270 32 -430 321 662 -531 -456 -909 258 999 -428 151 -526 -770
7846g70J451j98j401N8Q45o49j07K64J105j452M25J457j147j174j35n7J307m35
$$ -770 681 483 -918 -860 -15 -664 -771 -507 598 -854 -429 1028 -119 -1293 -1428 -1485 -178 -613
7864f13n13q28J185l82J57m49K26M5q03Q71R97p61r18j39K88N64J8n70n97J011
$$ -613 -1126 -1954 -769 -1151 -994 -1443 -1217 -1172 -1975 -1104 -107 -868 -1786 -1925 -1637 -1073 -1055 -1625 -2222 -1211
7884a211N75k02m83n9L99k78J195o37j26j023J251r6l59N12j685K082M21o31L30
$$ -1211 -636 -838 -1321 -1380 -981 -1259 -64 -701 -827 -1850 -599 -695 -1054 -542 -2227 -145 276 -355 -25
7903b5m36r13J306L79q74N23J87l11K41m15n96L26Q63Q65p33m90Q04J06P58N72
$$ -25 -461 -1374 -68 311 -563 -40 147 -164 77 -338 -934 -608 255 1120 387 -103 701 807 1565 2137
7923B137j955j62R28M13k97J17r61P29k96K48R32r14j25l36P44J717j006j579
$$ 2137 182 20 948 1361 1064 1181 220 949 653 901 1833 919 794 458 1202 2919 1913 334
7941C34j45J058l20o3q88m07K920n14j169L22n04P67J85n69n3o12L20J111j89
$$ 334 189 1247 927 864 -24 -431 2489 1975 806 1128 624 1391 1576 1007 954 342 662 1773 1584
7960A584K12j256K07N75q31M01L27r48l25P84Q31r04m02l8J18J692j163k88r74
$$ 1584 1796 540 747 1322 491 892 1219 271 -54 730 1561 657 255 217 335 2027 864 576 -398
7979c98J73N7J682j432n92q5R01J51j338J162m87l43P64Q80k622L3L20J662K9
$$ -398 -225 -168 1514 82 -510 -595 306 457 -881 281 -206 -549 215 1095 -1527 -1494 -1174 488 517
7998E17j833K69M88J68m77q88L31P68P18j256L8j15n96J392j64J323j469J32j379
$$ 517 -1316 -1047 -559 -391 -868 -1756 -1425 -657 61 -1195 -1157 -1272 -1868 -476 -640 683 -786 -654 -2033
8017b033J217J035q46o18N95J08l26pq80K0N29J166m56K66j25J62k22J312j322
$$ -2033 -816 219 -627 -1245 -650 -542 -868 -875 -1755 -1735 -1206 -40 -496 -230 -355 -193 -415 897 -425
8036d25n12M26j294K289o26q09K42Q02l9O15j086j80j56K42O02J587j721J16m53
$$ -425 -937 -511 -1805 484 -142 -951 -709 93 54 669 -417 -597 -753 -511 91 1678 -43 73 -380
8055c80P48L00K03q91o92P89L25l0l09k55M67J043r90o38O70J83l69r1L96p27
$$ -380 368 668 871 -20 -712 77 402 372 63 -192 275 1318 328 -310 360 543 174 83 479 -248
8075b48L85N61l10N39r48K02k56J841j744j030O23J435o49Q84n42q93P0M20J52
$$ -248 137 698 388 927 -21 181 -75 1766 22 -1008 -385 1050 401 1285 743 -150 -80 340 492
8094D92J07n25kQ46k28l09r09pn13K408p90k58K80q98K35O04r82M13M75j110M19
$$ 492 599 74 72 918 690 381 -528 -535 -1048 1360 570 312 592 -306 -71 533 -449 -36 439 -671 -252
8115b52n2J380q35m11R4J319m45l06j36Q87j262j10m2o07J230j221N47p51O90
$$ -252 -304 1076 241 -170 -76 1243 798 492 356 1243 -19 -129 -171 -778 452 -769 -222 -973 -283
8134b83j98N47O65o10l69K54j60O1k5j439J001n68J194o59l00P3k9J189j63j159
$$ -283 -481 66 731 121 -248 6 -154 -93 -118 -1557 -556 -1124 70 -589 -889 -816 -845 344 181 -978
8154i78l72J410m32O23P46n12j453N15N67n56m20R21K39K70j188Q36J05n93O84
$$ -978 -1350 60 -372 251 997 485 -968 -453 114 -442 -862 59 298 568 -620 216 321 -272 412
8173D12K0j149m40N97m99J123R65j595P02r23L91J679j642J55m50J156r48O59
$$ 412 432 -717 -1157 -560 -1059 64 1029 -566 136 -787 -396 1283 -359 -204 -654 502 -446 213
8191B13
$$ Imaginary data points
##PAGE= N=2
##DATA TABLE= (X++(I..I)), XYDATA
0@%%%%%%%%%%%%%%%Kp2J71k09K16k16K16k31K90l75M25m61N24o05O81p69Q69r75
$$ 0 0 0 0 0 0 0 0 0 0 0 0 0 0 0 0 2 -70 101 -108 108 -108 108 -123 167 -208 217 -244 280 -325 356 -413 456 -519
33e19J085j213J357j508J677j859K062k282K526k799L104l440L805m232M714n254
$$ -519 566 -647 710 -798 879 -980 1082 -1200 1326 -1473 1631 -1809 1996 -2236 2478 -2776
49b776N884o624P513q587R925j1659J3995j7334K2549l1928N4120j89617k74632
$$ -2776 3108 -3516 3997 -4590 5335 -6324 7671 -9663 12886 -19042 35078 -154539 -429171
62d29171J14631K6442m761r3543l2898j2082J7781j3555j5364m7565l2502n244
$$ -429171 -314540 -288098 -292859 -386402 -419300 -431382 -413601 -427156 -442520 -490085 -522587 -527831
74e27831L0275n440m5941n3674R155M0039J0483n0323m7748O419M7545J1775l1160
$$ -527831 -497556 -502996 -548937 -602611 -593456 -553417 -542934 -593257 -641005 -634586 -587041 -575266 -606426
87f06426l8627J491K4573K8059K145j9388k8223O147M5153M2462j7060m6602k221
$$ -606426 -645053 -643562 -618989 -590930 -588785 -608173 -636396 -630249 -585096 -542634 -559694 -606296 -608517
100f08517O3468N5588j5276m2331M091N7944M5921J901j3763L917K5524M2466
$$ -608517 -545049 -489461 -504737 -547068 -542977 -485033 -439112 -437211 -450974 -447057 -421533 -379067
112c79067L9101R053j7636M986N3470O2465J3116k6291j573N4599O8774K2942
$$ -379067 -339966 -330913 -348549 -343563 -290093 -227628 -214512 -240803 -242376 -187777 -119003 -96061
124i6061k1581o210M3520O4296K9039m087r01K0898L8963M7849L0744r823j8584
$$ -96061 -117642 -123852 -80332 -16036 13003 8916 8015 28913 67876 115725 146469 136646 118062
137A18062L1063P5892M1135k9032l0553L7819P2615K8887k2781j6642K2823M4283
$$ 118062 149125 225017 266152 237120 206567 244386 317001 345888 323107 306465 329288 373571
149C73571K9987L880r241q833J7188M2173L1632j6482l8096N613N3361L7207k3526
$$ 373571 403558 407438 398197 389364 406552 448725 480357 463875 425779 431392 484753 521960 498434
162D98434m3480O73M1219K9468j4830l3661j1909J1726K4448O750j9603l5176
$$ 498434 454954 455627 496846 526314 511484 477823 465914 477640 502088 508838 489235 454059
174D54059j6400K1801L0977j3676n7755l3247K5432L8184k0902o0625l1656J7220
$$ 454059 437659 459460 490437 476761 419006 385759 411191 449375 428473 367848 336192 353412
186C53412K0653j6098m1289l3748j1921M540O213k0165m7481m0112J671K4498
$$ 353412 374065 357967 316678 282930 271009 275549 281762 261597 214116 174004 175675 200173
198B00173p802n7076n2520J87K7767n054n1708m9413q204J5762l330l0278l6622
$$ 200173 192371 135295 82775 82962 110729 105675 53967 4554 -3650 12112 8782 -21496 -58118
211e8118k8872n329J0673j494l5622n2546j6858K8898J6267l9460o1560j4356
$$ -58118 -86990 -92319 -81646 -83140 -118762 -171308 -188166 -159268 -143001 -182461 -244021 -258377
223b58377L4127J4495l5780m6549j2310J5391R522r255k4680k8026j1055J9994
$$ -258377 -224250 -209755 -245535 -292084 -304394 -289003 -279481 -288736 -313416 -341442 -352497 -332503
235c32503K2175j6586m6506j8279K9709L6725j4224m5218j6844K9860L1899l072
$$ -332503 -310328 -326914 -373420 -391699 -361990 -325265 -339489 -384707 -401551 -371691 -339792 -342864
247c42864k5727j5685J0860K4001J8413j314j9327j3510K2104M3284J4643l2547
$$ -342864 -368591 -384276 -373416 -349415 -331002 -332316 -351643 -365153 -343049 -299765 -285122 -317669
259c17669k2640K7680N4589J4379k9790j8477K6180M4813J8543q943j0343O779
$$ -317669 -340309 -312629 -258040 -243661 -273451 -291928 -265748 -220935 -202392 -211335 -221678 -214899
271b14899K6876L2922J8431j0338j5688J6887M9305L2682j4606k6128J6197N2898
$$ -214899 -188023 -155101 -136670 -147008 -162696 -145809 -96504 -63822 -78428 -104556 -88359 -35461
283c5461L1892j0015k0675J0984L7780L1881O692o785m004J3620L4354L0792N4
$$ -35461 -3569 -13584 -34259 -23275 14505 46386 53078 46293 42289 55909 90263 121055 121109
296A21109k4789n96M1499M5548j966l5726n642M2386M1669k260k6946n463K3409
$$ 121109 96320 95724 137223 182771 180805 145079 139437 181823 223492 221232 194286 188823 212232
309B12232K8701J1302n459j4963o088K2163L2053O633l0794k1814J9433M2462
$$ 212232 240933 252235 246776 231813 225725 247888 279941 286574 255780 233966 253399 295861
321B95861O019l6463k2984J7503L2063L479k3813k0053j572J5172J3317k793k2647
$$ 295861 301880 265417 242433 259936 291999 295478 271665 251612 250040 265212 278529 275736 253089
334B53089k6817J722K9876J1780l1635m3021O90L4241J2582l5520l8510k521K0658
$$ 253089 226272 227994 257870 269650 238015 194994 195684 229925 242507 206987 168477 165956 186614
347A86614P236j8639k9242j6817J580J0851J841k1842l7233j3401J8428J8123
$$ 186614 193850 175211 145969 129152 130732 141583 143424 121582 84349 70948 89376 107499
359A07499k3539m6628j8565K0608J8005k0443m0174j8721R433J0039o930k3405
$$ 107499 83960 37332 18767 39375 57380 36937 -3237 -21958 -12525 -2486 -9416 -32821
371c2821k4714j2249P328J2121q631l9187k7920J2362K9518n647m5929l0066J4635
$$ -32821 -57535 -69784 -62456 -50335 -58966 -98153 -126073 -113711 -84193 -89840 -135769 -165835 -151200
384a51200K6388m293l1946k3670J809J5698N499j1491k2419j7985O319K3563O264
$$ -151200 -124812 -129105 -161051 -184721 -182912 -167214 -161715 -173206 -195625 -213610 -207291 -183728 -177464
397a77464k6779l2863N675L5368J2362k8448l0729P014K9863J0827j4850j8285
$$ -177464 -204243 -237106 -231431 -196063 -183701 -212149 -242878 -235864 -206001 -195174 -210024 -228309
409b28309l476J3406J7297Q818j0491k1576p80L0611K7135j0743l2304k499L7594
$$ -228309 -231785 -218379 -201082 -192264 -202755 -224331 -225111 -194500 -167365 -178108 -210412 -212911 -175317
422a75317L0956j1090k7718j238K8831K7773P28j2414n618Q419K4477K1529J234
$$ -175317 -144361 -155451 -183169 -184407 -155576 -127803 -127075 -139489 -145107 -136688 -112211 -90682 -89448
435h9448j7844n884K7528L5874M683k5394j0415K8096L8742O545k0093p219J9208
$$ -89448 -107292 -113176 -85648 -49774 -45091 -70485 -80900 -52804 -14062 -7517 -27610 -34829 -15621
448a5621K7850J4750j319r710j391J8681K8580J4980j6395j9125J6699M0805J8869
$$ -15621 12229 26979 25660 15950 14559 33240 61820 76800 60405 41280 57979 98784 117653
461A17653k0157k3588J4735L8745J7081j6062j6364O219K2974J8942J929j0060
$$ 117653 97496 73908 88643 127388 144469 128407 112043 118262 141236 160178 162107 152047
473A52047j1034N858K5330J9601j1454k7277j907L3396K4050j6040k9038j952
$$ 152047 141013 146871 172201 191802 180348 153071 151164 184560 208610 192570 163532 161580
485A61580K6137J7143p343j8948q405N777J4961P905o869k5040j2507J7674K5619
$$ 161580 187717 204860 197517 178569 170164 175941 190902 198807 191938 166898 154391 172065 197684
498A97684p134l5779k0193K0932K5938q340l4091j8823J2130J7727k229k0998
$$ 197684 190550 154771 134578 155510 181448 173108 139017 120194 132324 150051 147822 126824
510A26824k0012p152P550J0791m766k5397k7572M286K4119K012l5669l0460N040
$$ 126824 106812 99660 107210 118001 113235 87838 60266 64552 88671 90683 55014 24554 29594
523B9594K3903q9k8059k5624k940J0167L961j1418k0336j8085l367J3901O307
$$ 29594 53497 53408 25349 -275 -3215 6952 10913 -505 -20841 -38926 -42293 -28392 -22085
536b2085k2161l3349p376K2944J4629k4524l6579q351K2563J2726j6770k8848
$$ -22085 -44246 -77595 -84971 -62027 -47398 -71922 -108501 -116852 -94289 -81563 -98333 -127181
548a27181j0682Q633J1081j731j4147k0641q077J4772J7514q469l3044j4571K1353
$$ -127181 -137863 -129230 -118149 -119880 -134027 -154668 -162745 -147973 -130459 -138928 -171972 -186543 -165190
561a65190K5967p500l1249j2803J7773J9533j692j5668j1404J903J3058J3161
$$ -165190 -139223 -146723 -177972 -190775 -173002 -153469 -155161 -170829 -182233 -180330 -167272 -154111
573a54111O98j8078j3912J2728L2108P332k3649k0780J6672L4460J0806k0968
$$ -154111 -153413 -171491 -185403 -172675 -140567 -133235 -156884 -177664 -160992 -126532 -115726 -136694
585a36694j6825J2375K6758J2081m430r250p30J3310K1933J3380r846j6001P245
$$ -136694 -153519 -141144 -114386 -102305 -106735 -115985 -116715 -103405 -81472 -68092 -77938 -93939 -86694
598h6694L4221K3528j2849k1502O633L5134J9665p607j3884M663J9608J9655Q331
$$ -86694 -52473 -28945 -41794 -63296 -56663 -21529 -1864 -9471 -23355 -18692 916 20571 28902
611B8902m872o914L638K2961K4696n69k0377m170K7528L1673l45k5024o496K6725
$$ 28902 24030 17116 20754 43715 68411 67842 47465 43295 70823 102496 102151 77127 70631 97356
625I7356K7940K025j7131p788J3118J9496J2594l077j2833o471J4556K5119O042
$$ 97356 125296 127321 110190 102402 115520 135016 147610 144533 131700 125229 139785 164904 170946
638A70946k2768j6265J4878L1517L517k4657j6299J1749K1247N116j2680j4149
$$ 170946 148178 131913 146791 178308 181825 157168 140869 152618 173865 178981 166301 152152
650A52152l664P705J1818M717j6679k2691L84K3315J1568k1705k9621j170K3575
$$ 152152 148488 156193 168011 172728 156049 133358 133742 157057 168625 146920 117299 116129 139704
663A39704J0428j9796k7427n777J3466Q999j0123j9912j2903j963P359P606j4993
$$ 139704 150132 130336 102909 97132 110598 119597 109474 89562 76659 74696 82055 89661 74668
676G4668k8825j2776J5404J5427j4799l5241j3732J5095J3970j3417k7236j4181
$$ 74668 45843 33067 48471 63898 49099 13858 126 15221 29191 15774 -11462 -25643
688b5643L889O863j629j3231j9622j4513N975J3495m216k8238k2972P663K2642
$$ -25643 -21754 -14891 -16520 -29751 -49373 -63886 -57911 -44416 -48632 -76870 -99842 -92179 -69537
701f9537k175k9400k2709O929J7125K45j9912j8642k124Q986Q907l310j7906j5541
$$ -69537 -71712 -101112 -123821 -116892 -99767 -99522 -119434 -138076 -140200 -131214 -122307 -125617 -143523 -159064
715a59064L453J9516Q158j8999k5604K211K7602J1305j9354k1647L639J9952R775
$$ -159064 -155611 -136095 -127937 -146936 -172540 -170329 -142727 -131422 -150776 -172423 -168784 -148832 -139057
728a39057n910j1228n224P123J4831J1466n521j6767m013K4382K3929n854k4184
$$ -139057 -144967 -156195 -161419 -154296 -139465 -127999 -133520 -150287 -154300 -129918 -105989 -111843 -136027
741a36027k683K7421K4675m203j8505k515J9702J8804O763n660o309L938J7389
$$ -136027 -138710 -111289 -86614 -90817 -109322 -111837 -92135 -73331 -66568 -72228 -78537 -74599 -57210
754e7210K0326K987j3194p293J9557L1544N240j8623r393K0779K9797O017j2130
$$ -57210 -36884 -33897 -47091 -54384 -34827 -3283 1957 -16666 -26059 -5280 24517 30534 18404
767A8404n550R815J9418J2280J766m974o523J1112K4794J2797j2294j6031Q967
$$ 18404 12854 22669 42087 54367 56133 51159 44636 55748 80542 93339 81045 65014 73981
780G3981K9836J5329j5286j6923P328K6767J3062j0454j1520n87J1206J6094M810
$$ 73981 103817 119146 103860 86937 94265 121032 134094 123640 112120 111533 122739 138833 143643
793A43643r020j3564K89K0277J5189r115k3323n807K3115J7593j1060k3504n220
$$ 143643 134623 121059 121348 141625 156814 147699 124376 118569 141684 159277 148217 124713 119493
806A19493J5333J2006l566j4211j0326k016Q831Q051m306k1057j5071J0183J9533
$$ 119493 134826 146832 143266 129055 118729 116713 125544 133595 129289 108232 93161 103344 122877
819A22877k912l0770j6810J0650J8039m003k4724j8199O113R011J488j3869j6237
$$ 122877 119965 89195 72385 83035 101074 97071 72347 54148 60261 69272 70760 56891 40654
832D0654j1070K647J0221j25k1188k2645L99J7835M927k6174k3938J359J6803
$$ 40654 29584 32231 42452 42327 21139 -1506 -1107 16728 21655 -4519 -28457 -27098 -10295
845a0295J231j8650j8131l337M464M368m000j4411j6540k557J2287J0303j5637
$$ -10295 -9064 -27714 -45845 -49182 -44718 -40350 -44350 -58761 -75301 -77858 -65571 -55268 -70905
858g0905k6072o138J8180J4300j5293k6322n127J5041J2425r199j5610q826N160
$$ -70905 -96977 -103115 -84935 -70635 -85928 -112250 -117377 -102336 -89911 -99110 -114720 -123546 -118386
871a18386J0185N453q116j5315n775J2808J8102n360k0251j1972J7249J9942j422
$$ -118386 -108201 -102748 -110864 -126179 -131954 -119146 -101044 -106404 -126655 -138627 -121378 -101436 -102858
884a02858j7465j0381J3137J5860L380q100o488O85J0052J4385N499j1261j2970
$$ -102858 -120323 -130704 -117567 -101707 -98327 -106427 -112915 -112230 -102178 -87793 -82294 -93555 -106525
897a06525J0572K4735J1507j6519j4718J0467K6473J0982j2094j1802O144J9553
$$ -106525 -95953 -71218 -59711 -76230 -90948 -80481 -54008 -43026 -55120 -66922 -60778 -41225
909d1225J0209J122p268l097P626J8528J3116n987j5331M608K3864J8298q332
$$ -41225 -31016 -29894 -37162 -40259 -32633 -14105 -989 -6976 -22307 -17699 6165 24463 16131
922A6131j7899M722K1769J6363n300r012m09J1585J2387O988r69j0597k187J6008
$$ 16131 -1768 2954 24723 41086 35786 26774 26365 37950 50337 57325 56356 45759 43572 59580
936E9580J9243P01j8629p755J8044K3884r01j9808p796J5150J7462J620j0663
$$ 59580 78823 79524 60895 53140 71184 95068 94167 74359 66563 81713 99175 100795 90132
949I0132p564J516J0143J1968j252j3290r856P509J9106N598j9735j6046R292
$$ 90132 82568 84084 94227 106195 104943 91653 81797 89306 108412 114010 94275 78229 87521
962H7521K0546K589j8352j4057L718J3092M640p690j1624o200L348R297M179j1788
$$ 87521 108067 110656 92304 78247 81965 95057 99697 92007 80383 74183 77531 86828 91007 79219
976G9219j9494k634J6498J2448j5939k4193l530J7459R746j4777j9725m325P811
$$ 79219 59725 57091 73589 86037 70098 45905 42375 59834 69580 54803 35078 30753 38564
989C8564O845l230j1126j4437k992Q399Q862p927k3524j0067J3460J4302q140
$$ 38564 45409 42179 31053 16616 13624 22023 30885 22958 -566 -10633 2827 17129 8989
1002H989k5881j1042J3375J0916o586j6260r961K514N101M359n886j4489j1836
$$ 8989 -16892 -27934 -14559 -3643 -10229 -26489 -36450 -33936 -28835 -24476 -30362 -44851 -56687
1015e6687M061J6145J657j9229j9123O225K0267J530k0247j5434O453J3900L155
$$ -56687 -52626 -36481 -34824 -54053 -73176 -66951 -46684 -45154 -65401 -80835 -74382 -60482 -57327
1028e7327j0727j2738j572N096J0121J019j0870j3760J068J7970J1046j4951k0108
$$ -57327 -68054 -80792 -82364 -77268 -67147 -66128 -76998 -90758 -89690 -71720 -60674 -75625 -95733
1041i5733M343J8624J1157j2696j3639J152J1697R405j792p083p035K229J3316
$$ -95733 -91390 -72766 -61609 -74305 -87944 -86792 -75095 -65690 -67482 -74565 -81600 -79371 -66055
1054f6055R803k432j6184m910J7974J7880l007j9327o074J8428J8386k369j4150
$$ -66055 -56252 -58684 -74868 -79778 -61804 -43924 -46931 -66258 -72332 -53904 -35518 -37887 -52037
1067e2037l642J0292J1941O561k304q857k058J0427J7411L795j4406r537J3000
$$ -52037 -55679 -45387 -33446 -26885 -29189 -38046 -40104 -29677 -12266 -8471 -22877 -32414 -19414
1080a9414K2913N148j7187j0235J2679J9641M298r052o908N110J0301R863M858
$$ -19414 3499 8647 -8540 -18775 -6096 13545 17843 8791 1883 6993 17294 27157 32015
1093C2015q169q663N163J7433J2822j1911j6620M810K2905J1096j0126j5062L085
$$ 32015 23846 15183 20346 37779 50601 38690 22070 26880 49785 60881 50755 35693 38778
1106C8778J6556J0082n639q088l324N519J2003P214m770j4645j211J4989J4387
$$ 38778 55334 65416 59777 51689 48365 53884 65887 73101 68331 53686 52475 67464 81851
1119H1851p553j8770l554J6282J5142o272j6085n848J0244R738P59p453q520k432
$$ 81851 74298 55528 51974 68256 83398 77126 61041 55193 65437 75175 75934 68481 59961 57529
1133E7529O644J0102j01j6363j0778O835J6999J394k0556j2938P479J6530p97
$$ 57529 64173 74275 74174 57811 47033 53868 70867 72261 51705 38767 46246 62776 61979
1146F1979j4605j2089K591Q101L666m333j2834r897K835J2124M292j5608j7753
$$ 61979 47374 35285 37876 45977 49643 45310 32476 22579 25414 37538 41830 26222 8469
1159H469J564J6098M972j4652j8101M52J3914K741r946j3847k552K164O394K93
$$ 8469 10033 26131 31103 16451 -1650 -1198 12716 15457 5511 -8336 -10888 -8724 -2330 -2037
1173b037q817j3109p353J2456J1120q750k1226o783J4765J3410j0111j8290o681
$$ -2037 -10854 -23963 -31316 -18860 -7740 -16490 -37716 -44499 -29734 -16324 -26435 -44725 -51406
1186e1406Q050J0081l273j0700q978J13Q049P283m637j5115q893R940J4822j463
$$ -51406 -43356 -33275 -36548 -47248 -56226 -56113 -48064 -40781 -45418 -60533 -69426 -59486 -44664 -46127
1200d6127j7648j1383J0281J6938p28j5654q739O038R423L293m246q319k724L743
$$ -46127 -63775 -75158 -64877 -47939 -48667 -64321 -73060 -67022 -57599 -54306 -58552 -66871 -69595 -65852
1214f5852J1723N508j0966j3108M515K0628Q043j4518j3599M858J8395P942r129
$$ -65852 -54129 -48621 -59587 -72695 -68180 -47552 -39509 -54027 -67626 -62768 -44373 -36431 -45560
1227d5560j1150J821J0371J0135P60n424p496K125J5819R992n378j4413P29J7477
$$ -45560 -56710 -54889 -44518 -34383 -33623 -39047 -46543 -44418 -28599 -18607 -23985 -38398 -37669 -20192
1241b0192J4880o147j5787J890J4094J1371j039p659k126O603R638P047r64q704
$$ -20192 -5312 -11459 -27246 -25356 -11262 109 -930 -8589 -10715 -4112 5526 12573 11609 2905
1255B905m422J1928J7315J100j5633p748J3601J9865O14j4316n901J0440J3537
$$ 2905 -1517 10411 27726 28826 13193 5445 19046 38911 39525 25209 19308 29748 43285
1268D3285K143n904n270j628Q432J1699K932j0036j0892P921J6722N549j3606
$$ 43285 45428 39524 34254 32626 41058 52757 55689 45653 34761 42682 59404 64953 51347
1281E1347j1927O717J6765M224j0967r688J703R864N935j075p836o891J327J0729
$$ 51347 39420 46137 62902 67126 56159 46471 48174 58038 63973 62898 55062 48171 49498 60227
1295F0227O868p330j5540j945J4224J0479q973j8679l011J2915J1276q434j3076
$$ 60227 67095 59765 44225 42280 56504 66983 58010 39331 36320 49235 60511 52077 39001
1308C9001m864M889O377J969o664j2200m775Q080J0555m279j7679r917J1148J2035
$$ 39001 34137 39026 45403 47372 40708 28508 23733 31813 42368 38089 20410 10493 21641 33676
1322C3676n204j7470q648P416J0072l122j1673q164M89L234M828k088j1573j1717
$$ 33676 28472 11002 2354 9770 19842 16720 5047 -3117 -2628 606 5434 3346 -8227 -19944
1336a9944L114J3534K804j5701j6837N528J4889K395j4721j3186K213J0651L174
$$ -19944 -16830 -3296 -492 -16193 -33030 -27502 -12613 -10218 -24939 -38125 -35912 -25261 -22087
1349b2087p882r191n737L638P924K831q095j3716j019J3341Q905j0506j6714k8
$$ -22087 -29969 -39160 -44897 -41259 -33335 -30504 -38599 -52315 -53334 -39993 -31088 -41594 -58308 -58336
1363e8336J5078R099r455j2232j418P901P872r94n528p221j77P627J1087l628
$$ -58336 -43258 -34159 -43614 -55846 -57264 -49363 -41491 -42485 -48013 -55234 -55411 -47784 -36697 -40325
1377d0325j3305n755J1878J5948l019j5215n249J2486J2897L78j0132m149M701
$$ -40325 -53630 -59385 -47507 -31559 -34578 -49793 -55042 -42556 -29659 -29281 -39413 -43562 -38861
1390c8861R353M839J8p016m640O890J4128M352j1712j0044R539J7346L871j0630
$$ -38861 -29508 -24669 -24651 -31667 -36307 -29417 -15289 -10937 -22649 -32693 -23154 -5808 -1937 -12567
1404a2567r016P490J4689M036n073m774M45M945J1742K961n588q033J462J5875
$$ -12567 -21583 -14093 596 4632 -441 -5215 -4770 175 11917 14878 9290 1257 2719 18594
1418A8594R662p960j2675P64J7090J0534p793j1492Q07J0830Q644r47n616n160
$$ 18594 28256 20296 7621 8385 25475 36009 28216 16724 17531 28361 37005 36058 30442 25282
1432B5282K896R302P954l660j1550m360J2425J3703m604j5429o069J3609J1845
$$ 25282 28178 37480 45434 41774 30224 25864 38289 51992 47388 31959 25890 39499 51344
1445E1344l460j1732m601M733Q269K289n063o898m464M286J0803J655j2471j1744
$$ 51344 47884 36152 31551 36284 44553 46842 41779 34881 30417 34703 45506 47161 34690 22946
1459B2946N421J4919N34j4188j1579N477J2679J215j1071r809J60O591M843k131
$$ 22946 28367 43286 43820 29632 18053 23530 36209 37424 26353 16544 16704 23295 28138 26007
1473B6007r085r771R44J0472N802j2135j3477m96J4078M547j1207j4864J90R697
$$ 26007 16922 7151 8095 18567 24369 12234 -1243 -1739 12339 16886 5679 -9185 -8995 702
1487G02M522n815r186m394K071N308L180n305j1991n629J1731R515o576j4713
$$ 702 5224 -591 -9777 -14171 -12100 -6792 -3612 -8917 -20908 -26537 -14806 -5291 -11867 -26580
1501b6580p489J3549R633n308j4571m449P418P763n53p231o269k053O175Q232
$$ -26580 -34069 -20520 -10887 -16195 -30766 -35215 -27797 -20034 -20587 -27818 -34087 -36140 -29965 -21733
1515b1733q58j1534q835P881J4329L79j4735q912Q033J4678L39j0742o466L320
$$ -21733 -22591 -34125 -42960 -35079 -20750 -20371 -35106 -44018 -35985 -21307 -20968 -31710 -38176 -34856
1529c4856P540N434k671n512n193L759R968P689q838j2346K641J6480P087r444
$$ -34856 -27316 -21882 -24553 -30065 -35258 -31499 -21531 -13842 -22680 -35026 -32385 -15905 -8818 -18262
1543a8262j1525L189J3641O299n527p805l05N870Q608K781m623p703Q10J2805
$$ -18262 -29787 -26598 -12957 -6658 -12185 -19990 -20295 -14425 -5817 -3036 -7659 -15362 -14552 -1747
1557a747R574n550j2966k058J4225J2439o273j1764j321J1358Q301j244o607l061
$$ -1747 7827 2277 -10689 -12747 1478 13917 7644 -4120 -5441 5917 14218 12974 6367 3306
1571C306J793P728O106n86p956o274P857J4093J771j3725r445Q647J4311J950
$$ 3306 5099 12827 18933 18347 10391 4117 11974 26067 27838 14113 4668 13315 27626 29576
1585B9576j2431o777N509R392K490m239n861l650M654R835K692r308j1548L753
$$ 29576 17145 10368 15877 25269 27759 23520 17659 14009 18663 28498 31190 21882 10334 14087
1599A4087J4429M404j2057j1910M194J3428K818q280p703N13N946L072J01o049
$$ 14087 28516 32920 20863 8953 13147 26575 29393 21113 13410 13923 19869 22941 23042 16993
1613A6993p868j639R956Q233p169j3698k782J1556J1170q888j4708k775J0718
$$ 16993 9125 7486 17442 25675 18506 4808 2026 13582 24752 15864 1156 -1619 9099
1626I099P286k945r790m921J976O375K785l075j0247n092Q104J0842k324j4956
$$ 9099 16385 13440 3650 -1271 705 7080 9865 6790 -3457 -8549 -445 10397 8073 -6883
1640f883p661Q485J3642l097j3303n850N351Q430K71n925n874j595M627O983J135
$$ -6883 -14544 -6059 7583 4486 -8817 -14667 -9316 -886 -615 -6540 -12414 -14009 -9382 -2399 -1264
1655a264q667r644L826J2074L459r974j2546M390J2936N054j0731r367K355Q020
$$ -1264 -9931 -19575 -15749 -3675 -216 -10190 -22736 -18346 -5410 -356 -11087 -20454 -18099 -10079
1669a0079O789m157o354m353O51R437O856o692j1372j179J3641Q506p748j3515
$$ -10079 -3290 -7447 -13801 -18154 -17503 -8066 -1210 -7902 -19274 -20453 -6812 1694 -6054 -19569
1683a9569P73J1853P496o370p265j580M848O161K063l259o698k443O972J0890
$$ -19569 -18796 -6943 553 -5817 -13082 -14662 -9814 -3653 -1590 -4849 -11547 -13990 -7018 3872
1697C872r90j3537n470J0848J2172k756j2503n288Q670J0564k47p322n221J354
$$ 3872 2882 -10655 -16125 -5277 6895 4139 -8364 -13652 -4982 5582 5335 -1987 -7208 -5854
1711e854P130N355r49q312o218N674J3103L304j1776j0331N994J2737M030j0915
$$ -5854 1276 6631 5682 -2630 -8848 -3174 9929 13233 1457 -8874 -2880 9857 13887 2972
1725B972p468M072Q466L523n639m826j500J951Q091L199n548j0560p85J2067Q783
$$ 2972 -4496 -424 8042 11565 5926 1100 -400 1551 9642 12841 7293 -3267 -4052 8015 16798
1740A6798p989j3453O39J2717P492p323j0229j151Q539M472j046l994o301O15
$$ 16798 8809 -4644 -4005 8712 16204 8881 -1348 -2499 6040 10512 9466 5472 -829 -214
1754b14P333O645l347j2091m188R230J2559l710j3501m992R605Q130j850j0267
$$ -214 7119 13764 10417 -1674 -5862 3368 15927 12217 -1284 -6276 3329 11459 9609 -658
1768f58l121L039N636L839k532o935m992N250Q869J875j0040j0585N688J2957
$$ -658 -3779 -740 4896 8735 6203 -732 -5724 -474 8395 10270 230 -10355 -4667 8290
1782H290K057j0626r785N441R310L106o238o614k250N174O250J733p666p794M67
$$ 8290 10347 -279 -10064 -4623 4687 7793 1555 -5059 -7309 -2135 4115 5848 -1818 -9612 -9145
1797i145J2119N543r403j2479Q80J2823O709p464j0586r9Q973N829l551n277l149
$$ -9145 2974 8517 -886 -13365 -12485 338 7047 -417 -11003 -11102 -2129 3700 149 -5128 -8277
1812h277l65P207M543l670j0203k265R711R650m163j3438k913Q868J0022l550
$$ -8277 -8642 -1435 3108 -562 -10765 -13030 -3319 6331 2168 -11270 -14183 -5315 4707 1157
1826A157j0139m554N298P546J519k900o398l712N884R037N78j0324p422O854J2008
$$ 1157 -8982 -13536 -8238 -692 827 -2073 -8471 -12183 -6299 2738 3316 -7008 -14430 -7576 4432
1841D432L82j1814o532N133J0421K790q901n522K849M383M687j70n520o396m80
$$ 4432 4814 -7000 -13532 -8399 2022 4812 -4089 -9611 -6762 -2379 2308 2138 -3382 -9778 -10258
1856a0258J1006O795q143j1155R36J2682O680r172j0011J515R716M397k787n867
$$ -10258 748 7543 -600 -11755 -10819 1863 8543 -629 -10640 -9125 591 4988 2201 -3666
1870c666k344K084O973K896l781q659l096J1672Q909n200j2445k428J1109R110
$$ -3666 -6010 -3926 3047 5943 2162 -6497 -9593 2079 10988 5788 -6657 -9085 2024 11134
1884A1134n536r347j160M990P166L42m860l807j410N752O823J292j1578n604P594
$$ 11134 5598 -3749 -4909 81 7247 7589 2729 -1078 -2488 3264 10087 11379 -199 -5803 1791
1899A791R953J944j1834p524P400J0399J039p661p742K559P040M296j939n243
$$ 1791 11744 13688 1854 -5670 1730 12129 13168 5507 -2235 324 7364 11660 9721 4478
1913D478n239M351Q884K581q226r843L165J2936M998j0340j0613L560R651M455
$$ 4478 -761 3590 12474 15055 6829 -3014 151 13087 18085 7745 -2868 692 10343 14798
1927A4798n272p520j05M338M954J019l814p347r13R233P528l531j3149l483J0955
$$ 14798 9526 2006 1901 6239 11193 12212 8398 1051 138 9371 16899 13368 219 -3264 7691
1942G691Q046m547j0899j719P213O461k251m876m692M95N579M656j105r505n231
$$ 7691 15737 11190 291 -1428 5785 12246 9995 5119 427 922 6501 11157 10052 547 -4684
1957d684O574J1390j331j3347n850O655J1714k124j0606n751M254P702J514m586
$$ -4684 1890 13280 11949 -1398 -7248 -593 11121 8997 -1609 -7360 -3106 4596 6110 1524
1971A524m799k877K296P114L049p971r329K252J1915L980j0151r056J346J2166
$$ 1524 -3275 -6152 -3856 3258 6307 -1664 -10993 -8741 3174 7154 -2997 -12053 -10707 1459
1985A459J691o225q133q17N876N035J15o082o824J814P868N820n966j2324q88
$$ 1459 3150 -3075 -11208 -12025 -6149 -1114 -999 -7081 -13905 -12091 -4223 1597 -4369 -16693 -17581
2000a7581J0770R436p491j0497j860R763N613m377o056k672K714N097K197j785
$$ -17581 -6811 2625 -4866 -15363 -17223 -7460 -1847 -6224 -12280 -14952 -12238 -7141 -4944 -6729
2014f729o998l204N725J0155j236j2392n250P936J1306j234j0882m904O015Q581
$$ -6729 -13727 -16931 -11206 -1051 -2287 -14679 -19929 -11993 -687 -1921 -12803 -17707 -11692 -3111
2028c111O53m549n563M0L585O717J625p521p648M323J2110L039j0092q484M517
$$ -3111 -2458 -7007 -12570 -12530 -8945 -2228 -603 -8124 -15772 -11449 661 3700 -6392 -14876 -10359
2043a0359J1383L544q150o555J735Q136K737l61n453k843L04Q225M733m960p759
$$ -10359 1024 4568 -3582 -10137 -8402 -266 2471 2110 -3343 -6186 -5882 2343 7076 2116 -5643
2058e643j577J0322Q274n362j1491j41J0656O782n082o444l142M854N764K872
$$ -5643 -7220 3102 11376 6014 -5477 -5618 5038 11820 6738 294 -2848 2006 7770 10642
2072A0642l734m545k924O566Q854k822j0273m677Q372J0431k353j0893l606P403
$$ 10642 6908 2363 -561 6005 14859 12037 1764 -2913 5459 15890 13537 2644 -962 6441
2086F441Q203r53n973k953N84M333L413r7o533n712L139J0992J952q549r955O384
$$ 6441 14644 13691 7718 4765 5349 9682 13095 12998 6465 753 3892 14884 16836 8287 -1668 4716
2102D716R740K788q653q443L525N854M257m793l939l725K340O079K523n424q404
$$ 4716 14456 17244 8591 148 3673 9527 13784 8991 5052 1327 3667 9746 12269 6845 -1559
2117a559N18J0528N497p681j0092j034J0111N498n559q050r95N534M482o18m110
$$ -1559 -1041 9487 14984 7303 -2789 -3823 6288 11786 6227 -1823 -2818 2716 7198 6580 2470
2132B470n685k27M959O378l222r731l844P619R775m213r133n303P374Q171j725
$$ 2470 -3215 -3442 1517 7895 4673 -5058 -8902 -1283 8492 4279 -4854 -10157 -2783 5388 3663
2147C663p769o166M275N127K743j532o609m016L694R352J576r919p856M446J1533
$$ 3663 -4106 -10272 -5997 -870 1873 341 -6268 -10284 -6590 2762 4338 -5581 -13437 -8991 2542
2162B542Q84r661p042M500Q944R80m391n093q58L367M767J121m147p140J606P562
$$ 2542 3426 -6235 -13277 -8777 167 1147 -3244 -8337 -9195 -5828 -1061 60 -4087 -11227 -9621 -2059
2178b059N483n185j1297K237R567N808n499r243jP436N001j708m934l146K08N939
$$ -2059 3424 -1761 -13058 -10821 -1254 4554 -945 -10188 -10189 -2753 2248 540 -4394 -7540 -7332 -1393
2194a393N133l089r214k998R538R330m681j0060k248P921P136k255q383k228M773
$$ -1393 3740 651 -8563 -11561 -2023 7307 2626 -7434 -9682 -1761 5375 3120 -5263 -7491 -2718
2209b718N357J267l474m302q77K836O617J392r562m955M985J0460O21q752o653
$$ -2718 2639 3906 432 -3870 -4747 -1911 4706 6098 -3464 -8419 -3434 7026 7647 -1105 -7758
2224g758M535Q584J261o554m639R86M898L846q1m267o194J807Q301L351o396r570
$$ -7758 -3223 5361 6622 68 -4571 -3585 1313 5159 5078 811 -5383 -3576 4725 8076 1680 -7890
2240g890Q93J2033M813q166q333J676Q333L569l623n244k347K299N511L079n180
$$ -7890 -6997 5036 9849 1683 -6650 -4974 3359 6928 3305 -1939 -4286 -1987 3524 6603 1423
2255A423o146j107P572N816k594r742l009Q509O961l678q232k067N543M851J063
$$ 1423 -4723 -5830 1742 7558 4964 -4778 -7787 722 7683 4005 -4227 -6294 -751 4100 5163
2270E163m049m835q58M111P962j375q011n876N631R851P73j0050n990N800J0239
$$ 5163 1114 -3721 -4579 -468 7494 6119 -1892 -7768 -2137 7714 8487 -1563 -7553 -1753 8486
2285H486l97o947n512L308M277K796n72m923l274K699O393L049o538r271L424
$$ 8486 8089 1142 -4370 -1062 3215 6011 5439 516 -2758 -59 6334 9383 2845 -6426 -3002
2300c002J0912L263p624p600J670Q495L412l733o356K89L420M552P55l864n748
$$ -3002 7910 11173 3549 -4051 -2381 6114 9526 5793 -563 -274 3146 7698 8453 4589 -1159
2315a159m46Q098N139l431j0196j544R113P821m842j0419J36O105N953k643m717
$$ -1159 -1605 6493 11632 8201 -1995 -3539 5574 13395 8553 -1866 -1730 4375 10328 7685 2968
2330B968l034k02O279J566J26p410m506N865P720n55r090o460O053Q815q64p638
$$ 2968 -66 -268 6011 7577 7703 293 -4213 1652 9372 8817 -273 -6733 -680 8135 7271 -367
2346c67m776K948N984J100l096n675j536K552O501J049o446q081K878R744L387
$$ -367 -5143 -2195 3789 4889 1793 -3882 -5418 -2866 3635 4684 -1762 -9843 -6965 2779 6166
2361F166q224j0667L497J0055K308p546m953j11N280K974r99l328n903J148M469
$$ 6166 -2058 -12725 -9228 827 3135 -4411 -9364 -9475 -4195 -1221 -2220 -5548 -11451 -10303 -5834
2376e834N176l293j0213j187R359O070n203q989k061R409M889l524m801k871P83
$$ -5834 -658 -3951 -14164 -15351 -5992 78 -5125 -14114 -16175 -6766 -1877 -5401 -10202 -13073 -12290
2391a2290N124K559j195o499k888N054R159k732r568m318P545R058r82r228k616
$$ -12290 -7166 -4607 -5802 -12301 -15189 -10135 -976 -3708 -13276 -17594 -10049 -991 -1973 -11201 -13817
2406a3817M381P392q1m096l767L27L479M523K123o847n144M060P746L434o282
$$ -13817 -9436 -2044 -2125 -6221 -9988 -9661 -6182 -1659 464 -6383 -11527 -7467 279 3713 -2569
2421b569p819M598R168L789o967n564K761L514N023Q5m931l117L010N702M144
$$ -2569 -10388 -5790 3378 7167 200 -5364 -2603 911 5934 6019 1088 -2029 981 6683 10827
2436A0827m068p702j18Q844O209m414q759N96Q616M737l759o399q5L928L580J640
$$ 10827 6759 -943 -1061 7783 13992 9578 819 1415 10031 14768 11009 4610 4525 8453 12033 13673
2452A3673k665m054j356N338P230k569q052m540O855Q947k116q282l659O613N520
$$ 13673 11008 6954 5598 10936 18166 15597 7545 3005 9860 18807 16691 8409 4750 11363 16883
2467A6883j000m869l061J2L708M666q01n896o204M060Q472Q88q569p766M643R297
$$ 16883 15883 11014 7953 7965 11673 16339 15538 9642 3438 7498 15970 16858 8289 523 5166 14463
2483A4463J592r422n601J665P603J536m352n416o54J347M517K108m467q373q41
$$ 14463 16055 6633 1032 2697 10300 11836 7484 2068 1414 2761 7278 9386 4919 -3454 -4295
2498d295Q717N470o200j1037P56Q272K317m633o632n81M186L828q73l781n203
$$ -4295 4422 9892 3692 -7345 -6589 1683 4000 -633 -7265 -7846 -3660 168 -705 -4486 -9689
2513i689M30L674N192k245q861m241Q244O603k531j1012k868O774N675j839n671
$$ -9689 -9259 -5585 -393 -2638 -11499 -15740 -7496 -893 -3424 -14436 -17304 -10530 -4855 -6694 -12365
2528a2365m595L206M317J654k177m464l450L576P478r8p174o362M789Q039K469
$$ -12365 -16960 -13754 -9437 -7783 -9960 -14424 -17874 -14298 -6820 -6918 -14092 -20454 -15665 -7626 -5157
2543e157q680n632M359O597K529o560k740k49K844N288J072m759l674M29P542
$$ -5157 -13837 -19469 -15110 -8513 -5984 -12544 -15284 -15533 -12689 -7401 -6329 -11088 -14762 -14333 -6791
2558f791N098m791r040J057J0199M788m379q255J555O103N888l760l050k121K395
$$ -6791 -1693 -6484 -15524 -14467 -4268 520 -3859 -12114 -10559 -4456 1432 -2328 -5378 -7499 -5104
2573e104M089M722j451o872k460P657O479j914p263k576P813P124j614o416l003
$$ -5104 -1015 3707 2256 -4616 -7076 581 7060 5146 -2117 -4693 3120 10244 8630 2214 -789
2588g89M350M702K155k261m513j046K912P378K67n902o894N055J0994P85r216
$$ -789 3561 8263 10418 8157 3644 2598 5510 12888 13155 7253 359 5414 16408 17193 7977
2603G977n728N792O839R69n574l613J454M073K895K32l485o438M051N484L497
$$ 7977 2249 8041 14880 15849 10275 6662 8116 12189 15084 15316 11831 5393 9444 14928 18425
2618A8425o315o441J297P753M149n938o542N82N451K842l383m415k406K691L334
$$ 18425 12110 5669 6966 14719 18868 12930 6388 6970 12421 15263 11880 7465 5059 7750 11084
2633A1084K702l621o667k084O713O638m014r555k314Q404N074l614q460r08L033
$$ 11084 13786 10165 3498 1414 8127 14765 10751 1196 -1118 7286 12360 8746 286 -622 2411
2648B411M585K38n662k666j40L364L350j564n285o383N441P847j230p603o073
$$ 2411 6996 7234 1572 -1094 -1234 2130 5480 3916 -1369 -7752 -2311 5536 4306 -3297 -9370
2663i370M088P640l19o513k952K85M004J630j428l501l837J879N335K689p468
$$ -9370 -5282 2358 2039 -4474 -7426 -7141 -3137 -1507 -2935 -6436 -10273 -8394 -3059 -370 -7838
2678g838o387K712Q328K679o115p675J711O700K992k967n796r33K885M938l97
$$ -7838 -14225 -11513 -3185 -506 -6621 -14296 -12585 -5885 -2893 -5860 -11656 -12589 -9704 -4766 -5163
2693e163l886l398q93O732M838m306p348j514P418O390l438p106j064N227N047
$$ -5163 -9049 -12447 -13340 -6608 -1770 -6076 -13424 -14938 -7520 -1130 -4568 -11674 -12738 -7511 -2464
2708b464j637m361k752J039L534M025L34o994l128N838O677q52p195n057O076
$$ -2464 -4101 -8462 -11214 -10175 -6641 -2616 -2282 -9276 -12404 -6566 111 -741 -7936 -12993 -6917
2723f917P999m89o312n008N157M036K503j710m410k577L610O466J330m977o631
$$ -6917 1082 593 -5719 -10727 -5570 -1534 969 -741 -5151 -7728 -4118 2348 3678 -1299 -7930
2738g930K322Q470K603o459n659K226O804L071m099n316N97L934M646k77k805
$$ -7930 -5608 2862 5465 -994 -6653 -4427 2377 5448 1349 -3967 -3370 564 5210 4933 2128
2753B128m192N50N289N145l422q306l30Q258N138l760q317j486Q179M174k325
$$ 2128 -2064 -1514 3775 8920 5498 -2808 -3138 5120 10258 6498 -1819 -3305 4874 9048 6723
2768F723n957k201L310M053K560k814m204k347M766O801l17r109k769N736O803
$$ 6723 766 -1435 1875 5928 8488 5674 1470 -877 3889 10690 10373 1264 -1505 4231 11034
2783A1034j183p105k785L135N644J018l423l835j130L037N452m56o293m124K979
$$ 11034 9851 2746 -39 3096 8740 9758 6335 2500 1370 4407 9859 9403 3110 -1014 1965
2798A965Q542J764p690o059L549P908J861o168n637J531N641K015q25l549l877
$$ 1965 10507 12271 4581 -1478 2071 9979 11840 5672 35 1566 7207 9222 8397 4848 971
2813I71K235M073L010l319o581M27O177M921m664q261P41N703M093l371m397j514
$$ 971 3206 7279 10289 6970 389 816 6993 11914 7250 -1011 -270 5433 9526 6155 1758 244
2829B44K582L331P30j771n926J82M227O411l534p376k903N041O887j735r401l420
$$ 244 2826 6157 6887 5116 -810 -628 3599 10010 6476 -900 -3803 1238 8125 6390 -3011 -6431
2845f431P283N047m99o047k927J715K625J551m28m211m588L816N966K61n309o152
$$ -6431 852 5899 5400 -647 -3574 -1859 766 2317 1889 -2322 -6910 -3094 2872 3133 -2176 -8328
2861h328K305Q004P69o103n676J636N224L023m911j687k896J824L989J902l633
$$ -8328 -6023 1981 2750 -3353 -9029 -7393 -2169 854 -4057 -5744 -8640 -6816 -2827 -925 -4558
2876d558o615r6P420M005n541p419L87P002M994n176o465J78L681L860j323k913
$$ -4558 -11173 -11269 -3849 156 -5385 -12804 -12417 -5415 -421 -5597 -12062 -11884 -8203 -4343 -5666 -8579
2892h579l934J209L392M298j967o594k517O159N687m02q264l944N892P558q07
$$ -8579 -12513 -11304 -7912 -3614 -5581 -12175 -14692 -8533 -2846 -3248 -11512 -15456 -9564 -2006 -2813
2907b813o490k555K427L537L490j878m196k150K471P367N56o891n255N010O858
$$ -2813 -9303 -11858 -9431 -5894 -2404 -4282 -8478 -10628 -8157 -790 -234 -7125 -12380 -7370 -512
2922e12K649q598l757L371P233J523m266l845J429K590L605J519l195m774J292
$$ -512 2137 -6461 -10218 -6847 386 1909 -2357 -6202 -4773 -2183 1422 2941 -254 -5028 -3736
2937c736Q053L249n183o717K526P444L438l480m450p51N545K297p5l687j297Q0
$$ -3736 4317 7566 2383 -4334 -1808 5636 9074 5594 1144 393 5938 8235 8160 4473 3176 3256
2953C256M253M939k743o008j471N619O590k197p226k439O429N921j482n127k681
$$ 3256 7509 12448 9705 3697 2226 7845 14435 12238 5012 2573 9002 14923 13441 8314 5633
2968E633K925M918J07k151l783k036N299M159p06n840n435O121M858K339q955
$$ 5633 8558 13476 13583 11432 7649 5613 10912 15071 14365 8525 3090 9211 14069 16408 7453
2983G453l195K926N444K027n726m450J28L586L560j830k366m719N26P449J415
$$ 7453 4258 7184 12628 14655 8929 4479 4607 8193 11753 9923 7557 2838 3364 10813 12228
2998A2228o396p455K178Q553J688n343o752m14O743J190k956l551j270K78K828
$$ 12228 5832 -1623 555 9108 10796 5453 -1299 -1713 5030 6220 3264 -287 -1557 -1279 1549
3013A549J503l527m751j172M908M594m037o153k826O670N145n151n583k283M042
$$ 1549 3052 -475 -5226 -6398 -1490 3104 -933 -7086 -9912 -3242 1903 -3248 -8831 -11114 -7072
3028g072L767o10k511l668j541L173M407j637n410n445M793O910J18q218m803
$$ -7072 -3305 -3915 -6426 -10094 -11635 -8462 -4055 -5692 -11102 -16547 -11754 -4844 -4726 -12944 -17747
3043a7747N059N566J761o924l083J044M982J931j986l295k438K300N654O35l771
$$ -17747 -12688 -7122 -5361 -12285 -15368 -14324 -9342 -7411 -9397 -12692 -15130 -12830 -7176 -6541 -10312
3058a0312n938K168P471K293m520o728K014P265J574j512l963r75K874M046J196
$$ -10312 -16250 -14082 -6611 -4318 -8838 -15566 -13552 -6287 -4713 -6225 -10188 -11163 -8289 -4243 -3047
3073c047k350l750M97M852N662k254q070l78P573O008m691n136j250O455M567
$$ -3047 -5397 -9147 -8650 -3798 1864 -390 -8460 -8838 -1265 4743 52 -5084 -6334 121 4688
3088D688j908k258k108J675M257J882P17n825j337M050O535p06p813k042N539
$$ 4688 2780 522 -1586 89 4346 6228 6945 1120 -217 3833 10368 9662 1849 -193 5346
3103E346P111p11n731k084K421M941J802k999k707j266K585N295L53m601m022
$$ 5346 12457 11746 6015 3931 6352 11293 13095 10096 7389 6123 8708 14003 14356 9755 5733
3118E733K071O721K386n812o874K998O458J703l971m844J252K946L552j381n089
$$ 5733 7804 14525 16911 11099 4225 7223 13681 15384 11413 6569 7821 10767 14319 12938 7849
3133G849j884J291M075K662l524o261n17M186N504m600o659N42L406N156l130
$$ 7849 5965 7256 11331 13993 10469 4208 3691 7877 13381 8781 2122 2664 6070 11226 8096
3148H096n474j805R63M371P29k475n007k738M538M783k115o457n130N928N830
$$ 8096 2622 817 1780 6151 6880 4405 -602 -3340 1198 5981 3866 -2591 -7721 -1793 4037
3163D037j339p124k886J601N628j26m653k688m87K240K668K80n195k963J64O847
$$ 4037 2698 -4426 -7312 -5711 -83 -209 -4862 -7550 -8037 -5797 -3129 -2849 -8044 -11007 -10843 -3996
3179c996J298n833n673L016N693O37l870n197l67O237J508j721k874k121J979
$$ -3996 -2698 -8531 -14204 -11188 -5495 -4858 -8728 -13925 -14292 -8055 -6547 -8268 -11142 -13263 -11284
3194a1284L679K642l956o373N85O558M501m157p160J231O370L217k236n762o70
$$ -11284 -7605 -4963 -8919 -15292 -14707 -8149 -3648 -7805 -14965 -13734 -7364 -4147 -6383 -12145 -12815
3209a2815M017K936R60l129l284N58L975N726j512n915k141M946O388l14p766
$$ -12815 -8798 -5862 -4902 -8031 -11315 -10757 -6782 -1056 -2568 -8483 -10624 -5678 710 396 -7370
3224g370k084M511N541J099l340k011k95L978L387L60m954k419K788O958j86l672
$$ -7370 -9454 -4943 598 1697 -1643 -3654 -3949 29 3416 3776 -1178 -3597 -809 6149 5963 2291
3240B291m803M490N867M26m576m272L035O481J204l275k635j16K767K366L407
$$ 2291 -2512 1978 7845 8271 3695 -577 2458 8939 10143 6868 4233 4117 6884 9250 12657
3255A2657l988n444J118O400M184n028o933L003N397K444k942m694j05L902L031
$$ 12657 8669 3225 4343 10743 14927 9899 2966 5969 11366 13810 10868 6174 6069 9971 13002
3270A3002l70k018n254m18N196M104k251n809k213N070M896k128p292j194M362
$$ 13002 12632 10614 5360 4942 10138 14242 11991 6182 3969 9039 13935 11807 4515 3321 7683
3285G683M503j103n417k336K342J200K573k108m097k577L253M285K75o072n190
$$ 7683 12186 11083 5666 3330 5672 6872 9445 7337 3240 663 3916 8201 8476 2404 -2786
3300b786L458O432j63n665m584L068M226M1k986l203l99J828L988j474m357m216
$$ -2786 672 7104 6941 1276 -3308 -240 3986 4027 1041 -2162 -2561 -733 3255 1781 -2576 -6792
3316f792R30N270K977m630q386K277N160L514m647l681j812N012L581l337k723
$$ -6792 -5862 -592 2385 -2245 -10631 -8354 -3194 320 -4327 -8008 -9820 -4808 -1227 -4564 -7287
3331g287l013J821K624K944k871m527j683M738L682j167p182o79N534L638k465
$$ -7287 -10300 -8479 -5855 -2911 -5782 -10309 -11992 -7254 -3572 -4739 -11921 -12600 -7066 -3428 -5893
3346e893l750k741L849K393J577k412k684j671L554M769n08o056l861M434O641
$$ -5893 -9643 -12384 -8535 -6142 -4565 -6977 -9661 -11332 -7778 -3009 -3517 -9573 -13434 -9000 -2359
3361b359J299p128l797M103N334L72m440k070O30K909K951O70m023k112J860M525
$$ -2359 -1060 -8188 -11985 -7882 -2548 -2176 -6616 -8686 -8056 -5147 -2196 -1526 -5549 -7661 -5801 -1276
3377a276L555n769l375O70O892K395l238n967K032L693L345k397k726j127J517
$$ -1276 2279 -3490 -6865 -6195 697 3092 -146 -6113 -4081 -388 2957 560 -2166 -3293 -1776
3392a776M360J333k326l380j083N449L857j802p340j621P313M594j817o390j810
$$ -1776 2584 3917 1591 -1789 -2872 2577 6434 4632 -2708 -4329 2984 7578 5761 -629 -2439
3407b439N492L796m07j874l574N93L032K836k14m578k756L917N197J111p802l184
$$ -2439 3053 6849 6442 4568 994 1587 4619 7455 7241 2663 -93 3824 9021 10132 2330 -854
3423h54N004M803o41k837l436J778K778J121j75l880m34J235K948K879n547m757
$$ -854 4150 8953 8312 5475 2039 3817 6595 7716 7541 3661 3227 4462 7410 10289 4742 -15
3439a5J420P255K868n769m695J597N426M03j875m843Q41J951K609j317j452m189
$$ -15 1405 8660 11528 5759 1064 2661 8087 8490 6615 1772 2613 4564 7173 5856 4404 215
3455B15Q47M374L116j902q493M10O146L257k983m959j96L182K270n19l615j355
$$ 215 1062 5436 8552 6650 -1843 -1433 4713 7970 4987 28 -168 3014 5284 4765 1150 -205
3471b05n57K256L218q82n434j418K781O045r72o839l517N140M606j176n576j793
$$ -205 -762 1494 4712 3830 -1604 -3022 -241 5804 4832 -2007 -5524 -384 4222 3046 -2530 -4323
3487d323J762M209M54j584m597o72K549K906K34l350n824K975N312J172l969n312
$$ -4323 -2561 1648 2102 518 -4079 -4751 -2202 704 938 -2412 -8236 -5261 51 1223 -2746 -8058
3503h058J768M541J469k458m053k14M239M66p17j799k652k63N167K572l133n390
$$ -8058 -6290 -1749 -280 -2738 -6791 -7005 -2766 -2300 -3017 -4816 -7468 -7731 -2564 8 -3125 -8515
3519h515j061N441L295l317m556j083M968K266r71m049m41J410K529J338k572
$$ -8515 -9576 -4135 -840 -4157 -8713 -9796 -4828 -2562 -3533 -7582 -8023 -6613 -4084 -2746 -5318
3534e318l085p21K546O154j637n951k737N116N331j995l966l203K812M736lj709
$$ -5318 -8403 -9124 -6578 -424 -2061 -8012 -10749 -5633 -302 -2297 -6263 -9466 -6654 -1918 -1921 -3630
3550c630k525q60K173L467J58l413m057K723O975P65m782l833K374N919J917l700
$$ -3630 -6155 -7015 -4842 -1375 -1217 -4630 -8687 -5964 1011 1776 -3006 -6839 -4465 1454 3371 -329
3566c29l307J154L443K495j211k189j317Q81M377J233j855m584J99O281L072l408
$$ -329 -3636 -2482 961 3456 2245 56 -1261 -380 3997 5230 3375 -1209 -1010 5271 8343 4935
3582D935n502J519N037L126j946n058O75M334O24J546j768l571l94L944M178j353
$$ 4935 -567 952 5989 9115 7169 2111 2786 7120 7744 9290 7522 3951 3557 7501 11679 10326
3598A0326n098k324O679L644k443l995k493L853M434j419j824l483J848K237J670
$$ 10326 5228 2904 9583 13227 10784 6789 4296 8149 12583 11164 9340 5857 7705 9942 11612
3613A1612o20l154k948K786M093N5m831l860K785O148Mn572l002J523N006m33
$$ 11612 10992 7838 4890 7676 11769 11824 6993 3133 5918 12066 12070 6498 3496 5019 10025 9592
3629I592k381k388j074K1K491P23k247m541j25N258K783m711n480j00O310L80
$$ 9592 7211 4823 3749 3770 6261 6984 4737 196 71 5329 8112 3401 -2079 -2179 4131 4511
3645D511k806m262p91J795K788r67k575k460j93K156J824k163m067j625J741N429
$$ 4511 1705 -2557 -3348 -1553 1235 268 -2307 -4767 -4960 -2804 -980 -3143 -7210 -8835 -7094 -1665
3661a665j474p710q6L176L964j954m187j105q1K623K232k725l367j757L073K825
$$ -1665 -3139 -10849 -10935 -7759 -3795 -5749 -9936 -11041 -11122 -8499 -6267 -8992 -12359 -14116 -11043 -8218
3677h218N97m940l786K952N596K16m964k882J096N366O13l566l169J231L540M07
$$ -8218 -7621 -12561 -16347 -13395 -7799 -7583 -12547 -15429 -14333 -8967 -8354 -11920 -15089 -13858 -10318 -9911
3693i911L11j297l403J431M398L209m949m746K097O092J798l297l170J579K721
$$ -9911 -9600 -10897 -14300 -12869 -8471 -5262 -10211 -14957 -12860 -6768 -4970 -8267 -11437 -9858 -7137
3708g137K704j215r54j860J000M382J341N4m961j92N358M141j269m963j116N244
$$ -7137 -4433 -5648 -6602 -8462 -7462 -3080 -1739 -1685 -6646 -6838 -1480 2661 1392 -3571 -4687 557
3724E57L741q09l855j74L101L052J038k042j643J11K953M198j576k880j882L552
$$ 557 4298 3489 -366 -540 2561 5613 6651 4609 2966 3077 6030 10228 8652 5772 3890 7442
3740G442N635R3n423j826L455L898J548l616k718J154K909K110n37k105k103J107
$$ 7442 13077 13170 7747 5921 9376 13274 14822 11206 8488 9642 12551 14661 14124 12019 9916 11023
3756A1023L926J358k780m938K051M898K684m478m176P76M928J552k495l907J55
$$ 11023 14949 16307 13527 8589 10640 15538 18222 13744 9568 10344 15272 16824 14329 10422 10577
3771A0577J454K249K92l383k818q09L653K648k069n292k160N188K193j918o141
$$ 10577 12031 14280 14572 11189 8371 7562 11215 13863 11794 6502 4342 9530 11723 9805 3664
3786C664O40J724K017p31m085p71p22J005K394j945m066l268M596K901J53n241
$$ 3664 4304 6028 8045 7314 3229 2458 1736 2741 5135 3190 -876 -4144 452 3353 3506 -1735
3802a735l746P64N587j094n559k099P94K815O87j037l678j977J581K280J278m048
$$ -1735 -5481 -4717 870 -224 -5783 -7882 -7088 -4273 -3586 -4623 -8301 -10278 -8697 -6417 -5139 -9187
3818i187n377J587O471m0l831m091K613K396J125k214l521j050L451J423k69j513
$$ -9187 -14564 -12977 -6506 -6546 -10377 -14468 -11855 -9459 -8334 -10548 -14069 -15119 -11668 -10245 -10514 -12027
3834a2027l729M63L253M472l319m564o98L970M429k932m787N67K436M816j041
$$ -12027 -15756 -15293 -12040 -7568 -10887 -15451 -16149 -12179 -7750 -10682 -15469 -14902 -12466 -7650 -8691
3849h691k143j691N54L863J426j414k677j758M467M777j260m485j536K957N675
$$ -8691 -10834 -12525 -11971 -8108 -6682 -8096 -10773 -12531 -8064 -3287 -4547 -9032 -10568 -7611 -1936
3864a936Q13m001j370K297K639Q42j51r51j341K292L298R13k919k479J502N583
$$ -1936 -1123 -5124 -6494 -4197 -1558 -716 -867 -1818 -3159 -867 2431 3344 425 -2054 -552 5031
3880E031J597k853l402K831M016Q12j841j974r69M580K124K18k121k099Q51M715
$$ 5031 6628 3775 373 3204 7220 8032 6191 4217 3248 7828 9952 10170 8049 5950 6801 11516
3896A1516J688j631o549J518L171N540l194m981Q7M607K594k454k385j989K167
$$ 11516 13204 11573 5024 6542 9713 15253 12059 7078 7165 11772 14366 11912 9527 7538 9705
3911I705J982J605j163m287K83J305L979n15m993k396K422N486j874l551l824
$$ 9705 11687 13292 12129 7842 8125 9430 13409 12894 7901 5505 7927 13413 11539 7988 4164
3926D164K274N149q72m675q47q5J643R35J064m949l039J943M108Q27n325l731
$$ 4164 6438 11587 10715 6040 5193 5108 6751 7686 8750 3801 762 2705 6813 7640 2315 -1416
3942a416K219M407J86l745l634J181K175R56j375m195j56R08J305J187j809n732
$$ -1416 803 5210 5396 1651 -1983 -802 1373 2329 954 -3241 -3397 -2489 -1184 3 -1806 -7538
3958g538O18N247J125l727m174R45L510K389l969k802r86J379L086l65j209m122
$$ -7538 -6920 -1673 -548 -4275 -8449 -7504 -3994 -1605 -5574 -8376 -9362 -7983 -4897 -5262 -6471 -10593
3974a0593qL048L597j788n386j476N026K686j466m586j723M218K518o13j542k363
$$ -10593 -10601 -7553 -3956 -5744 -11130 -12606 -7580 -4894 -6360 -10946 -12669 -8451 -5933 -6546 -8088 -10451
3990a0451m43M339M67K63k367j530Q58N319m90k779l159J980N489M24m000j452
$$ -10451 -10894 -6555 -6088 -5825 -8192 -9722 -8864 -3545 -4035 -6814 -9973 -7993 -2504 -2080 -6080 -7532
4006g532J196M374J580k094k491M7J702K701K31k240k303K02O661J416k862n816
$$ -7532 -6336 -1962 -382 -2476 -4967 -4920 -3218 -517 -286 -2526 -4829 -4627 2034 3450 588 -5228
4022e228K399M481K327k595k545Q43K152J861L6j390j816J292J539K083j621l594
$$ -5228 -2829 1652 3979 1384 -1161 -318 1834 3695 3731 2341 525 1817 3356 5439 3818 224
4038B24p51M914M012j723m287j835L831M302j223l042j805R87M183r47j1m062
$$ 224 -527 4387 8399 6676 2389 554 4385 8687 7464 4422 2617 3604 7787 6840 6829 2767
4054B767n52K070M417m08l866k206L021L343o3m411k663M059J330k0j568k513
$$ 2767 2215 4285 8702 8294 4428 2222 5243 8586 8523 4112 1449 5508 6838 6818 5250 2737
4070B737O77J740J659j070j373j766k40L571K033l911l338j13M168K086l196l562
$$ 2737 3414 5154 6813 5743 4370 2604 2364 5935 7968 4057 719 606 4774 6860 3664 102
4086A02O72K144L128l046j739j066j65M103j08j612k739q53J244M704k443n165
$$ 102 774 2918 6046 3000 1261 195 30 4133 4025 2413 -326 -1179 65 4769 2326 -2839
4102b839l41M269J757q34m190j651K302K209P56k642j983r44K060K475M2k880
$$ -2839 -3180 1089 2846 2012 -2178 -3829 -1527 682 1438 -1204 -3187 -4131 -2071 404 446 -2434
4118b434k641L492K944L15m417l348L014K931J194l667k474K56L470N22n62k667
$$ -2434 -5075 -1583 1361 1676 -2741 -6089 -3075 -144 1050 -2617 -5091 -4835 -1365 -843 -1405 -4072
4134d072j115K39M009J499k703n145J429M839J448l220k623J227L360K42q01k713
$$ -4072 -5187 -4948 -939 560 -2143 -7288 -5859 -1020 428 -2792 -5415 -4188 -828 -586 -1387 -4100
4150d100j563K317J669R87j531k496j131M288K075j708n213L73L701L080j437
$$ -4100 -5663 -3346 -1677 -690 -2221 -4717 -5848 -1560 515 -1193 -6406 -6033 -2332 748 -689
4165f89m414q27K963K199j244j35r87K94J034O69L73l913k116M072L355m10l733
$$ -689 -5103 -5930 -2967 -768 -2012 -2147 -3134 -2840 -1806 -1137 -764 -4677 -6793 -2721 634 224 -3509
4182c509j403R87L424J787m539r35M43K880J772j670r81k564J505K877K216l403
$$ -3509 -4912 -3925 -501 1286 -3253 -4188 -3745 -865 907 -763 -1744 -4308 -2803 74 2290 -1113
$$ [...]
8191A11
##END NTUPLES=NMR FID
##END=
