##TITLE=1H_IPACAT-21a
 DMSO-d6, 8 sc, 
 7.5.2019
##JCAMPDX= 6.0         $$ Bruker NMR JCAMP-DX V2.0
##DATA TYPE= NMR FID
##DATA CLASS= NTUPLES
##ORIGIN= UXNMR, Bruker Analytische Messtechnik GmbH
##OWNER= root
$$ XWIN-NMR		Version 3.5
$$ Tue May  7 14:26:22 2019 Russian Standard Time (UT+4h)  she@DPX200
##.OBSERVE FREQUENCY= 200.1315
##.OBSERVE NUCLEUS= ^1H
##.DELAY= (6, 6)
##.ACQUISITION MODE= SIMULTANEOUS
##.ACQUISITION SCHEME= undefined
##.AVERAGES= 108
##.DIGITISER RES= 18
##SPECTROMETER/DATA SYSTEM= spect
##.PULSE SEQUENCE= zg30
##.SOLVENT NAME= DMSO
##.SHIFT REFERENCE= (INTERNAL, DMSO, 0, 15.7039)
##AUDIT TRAIL= $$ (NUMBER, WHEN, WHO, WHERE, WHAT)
$$ ##TITLE= Audit trail, XWIN-NMR		Version 3.5
$$ ##JCAMPDX= 5.01
$$ ##ORIGIN= Bruker BioSpin GmbH
$$ ##OWNER= she
$$ F:/spectra/data/she/nmr/H-F/1/audita.txt
$$ ##AUDIT TRAIL=  $$ (NUMBER, WHEN, WHO, WHERE, WHAT)
(   1,<2019-05-07 14:19:55.00 +0400>,<she>,<DPX200>,
      <continue with go, POWCHK disabled, PULCHK disabled
       configuration hash MD5:
       00 E9 B6 7A A2 85 ED C7 34 08 36 98 17 FE 4E 26
       data hash MD5: 16K
       11 24 30 E1 4E 2F B1 04 73 23 81 8F 9B E6 33 17>)
$$ ##END=
$$ 
$$ hash MD5
$$ DB FC 16 6E B8 6A 85 F3 F8 2B FE 01 C1 0A E9 55
##$RELAX= 
##$RELAX= 
##$RELAX= 
##$RELAX= 
##$RELAX= 
##$RELAX= 
$$ Bruker specific parameters
$$ --------------------------
##$DU= <F:/spectra>
##$EXPNO= 1
##$NAME= <H-F>
##$PROCNO= 1
##$TYPE= <nmr>
##$USER= <she>
##$AMP= (0..31)
100 100 100 100 100 100 100 100 100 100 100 100 100 100 100 100 100 100 
100 100 100 100 100 100 100 100 100 100 100 100 100 100 
##$AQSEQ= 0
##$AQ_mod= 1
##$AUNM= <au_zg>
##$AUTOPOS= <>
##$BF1= 200.13
##$BF2= 200.13
##$BF3= 200.13
##$BF4= 200.13
##$BF5= 200.13
##$BF6= 200.13
##$BF7= 200.13
##$BF8= 200.13
##$BYTORDA= 1
##$CFDGTYP= 0
##$CFRGTYP= 5
##$CHEMSTR= <none>
##$CNST= (0..31)
1 1 145 1 1 1 1 1 1 1 1 1 1 1 1 1 1 1 1 1 1 1 1 1 1 1 1 1 1 1 1 1 
##$CPDPRG= <>
##$CPDPRG1= <>
##$CPDPRG2= <>
##$CPDPRG3= <>
##$CPDPRG4= <mlev>
##$CPDPRG5= <mlev>
##$CPDPRG6= <mlev>
##$CPDPRG7= <mlev>
##$CPDPRG8= <mlev>
##$CPDPRGB= <>
##$CPDPRGT= <>
##$D= (0..31)
0 1.2 0 0 0 0 0 0 0 0 0 0.03 0 0 0 0 0 0 0 0 0 0 0 0 0 0 0 0 0 0 0 0 
##$DATE= 1557224043
##$DBL= (0..7)
120 120 120 120 120 120 120 120 
##$DBP= (0..7)
150 150 150 150 150 150 150 150 
##$DBP07= 0
##$DBPNAM0= <>
##$DBPNAM1= <>
##$DBPNAM2= <>
##$DBPNAM3= <>
##$DBPNAM4= <>
##$DBPNAM5= <>
##$DBPNAM6= <>
##$DBPNAM7= <>
##$DBPOAL= (0..7)
0.5 0.5 0.5 0.5 0.5 0.5 0.5 0.5 
##$DBPOFFS= (0..7)
0 0 0 0 0 0 0 0 
##$DE= 6
##$DECBNUC= <off>
##$DECIM= 24
##$DECNUC= <off>
##$DECSTAT= 4
##$DIGMOD= 1
##$DIGTYP= 9
##$DL= (0..7)
0 120 120 120 120 120 120 120 
##$DP= (0..7)
150 150 150 150 150 150 150 150 
##$DP07= 0
##$DPNAME0= <>
##$DPNAME1= <>
##$DPNAME2= <>
##$DPNAME3= <>
##$DPNAME4= <>
##$DPNAME5= <>
##$DPNAME6= <>
##$DPNAME7= <>
##$DPOAL= (0..7)
0.5 0.5 0.5 0.5 0.5 0.5 0.5 0.5 
##$DPOFFS= (0..7)
0 0 0 0 0 0 0 0 
##$DQDMODE= 0
##$DR= 18
##$DS= 0
##$DSLIST= <SSSSSSSSSSSSSSS>
$$ [...]
##$SUBNAM2= <"">
##$SUBNAM3= <"">
##$SUBNAM4= <"">
##$SUBNAM5= <"">
##$SUBNAM6= <"">
##$SUBNAM7= <"">
##$SUBNAM8= <"">
##$SUBNAM9= <"">
##$SW= 24.9337058887773
##$SWIBOX= (0..15)
0 0 2 0 0 0 0 0 0 0 0 0 0 0 0 0 
##$SW_h= 4990.01996007984
##$TD= 16384
##$TD0= 1
##$TE= 0
##$TE2= 300
##$TE3= 300
##$TEG= 300
##$TL= (0..7)
0 120 120 120 120 120 120 120 
##$TP= (0..7)
150 150 150 150 150 150 150 150 
##$TP07= 0
##$TPNAME0= <>
##$TPNAME1= <>
##$TPNAME2= <>
##$TPNAME3= <>
##$TPNAME4= <>
##$TPNAME5= <>
##$TPNAME6= <>
##$TPNAME7= <>
##$TPOAL= (0..7)
0.5 0.5 0.5 0.5 0.5 0.5 0.5 0.5 
##$TPOFFS= (0..7)
0 0 0 0 0 0 0 0 
##$TUNHIN= 0
##$TUNHOUT= 0
##$TUNXOUT= 0
##$USERA1= <user>
##$USERA2= <user>
##$USERA3= <user>
##$USERA4= <user>
##$USERA5= <user>
##$V9= 5
##$VALIST= <valist>
##$VCLIST= <CCCCCCCCCCCCCCC>
##$VD= 0
##$VDLIST= <DDDDDDDDDDDDDDD>
##$VPLIST= <PPPPPPPPPPPPPPP>
##$VTLIST= <TTTTTTTTTTTTTTT>
##$WBST= 1024
##$WBSW= 4
##$XGAIN= (0..3)
0 0 0 0 
##$XL= 0
##$YL= 0
##$YMAX_a= 5773049
##$YMIN_a= -6847692
##$ZGOPTNS= <>
##$ZL1= 120
##$ZL2= 120
##$ZL3= 120
##$ZL4= 120
##$ABSF1= 10
##$ABSF2= 0
##$ABSG= 5
##$ABSL= 3
##$ALPHA= 0
##$AQORDER= 0
##$ASSFAC= 0
##$ASSFACI= 0
##$ASSFACX= 0
##$ASSWID= 0
##$AUNMP= <proc_1d>
##$AZFE= 0.1
##$AZFW= 0.1
##$BCFW= 1
##$BC_mod= 2
##$BYTORDP= 1
##$COROFFS= 0
##$CY= 11.3945322036743
##$DATMOD= 1
##$DC= 2
##$DFILT= <>
##$DTYPP= 0
##$F1P= 18.9103706918063
##$F2P= -1.10871071338519
##$FCOR= 0.5
##$FTSIZE= 0
##$FT_mod= 4
##$GAMMA= 1
##$GB= 0.15
##$INTBC= 1
##$INTSCL= 1
##$ISEN= 128
##$LB= 0.24
##$LEV0= 0
##$LPBIN= 0
##$MAXI= 10000
##$MC2= 0
##$MEAN= 0
##$ME_mod= 0
##$MI= 1.114404
##$NCOEF= 0
##$NC_proc= 0
##$NLEV= 6
##$NOISF1= 3.799351
##$NOISF2= 2.8
##$NSP= 1
##$NTH_PI= 0
##$NZP= 0
##$OFFSET= 15.70392
##$PC= 1
##$PHC0= -8868.065
##$PHC1= 29.00026
##$PH_mod= 1
##$PKNL= yes
##$PPARMOD= 0
##$PSCAL= 0
##$PSIGN= 0
##$REVERSE= no
##$SF= 200.130013532006
##$SI= 16384
##$SIGF1= 3
##$SIGF2= 2
##$SINO= 400
##$SIOLD= 16384
##$SREGLST= <1H.CDCl3>
##$SSB= 0
##$STSI= 0
##$STSR= 0
##$SW_p= 3612.71676300578
##$SYMM= 0
##$S_DEV= 0
##$TDeff= 0
##$TDoff= 0
##$TI= <>
##$TILT= no
##$TM1= 0
##$TM2= 0
##$TOPLEV= 0
##$USERP1= <user>
##$USERP2= <user>
##$USERP3= <user>
##$USERP4= <user>
##$USERP5= <user>
##$WDW= 1
##$XDIM= 8192
##$YMAX_p= 0
##$YMIN_p= 0
$$ End of Bruker specific parameters
$$ ---------------------------------
##NTUPLES= NMR FID
##VAR_NAME=  TIME,          FID/REAL,        FID/IMAG
##SYMBOL=    X,             R,               I
##VAR_TYPE=  INDEPENDENT,   DEPENDENT,       DEPENDENT
##VAR_FORM=  AFFN,          ASDF,            ASDF
##VAR_DIM=   8192,          8192,            8192
##UNITS=     SECONDS,       ARBITRARY UNITS, ARBITRARY UNITS
##FACTOR=    0.0002004,     1,               1
##FIRST=     0,             0,               0
##LAST=      1.6414764,     0,               0
##MIN=       0,             -6847692,        0
##MAX=       1.6414764,     5773049,         0
$$ Real data points
##PAGE= N=1
##DATA TABLE= (X++(R..R)), XYDATA
$$ [...]
2756b35O38m64L85p22L11k6m58m65J892q51J21m34N42N16j868J632m97R90j531
2775e24j66J180qj32r3j10j52R12n15m44q16R05M14j608Q60Q0Q09j290M74J121
2795H97O1q32K06l71N86j464N99Q13k68r22n72J557K19m4J23j18o47P31l44K79
2815D89r77rR78k94j192J088J60M3l77n27Q32k81p8l65L08o58R71q40P83L21m83
2836a08O34N3o40l61Q16O6J57l92q3N62p64R65r19P88r88k09N91P35k36j489J449
2857F27n77o33Q60n50N04o67K34Jj80J121j106J459j763n23R0j9K720j729M00
2876B69J83m86k77L83k21L52m45o76K085k449J42K029j686J404n59q24P45J130
2894A099o06k64K80J45j092J066j065O14j37J725o18q17O49j319n60J134j186
$$ plain form
2756 -235 403 -61 324 -398 -87 -113 -571 -1036 856 5 126 -308 234 750 -1118 514 17 1007 -524
2775 -524 -690 490 482 350 257 147 -5 907 392 -52 -868 37 451 -1157 -297 -217 592 -698 -224 897
2795 897 958 126 332 -39 547 -917 -318 495 227 -695 -1267 290 509 465 588 470 -177 554 210 489
2815 489 -488 -497 481 187 -1005 83 243 286 -91 -618 214 -67 -145 -510 -202 -860 111 -729 54 375 -108
2836 -108 526 579 -61 -422 394 460 617 225 142 704 -60 905 -14 774 -214 -423 168 903 667 -822 627
2857 627 50 -583 277 -273 231 -436 -202 -201 -381 740 -366 1093 -670 -1193 -1103 -1122 1598 -131 269
2876 269 452 -34 -311 72 -149 203 -242 -918 1167 -1282 -1140 889 -797 607 48 -776 -31 1099
2894 1099 493 229 509 654 -438 628 -437 177 40 1765 1147 330 979 -340 -900 234 -952
2911i52P91L49k50l06N82L01j0j75K28r77R24o05P3N12j216J462m96j9j61J12
2931A67p84Q72j688J793k80k89l63N36p9J058j103N70o72J028l98N58r74m29R33
2950D56j205p9L95k58J577r61J41m78j07l7J98J674j506J21P84j248L48l0K88
2969G3l11R67J72n8j421J32j097K520q17J482j159o72K84j82n30K138o56o01J53
2988D17p2J35r21R82j279M71P24j029N30J196j764O39j101J156k38j94M17l48
3006b79j08R32j534R70r07J286K07n32j161O40M76l92P17K85j06p98L23k29m1
3025b51J004j724J267n72N38J17q29J153j789l48K056M32n80n29nj42J4R19q64
3044a33M83J42q48O7Q67q62O55m55R82j264K78p26R51k9p9j30L41L37K49p73Q62
$$ plain form
2911 -952 -161 188 -62 -368 214 515 505 330 558 -419 505 -100 -27 485 -731 731 235 216 55 167
2931 167 -617 255 -1433 360 80 -209 -572 -36 -115 943 -160 410 -262 766 368 926 -48 -477 456
2950 456 -749 -828 -433 -691 886 -75 66 -412 -519 -556 -358 1316 -190 -69 715 -533 -185 -215 73
2969 73 -238 729 901 843 -578 -446 -1543 977 160 1642 483 -189 95 -87 -617 1521 865 264 417
2988 417 345 480 -441 541 -738 -267 457 -572 -42 1154 -610 29 -1072 84 -154 -348 69 -279
3006 -279 -387 545 -989 -19 -926 360 567 35 -1126 -486 -10 -402 315 600 494 -304 19 -210 -251
3025 -251 753 -971 296 -276 262 379 -450 703 -1086 -1434 622 1054 474 -55 -60 -202 -188 731 -133
3044 -133 350 492 -356 -289 578 -284 371 -84 898 -366 -88 -814 137 108 29 -101 240 577 826 53 915
3065I15r15j19J575j197p96M40j212J882r76K53m20M27J00m3J90j032J535o13
3083fO47M00k016K36O06L19L83q26J095j009K43o55l91P46J14J63L76j239j20
3102i34J482K77o40J83K53j33j475J278n73J200j415Q15j047N65q26Q00K31k56
3120b15L87n4p09J430j271J559r45K6L92j111Q20N11j345J01J016q87j48J674
3138A231j190k04o12J460p31L34n5j336K025p47l63J44o2j69N04o19l03J92R38
3157D37j39K90q74K08O14j350Q15n47j76R39J30N65j505N73m45J564j528J5Q45
3176D31j330L01O42M32j11o65R92q1l18q8l99r51J048K21o92J387q64n24K45L45
3196B1O62p94k64P54k98p86J336K59n32j296J305K57j621J460n38k77J081J2o58
$$ plain form
3065 915 0 -119 1456 259 -537 -97 -1309 573 -403 -150 -570 -143 -43 -86 104 -928 607 -6
3083 -6 641 1041 -975 -739 -133 186 569 -257 838 -171 72 -583 -974 -228 -114 49 425 -814 -934
3102 -934 548 825 185 368 621 488 -987 291 -282 918 -497 318 -729 -164 -990 -190 41 -215
3120 -215 172 118 -591 839 -432 1127 182 208 600 -511 309 820 -525 -424 592 -295 -443 1231
3138 1231 41 -163 -775 685 -46 288 233 -1103 922 175 -188 -44 -106 -275 229 -390 -693 -501 437
3157 437 298 588 -286 -78 536 -814 1 -546 -722 217 347 912 -593 -20 -465 1099 -429 -414 431
3176 431 -899 -598 44 476 365 -300 692 611 293 205 -194 -1145 -97 124 -568 819 -45 -569 -324 21
3196 21 683 -111 -375 379 81 -705 631 890 358 -938 367 624 -997 463 -75 -352 729 741 83
3215H3l2O3j58m79J136j35j483J450o82K86o47J96K83M1j70j151J882k7k00n76
3235c20P63k28L0k024J106j25J313l47J344j964P34q72K58O55j3m90j322Q58J070
3254D26R7L37j853N91l23Q29n68P25L67o88q45J501q5K12L92m46q27J24L64J54
3274D84R1j041L38L82J260j434q77Q50l39J16j211L54J192m56Q67j143K46j79
3292e00J059k503J486N8O00j287J276n4n42J60L44o58O06K08k052K752n70n54
3310a71q81R99j318K433r68m46j140N86J365J069j261o8L49p04m26n53J370j870
3328a635K147M82j149K0l15L41J02J075j106o08q9M68P69o81L44k67m80N53N3
3347B4M25j6o76m0p84R82M72P21j590n67K99n44O60J78N28m3r5L92k35n16j14
$$ plain form
3215 83 51 114 -44 -523 613 478 -1005 445 -237 49 -598 -402 -119 -78 -248 -1399 483 456 256 -320
3235 -320 443 215 245 -1779 -673 -798 515 168 1512 -452 282 -590 -332 323 310 -180 -1502 -644 426
3254 426 523 860 -993 -402 -725 104 -464 261 628 -60 -905 596 511 723 1115 669 -158 -34 330 484
3274 484 575 -466 -128 254 1514 80 -797 53 -286 -170 -1381 -1027 165 -291 576 -567 -321 -500
3292 -500 559 -1944 -458 -400 200 -1087 189 135 -407 -247 97 -561 45 253 -1799 953 383 -171
3310 -171 -1052 -53 -1371 1062 94 -352 -1492 -906 459 1528 267 199 548 -156 -582 -1135 235 -1635
3328 -1635 512 994 -155 -135 -450 -109 -7 1068 -38 -646 -735 -267 502 -179 165 -102 -582 -29 24
3347 24 449 433 -243 -283 -1067 -85 387 1108 -482 -1049 -750 -1294 -634 -456 72 29 -66 326 91 -425 -539
3368e39M48P45j362O0Q02p20j93q3J506r57N65p50J802j179P9J58j217l78J175
3387c8O49l64k19n09L65M67q10L76o16J752j677L27j14J851j899M41n50N17N61
3406E10j242Q73q38k84J297j082j37J659k04k46j221O33J010k22o50R5J5K69p5
3425A60k33O73o62l96M89k58p37L94m80J22M29K39J216j470K78m6R8L43j710M95
3445a056J319j410J135n44J897j945M81k72N68m86l01p53J245N58l43R36l19J77
3463H87j283Q50l20p02P59r26J832l06r13o89L17J386m91O19j205R06q45J604
3481A480l346K181p37M12L53j41j42j40J78L0k10o2K64J40k6k67m76N75N76j089
3501d47J074n16k25Q72l84P1M64p43o09M82o43J008p72J011q48K33L55q9k62q30
$$ plain form
3368 -539 -91 654 -708 -648 154 -566 -759 -842 664 -293 272 -478 1324 145 224 382 -835 -1213 -38
3387 -38 611 247 28 -481 -116 351 -459 -83 -699 1053 -624 -297 -411 1440 -459 -18 -568 -51 510
3406 510 -732 141 -697 -981 316 -766 -903 756 552 306 -915 -282 728 506 -144 -49 -34 235 160
3425 160 -73 600 -62 -458 31 -227 -964 -570 -1050 -928 -499 -260 956 -514 -236 -282 -184 159 -1551 -1056
3445 -1056 263 -1147 -12 -556 1341 -604 -123 -395 173 -313 -614 -1367 -122 436 93 1029 710 887
3463 887 -396 454 134 -568 191 -735 1097 791 -122 -811 -494 892 401 1020 -185 721 -124 1480
3481 1480 -1866 315 -422 -10 343 202 60 -80 98 128 -82 -144 120 260 234 -33 -509 66 642 -447
3501 -447 627 111 -114 758 374 445 909 166 -443 39 -604 404 -368 643 -205 28 383 294 32 -798
3521g98J552q7%p18N40l1J189j205m48j016J895j54r61m60r5J115j271K72R39
3540B58p80l45J240q20O49R48r26K07j611J242m46N75J0j92k10j76R37o38o29
3559g07J49J552k16j125l47J271p58J144j917K68J467K39j633K62j0J294k122
3576a189J166Nm98J084o54p51J306m36j502J796L17j48m59J27p54P80Q13j573
3594e70J098j50m99J40O27q55M5M07J199j828J210k91J72p37L16k76k86J90p29
3613h17m17K247n81r88m67K126j808K64l95O35j95m50Q09n96P08J60j200R84P09
3632G28m78j136Q41n54L59M17N13m85L31l68n27N78l92k0J513k054P39p0K67L25
3652E27l43j23M2q3k08m34N73J86k51P45j060J135q28L10l63p49J082O32k59p05
$$ plain form
3521 -798 754 667 667 -51 489 458 1647 442 -6 -1022 873 719 -242 -702 -797 318 -953 -681 258
3540 258 -522 -867 373 -447 202 1150 224 431 -1180 62 -384 191 201 9 -201 -377 560 -78 -707
3559 -707 -558 994 778 -347 -694 577 -181 963 -954 -686 781 1020 -613 -351 -361 933 -1189
3576 -1189 -23 -18 -516 568 -86 -837 469 33 -1469 327 644 496 37 164 -590 190 1003 -570
3594 -570 528 378 -121 19 646 -209 -164 243 1442 -386 824 533 705 -32 284 8 -278 -88 -817
3613 -817 -1234 1013 432 -556 -1023 1103 -705 -441 -836 -201 -396 -846 -37 -633 75 235 -965 19 728
3632 728 250 -886 -45 -599 -240 177 690 205 536 168 -359 219 -173 -193 1320 -734 5 -65 202 527
3652 527 184 61 103 20 -188 -622 -49 137 -114 631 -429 706 -122 188 -175 -924 158 790 531 -174
3672a74j194J677r46J614r89l10Q58J45j307Q36m98M23o13N59j038J216l26N57
3690D90K53L01p74o03L7M54k3r0o31O30O07n60M76j086J309q51J020p18K41r26
3710d44M65n19Q47o84R8J026n72p77P07P44j858J760j730J023k40k14l69Q60n24
3729d01R24L11k062J24J466j124J148j204O53J300j180r0Q83k487J200N02P0O06
3747F39r36Q62r03M74o43J134l23q21L95J191j059J85m36k7N83k38o94J007J205
3766A595k511N87N0l38J35K38p50L28N85J03j737J433m80J44J721j564J46L70
3784E5J28n06L58o88N87K28l17J93L23m12k15k56j79K64k35O57QR44n20L55j022
3805b50J152n67J28l5k46Q8K69l4q13P39p5n42J29J33R5q00M39L57o44J086k89
$$ plain form
3672 -174 -1368 309 -637 977 -12 -322 536 681 -626 210 -288 135 -478 81 -957 259 -67 490
3690 490 743 1044 270 -333 -296 158 135 45 -586 44 651 91 567 -519 790 -61 959 241 482 -444
3710 -444 21 -498 349 -335 -237 789 217 -560 147 891 -967 793 -937 86 -154 -368 -737 123 -401
3729 -401 523 834 -1228 -1104 362 -762 386 -818 -165 1135 -45 -135 748 -1739 -539 -37 33 639
3747 639 -297 565 -338 136 -507 627 304 -517 -122 1069 10 195 -241 -268 315 77 -617 390 1595
3766 1595 -916 -329 -279 -617 -482 -244 -994 -666 -81 22 -1715 -282 -762 -618 1103 -461 -315 55
3784 55 183 -323 35 -653 -66 162 -155 38 361 -51 -266 -522 -701 -437 -672 -15 -7 937 417 772 -250
3805 -250 902 335 463 428 182 270 539 505 -308 431 356 -186 -57 76 171 -629 -190 167 -477 609 320
3826C20j302J16J056o42K96l85J293j292p15N03Q70k74l44Q58k89n43K84N35o41
3845b96R99p94p69J939q24l02p01K62J44R04j433Q48l98P00J90j035M20L80j59
3864G5l89M05o75N2n40J394j397K00O70K25l60M68j82k29J23n40L88j052R54N32
3884A22N06j86o1p47O15M20j9N11n45n55J224r92j333J058j8J17j049m98J030
3903d00J324j232K82r76J131r18J083j26j53R64q70m6o67J941j784M12m70Q56
3921C51J09j006j88J154o01J735k580P97N05p0o3o07j64M08o52J119J194r65p71
3940b95O7N43l03M66R7l55m2j91j010M15n6M25O04k20j321J768Q70j521K70l88
3960a77L29R3o0O25k91L3q48L48K86n72N9j08L10Q86j277N83O9L58k92j662J929
$$ plain form
3826 320 -982 -866 190 -452 -156 -541 752 -540 -1255 -752 118 -156 -500 358 69 -474 -190 345 -296
3845 -296 703 -91 -860 1079 255 -47 -748 -486 -342 562 -871 -23 -421 279 469 -566 -146 234 75
3864 75 -314 91 -584 -532 -1072 322 -1075 -875 -205 20 -340 128 -54 -283 -160 -700 -312 -1364 -410 122
3884 122 628 442 381 -366 249 669 650 1161 616 61 1285 293 -1040 18 0 117 -932 -1430 -400
3903 -400 924 -308 -26 -1002 129 -789 294 168 15 979 109 63 -604 1337 -447 -35 -505 351
3921 351 460 -546 -734 420 -181 1554 -1026 -229 276 206 143 -464 -628 -220 -872 247 1441 476 -295
3940 -295 -228 315 12 478 575 220 178 -13 -1023 -608 -664 -239 365 145 -1176 592 1462 -59 211 -177
3960 -177 152 245 185 810 519 552 -296 52 338 -234 -175 -283 27 913 -364 219 288 646 354 -1308 621
3981F21m13o88J263n24R16j120q60Q4M31J313r83p67n9J361n81m19L02q5R21m65
4001B48q85P58k60n15R08q30j95N35m7j05P8j84Q6K41O83l58Q93m66J98p01k06
4022a24N78R9o55K27j70l43Q67n93K00l94L61q64J589q67Q55p86j03k33M72O77
4042G93o81R81k531Q56R26n47P17l12N15k038K72J495m59M29p39L13K20j00n90
4061d80J299k33j405J160n65R9J167j210q7m8K35M4R06n93l6M33o31m89J75O10
4081C51q43O28M90m63q97P07r14L24J216j60o92J188r41J07n80m08P47J6O91m13
4101A54J198r51N5j033L90j89R84l59l44J26o3J2J52l50O49J38q5J73m61j010
4121h14N20P20p62P97J119j976L15p51K142j122m07o25R10R37j78q00p87J248
$$ plain form
3981 621 208 -480 783 259 1175 55 -805 -721 -290 1023 40 -727 -786 575 -6 -425 -123 -208 713 248
4001 248 -637 121 -139 -654 254 -576 -771 -236 -283 -388 -310 -494 -408 -167 516 158 1051 585 783 82 -124
4022 -124 454 553 -102 125 -45 -388 479 -114 86 -308 53 -811 778 -89 766 -20 -123 -356 116 793
4042 793 112 1093 -1438 -582 344 -203 514 202 717 -1321 -1049 446 -13 416 -323 -10 210 110 -480
4061 -480 819 586 -819 341 -224 -125 1042 -168 -255 -303 -68 -24 882 289 253 686 55 -434 -259 351
4081 351 -492 136 626 163 -734 -27 -941 -617 599 439 -253 935 -6 101 -479 -887 -140 -124 567 154
4101 154 1352 401 456 -577 -187 -376 608 249 -95 31 -32 -20 132 -218 431 569 484 657 196 -814
4121 -814 -294 426 -336 461 1580 -396 -81 -832 1310 188 -219 -844 66 1003 825 25 -762 486
4139D86J82L12k060J432n95k92P97q13J4N03L9M23p42o90L44k53m16J051p09O59
4159c28j31J374j068P90j585P53j58P72n54J06O81l41q24J231p46L79o56K86q26
4178h45K72N03k70N26k37p02O52L06p90J237n88M7P1J052q69J11n97m5p04P13
4198a57J12J16Q78p62K54q78K49M62q50j3J118j541N8R38M21L42l85j154J459
4217F67j192M63L95o61P32N0k4j09j218J33J343j324P34p8J29ko24J271n85L17
4237D17j064Q5J16N55n98m89J431k96l69l97J677o55k91l34M29j002O54J537k088
4256f82P30J4L59J80rq54M58l48m23K95K76K69o8R80j025j89n33J240m37m00o84
4277h51J401j83Q37j182M68n85J5K16l02j05P59L62l54K90l68q40k07N93Q19j006
$$ plain form
4139 486 668 980 -1080 352 -243 -535 262 -551 -537 -34 5 428 -314 -1004 -660 -913 -1329 -278 -987 -328
4159 -328 -459 915 -153 637 -948 -195 -353 419 -135 -29 652 311 -513 718 -28 351 -305 -19 -845
4178 -845 -573 -70 -340 186 -51 -753 -101 205 -585 652 64 111 182 1234 365 476 -121 -166 -870 -157
4198 -157 -45 71 949 187 441 -437 -188 274 -576 -589 529 -1012 -954 -16 405 747 362 -792 667
4217 667 -525 -62 333 -328 404 454 430 321 -897 -764 579 -745 -11 -89 40 38 -586 685 100 417
4237 417 -647 -562 -446 109 -489 -978 453 157 -212 -609 1068 413 122 -212 217 -785 -131 1406 -682
4256 -682 48 62 421 601 592 -262 196 -152 -575 -280 -4 265 197 1177 152 -37 -570 670 233 -167 -851
4277 -851 550 367 1204 22 490 -95 -80 136 -166 -271 488 850 496 786 418 -422 -629 -36 783 -223
4297b23o16J027m3K26j130j32L90P18k04L34o34J010o55k2j170J021m94M98p49
4316h48P79Q50p0k04j81m73M5K11j27J146j035K67j231J107o05R46j676J056K54
4335B11j79N24l88L97p79j95M98O52r14P85L79j050l16l5M65J286p32j238M20
4354b09o07j4J095K05r20K12q7O12q65J064j741J514N5N50n31o40J527j184j93
4373a57o30J300n89n49Q15j38q46J260q53Q51m71K51j33k44J4r09J486j041J223
4392F40k50q9K07p11Q7j54NJ75m29M8J38J256q69n49P46p30O05m73J785n8m69
4413I11j930K56Q68q0j11j24o68J055Q49j484Q62r33R40q36M69J35j022J571r50
4432b22L58o50Q86n38L55K73j153P69k85L12N24p55m03k28J273n07J001j227J305
$$ plain form
4297 -223 -839 188 145 371 -759 -891 -501 217 13 347 -287 723 68 46 -1124 -103 -597 -99 -848
4316 -848 -69 781 711 507 326 -147 -102 109 -18 1128 93 360 -871 236 -369 577 -1099 -43 211
4335 211 32 556 168 565 -214 -409 89 741 -173 612 991 -59 -375 -410 55 1341 609 -629 -209
4354 -209 -816 -830 265 470 -450 -238 -325 287 -578 486 -1255 259 314 864 333 -307 1220 36 -157
4373 -157 -787 513 -76 -625 190 52 -794 466 -387 464 -7 244 111 -133 -119 -1028 458 -583 640
4392 640 390 301 508 -203 -116 -270 -265 -90 -519 -471 -333 923 54 -495 251 -479 126 -347 1438 1380 911
4413 911 -1019 -763 105 25 -86 -210 -878 177 1026 -458 404 -529 411 -425 44 179 -843 728 -222
4432 -222 136 -514 372 -166 189 462 -691 78 -207 105 629 -126 -529 -757 516 9 1010 -217 1088
4451A088q73j608J450J176n67j442R27o31j18j83Q32J251j369l75J199k81k49
4468B27M34j289R97L11k85l7M64j554M34n65K45O05P60j039P1K74m42P72l19n20
4488d56n23J230k86k63O80j197L26J220k19k14n19N23k19m51N5P79n89J059p90
4507A46K10K65p11P88j95l51O27m27n25j53k10O61l20j27J229j105J767j596r78
4526a005M19R97q41n5QL80q13K87p5J313j812J027j86r3J296j764L54J20L91J156
4546A104k231O62N12j49N99J27N9l87l01O10K59r52J512r56o70L33p08o54J175
4565e6O53l34o73O50j04p81J297p19n00N09P8r91J358k76K2N55l34p43m81J418
4585E48q47k11J088j149J655n56j78k94j034Q89K51r5o19R71l69p01L85J13o23
$$ plain form
4451 1088 215 -1393 57 1233 666 -776 151 -480 -598 -781 51 1302 -67 -442 757 476 227
4468 227 661 -628 369 680 395 358 822 -732 -298 -863 -618 -13 747 -292 -221 53 -389 383 64 -456
4488 -456 -979 251 -35 -298 382 -815 -489 731 512 298 -221 302 83 -368 -313 466 -123 936 146
4507 146 356 621 -90 698 503 152 779 352 -173 -326 -536 125 -195 -322 907 -198 1569 -27 -1005
4526 -1005 -586 411 -430 -485 -477 -97 -910 -623 -698 615 -1197 -170 -356 -449 847 -917 -563 -443 -52 1104
4546 1104 -1127 -465 47 -102 497 624 683 296 -5 605 864 -88 1424 468 -202 131 -577 -1231 -56
4565 -56 597 263 -410 240 136 -645 652 -67 -567 -58 20 -971 387 111 133 688 354 -389 -870 548
4585 548 -299 -510 578 -571 1084 528 350 56 -978 -89 162 67 -552 419 50 -651 -266 -153 -776
4604g76J76K96J152j271N23o53R86j21M10p94n16M61R98k44l00J161j606J87q09
4623g40R32q27k74j47J584m17L65m16j192L34K185j035j241O71R05m45n73L39
4641HM27k10lQ8Q10m54j109J85q16J779p50j1m85L09J229m55P61j918J464j107
4661b58P63n88N69r90M90Rj420J320k2R26p18j12j34j10O38k87Q23l28k047J045
4681d31O1J19J200k42k37l68r57L52k64O50j54L03M12K61r2l87o38M23p77J781
4701A015j141n83J841j248K15N14q23O30r3J78n38R48n66q47J586j965Q63P5j97
4720a36K43Q96k044J944q16L76J6k32J79q95J227J94j387J22l29L88J018j388
4738f24J400o20n84p3J124n08l25O76j544J515p68O43r75o27J243n57J057j055
$$ plain form
4604 -776 -600 -304 848 -423 100 -553 433 312 722 -72 -588 -127 871 627 327 1488 -118 69 -740
4623 -740 192 -635 -909 -1056 528 111 476 60 -1132 -798 1387 352 -889 -218 687 242 -331 8
4641 8 435 225 222 310 1120 666 -443 -258 -1074 705 -45 -56 -541 -232 997 542 1303 -615 849 -258
4661 -258 505 -83 486 -504 -14 -5 -1425 -105 -127 799 81 -31 -165 -275 363 76 899 571 -1476 -431
4681 -431 -370 -251 949 707 470 102 -855 -503 -767 -117 -271 32 444 705 613 226 -412 11 -766 1015
4701 1015 -126 -709 1132 -116 99 613 -210 420 327 505 -33 915 349 -498 1088 -877 -14 61 -136
4720 -136 107 1003 -1041 903 87 463 479 247 426 -469 758 952 -435 -313 -642 -254 764 -624
4738 -624 776 156 -428 -501 623 115 -210 466 -1078 437 -331 312 -663 -1290 -47 -604 453 -602
4756f02J958j255j153Q42L78Q3n02p46J775j626R8j48J97J045j146m4J506n4j97
4775D09m58o02J118k41l3j83N40k2l13q33r0K43P5L48k73k75j27j28J146Q87j637
4796d49J084l37l5M13r38J243j923K040j347j94q9r68K26O00K74J382r41J11L83
4815E35j33p01R42j144k69l75J25J021n18l46J49O70l18M69Q11j068j52J239m20
4834E17n69j081J479J1j097J23Q28j1K99o16M65r62P67n41K77m84Q04k7j325J248
4854A05l79N1L05r03P15M19q46J617j546Q28O2L07n98K93j497J685M79j079m18
4873d00j320J237o36J216K47m26k38P77J77j404m36L10J032j05R2J0l55k56M57
4892b1j415J881k22O06j364P54Q9M02n92l9O23j591J230J19L24j295M79m48jO91
$$ plain form
4756 -602 1356 101 -1052 -210 168 251 -251 -997 778 -848 -750 -898 -701 344 -802 -846 660 606 409
4775 409 -49 -651 467 226 193 10 550 528 215 -618 -708 -465 -390 -42 -315 -590 -717 -845 301 1188 -449
4796 -449 635 298 263 676 -262 981 -942 1098 -249 -443 -532 -1500 -1274 -674 -400 982 41 152 535
4815 535 402 -299 643 -501 -770 -1145 -1020 1 -517 -863 -714 -44 -362 107 918 -150 -302 937 517
4834 517 -52 -1133 346 357 -740 -617 211 200 499 -117 348 -614 153 -388 -111 -595 209 182 -1143 105
4854 105 -274 -223 82 -821 -106 313 -533 1084 -462 366 428 735 137 430 -1067 618 1097 18 -400
4873 -400 -1720 -483 -1119 97 344 -82 -320 457 634 -770 -1206 -896 136 31 123 133 -222 -478 -21
4892 -21 -1436 445 223 829 -535 219 308 710 118 79 702 -889 341 460 784 -511 -32 -480 -481 210
4912B10L2k28k70R20j060M07O35p17J5O49P5o63K08O21j760P10J261l23Q4j20
4932F86m15l9m69J099k99o62j03N91o23m51K16K04p19N14j78R60m4o16J570m29
4952G93N71j443q74J468p75N39j179J238j336J444p55p7M14K13O61Q58j545q45
4970f30M00Q43q74J45p57L44J81k66R27m59P47j343J375l87l41JlN47q5Q17j472
4991b90L62O65o74n11J302j889K334o93L47j944M75k42J175O0j398P79m53J94
5009d01m51M91k91J624j598R36N4k79o56K24J64m23J275p43K1R64j383Q67K69
5028F64q38M37O42q11p56n22J278O25k56k36j08n39o63j45J443n65N03j552J665
5047B66o33P82l96k50j58l70M08M31M72o07r1J87p93Q17N20n12J69q29l73J191
$$ plain form
4912 210 242 14 -256 664 -396 11 646 -71 -56 593 668 5 213 834 -926 -216 1045 722 806 686
4932 686 271 232 -237 862 563 -99 -202 389 -234 -685 -469 -265 -984 -470 -648 312 268 -348 1222 793
4952 793 1364 -79 -953 515 -260 279 -900 338 -998 446 -309 -386 28 241 902 1760 215 -630
4970 -630 -230 613 -261 -116 -873 -529 -348 -614 313 -146 601 -742 633 246 -95 -94 -97 450 365 1182 -290
4991 -290 72 737 63 -448 854 -1035 1299 606 953 -991 -516 -758 417 477 -921 -142 -595 -401
5009 -401 -852 -361 -652 972 -626 310 364 85 -571 -347 -183 -606 669 -74 -53 911 -472 395 664
5028 664 -174 263 905 94 -662 -1184 94 719 463 227 119 -420 -1083 -1228 215 -350 153 -1399 266
5047 266 -367 415 19 -231 -389 -759 -351 80 552 -55 -146 41 -752 65 585 73 242 -587 -960 231
5067B31O02n55o70j2J651k51o55m96R21r23J33K02j193J142j23K38L5o76O91p79
5087d87J81m09K55K90L03kJ68j728J79Q10L93J70k11L50l16m61k34J349p0n22
5107HO5m11O7O27q18K109p68j731J550q22r14Q52R40j250N93Q4p12N48M84M23
5127I24m76l10k41k29J008j357J587j572R51r83J244j118N10J34K02k46m56R76
5145E48K57J26j479J77J407j309J45R41k29m40j324O95R26n68N87J14J14q08j110
5164a230J646q56N05l13O6n64N66J49R92nj656K16n07J068r60J147o43q3N29n57
5184d90J014r77q1P12P85j759M48m60Q23n10j37J456k70j094J315j245Q51j698
5202a317Q39k3J6Q25L9o49k16O71j376K90N71K90k25K043k013n06J319k11q82
$$ plain form
5067 231 833 278 -392 -404 1247 996 341 -155 766 -157 -24 178 -1015 127 4 242 277 -399 292 -487
5087 -487 -306 -715 -460 -170 133 131 299 -1429 -1250 -440 -47 123 -88 262 -54 -515 -749 600 530 8
5107 8 73 -338 -271 356 -462 1647 879 -852 698 -124 -1038 -186 754 -496 97 181 -531 17 501 924
5127 924 448 138 -103 -332 676 -681 906 -666 285 -698 546 -572 -62 72 274 28 -428 548
5145 548 805 931 -548 -371 1036 -273 -128 813 584 144 -1180 -485 441 -127 460 574 688 -120 -1230
5164 -1230 416 -440 65 -248 -182 -746 -180 -31 961 956 -700 -484 -991 77 -883 264 -379 -462 67 -490
5184 -490 524 -453 -534 178 963 -796 -348 -808 15 -495 -632 824 554 -540 775 -470 381 -1317
5202 -1317 -478 -501 -485 340 379 -270 -486 185 -1191 -901 -330 -40 -265 1778 -235 -741 578 367 -515
5221e15M03j05J80j78N45j007Q23L2l84L64L32j23p73L14N29M92j257J4k12J329
5241H03j65m83k22l65J01R26k9q55m34J68J86L34O04o77O63j009K01N38J29k39
5261A75j59l87J011n89N43o99o17O63l68R80m31j328K127j526N46q88Q27k33K81
5280g2J001j599J419j247L93j65L28L22q20M98o03m1P0J257l57n11l42l28m96
5299a293Q76J61K57P9l61J828j948N14j95K80m41J26J76O73j067n10Q22p77N07
5318b93L85m70j177K037j99q27O71l10l14J44R18p30L16k79R88n52p89N46J02
5337A67n50Q17k3J5j633R32L16n6p07J232q53j724J824q1R70j923N31J631j016
5356a31J320j515j30R23o32L5m06J377k16j071P67J38o17rj90Q00M33j130M9m77
$$ plain form
5221 -515 -112 -217 -37 -215 330 -677 146 178 -206 158 490 367 -406 -92 437 929 -328 -314 -526 803
5241 803 638 155 -67 -432 -331 595 566 -289 -723 -555 -369 -35 569 -108 555 -454 -253 285 414 175
5261 175 16 -371 640 51 594 -105 -722 -59 -427 553 122 -1206 921 -605 -59 -947 -120 -353 -72
5280 -72 929 -670 749 -498 -105 -270 58 380 -440 58 -545 -586 -516 741 384 -127 -469 -797 -1293
5299 -1293 -417 -256 1 80 -281 1547 -401 113 -82 198 -243 -117 59 732 -335 -845 -23 -800 -293
5318 -293 92 -378 -1555 482 283 -544 127 -183 -497 -353 565 -165 151 -128 860 308 -481 65 167
5337 167 -383 434 411 426 -1207 -275 41 -15 -722 510 -343 -2067 -243 -324 646 -1277 -746 885 -131
5356 -131 1189 -326 -456 467 -165 -130 -536 841 625 -446 321 459 -158 -167 -357 443 876 -254 -205 -682
5376f82K00O30k32N87J99k29n56l98R67j411Q57J379j247K48o77M55L91k25K7
5395B83q4o63J188j071J68M98m54L50J64r14Q47L97J010j291q37p11O44L23N69
5414D16m25N13k87q57M97n34m39R27J533j241j298P29P21k89J62n71R84M50l75
5433F16q08K34L52K40p82K30n95K63R5j43K83n69J481j669R71o26J809k31k057
5452i06J181J273p30q78j86j61R11j54j031l87L45J220o66K49p84R70J130j391
5470EL65j555R19j059J544m61k14L45n0r2p26J049j343P98O34q3j35J091r75J089
5490A146j627K83P09j223K60n81N35lK7J443j803J009j531J244O63j374Q33l2
5508b2P18o20M5k77k74m44J575j072J659j637j58J440j73j520M19O04j396M95
$$ plain form
5376 -682 -482 148 -84 503 702 473 -83 -481 486 -925 -68 1311 64 312 -365 90 481 256 283
5395 283 199 -464 724 -347 -179 319 -135 215 379 -535 312 709 1719 428 -409 -1120 -476 -153 416
5414 416 -9 504 217 -640 -143 -677 -1116 -189 1344 103 -1195 -466 255 -34 128 -443 541 991 616
5433 616 -192 42 394 634 -148 82 -513 -250 -155 -298 -15 -584 897 -772 199 -427 1382 1151 -906
5452 -906 275 1548 818 -60 -246 -407 504 350 -681 -1068 -723 497 -169 80 -704 266 1396 5
5470 5 370 -1185 -266 -1325 219 -242 -456 -111 -161 -253 -979 70 -1273 -475 159 76 -59 1032 57 1146
5490 1146 -481 -198 511 -712 -452 -1033 -498 -501 -474 969 -834 175 -1356 -112 551 -823 10 -22
5508 -22 696 76 121 -156 -430 -874 701 -371 1288 -349 -507 933 760 -760 -341 263 -1133 -638
5526f38K16R88l37j451K209j345L29J63N36l79j243J783j075r4L34M47k72o56
5544d85M8j45l83O06m11K55P26N69o19j427J072j09K4J9q22J127J96J70K69r79
5564b99j66L22Q46O5j340O94o32J10Q47j139m89J510n77O24p73J036j380K66L23
5583a52M1n16Q57P20%j424R01o43K07M66o42m84M97q19J908L88j470N59n90n10
5603g06Q42r26R81L08n61r03K269p26K76j538O87L20o33L11k44J047r93k31o65
5622a085J349j42N42m10j048J365j743J439J33p99Q3K45qo14J371j353O12m81
5640e44L90M70q05L85j197K86J004N75n36J146j211N02j213O95M92Q3j048Q62
5658C36q43O54M85o20M12p90J391j206q0j27R10o63qM14j95M06j138M18M01K13
$$ plain form
5526 -638 -422 566 229 -1222 987 -358 -29 134 670 291 -952 831 -244 -338 -4 443 171 -485
5544 -485 -437 -582 -965 -359 -770 -515 211 780 161 -1266 -194 -303 -279 -260 -1082 45 241 411 680 -299
5564 -299 -465 -143 703 768 -572 122 -510 -400 447 -692 -1181 329 -248 376 -397 639 -741 -475 -152
5583 -152 -111 -627 230 950 950 -474 427 -216 -9 457 -185 -669 -172 -991 917 1305 -165 394 -196 -706
5603 -706 136 -790 191 499 -62 -965 1304 578 854 -684 3 323 -310 1 -243 804 -189 -420 -1085
5622 -1085 264 122 664 254 -794 571 -1172 267 400 -399 -316 -71 -79 -693 678 -675 -63 -544
5640 -544 -154 316 -489 -104 -1301 -1015 -11 564 28 1174 -37 465 -748 -53 439 522 -526 336
5658 336 -507 147 632 12 424 -366 1025 -181 -261 -388 522 -141 -149 265 70 476 -662 -244 157 370
5678C70n30K34l18j040P56J135M84n31j209P86J4o5rr25J018j342J432j38q39
5697g17M4R9l35P37j45M56J29r2k50N00K91r43j20j25R84j014N86r82K047j971
5717h21M53k18Q87J590j915K42j10P56j057J298j184O58j405J251n42q6J018j406
5735e91N1J39j53M44N58n92j088J694l5k49m35j382J012O05k45K81O25j70k53
5754B16K53L20p72Q12j792L12R57j66J78r6j79J66J95J95j510L8Q00k56K34l88
5774d83k63j04J354j44K12M81m05m39q21R84j225K23R08k7L90k3k053J437M10
5793D12L9j018j98M11k37M0j31Q73o57L41Q58j163Q92j62o94K27K25k14L74j0
5813B08o43N07p32R87Oj200Q32o50r6J96J453j074q9l36J149j027M60l32q4K00
$$ plain form
5678 370 -160 74 -244 -1284 -528 607 1091 560 -649 137 151 86 77 -848 170 -1172 260 122 -717
5697 -717 -673 -574 -909 -172 -317 139 268 176 -74 426 717 -226 -346 -471 513 -501 85 -897 1150 -821
5717 -821 -368 -586 301 1891 -24 218 108 864 -193 1105 -79 579 -826 425 -117 -203 815 -591
5735 -591 -540 -401 -554 -110 448 -144 -1232 462 427 178 -257 -1639 -627 -22 -267 14 639 469 216
5754 216 469 789 17 829 -963 -651 306 140 318 222 43 209 404 599 -911 -873 -73 -329 -95 -483
5774 -483 -746 -850 504 360 572 1053 648 209 -612 372 -853 -630 278 251 641 618 -1435 2 412
5793 412 451 -567 -765 -354 -591 -551 -682 191 -466 -125 733 -430 462 300 -394 -167 58 -156 218 208
5813 208 -435 72 -660 327 333 -867 -35 -685 -781 -585 868 -206 -295 -631 518 -509 -49 -381 -465 -265
5833b65m47k53N63m36P99k34k80L4j38L96J55m85Q43n84pM34n51O79r25m00J942
5854H40o19O48o96j893J542l62M02p43j54J761O07p11m84J9l71Q06j223M53R33
5873G55o73L26M45k42j561J093j86l48J223j051J029j115R09r3p69O1l07Q97q95
5892e02O68k40l47P46j14o37J3P86j137Q45M58q05K90k01K67j045P45O15L05R03
5912A613k150K4P57j6m17Q04J03r15k26N53j395J432J053j308l93O66k49P47M89
5931A172j101J005j605J229o63P5j97N40j920R35qN7R06q48K16l3N33l48o01L02
5951c54k77O51K01N88r38r23J255n59J086o97m41K77O85l92m0q84J601Q2L32j590
5971c37O80o35j21O5P19k85O64k86Q5j127m67J486n82L21k43N95l13J101j515
$$ plain form
5833 -265 -712 -965 -402 -838 -39 -273 -553 -519 -657 -261 -106 -591 252 -332 -339 95 -456 223 -702 -1102 840
5854 840 221 869 173 -1720 -178 -540 -138 -881 -1035 726 1333 622 138 157 -214 592 -631 -178 755
5873 755 82 408 853 611 -950 143 -43 -391 832 -219 810 -305 604 511 -258 -197 -504 393 -502
5892 -502 166 -74 -421 325 211 -426 -413 373 -764 81 539 -266 24 -177 90 -955 -210 405 710 1613
5912 1613 -537 -513 244 228 -189 615 718 -197 -423 130 -1265 167 1220 -88 -481 185 -64 683 1172
5931 1172 71 1076 -529 700 37 112 -85 455 -1465 -530 -538 -481 425 -423 -207 -240 293 -55 -656 -354
5951 -354 -631 20 221 809 -129 -1052 203 -356 730 33 -408 -131 554 162 122 -762 839 921 1253 -337
5971 -337 343 -292 -413 -348 371 86 750 464 549 -578 -1045 441 -141 180 -63 532 219 1320 -195
5990a95J24o89Q23o34L65N12k71P20p91l96p97J442o9o40M46P0M15j166J111q60
6010d80k03O77l17ko60Q69J391j148n56l38Q49K52n32O6m96m66J030p1l53L94
6030i4M27O75q47j225K104j002J97p69P58j42k44R22q97J53l75J772o19p55m73
6049d34J650j253J425m09r77J47o63p0j21J281k42o13J285j125o79J812j594J350
6067G70j408J196j435J020j041J536j094O89l56r90R56p45N96m93L62J009r85
6084d13O88r52j7l95J435L65j488J279j51R65r82p97N89M91k76M48r15L3M07R73
6104A287j765L07J129k002Q37m90J082o08K86k81P70J87K04o10j66o68L26J039
6122H64o75N90r21J462j571P86p29R02j738L18P24j4k80M59Q53m12o79J94O1j43
$$ plain form
5990 -195 -71 -760 63 -571 -206 306 35 755 -36 -432 -1229 213 144 -496 -50 20 435 -731 380 -480
6010 -480 -683 -6 -323 -325 -985 -116 1275 127 -429 -767 82 334 -198 -132 -628 -1094 -64 -135 -488 -94
6030 -94 333 1008 161 -1064 1040 38 235 -534 224 82 -162 760 -137 16 -359 1413 794 39 -434
6049 -434 1216 -37 1388 979 2 149 -514 -584 -705 576 334 -279 1006 -119 -798 1014 -580 770
6067 770 -638 558 -877 143 -898 638 -456 233 -123 -1113 -157 -902 -306 -799 -437 572 -413
6084 -413 275 -677 -694 -1089 346 711 -777 502 351 1316 334 -463 126 617 341 789 -126 -93 314 1287
6104 1287 -478 -171 958 -1044 -207 -697 385 -223 63 -218 552 739 943 333 167 -501 -175 864
6122 864 189 779 -142 1320 -251 535 -194 708 -1030 -712 12 -2 -282 177 1030 618 -61 133 194 51
6142E1j066R85K08J12o50M53n96m3k82J58N64j35N16k84l68J017o39l27P75n16
6162f7r33L84M90M14K50n06J64j107J217j289M94k65k4J109L6j70j488R3K080
6181H82j657K049p31q60R50r27m40J314n04j82l13o18J746m12q4kO98m33o87Q96
6201F85M3j611R02O37o25M23j104R54r43M18k02J139m29M61o8j192P1q47J726
6220D38J65m08K28q57L54J360j395J36J47Kp16R01o09P7L98K75p87J056n15m20
6240a70r3n16J193n30M52J17j658J702j21m00m7j314R21J171j147L92M25N19j785
6259h89J037l04N8n6J73J53k94J044k61m25j22l11Q30j973J530l66P3L59p59J136
6279F33j18n06P06N02p18l24n8r36Q89r30L16R79j332N36N5P90m66N0k76O09q92
$$ plain form
6142 51 -1015 -30 178 290 -360 93 -503 -546 -828 -670 -106 -241 275 -9 -377 640 1 -326 449 -67
6162 -67 -1000 -616 -126 288 538 32 196 -911 306 -983 -489 -754 -778 331 367 197 -1291 -1198 882
6181 882 -775 1274 543 -317 633 -294 -734 580 76 -106 -419 -1037 709 297 213 211 909 476 -211 685
6201 685 728 -883 19 656 31 454 -650 304 -639 -221 -423 716 287 748 680 -512 -441 -1288 438
6220 438 603 195 423 -434 -80 1280 -115 21 168 170 -546 355 -254 -177 221 496 -291 765 250 -170
6240 -170 -263 -779 414 -116 336 453 -1205 497 376 -24 -71 -1385 -464 707 -440 -48 377 896 -889
6259 -889 148 -156 -98 -154 19 172 -122 922 661 236 114 -197 633 -1340 190 -176 -103 256 -503 633
6279 633 515 9 715 1217 499 175 117 -819 70 -860 -544 435 -897 -361 -306 484 18 68 -208 401 -491
6300d91R43M68r01J267j636O41j083N53J57l17L88k41J98r38J465k64j001N28
6318b64L1R62p51k19L71k5J19j13J72L01m00K27M17p35J76n21j79k94o34Q93j175
6339a641R35O86M31M11o82k2j118J452k20k88k28P32k29p13J024j35l73L80j190
6358g88Q49p95P76K27j123J152l5R4p45L93r55R16K11L69k3j53m22k78N88J79
6378D37J094j283m30O00p46J43Q30M6l76N81j356O22K02L63o22j02j199P28M17
6397e1O8p6J234j174Q7r02J905j105q97M57N84q05Q03O16j570k5J330k35o30K92
6417i4J84M60q00l89Q31n74J045p72l8k35K07n24J3Q73q17k98K293j533q7K4L64
6438A33N5j076J131nj62O3o62J399j062O04k63j162J439p75Q66m11J146j630J98
$$ plain form
6300 -491 452 920 19 1286 -350 291 -792 -239 -82 -399 -11 -252 -54 -992 473 209 -792 -264
6318 -264 -233 729 -22 -241 130 105 224 111 283 584 184 411 828 93 269 -252 -431 -725 -1359 -466 -1641
6339 -1641 -706 -20 411 822 140 118 -1000 452 232 -56 -284 448 219 -494 530 395 22 402 -788
6358 -788 61 -734 42 269 -854 298 263 357 -388 5 -950 -34 177 546 523 370 -52 -330 258 437
6378 437 1531 248 -182 418 -328 -185 645 691 315 896 -460 162 364 727 105 3 -1196 -468 -51
6397 -51 17 -59 1175 1 88 -814 1091 -14 -911 -454 130 -675 128 744 -826 -851 479 244 -386 -94
6417 -94 90 550 -250 -639 192 -382 663 -109 -147 -382 -175 -699 -686 187 -630 -928 1365 -168 -255 -231 133
6438 133 188 -888 243 238 76 139 -523 876 -186 418 155 -1007 432 -343 523 112 1258 -372 -174
6457a74J84J3Q18n72P59L74k089J649j568J251j297K73K88p56J021n82Q72O7k69
6476B62n40P61m78j35n13J22R94l50Q12r68J255j550K7n07O30J302o90k049J307
6495c08k36K67k30J549k84r69K94P22q48P94K10j533J200o03k85o8K52k86l55
6514g17O80n90P21n43Q32p31j351K022p14J88o4l3J59j89j66J303j124R94p98
6533a21J44Q86o44m95K97%k47j439J455P46j490J508o11O87j094j82M30n30J52
6552e48J043k01k91Q08q73n79R08q47K632k640J466p52q50k38J393o30k80k86
6570g65J285J255j881M99n54L99k42o97J91R10K51J4j95Q91j824M28l05N49N05
6589G14r11Q1K1n13J561j350K06m00N42q77M10J260p04J625k121Q94n48N97L55
$$ plain form
6457 -174 10 23 841 269 1028 1402 -687 962 -606 645 -652 -379 -91 -847 174 -408 464 531 262
6476 262 -278 483 5 -130 -643 -521 473 123 935 -33 1222 -328 -301 -808 -178 1124 434 -1615 -308
6495 -308 -544 -277 -507 1042 758 -211 83 805 -43 751 961 -572 628 25 -260 -328 -76 -362 -717
6514 -717 -37 -627 94 -449 383 -348 -1699 323 -391 -203 -267 -300 -141 -330 -496 807 -317 677 -121
6533 -121 23 909 265 -230 67 67 -180 -1619 -164 582 -908 600 -11 676 -418 -600 -170 -700 -548
6552 -548 495 294 3 811 -62 -641 267 -580 2052 -588 878 126 -724 -962 431 -199 -479 -765
6570 -765 520 1775 -106 393 -161 238 -4 -701 -510 400 651 665 470 1361 -463 -35 -340 209 714
6589 714 -197 -116 -95 -608 953 -397 -191 -591 -49 -926 -516 744 40 1665 -456 438 -110 487 842
6608H42p10o53Q47q80J284l90o79R77o45P42p39j396J201m58P12k36N70J62L54
6627I05j158j371J767p4O52j273l15P45R75j064P49r67K65j06R1k59n11R1Q5P61
6647a2K55j044R21j39K65k8n96n88R23j105J095O14n80q57J135n85J471k197m59
6666a511R56P48j070R43o85P26M09j113O61M58j173R13r86O92P28j546J92M87
6684a71N56k73j12R7L50o04R04j305Q9O35r3o93J181j701J016n73J364o62m78
6703d73N91l10O9P58l01k32o2k73J59N0q08J424m06k95k03K36l98K38N13j457
6723a180R90n1P05j182J211n00O05l94r72m26J819j223J114q97M90j408N33J746
6741I80P8k164J184o32P21J29j108N65J91P76k204J592m06R16m6q22K98j568J597
$$ plain form
6608 842 132 -521 326 -554 730 340 -339 638 -7 735 -4 -1400 -199 -657 55 -181 389 551 905
6627 905 -253 -1624 143 69 721 -552 -867 -122 853 -211 538 -429 -164 -270 -179 -438 -949 -858 -773 -12
6647 -12 243 -801 120 -19 246 218 -378 -966 -43 -1148 -53 561 -19 -876 259 -326 1145 -1052 -1511
6666 -1511 -555 193 -877 66 -619 107 516 -597 64 522 -651 262 -724 -32 696 -850 -658 -171
6684 -171 385 112 0 97 447 -157 747 -558 -469 166 73 -620 561 -1140 -124 -697 667 5 -473
6703 -473 118 -192 -123 635 334 102 40 -233 -74 -24 -832 592 186 -109 -312 -76 -474 -236 277 -1180
6723 -1180 -190 -241 464 -718 493 -7 598 204 -768 -1194 625 -598 516 -381 109 -1299 -766 980
6741 980 1058 -1106 78 -554 167 296 -812 -247 -56 720 -1484 108 -298 618 572 -250 48 -1520 77
6760G7m93P18J36j498Q77j5j35J497r72Q71j513j2J00L35N10j222J63P42o92J150
6780F24l52q06N45QJ002j204O7l20P3R07l29J97q53j44M3Q35m51Q13q88j2J391
6801A146o33j127Q83k75Q26m21j134P58mj03j231J630k56p34L58L04J037l80j903
6820a259N26K12R95K00K99r09J40nr14J060q04r8Q41q50M09p31J316q82n05J279
6840C20m38J2j54L51M44K22j391J83j60J052n20j545P46N63n15L29K0j26q0J297
6860F10l12p3n0M47q62J228j103p13J089K11o45k01k12J135j072R25o4J24j207
6879g45J528j158l96J020J38r56J98K49j70J608j173J028k092J713n81J49o26
6896b66Q66m72K13l70J15j503R39K16R70p56J78j007J245m90m25J407l0j236P47
$$ plain form
6760 77 -416 302 438 -1060 -183 -198 -333 1164 192 1063 -450 -462 -362 -27 483 -739 -576 166 -526 624
6780 624 272 -534 11 19 1021 -183 -116 -436 -363 544 215 412 -441 -585 -542 293 -158 655 -233 -245 1146
6801 1146 513 -614 269 -6 820 399 -735 23 19 -84 -1315 315 59 -675 -317 -13 1024 644 -1259
6820 -1259 -733 -521 474 674 973 64 204 199 -715 345 -459 -557 284 -566 -157 -888 428 -454 -959 320
6840 320 -118 -106 -260 91 535 757 -634 -451 -611 441 -79 -1624 -878 -315 -830 -501 -481 -607 -687 610
6860 610 298 225 175 622 -240 988 -115 -828 261 472 -173 -374 -586 549 -523 402 338 462 -745
6879 -745 783 -375 -771 249 387 -569 -371 -122 -292 1316 143 1171 -921 792 211 360 -266
6896 -266 600 128 341 -29 86 -1417 -478 -262 708 -48 130 -877 368 -122 -547 860 830 -406 341
6915C41K35p49O19l89L16J9j208J284j02k3k46o45J029n82Q7o6nn97Q51N7l36
6936a10q46N52L13L4M20o8l56N60k77J0l36k93P00m29Q27r51l61N98J106j91j030
6957a28j95m67K343j235j028J25L62m80J883J78p73j428P27J242j083p42J927
6974A228j123J96M7O87j165q57L00P4R60o57L31o63O99j33R75o60K6M89j564P73
6994c7O2J229j329J766j790m8j64J714j827k48r6J250M16q56p9Q20J28p74o21
7013d84l05J044j057K49o03J717j45m93p9L52l59O76r36O62K48r60M80L53n81
7032b21j34L57P29j340O06o27J39R86L6r72J035q14M64J22l67m71M69m52P4Q78
7052D97q06j33J210l13k14p80J020j346M77J846j444M99j183J042q01J051k31
$$ plain form
6915 341 576 -173 446 57 373 392 -816 468 366 343 97 -548 481 -101 -14 -80 -85 -682 169 226 -110
6936 -110 -956 -404 -91 -57 363 295 -61 499 222 232 -104 -397 303 -126 701 -250 -611 -13 1093 902 -128
6957 -128 -323 -790 1553 318 -710 -585 -223 -703 1180 1358 585 -843 -116 1126 43 -699 1228
6974 1228 105 301 348 1035 -130 -987 -687 -613 347 -310 21 -642 57 -76 899 239 265 754 -810 -37
6994 -37 25 1254 -75 1691 -99 -147 -311 1403 -424 -672 -768 482 898 42 -37 783 911 137 -484
7013 -484 -789 255 -802 -553 -1156 561 416 -77 -156 196 -163 513 -423 239 487 -473 7 360 -221
7032 -221 -355 2 731 -609 -3 -630 -491 495 531 -441 594 -220 244 366 -1 -472 -3 -455 -381 497
7052 497 -309 -442 768 455 241 -539 481 -865 -388 1458 14 513 -670 372 -429 622 391
7069C91r01J348j001Q68j337O79J042j839J241p06k39L14N83j71M61m79p31N3
7087d24J237j484q9J515q07p24O63L32k62P18j82l91p83j11J452j99j76j66K97
7106D16k91j87K05p05J380k46j204J330k49j257O26r79K270j418R15q34N88J170
7124A530j857L66J40L27n87o29J736j545O13Q37j593P34m57J694o03o27N6P27
7142H62p00j72m73o30N67J279j192N83q34R68K30k158J169k1p2P30q03J292j347
7161g22J228j030P53r13k31l1N50P30R21p28j181M47N51m02M98J106j764l58l29
7180i05J101m49p7M82l14n92R01m62J063j076L12n44j92J227j002J010r07L24
7198a00Q1L92j05m07Q79q32N57j069N17q39Q29L64nm38m3N44k12R02j40m35J95
$$ plain form
7069 391 -510 838 -163 705 -632 47 1089 -750 491 -215 -454 -140 443 272 733 254 -477 -424
7087 -424 813 -671 -760 755 -52 -776 -113 219 -43 675 493 102 -681 -792 660 461 285 119 416
7106 416 125 -62 143 -562 818 572 -632 698 449 -808 -182 -1161 1109 -309 606 -228 360 1530
7124 1530 -327 39 179 506 -81 -710 1026 -519 94 931 -662 72 -385 1309 706 79 135 862
7142 862 162 -10 -483 -1113 -546 733 -459 124 -710 258 488 -1670 -501 -522 -594 136 -667 625 -722
7161 -722 506 -524 229 -684 -915 -946 -396 334 1255 527 -654 -207 344 -58 440 1546 -218 -576 -905
7180 -905 196 -253 -330 152 -162 -754 147 -315 748 -328 -16 -560 -752 475 -527 483 -424 -100
7198 -100 -19 373 268 -139 740 -92 465 -604 -87 -926 -97 267 262 -176 -219 325 113 1015 875 440 635
7219F35q00p26J234O75o01O37k228Q38K02q9n89N52M18j105P51L65j281R13J86
7238a3L41l12q63J012o66N36k85p99J578j568J437m65n03J122o94k17l11J935
7256A265j652L04l15R41j817P20M72l32J922j596M34k13J41K73q73j42O92K51
7274D75k38n0k7l44J149j553J054n58N4L45N34j640J183r88L42m63R0J789p10
7293D44q07L79N43r44J74R57p38J2j492P24J529n61m68k02m95P29l21J218l60
7312C21K75j0n72j034N91J29O87r63O61k0L98j199L46R85j147J08N48k13J29L87
7332D07J45K92l86m94m08m54J290L3M12r69P15j491K02L61N45j95J35o23R89o25
7352a19m23K85J097r20j413O80J093l26p87O45M83l57O16j67m48k83L87j261J004
$$ plain form
7219 635 -165 -891 343 1018 417 1054 -1174 -336 -134 -223 -812 -260 158 -947 -196 169 -1112 -199 -13
7238 -13 328 16 -847 165 -501 35 -250 -1049 529 -1039 398 -67 -570 552 -142 -359 -670 1265
7256 1265 -387 -83 -398 543 -1274 -554 -82 -414 1508 -88 346 133 274 547 -326 -468 224 475
7274 475 237 187 160 -184 965 -588 466 -92 -38 307 841 -799 384 -604 -262 -725 -635 1154 444
7293 444 -363 16 559 -385 -211 746 8 20 -1472 -748 781 220 -248 -450 -945 -216 -537 681 321
7312 321 596 586 14 -1020 -429 -300 387 -576 85 65 463 -736 -390 595 -552 -444 104 -109 20 407
7332 407 552 844 458 -36 -444 -898 392 425 837 -132 583 -908 -706 -345 200 5 140 -483 506 -119
7352 -119 -542 -257 840 -80 -1493 -813 280 -46 -833 -188 295 -62 554 387 -61 -344 43 -1218 -214
7371b14n48L71R04j199J494j067K01k12M90J84q24j32J7J23l46J375M67p96M98
7390G86q11M65M34j291P63j68q8R58j097P56j388O33m72J461p82r3m23j54J85
7409c26j474J326J87k87m41J161j567J483Q18o27j501J190J122p09n24Q41j011
7426c39J069j157R26m57j112O10M63j43J38l17P09M01k048J475L5o47Q59q80K05
7445b10p65O66M66M4l65o49J121L8n93L36l90P53j960J414j57L45j19R80o29j046
7465g20r3R10o32J453j861L89R18m48N54j318O5Q27m86R83O76j093M26J14j97
7484D67j032R06j36p03L59L33o39n0N37p30M02l04p44J582J55r82R11m36m05J151
7504F42j124M85L64J57j247M29K48K05k25o85Q68Q34j152p87K103p86r09L58l37
$$ plain form
7371 -214 -762 -391 513 -686 808 -259 -58 -270 220 404 -420 -552 -535 -412 -758 617 1084 288 786
7390 786 -25 440 874 -417 346 178 90 1048 -49 707 -681 -48 -520 941 159 66 -357 -511 -326
7409 -326 -1800 -474 -287 -574 -1015 146 -1421 62 880 253 -1248 -58 1064 355 -169 672 -339
7426 -339 730 -427 499 42 -1070 -460 3 -140 -2 -319 390 791 -1257 218 253 -394 465 -415 -210
7445 -210 -975 -309 157 201 -164 -813 308 346 -247 89 -301 452 -1508 -94 -251 94 -25 955 326 -720
7465 -720 -813 97 -535 918 -943 -554 364 -84 470 -848 -783 44 -442 541 1217 124 550 664 467
7484 467 -565 341 205 -498 -139 194 -445 -495 42 -688 -286 -590 -1334 248 403 -579 332 -104 -509 642
7504 642 -482 3 367 524 -723 -294 -46 159 -66 -751 117 951 -201 -988 1115 329 -580 -222 -559
7523e59J061o36Q0M43R5K24n76m7k63k3O7J270j318r09Q60P56m26K8n99k67Q62
7544A23o53J35p93J453q68j56Q56K59n75R7m7n88L85P9J132j350M41m08J712j213
7564B1j584J934p01O40p75Q48O57l59j073N21j175J546P9l90J56J228j800k73
7582e00R5Q75k87m48K74j32Q0l17R28j009J922k886J236J092l14n32o4O8r14J018
7602A85P64j76l11O68j006J95J3k40L28o79j001J267l88k85O97m05N05m22J18
7621a73l47N70J205j988R06q58M78O12p61N00k29n72L33M82n0n60K08j81M52n81
7641e54J546l29j84n20K02n17n01J412l07q7J8j61k66j26o0L12J194K7j924M12
7661d13J79J493j995P90L99K17m81j47N72m33j03M60n77p9Q30j156L17o04J309
$$ plain form
7523 -559 502 -134 -54 389 484 708 132 85 -178 -201 -134 1136 -182 -1091 -231 525 99 127 -472 -739 123
7544 123 -530 -395 -1188 265 -603 -759 97 356 -219 -122 -169 -757 -372 -293 839 -511 -70 -478 1234 21
7564 21 -1563 371 -330 310 -465 383 1040 681 -392 129 -1046 500 579 189 345 1573 -227 -500
7582 -500 -405 470 183 -265 9 -123 -43 -360 568 -441 1481 -1405 -169 923 609 77 13 81 -833 185
7602 185 949 773 462 1130 124 319 332 92 420 -259 -1260 7 -381 -666 31 -374 131 -291 -173
7621 -173 -520 50 1255 -733 173 -685 -207 405 -356 144 -85 -657 -324 158 108 -452 -244 -425 27 -554
7641 -554 992 663 479 -41 161 -356 -857 555 248 161 179 18 -248 -374 -434 -122 1072 1099 -825 -413
7661 -413 -234 1259 -736 54 453 670 189 42 614 181 78 538 -39 -118 712 -444 -127 -731 578
7680E78m47M39m32n70q11J646m48l45M70k76K53K51o92Q59J81j143k10J61N12
7699b4K1J45j58m16j44J302j028J66q0p4P3l65J889r17o57M91o8r87R7J003n00
7720b31j74J064mq79j026J710n30k6N28m93L87p18K14Q00p79M16q15o24P24J334
7740H78j242M12J128j645J036K01K47q21k70n0L15q04P31n49P86K65r93m51J964
7759A138j140l23q33O07q1M63J295j655J370p7r29k29j43J49N5L0O16j064R88
7778B37m31m47N11M29l62j192Q31N03K23j212J426j391J314O04j159P40r27L26
7796B3N4n56o10J101M40J04m96j210J120j55m14J285l65k38m11N02o12q46O57
7815f27J024k32J60q86M27R9j6K79p99M93J19RK91r71O6J010M89o11q62NJ200
$$ plain form
7680 578 131 570 138 -432 -1243 403 -45 -390 80 -196 57 308 -384 475 656 -487 -697 -536 -24
7699 -24 -3 142 -16 -432 -576 726 -302 -136 -216 -290 -217 -582 1307 390 -267 224 156 -831 -734 269 -231
7720 -231 -405 659 655 -224 -1250 460 -70 -96 432 -61 326 -392 -178 622 -157 259 -556 -1180 -456 878
7740 878 -364 48 1176 -469 567 768 1015 194 -76 -126 189 -615 116 -433 353 618 -375 -826 1138
7759 1138 -2 -325 -1158 -551 -632 -169 1126 -529 841 764 -165 -394 -537 -388 -333 -303 313 -751 237
7778 237 -194 -641 -130 299 -63 -1255 -424 79 302 -910 516 -875 439 1043 -116 624 -303 23
7796 23 77 -479 -1089 12 452 556 60 -1150 -30 -185 -599 686 321 83 -328 174 -438 -1284 -627
7815 -627 397 165 325 -561 -134 -35 -51 228 -571 -78 41 50 341 -630 -564 446 935 324 -538 -533 667
7836F67l29Rn98m77R23N79j364n80K159j220j169O88L57Q95Ko83O15k37J11j40
7856B08n01N41J98q35o04M13J228q20L36J07O02j514K371j388o70K82L19o09N66
7875B30N88k247J178K51J94n93K4J28L89q45Q07p3m21K45M7n75O99n81o03J788
7895F30p72L36p3k45O53p28j98M08K11l01m19k77M87m53J398j612J992j311M55
7914A81o64J28k21J302n33j08K81j026M68o76J373o49K95n66J384l24nM08j771
7933g23m74J937p86L04K36j707J375M33m12k04j051J312M02J95k05m35o24J657
7951A230K32j54j007K15l13j51r3R9j576J571L23j082O39K74L11l09n6L20q16
7970c43J542k207L69Q46k41K24l59Mm79j018K794q96m65n7P25j52k83r08O65R05
$$ plain form
7836 667 338 347 -251 -728 195 774 -590 -1170 989 -231 -1400 -712 -355 540 542 -141 474 237 348 208
7856 208 -293 248 446 -389 -993 -580 648 -172 164 271 873 -641 1730 342 -328 -46 273 -336 230
7875 230 818 -1429 -251 0 194 -399 -375 -247 142 -703 104 31 -390 -145 -98 -673 26 -555 -1158 630
7895 630 -142 194 121 -124 529 -199 -397 11 222 -79 -498 -775 -288 -741 657 -955 1037 -274 181
7914 181 -483 -355 -576 726 193 85 366 -660 -192 -868 505 -144 151 -415 969 645 640 1048 -723
7933 -723 -1197 740 -46 258 494 -1213 162 595 183 -21 -1072 240 642 837 632 197 -427 1230
7951 1230 1462 1308 301 516 203 52 -41 58 -1518 53 376 -706 -67 207 518 209 153 473 -343
7970 -343 1199 -1008 -639 207 -34 190 -169 -165 -644 -1662 1132 236 -229 -286 439 287 4 -904 -239 666
7990F66l3j53p95L32m77J589k106Q74P46r61M73k01N1m45k82pQ15K79n9n61J22
8011a33Q17n78K76m53k65J342j160J63K0K0p54J441N0n99m92O71P4k2r98J45N66
8032A31r23J563j189J270j243R4N35K67o74Q87q75Lj7J100m64j111J778l23m25
8051C84m68k63J23J518r82o28Q92p86L84m76l70J071L7P50n81Rj07j635N71K65
8071b92M40m92N47o95Q01m63n77P47n61R11k08n16n9Q50m37j023O32R28K50r14
8091a31j60l1J463l41q85l17L11j97o78k54J742j330M40K29o46J254j162M28o47
8110i12R56k03l83L97q82J254j78l92J224r68J08J8L45j068N06K56m58k7P38k75
8130E6k26l31L21J451r87l49J71O8p96J097q06O05N27k179J037L83o3n46M18J526
$$ plain form
7990 666 633 480 -315 17 -460 1129 -977 -103 643 -318 155 -46 5 -440 -722 -729 86 365 306 -255 -133
8011 -133 684 106 382 -71 -336 1006 -154 9 29 49 -705 736 786 187 -305 366 440 418 -580 -435 131
8032 131 -792 771 -418 852 -391 -297 238 505 -169 718 -157 -154 -171 929 465 -646 1132 809 384
8051 384 -84 -347 -224 1294 312 -316 576 -210 174 -302 -672 399 436 1186 605 614 507 -1128 -557 -292
8071 -292 148 -344 203 -492 309 -154 -731 16 -545 366 158 -358 -417 433 -4 -1027 -395 533 783 -131
8091 -131 -291 -322 1141 800 -85 -402 -91 -288 -966 -1220 522 -808 -368 -139 -785 469 -693 -265 -912
8110 -912 44 -159 -542 -145 -1027 227 49 -343 881 -87 21 39 384 -684 -178 78 -380 -407 331 56
8130 56 -170 -501 -180 1271 284 -65 106 174 -622 475 -331 274 801 -1378 -341 42 -21 -567 -149 1377
8150A377k637J394q95J61J539p85l45O9j031J708q25j99J327j35m36N06j031l16
8168e54N15M56l69J004j100R91L28j926K291j996J246j143k17l93O60M21p31L69
8186a48M3q6N12m61o78
$$ plain form
8150 1377 -1260 134 -761 -600 939 154 -191 -122 -1153 555 -270 -469 858 723 287 793 -238 -554
8168 -554 -39 417 48 1052 -48 943 1271 -655 1636 -360 886 -257 -474 -867 -207 214 -517 -148
8186 -148 -105 -191 321 -140 -818
8191h18
$$ Imaginary data points
##PAGE= N=2
##DATA TABLE= (X++(I..I)), XYDATA
0@%%%%%%j08K16k16K16k16L12m20M34n42P56q65R81j208J417j696K017k275K631
24A434l058L452l965M532n084N773o518P286q200R173j0216J1411j2668J4058
38G410j5643J7307j9166K1258k3494K6030k8873L1975l5557L9637m4238M9675
50B6321n6071O3691p3137Q5020j00507J21796j52860K02752k96172N30466k183594
61a832295n015397K584890N760704M233724j193264m527869m118003m68527K791131
70a784906M023211K267471r75645l892598l865443o81569L604597N019739K058192
79E773049l109144n619196l079124K390507N576731L662559j433581m839901l828188
88d506288K00125L483704L743412J329935j762072l613832k959912O6982L506337
$$ plain form
0 0 0 0 0 0 0 0 -108 108 -108 108 -108 204 -216 218 -324 432 -433 548 -660 757 -939 1078 -1197 1434
24 1434 -1624 1828 -2137 2395 -2689 3084 -3434 3852 -4348 4825 -5391 6020 -6648 7410
38 7410 -8233 9074 -10092 11166 -12328 13702 -15171 16804 -18753 20884 -23354 26321
50 26321 -29750 33941 -39196 45824 -54683 67113 -85747 117005 -179167 351299 -1832295
61 -1832295 -6847692 -4262802 1497902 5731626 4538362 10493 -4107510 -4576037 -1784906
70 -1784906 2238305 4505776 3530131 -362467 -4227910 -4909479 -1304882 3714857 5773049
79 5773049 2663905 -2955291 -6034415 -3643908 1932823 5595382 4161801 -678100 -4506288
88 -4506288 -4306163 -822459 2920953 4250888 2488816 -1125016 -4084928 -4017946 -511609
97e11609M336323J290240l317509n152915k239350K829907N250435K836987j975017
106C347492m710339l195394P96651L667574L352583O10342k264448l366412k120317
115c882268P42249L356228L551302O21236l319771m596949j588953L125825M975734
124B984633K137159k550964m615152k459990J488848L687280K742358n5424k492910
133H65838l046597j454685J294396L281924K780098j76128l302811l758601q09340
142d325906L089859M327532J591099k649134m401090k090372J927598L886435
150A356021K344919q51516k887462k549426n55591J671100K833664K034216n68975
159B826950l140037l221834k48291L260706L870655Q37240k970615l943015j326281
$$ plain form
97 -511609 3824714 5114954 1797445 -3355470 -5594820 -2764913 2485522 5322509 3347492
106 3347492 -1362847 -4558241 -3761590 -94016 3258567 3868909 1604461 -1761951 -3882268
115 -3882268 -3140019 216209 3767511 4388747 1068976 -3527973 -5116926 -1991101 2984633
124 2984633 5121792 2570828 -2044324 -4504314 -3015466 671814 3414172 3358748 865838
133 865838 -2180759 -3635444 -2341048 940876 3720974 3544846 242035 -3516566 -4325906
142 -4325906 -1236047 3091485 4682584 2033450 -2367640 -4458012 -2530414 1356021
150 1356021 3700940 2849424 -38038 -2587464 -3143055 -1471955 1361709 3395925 2826950
159 2826950 -313087 -3534921 -3783212 -522506 3348149 4185389 1214774 -2728241 -4054522
168d054522K243155L560036J800992j178666k879704k249158p1854K013958K634901
177A819138J350752j094663k937717k492361K64583L114264L312259L75351l038850
186F72756l620707q22289K575801L410557J227381j674109k823450j692568M71452
195b275176K081978K203162P84091j339557k652713j903335O34616K920285K748634
204C201985k1323k959765l231164m70849K707173L273791Q45692k089563k871888
213a615911j199810J092358K177721J645011J56155j431056k206148j383889Q28290
222a937279K707115K291008m06870k929967k753270K6856K724819K824612M21610
231B968634k132934k635123r36705J301072K276030J454756l36565j764711j909784
$$ plain form
168 -4054522 -1811367 1748669 3549661 2370995 -508709 -2757867 -2829721 -815763 1819138
177 1819138 3169890 2075227 -862490 -3354851 -3090268 23996 3336255 3711606 672756
186 672756 -2947951 -3770240 -1194439 2216118 3443499 1769390 -1054060 -2746628 -2275176
195 -2275176 -193198 2009964 2794055 1454498 -1198215 -3101550 -2466934 453351 3201985
204 3201985 3180662 220897 -3010267 -3481116 -773943 2499848 3345540 1255977 -1615911
213 -1615911 -2815721 -1723363 454358 2099369 2255524 824468 -1381680 -2765569 -1937279
222 -1937279 769836 3060844 2653974 -275993 -3029263 -3002407 -277588 2547024 2968634
231 2968634 835700 -1799423 -2736128 -1435056 840974 2295730 1959165 194454 -1715330
240a715330o69511J185494K305825J604414o50284k597481k288253K34718K649892
249E9484K580592R5506k339366k477653m70132J636183K127239R71436o78421
258A504868j697818j557248l19219J301981K099067J178354r45147k452674j803934
267b691770N91432K543070K152621k35861k344095k221033j47781J828076K023838
276A498497N94614j034565j682109j145120J02017J335812J736150P67245j059928
285A112613k203131j401265Q23399K400147J756035n19197k263301j895669J09959
294b080410J853995J876426L69859j255318j729834q64422N36717J470130J346678
303A523821K39792j161272j792593r50307Q93070K132466J452497o71625k220292
$$ plain form
240 -1715330 -2384841 -1199347 1106478 2710892 2060608 -536873 -2825126 -2590408 59484
249 59484 2640076 2735582 396216 -2081437 -2551569 -915386 1211853 2183289 1504868
258 1504868 -192950 -1750198 -2069417 -767436 1331631 2509985 1564838 -887836 -2691770
267 -2691770 -2100338 442732 2595353 2359492 15397 -2205636 -2353417 -525341 1498497
276 1498497 2093111 1058546 -623563 -1768683 -1666666 -330854 1405296 2172541 1112613
285 1112613 -1090518 -2491783 -1668384 731763 2487798 1968601 -294700 -2190369 -2080410
294 -2080410 -226415 1650011 2019870 764552 -965282 -1829704 -1292987 177143 1523821
303 1523821 1763613 602341 -1190252 -2140559 -1247489 884977 2337474 1665849 -554443
312e54443j656181M20664J958811J617750k3022j384876j489308n41901O61779
321i90727J376748J151826J7245j289301j652550n69706J150259J941630R80721
330B116145r15914k002652j260927N99724J845507J396158k12150j473524j390283
339a297916k46020R17101J297716P72895k72121j198070j310598l28211J121599
348e43625J734202P64424j021819j922961j018944Q24319J838296J144415m81672
357A316635j523042j189584L3439J063221J187984M70438n19767j142407r75974
366a279057l5144J082094J427490N03662j024718j726796q09256R20566J774151
375H32992R40402o90488j545182r83160K84534J127131J026626K42725o51055
$$ plain form
312 -554443 -2210624 -1789960 168851 1786601 1763579 378703 -1110605 -1652506 -990727
321 -990727 386021 1537847 1555092 265791 -1386759 -1956465 -806206 1135424 2116145
330 2116145 1200231 -802421 -2063348 -1463624 381883 1778041 1565891 92367 -1297916
339 -1297916 -1543936 -626835 670881 1443776 1171655 -26415 -1337013 -1665224 -543625
348 -543625 1190577 1955001 933182 -989779 -2008723 -1184404 653892 1798307 1316635
357 1316635 -206407 -1395991 -1362552 -299331 888653 1359091 839324 -303083 -1279057
366 -1279057 -1314201 -232107 1195383 1699045 674327 -1052469 -1861725 -941159 832992
375 832992 1773394 1082906 -462276 -1445436 -1160902 -33771 992855 1235580 584525
384E84525j098774p67057K16937J144658J175965J48843j100461j428037m68466
393a591867R50205J525320P22476p23029j471493q82759M28863J240860R40920
402A139496m5677q45625r52223m29023L80427R94554R21566K8308j054924j295813
412a158934l04108J058684J453962M74965r19024j391588o00018O15220J172156
421D01315P31922k04958q71261q57998k41960N39900R53637O63725k01585j005100
431i2363j017777r7879J005846J249075L22591r27567j305242m74603P24211J179888
441E66180N93728l88146r35577p26949l1309O48647Q63778M39594l75164r54690
451b99908p72174J13851R66318J004260J32696q90262j128298l45946P42838J125304
$$ plain form
384 584525 -514249 -1281306 -1064369 80289 1256254 1405097 304636 -1123401 -1591867
393 -1591867 -641662 883658 1606134 883105 -588388 -1471147 -1042284 198576 1139496
402 1139496 1093819 248194 -704029 -1133052 -752625 241929 1163495 1191803 136879 -1158934
412 -1158934 -1463042 -404358 1049604 1524569 605545 -786043 -1386061 -770841 401315
421 401315 1133237 928279 57018 -800980 -1042940 -503040 450597 1114322 912737 -92363
431 -92363 -1110140 -1208019 -202173 1046902 1369493 441926 -863316 -1337919 -613708 566180
441 566180 1159908 771762 -163815 -890764 -922073 -273426 590352 1029946 654782 -299908
451 -299908 -1072082 -958231 8087 1012347 1145043 254781 -873517 -1219463 -476625 648679
461F48679M95906n06430r78199o07820J72341P22954P23396K33928m45762q59487
471d00494o17865K19170R73025Q82052n8266r76164r78470q6968Q25124R48059
481G29203K71607n47320q55575m84731K23129P31191O75006R9199n72591q08283
491e39165l96959L71097Q79610O60959j66446r01956q49713j0616Q50784R15983
501H13578J50872o88225q53749k97918M10718P11246M74450o4452n53884o65560
511e62924k68576M09978Q16186N29746k75505q78791o98775J26607Q39533P86244
521H23723L3991p08305p90615j98318M98393P16839L66132k14672n91151n43186
531f07169r7666M62752P13864L75142l54561q24805n56389K46620Q24857O43855
$$ plain form
461 648679 1144585 638155 -340044 -947864 -775523 -52569 670827 904755 458993 -400494
471 -400494 -1018359 -799189 173836 1055888 997622 21458 -957012 -1043980 -218856 729203
481 729203 1000810 453490 -402085 -886816 -663687 67504 742510 841709 269118 -539165
491 -539165 -936124 -565027 314583 975542 809096 -92860 -942573 -953189 -102405 813578
501 813578 964450 276225 -577524 -875442 -464724 246522 720972 656520 102636 -562924
511 -562924 -831500 -421522 394664 924410 648905 -229886 -928661 -802054 37479 823723
521 823723 857714 149409 -641206 -839524 -341131 375708 741840 527168 -63983 -607169
531 -607169 -704835 -242083 471781 846923 492362 -332443 -888832 -642212 182645 826500
541H26500j02726p07400o69689q8356N15098O65044K88757k91651o21611m66508
551f52542N4169N31979O00258J89629m04997p03985m15797K72696P69776N76846
561H18032j64286p56583o34070N4017O26485N98546R8267l91349n30712l06539
571e88192J15840M80175N20649J24398m41095o71837k99889L74535P29085M22309
581G65978k59080o97695n12778J09763O05204N61782N3593m60215n60472k12201
591f06121K65475N12958L73500m0017m45919n23889j68608L74395O32293L29206
601G03273k95356o59638m28803J79459O02999M85691k7439m82375n17487j40366
611e80042L27828N16284K95862j50853m77242m32356l6360M10041N41437K09407
$$ plain form
541 826500 723774 16374 -653315 -741671 -226573 438471 727228 435577 -186034 -652542
551 -652542 -598373 -66394 533864 723493 318496 -385489 -801286 -528590 241186 818032
561 818032 653746 -102837 -736907 -682890 -56405 542141 640408 249059 -281653 -588192
571 -588192 -472352 7823 528472 652870 211775 -460062 -759951 -385416 343669 765978
581 765978 506898 -190797 -703575 -593812 11392 573174 626767 166552 -393920 -606121
591 -606121 -340646 172312 545812 505795 59876 -464013 -632621 -258226 374067 703273
601 703273 407917 -251721 -680524 -501065 101934 587625 560186 77811 -439676 -580042
611 -580042 -252214 264070 559932 409079 -68163 -500519 -536879 -126838 414599 624006
621F24006l33993o06955l34914K49332N95196L96526j31565m94546m23103l6496
631d96512L38475M43802K32100j73621m71723l97469L6863M69470M98631Q0303
641E60319m09818n31853j95264K96207N25081L08465j59374m84887l97269K7392
651d61001M06852M31993J07160k76223m24423k53692J09741M08267L99274M3464
661D91412l89284n03131j56446L47763N32412K29228k54832m85719k94622J13006
671c70213L95876L57034N1179k92890m09165k01646J84237M25570L19443o5610
681C93815m05985m05981n3810L53491M55538J59192k74636m55337k38654J64465
691c07902M01249L02562j9766l14243l60934j31753K16811M07509K59276j24624
$$ plain form
621 624006 290013 -316942 -651856 -402524 192672 589198 457633 -36913 -460016 -496512
631 -496512 -158037 285765 517865 344244 -127479 -524948 -488085 -18615 480016 560319
641 560319 150501 -381352 -576616 -280409 244672 553137 393763 -91124 -488393 -461001
651 -461001 -54149 377844 485004 208781 -215642 -469334 -359593 48674 447948 491412
661 491412 102128 -401003 -557449 -209686 322726 551954 297122 -188597 -483219 -370213
671 -370213 25663 382697 433876 140986 -268179 -469825 -285588 139982 459425 393815
681 393815 -12170 -418151 -471961 -118470 337068 496260 221624 -233713 -472367 -307902
691 -307902 93347 395909 376143 61900 -299034 -430787 -213976 193533 452809 328185
701C28185m16319l45063K8790L76343L94205P6700k98611m14268j78257K06515
711b41780M03857K54189j01349l46406k96695k6979K48465L29351J69474j33842
721B58285l61488l03933M1078L81601L85183K5173l58603m02008q6540K74272
731a46980L68399J64858j44072l23298k54944J1525K76941L20688J00665k12972
741A60810l48179j94435J24155L36890K77169j8675l09287l43867p7740K67871
751a25288L73201J51300j99392l55013k06937R7586K99062K60391K4348k29075
761I0183l07471j37587J58847L33260K23877q4631l19210k81735m17K73976L14377
772B63469Q8943k07619l23829j64628J25920K98247K26278k5885k48564k75721
$$ plain form
701 328185 -88134 -433197 -404407 -28064 366141 442841 144230 -270038 -448295 -241780
711 -241780 162077 416266 314917 -31489 -328184 -355163 -106698 222653 392127 258285
721 258285 -103203 -407136 -366058 15543 400726 425899 67296 -334712 -421252 -146980
731 -146980 221419 386277 242205 -81093 -336037 -324512 -47571 273117 373782 160810
741 160810 -187369 -381804 -257649 79241 356410 337735 28448 -315419 -393159 -125288
751 -125288 247913 399213 199821 -155192 -362129 -264543 34519 294910 319258 90183
761 90183 -217288 -354875 -196028 137232 361109 276478 -42732 -324467 -324884 -50908 263469
772 263469 352412 144793 -179036 -343664 -217744 80503 306781 280896 32332 -243389
782b43389q3040J87330L12829J77602j26440l25987k37588O2632K95751K64338
792B84038J6405k26430k76684j10084J41781K79982J93936n9632k70211k50246
802b77145j3226K27391K70067R4570j53312k74935j78311P0044K72344K48798
812B86285K372k54431k80850n9532K03818K73305J16703j14462k44818j86418
822b58028J5276K14199K48760P0643j83774k80676j29959J36398K71817J72568
832B77224o0037k31279k13033k8299J81438K47667J06023j26558k57401j68715
842b72970O4889K39520K12045Q201k01924k43554q2167J53515K57191J39105r7406
853A76445k43423j79894K9872K01405K05042M9862j44922k23249j22985Q5761
$$ plain form
782 -243389 -326429 -139099 173730 351332 224892 -101095 -338683 -276051 19700 284038
792 284038 300443 74013 -202671 -312755 -170974 109008 302944 243312 -26899 -277145
802 -277145 -290371 -62980 207087 301657 148345 -126590 -304901 -234857 37487 286285
812 286285 288657 34226 -246624 -306156 -102338 170967 287670 173208 -71610 -258028
822 -258028 -242752 -28553 220207 290850 107076 -173600 -303559 -167161 104656 277224
832 277224 217187 -14092 -227125 -255424 -73986 173681 279704 153146 -104255 -272970
842 -272970 -208081 31439 243484 251685 49761 -193793 -275960 -122445 134746 273851 176445
853 176445 -66978 -246872 -217000 -15595 189447 239309 94387 -128862 -251847 -166086
863a66086K25119J78479k2107k03899k13522m5968J61589K37314J11385j13308
873A48996k46171j63328O8026K30528J84790j2749j79174j91528n5747J10724
883a05633J91562J30576l7269j94305j91034j6756J84204K19142N9038j43108
893I6417k17095j07291P9736K00007J60842j4200j82141j98156m2705J53684K10394
904A39492Q3396j03086j92760j25486L3290J63470J69578L8489j36197k02202
914a32016r3046J04527K08820J27939o0168j86237j54261O09J47416J73458O5870
925B02911j04369j88792j14331N6039J83890J52008p825j57981j73874m5275J20183
936g7416J85544R4630p6574j82561j28392K8576J57123J52283K7160j20319j67357
$$ plain form
863 -166086 59033 237512 215405 11506 -202016 -247984 -86395 150919 262304 148996
873 148996 -97175 -260503 -192477 38051 222841 210092 30918 -160610 -216357 -105633
883 -105633 85929 216505 179236 -15069 -206103 -222859 -38655 180487 239525 96417
893 96417 -120678 -227969 -148233 51774 212616 198416 16275 -181881 -224586 -70902 139492
904 139492 222888 119802 -72958 -198444 -165154 -1684 167894 206383 70186 -132016
914 -132016 -225062 -120535 88285 216224 156056 -30181 -184442 -183833 -36417 137041 202911
925 202911 98542 -90250 -204581 -148542 35348 187356 179531 21550 -152324 -197599 -77416
936 -77416 108128 202758 126184 -56377 -184769 -156193 930 153213 180373 60054 -107303
947a07303q1425P6205J74206J23455l3797j62386j48601j0923J27994J61080O5279
958A83784q5192j67741j15955M2410J69682J47726p848j50799j53943l3043J06592
969f4327J50081P7799n1719j41888j24698j285J34770J56703L6702j12652j61252
980a01766o7610P0613J46342J04738j5564j27756j43555l4873J14216J66424O7922
991A79131r1537j62837r0728N3160J38068J10288Q04j06663j31305n1798P6275
1002g7142J43485Q9343m3306j37023j13855K945J14343J33075M1000q6281j44345
1013g7761q0551N5801J44735J08599k2754j29739j22630j5189R9303J29330N5400
1024A44544o4770j31401q6952K8471J18129J08043J2029r2935j22249n5065O2580
$$ plain form
947 -107303 -188728 -112523 61683 185138 151341 -11045 -159646 -170569 -42575 118505 183784
958 183784 98592 -69149 -185104 -142694 26988 174714 166866 16067 -137876 -170919 -64327
969 -64327 85754 163553 111834 -30054 -154752 -156037 -21267 135436 172138 59486 -101766
980 -101766 -169376 -98763 47579 152317 136753 8997 -134558 -169431 -55215 111209 179131
991 179131 87594 -75243 -165971 -112811 25257 135545 136349 29686 -101619 -153417 -77142
1002 -77142 66343 155686 112380 -24643 -138498 -135553 -21210 111865 152865 66584 -77761
1013 -77761 -158312 -102511 42224 150823 128069 -1670 -124300 -139489 -40186 89144 144544
1024 144544 79774 -51627 -138579 -110108 8021 116064 128093 35158 -87091 -142156 -79576
1035g9576J31726R1752l4101j31128j11813N096J13198J20549K6577q0706j17421
1046f5847o6687L9543J17062J01176n914j11348j18715k0191R1136J18068M7968
1057A26251n3500j09221q0267J1716R9943J12583K1178r0196j24870m6193P0602
1068f1974J17879O5895l4455r8608r1319q533Q1514J11187M7451o7635j23019
1079f1617o7558M6132J13944Q2768j4223r3236r5279k4009O7610J04912N6876
1090A16320m0944j08457p7897J5689R3704R1633J7351p3058j01956m6879M7248
1101f7246J04295P3655k0907r8910q9959p054Q2881J00030L4689o0713j01230
1112e0469n9167L4898R8379P4083r115q0257q1159k4040N3521Q9485N5139k6250
$$ plain form
1035 -79576 52150 143902 109801 -21327 -133140 -128044 -14846 105703 132280 51574 -65847
1046 -65847 -132534 -92991 24071 125247 119333 7985 -110730 -130921 -39785 78283 126251
1057 126251 72751 -36470 -116737 -105021 -5078 107505 128683 38487 -86383 -132576 -61974
1068 -61974 55905 121800 87345 -11263 -102582 -111115 -29601 81586 129037 61402 -61617
1079 -61617 -129175 -83043 30901 113669 99446 6210 -89069 -113078 -45468 59444 116320
1090 116320 75376 -33081 -110978 -95289 -1585 90048 107399 34341 -67615 -114494 -67246
1101 -67246 37049 110704 89797 -9113 -99072 -106126 -23245 76785 111474 50761 -50469
1112 -50469 -109636 -74738 23641 97724 88609 8352 -72807 -96847 -43326 46159 101298 75048
1124G5048r2912q1951L364R1852R2900J4445p1726r3575l8714M4599Q9676O4618
1136I7624j4426q7108q6192n943P7491Q9629K4235n4747q2313m4881K0913P0340
1148D622P0441J3676o2566r2082l8321N5591R9840N1060m0134q8663o0015J1079
1160g5472P0766P5115J8726n4514q6544m3505M0158Q7977N5481j8031p5781o5891
1172g1515p176N3961P5660L5994l4945q0941n7614J7204P7453P1107L773o6466
1184A6495p6013k6610M8422P9139M5118k7639p5816o0182N812O3440O9300J8666
1196H0132m7287p4660m1617K8506P6656N8159j2363o9650o4723p256N3156O7502
1208D6555K8865k9910o8029n3088R206O8268O8094M806n8772p1509k1381M2280
$$ plain form
1124 75048 -17864 -99815 -96451 -4599 88301 102746 31020 -62555 -101269 -56670 33006 97624
1136 97624 83198 -3910 -90102 -96045 -18554 71075 95310 40563 -41750 -86631 -65718 4622
1148 4622 75063 88739 26173 -65909 -104230 -48639 51201 102261 62127 -26536 -86551 -75472
1160 -75472 -4706 70409 89135 34621 -51923 -95428 -55270 32707 88188 70157 -5624 -71515
1172 -71515 -78691 -24730 50930 86924 51979 -28962 -86576 -69372 8081 79188 82961 16495
1184 16495 -59518 -86128 -37706 41433 86551 58912 -16904 -77086 -71274 -7834 61466 80132
1196 80132 32845 -41815 -83432 -54926 21730 79889 67526 -2124 -66847 -74103 -20947 46555
1208 46555 75420 45510 -22519 -75607 -66401 1867 69961 74767 15995 -55514 -76895 -34615
1220c4615O6074L9185j5151o1195o2195m519N9337P4250J8447n2146p2632k8003
1232g3163L3190O1238M0184n484m7813n6979k1151L8913O9856L7314l0132o9710
1244b3737m7033J3170O2085N3018Q126m5980o3988k7276L2726O8686M2545k2200
1256E0142o4271m8614N142M9650N3306J4914l1457n5624l5461J4129N6178N0001
1268E8035R34m9342n8879j7767L9324O2119L3735k7029o2069m3987J2966N6137
1280D177M9389L106m2408n1662k1887K5411N4854L9032j2064n1768m9546j810
1292e5176M3894N2121J6517k8685m9662l5447Q616N1705N2301K515m9175n8612
1304d9088j2898M2514N6068J9990k4154m6964l3598J992M0199M8897J4241l5296
$$ plain form
1220 -34615 31459 70644 55493 -5702 -67897 -72416 -13079 61171 79618 27472 -45160 -73163
1232 -73163 -39973 21265 61449 55965 8152 -48827 -69978 -31065 38791 76105 45973 -23737
1244 -23737 -70770 -57600 4485 57503 65629 19649 -44339 -71615 -38889 29797 72342 50142
1256 50142 -14129 -62743 -57601 -7951 45355 60269 28812 -26812 -62273 -48144 8034 58035
1268 58035 58969 9627 -49252 -67019 -27695 34424 68159 41130 -20939 -64926 -51960 4177
1280 4177 53566 56672 14264 -37398 -59285 -33874 20980 60012 47948 -3820 -53366 -55176
1292 -55176 -11282 40839 57356 28671 -20991 -56438 -47822 3883 56184 58699 9524 -49088
1304 -49088 -61986 -19472 36596 56586 32432 -14532 -48130 -46138 -5939 42958 57199 21903
1316B1903n7182k3359K7232N1952L2062j2124m1613m1110p292L0786N2108K3174
1328E6537k4264n5675l3688J6526N1573L7015l084l7943m3813j3573K5707M7196
1340B2514K9991j3677m9772l7991K987M2646M4328Q266l3708m3783k1183J8627
1352c0755M5514L1722n427m0041l8562q646L0917M3492K0890j7266m7118l3562
1364d8842J0379M3475L8822J445l6602m2143j3155K5754M3344K3561j2027m2070
1376h059l5930L528L7102L8140P812k8985l6126j7347J1343L3530L2523M305l3925
1389G911m5002j4274L4514M8523J6451k5704m3539k1049J1691L3671L1144L941
1401C8278k6750l9208j6397K2444M0932K2731j4664l2828k7728j070K4605L4759
$$ plain form
1316 21903 -35279 -58638 -31406 20546 52608 40484 -1129 -42239 -49531 -18745 33363 56537
1328 56537 32273 -23402 -57090 -40564 11009 48024 44940 6997 -36816 -50389 -24682 22514
1340 22514 52505 38828 -10944 -48935 -45948 -3302 41026 49292 15584 -28199 -49382 -30755
1352 -30755 14759 46481 41054 1013 -37549 -46195 -15278 28214 49104 31838 -15280 -48842
1364 -48842 -38463 5012 43834 45279 8677 -33466 -46621 -20867 22477 46038 34011 -8059
1376 -8059 -43989 -40461 -3359 34781 42593 13608 -22518 -39865 -28522 5008 37531 41836 7911
1389 7911 -37091 -51365 -16851 31672 48123 22419 -21120 -42169 -30478 3193 34337 38278
1401 38278 11528 -27680 -44077 -21633 19299 42030 27366 -5462 -33190 -34260 -9655 25104
1413B5104J6116j7466m0729k8109J4295M1829L2391q270l5786l2562l026K5595
1425a0618L4511J4404j6090l3752k4820M472L2689L0986L968k5702l2301j5641
1437c7894J6834L4332K3645o542l3075k9798k039K5939L3525J2084j9053l4561
1449a6603k1713J1150L4495K7856l480l0145l0583l483K1420K8567J4897r534
1461B2844k8730k6269M11K9300L1883O191k7527l1484r039J6795K8186J7058l826
1474B5793k2989k9158p949K2185L5729J3453k0076l3927j6551J3465K6368K2135
1486B8478j819k0484k7896j0579J6405L2116J8608j4216l0539k0890O981K5124
1498A289K0589N223j5609k6387j4862Q326K8564K2690k244k7880k6742k885K2652
$$ plain form
1413 25104 41220 23754 -16975 -45084 -30789 11040 43431 35161 -625 -33187 -36213 -10618
1425 -10618 23893 38297 22207 -11545 -36365 -31893 796 31782 35750 10048 -22253 -37894
1437 -37894 -21060 13272 36917 30375 -2700 -32498 -34537 -8598 24927 37011 17958 -16603
1449 -16603 -38316 -27166 7329 35185 31705 1560 -29023 -32506 -11086 17481 32378 22844
1461 22844 -5886 -32155 -31744 -2444 29439 35630 8103 -23381 -32420 -15625 12561 29619 25793
1474 25793 2804 -26354 -34303 -12118 23611 37064 16988 -16939 -33490 -20025 6343 28478
1486 28478 26659 6175 -21721 -32300 -15895 16221 34829 20613 -9926 -30816 -23835 1289
1498 1289 21878 27101 11492 -14895 -29757 -21431 7133 29823 27579 -301 -27043 -29928 -7276
1511g276K8786Q281j4855k8448j6411Q458K5990K1294p54k1823k3116p174J5260
1524a1788K3617J5075p185k3490j9343k329K0886K4305R142j6639k5788j6926
1536c0463J0775K7209K1097l084k8145k3320J057K1725K1688M627j1850j8674
1548g358j3494K179J6932K2085N814j8084k6274r230J5442K5043J0969o170k0981
1561c127j8433j603J6497K5463R161j7026k7075j1571J3327K3776J3276o101j7535
1574i71j4709m503J1154K0039J3452q056k3375j7021L887K1546J8590J16j5952
1587D197j8220p182R431J9357J5419n787j9822j8227o84J8379K0141M770j1839
1600I933k1027r802O371J9518J5102j472j8337j6579m089J2026K0237R735p382
$$ plain form
1511 -7276 21510 29791 14936 -13512 -29923 -21465 4525 25819 25065 3242 -19874 -27048 -11788
1524 -11788 11829 26904 19719 -3771 -23114 -25443 -4557 19748 28890 12251 -13537 -30463
1536 -30463 -19688 7521 28618 25534 -2611 -25931 -24874 -3149 18539 23166 11316 -7358
1548 -7358 -20852 -18673 -1741 20344 26158 8074 -18200 -27430 -11988 13055 24024 17854 -3127
1561 -3127 -21560 -23163 -6666 18797 27958 10932 -16143 -27714 -14387 9389 22665 16564 -971
1574 -971 -15680 -20183 -9029 11010 24462 16406 -6969 -23990 -20103 1443 20033 20149 4197
1587 4197 -14023 -21205 -11774 7583 23002 17215 -2607 -20834 -21518 -3139 17002 21772 9933
1600 9933 -11094 -20896 -14525 4993 20095 18623 286 -16293 -20382 -8356 11881 21616 14234
1613A4234k1171j2866K581J8490J5874J322j3976j7100o258O237J8174J4449k045
1626A7945j8856j9126j533J8500K0888J829j3868j5415q607O759J2488J4364K035
1639A7403j3453j7818o780J2590J8962P738p161j6183j0560q50J4349J4390Q196
1652B0823j1622k0966j0663J1136K0823J1912q082j7509j2095K490J2362J1840
1664A0449N655p444j4340j1898M714J3968J5399k026j1916j3743m739Q108J6580
1677H767Q730m645j6686j3992J427J6368J3793M350j4607j4641m804P872J5036
1690F968Q304m370j2384j0077j790R109J1692O957n033j3884j1937K175J4927
1703F57J4351p76j0873j4674m037R436J2733Q742n233j2382j1358l39J2130J5029
$$ plain form
1613 14234 -6937 -19803 -17222 1268 17142 18464 4488 -12612 -18870 -12633 5541 19990 17945
1626 17945 -911 -20037 -21570 -3070 17818 19647 5779 -9636 -18243 -11484 1004 15368 17403
1639 17403 3950 -13868 -20648 -8058 10904 18642 11481 -4702 -15262 -16112 -1763 12627 20823
1652 20823 9201 -11765 -22428 -11292 9531 21443 13361 -4148 -16243 -13753 -1391 10449
1664 10449 16104 8660 -5680 -17578 -12864 1104 16503 14477 2561 -11182 -15921 -7813 8767
1677 8767 17497 12852 -3834 -17826 -16399 -31 13762 18112 3505 -11136 -15940 -8068 6968
1690 6968 15272 10902 -1482 -11559 -13349 -4240 7452 14409 9376 -4508 -16445 -14270 657
1703 657 15008 14232 3359 -11315 -15352 -5916 6817 15559 10326 -2056 -13414 -13753 -1623 13406
1717A3406K238j2223j2856m552O546J1533O912L66r923j1145n849R565J5306O788
1731A6112p334j5791p147N715J0566R296P52q270j0910o821N255J4347R689m443
1745A1016j4345j1026L351J1703Q335K901p238j0385o908L559J1266J0372r17
1758A1684j1382j1044m32P299J0827N964m481j1175r303J183J1002J0933K052
1771A3127r573j2568l884O734J2366P392m921j2460q475K808P937Q826K329n068
1785D570j0255n033J783R666R846R19j0247j1034k921Q990J0996M217n425q936
1799b864q134M58R949J0758J934r663j1494j786P128R406L629l509o288o305k563
1814i344M371J0288O195l420j3077o780L610J1022Q866l532q247p355k363O235
$$ plain form
1717 13406 15644 3421 -9435 -13987 -7441 4092 11004 11370 1447 -9698 -15547 -5982 9324 16112
1731 16112 8778 -7013 -14160 -8445 2121 11417 12169 3899 -7011 -13832 -8577 5770 15459 11016
1745 11016 -3329 -14355 -11004 699 9034 11935 4697 -5688 -12596 -9037 2229 12601 11684
1758 11684 302 -10742 -11174 -3875 6952 12916 8435 -2740 -12043 -10860 142 11075 13127
1771 13127 3554 -9014 -12898 -6164 6202 13594 8673 -3787 -12262 -9454 -1517 7309 9638 4570
1785 4570 -5685 -10718 -8935 731 10577 11496 1249 -9785 -12706 -3716 7280 11497 6072 -2864
1799 -2864 -10998 -10540 -591 10167 12101 2438 -9056 -10842 -3714 5692 9321 5812 -476 -6781 -9344
1814 -9344 -4973 5315 11510 8090 -4987 -11767 -8157 2865 11731 8199 -48 -7403 -9766 -3531
1828c531Q853N962m364r182q737L196R838O097q1o370o427m419L487P615O648
1843H585lp963r150j596P388J0277K721n112r134o548L574P930O796N92o929q546
1859g118k378N090Q568O058l635p940q548J163Q337O445K116p175o413k599K390
1874e639Q052N867J98o508r608j419P072Q126K941m798r000k641J279O036O605
1889F563J643m692r610l473N903R606L347m437p375l147M88M021O060K346k773
1904D470p899m888K051Q064O708o91q137p068j93N790O264L452l385o163n551
1919g176K27R102O098j167q100m954n18M820M627J978M46n462m929k617N664P563
1935E602J813l882o631n770L764O214O645q86o601n933m89M618O605J627l139
$$ plain form
1828 -3531 5322 11284 6920 -2262 -10999 -7803 2035 8132 8051 1681 -4746 -9165 -5678 1937 8585
1843 8585 8582 619 -8531 -10127 -2739 7538 10259 5147 -3987 -10535 -6961 969 7765 8357 1428 -7118
1859 -7118 -9496 -4406 4162 10220 6585 -1355 -9903 -8740 -403 6042 8158 983 -5430 -8029 -5639
1874 -5639 2413 8280 8478 1970 -7638 -9057 -1985 6141 9082 4284 -4716 -7357 -6078 -42 6563
1889 6563 8206 3514 -6096 -9569 -3666 5940 9287 4850 -2525 -5672 -5184 -1163 4897 7243 4470
1904 4470 -3429 -8317 -6266 1798 8506 7815 -322 -7390 -7583 -1793 4471 7923 4538 -1625 -7176
1919 -7176 -6949 2153 8251 7084 -1016 -5970 -6488 -1668 2959 4937 5383 -79 -5008 -7625 -1961 5602
1935 5602 7415 3533 -3098 -8868 -5104 1110 7755 6869 268 -5665 -6154 -1536 5069 6696 3557
1950C557m863m820J265N043N323n18m429n934K85K598M802L324l04m849n628k390
1966g538N226Q106K675n125q745j602M495N620J469l20m188l466l048M052N292
1981B903M253l350o673l411K895L868L402J59o85o134k302p60O994M993k7o794
1997f69n330J640M461M140P04k486n076k959K81O939K832J313n418n302j6K892
2013b054N686J746k354m691l297J122L397N038j31k796l283l603J854M429M234
2028E297M18n729m686j074M936M279J230k734m759j333o4N115K658J138n211l762
2044d281p94M581K886R58o33l316k136j587K371N227L302l971n983l774L652O418
2060B920K322j750m806j504n06J646L441L555k316m962k325O65M006K187R75j886
$$ plain form
1950 3557 -1306 -6126 -4861 182 5505 4987 558 -5376 -5091 -2493 2309 5633 5329 480 -5148 -7538
1966 -7538 -2312 5794 8469 3344 -5401 -7003 -2508 3112 4581 4261 73 -3393 -6441 -2389 2903
1981 2903 7156 3806 -2867 -6278 -3383 485 3887 4046 3361 -2773 -5075 -5835 1159 6152 6125 -669
1997 -669 -5999 -4359 102 4242 4946 2460 -2616 -5575 -5294 1645 4477 5790 372 -4930 -4946 -2054
2013 -2054 3632 5378 3024 -1667 -4964 -3842 -445 4593 4462 1666 -1617 -5220 -3366 1063 5297
2028 5297 5715 -14 -4700 -5774 -838 3441 4671 1937 -2822 -4155 -4219 896 3554 4692 -519 -4281
2044 -4281 -5075 -494 2392 3350 2717 -599 -2735 -4322 -1951 3276 6578 2607 -3376 -7150 -3498 2920
2060 2920 5242 3492 -1314 -2818 -3324 -1678 1763 5318 3002 -1960 -4285 -3620 386 2573 3548 1662
2076A662l002k060R10K859M358r55m410m438o81O674L074l44k538l801j810L495
2092a007J597K631J247l882k967j020K848J524L335p38n062j538R84K263K291
2107B506J078k147m441n95J716L814J431k44l879l176P8M359K615M21k975k719
2123b158r94L80L081K713k48k331l022j413K797K667J821k119k444j708P89J436
2139g53L200l8r01l218l734K082N260J853j671m343J61J26J414K760q2l58l011
2156a253j968J414J876L591j369k457j667j155K107K012J968l62l580k240J039
2171b044K435K586L66k169l258j148J724K383J392k89k418l008J41K059L517j16
2187B153j246k299k83j59K790J311Nq71j738j693L95J657K217O47k720k287j730
$$ plain form
2076 1662 -1340 -3400 -2490 369 4727 3772 -638 -5076 -5757 917 3991 3647 1109 -2692 -4502 -1007
2092 -1007 590 3221 4468 586 -2381 -3401 -553 971 4306 3568 -1494 -3032 -2048 215 2506
2107 2506 3584 1437 -3004 -3599 -1883 1931 3362 3118 -761 -3937 -3859 500 3115 3536 561 -2158
2123 -2158 -3152 -2772 309 3022 2774 443 -2579 -3992 -1195 1472 3293 1174 -1270 -2978 -2189 -753
2139 -753 2447 2409 1508 -1710 -5444 -3362 1898 3751 2080 -2263 -2102 -1976 -562 2198 2116 1758 -1253
2156 -1253 -3221 -1807 69 3660 2291 -166 -1833 -2988 -881 1131 3099 2737 -843 -3083 -2044
2171 -2044 391 2977 3343 1174 -2084 -3232 -1508 875 2267 1978 -440 -3448 -3307 -1248 2269 2153
2187 2153 907 -1392 -1675 -1834 956 2267 2272 1401 -337 -2030 -1635 22 2239 2886 166 -2121 -3851
2204c851L303L305K19l874j203k44R89J810K410j669j139j431q76M27L221K063
2220C460l23m592r13K77J295L006M01k044l066J9J003K202K209m68l755j814J407
2237a696J627J610J081j705j858j710R51K138K097l76l203k111M55K500J692k67
2253A225P0j775k041J030Q69K718R21j845k345j223J345K523Q8M7k831q1r41L292
2271A046J492j096q50j817j117M85K865O26O3k401j645m02J841J697J324j217
2287H94j622j520P34J029K893j198k091j402K67K263J670N70k227L29k163j41
2303a715N53J476K293o03k586j251N37K569L78m07k224J004j237J43J648P39Q51
2320B168k460j643R43K545J72l15q27m5j351L42Q32J969p56k011q14J021R70J047
$$ plain form
2204 -3851 -548 2757 2976 -898 -2101 -2345 -1356 454 2864 1195 56 -1375 -2251 -1824 1397 3460
2220 3460 3137 -1455 -2368 -2091 -796 2210 2611 567 -2499 -2480 -1477 725 2934 2466 -1289 -3103 -1696
2237 -1696 -69 1541 2622 917 -941 -2651 -1700 438 2535 2159 -1044 -3155 -2700 -200 1492 1225
2253 1225 1295 -480 -2521 -1491 -622 2096 3017 1172 -1173 -2396 -1051 1472 1560 1607 -1224 -1305 -2246 1046
2271 1046 2538 1442 592 -1225 -2342 -1857 1008 1634 1697 -704 -2349 -2751 -910 787 2111 894
2287 894 -728 -2248 -1514 -485 2408 1210 -881 -2283 -2016 247 1917 2487 260 589 -1574 -1715
2303 -1715 -1162 314 2607 2004 -582 -1833 -1296 1273 1651 1244 -980 24 -1213 -1070 578 1317 2168
2320 2168 -292 -1935 -992 1553 1725 1410 583 538 -813 -471 361 2330 1574 -437 -1251 -230 740 1787
2338A787j903J475j257m17k080J948K392l81j601j739L19J885K246K2k691k68
2354b63j699L78J658Q48o97m92P70j652J420K75P41m95j137j014k43J821J041
2371A260R6j063j125q7P17L63L2Q94q48j948N31J281L24J169r12q31p04r19K354
2390E84O67l74r44o96q67J99J999J803k180o70O01o46O39K93M40j73j134n03n08
2409a470J988P77J86j983n8p90J249K76r9K18n67j434J126J411N46j610Q49j206
2427e91m48N49M61J161K07r10k259PJ446J021m0n41o05m27N22J351o88N1N43n70
2447B40M26p7p28J349L72j326j348K06O94J293N13j394j551P31O44o97M97J186
2465A030o10j343m27K92J900N83k89j257q39P63L12O26n84J33q52J09L43n17R09
$$ plain form
2338 1787 -116 1359 102 -315 -2395 -447 1945 1564 -37 -1776 -1457 428 2674 2696 5 -263
2354 -263 -1962 -1584 74 922 225 -267 503 -1149 271 546 1287 792 -345 -1359 -1602 219 1260
2371 1260 1356 293 -832 -919 -202 161 193 1087 239 -1709 -1178 103 427 1596 684 -147 -851 -1770 584
2390 584 1251 877 -67 -763 -1630 -1431 568 2371 191 -479 122 -524 115 408 848 675 -459 -962 -1470
2409 -1470 518 1295 1481 -502 -560 -1350 -101 175 76 294 -273 -1707 -581 830 1376 -234 615 -591
2427 -591 -1039 -490 -29 1132 1339 429 -1830 -1823 -377 644 604 63 -542 -969 -447 904 216 267 810 240
2447 240 666 589 -139 1210 1582 256 -1092 -886 -192 1101 1614 220 -1331 -600 44 -653 -156 1030
2465 1030 420 -923 -1350 -1058 842 1425 1136 -121 -960 -197 115 741 157 290 -562 -453 -110 -627 282
2484B82k43L20j321M84k45L25J245l10n13p03K86R12K46P38k974O07l39J429O41
2503H67p54r76P69N21j092M87L98J902k039n55k76Q40N15L15j983m34m9L78J789
2522F23L02L04k97j044r41J797k2p23L87j98m35M7m83k47J430L45m04j755L11
2541a003Q89O35m09p83k52L43J558j534P05j49K51o74q16J188J132j20R5k355
2559a299L81J034J465m31j595N29m11N14O4k0Q6J46m96m72P55j268J111M41j01
2578D33j680j72P32j20J966j060k3n43J37L25J348j139O54r2n64pJ34j10P57m71
2598E05q48k45N5K946j702q15j027J48J558o45J33m22L79n87O76n87m2J307R7
2617H84n29j684k24J634mq56J134r63j163P44J226M72j651J319m1q88J128K25
$$ plain form
2484 282 39 359 -962 -478 -723 -398 847 537 24 -679 -393 519 765 1503 -1471 -864 -1203 226 867
2503 867 113 -863 -94 427 -665 -178 220 2122 83 -472 -748 92 607 922 -1061 -1495 -1544 -1166 623
2522 623 925 1229 932 -112 -1053 744 722 -1 386 188 -247 -200 -683 -930 500 845 441 -1314 -1003
2541 -1003 -114 521 112 -671 -923 -580 978 -556 149 0 251 -423 -1239 -51 1081 961 1056 -1299
2559 -1299 -918 116 1581 1150 -445 84 -327 187 251 231 317 463 -33 -505 250 -1018 93 534 433
2578 433 -1247 -1419 -687 -807 1159 99 76 -467 -330 -5 1343 204 858 766 202 195 329 219 976 505
2598 505 -343 -588 -533 2413 711 -104 -1131 -983 575 -70 63 -359 20 -567 109 -478 -520 787 884
2617 884 355 -1329 -1553 81 77 -779 355 -608 -1771 -1027 199 671 -980 339 298 -590 538 763
2635G63m12O32q60q44K02p36J204P82j654L04M8O93k93P74j068O72j413J052q69
2654a023Q82p3L31L9o41K83J660j475K19j27j65K16o58O90l98J54O62M02j005
2673b7k1N73p84O7l40k47Q83O18K06J80n75r55J472j028j27J16L74l00L62j038
2693e91J060L62k255J341N43q84m28J254o58K12M50j104J189r76Q05m47j50O29
2711C52l74M47r03K94J68M82n73n68K50Q58m88M54k52q00J103n77R95j400J067
2730E35o5l68O14j030J032n84L78J59r2K80j305K87N91p32Q93p63M7Q24K03j446
2750e42N54K22j31n03n36J229k44k0N75j215J288L21j637J767j82j438K48k66
2768e10J245j019M3L92K35m05J313j091Q0k31k5j49K6J62J79o83J74J27l03J593
$$ plain form
2635 763 351 983 123 -721 -519 -1255 -51 731 -923 -619 -571 122 -171 603 -465 207 -1206 -154 -1023
2654 -1023 -141 -214 117 156 -485 -202 1458 -17 202 75 -90 126 -532 158 -240 -86 576 978 -27
2673 -27 -48 525 -259 -192 -532 -779 104 722 928 1108 533 -422 1050 22 -105 11 385 85 447 -591
2693 -591 469 831 -1424 -83 460 -424 -852 402 -256 -44 406 -698 491 -485 320 -127 -277 352
2711 352 -22 425 -478 -184 -16 466 -107 -675 -425 433 -55 399 147 -653 450 -127 868 -532 535
2730 535 470 102 716 -314 718 134 512 671 579 859 -446 -159 432 -300 593 -170 -123 701 904 -542
2750 -542 12 234 103 -400 -936 293 49 29 604 -611 677 998 -639 1128 946 -492 -244 -510
2768 -510 735 -284 -241 151 386 -19 1294 203 283 52 27 -122 -96 66 245 -438 -264 -137 -440 1153
2788A153r48J56P86j231J34Q39n03j98m97O78j62n75p31J729L56j231K05P01o17
2807D4L48n02P44o24k28J097q68N37N27j397Q88K51l84j025O21p77N76J22N52
2826E02m69l48M10J031j885J28J162m82N99L56k355J373o3J31M39K72l67j373
2844i39N44J01R19p79m00J90L19j1o88R68J29j44l34M41m4o02p2K66l21J90L72
2865A05M55pj194Q1q64J215L57m93Q80J39j605M61L78J23K51J46j547J047j16
2884a88j27j4j604J872J053j209j02J512m62j137M61J746j754o13l00L81L9K28
2902b18L92RQ51j198n09J118n54m48n67M63k36N62L54m84J484p40k34r16K281
2921A410j014J04p11J68q99J316l58J364j148n08P61k29j045L14P16o30J177j104
$$ plain form
2788 1153 205 361 1147 -84 50 889 386 188 -309 369 207 -368 -1099 630 986 -245 -40 661 44
2807 44 392 -110 634 10 -218 879 11 548 1075 -322 566 817 433 -592 29 -748 -172 -50 502
2826 502 33 -315 95 1126 -759 -631 531 49 648 1004 -1351 22 -41 90 529 801 434 -939
2844 -939 -395 -294 625 -154 -554 -364 -45 -56 -744 224 353 209 -125 316 272 -330 -402 -136 -457 -267 105
2865 105 560 553 -641 -560 -1424 -209 148 -345 535 674 -931 -470 -92 31 282 428 -1119 -72 -188
2884 -188 -315 -329 -1933 -61 992 -217 -319 1193 731 -406 55 1801 47 -566 -866 -485 -446 -218
2902 -218 174 183 1034 -164 -673 445 -109 -557 -1124 -661 -897 -335 19 -465 1019 279 45 -871 1410
2921 1410 396 500 -211 -43 -942 374 16 1380 232 -276 485 256 -789 -475 241 -389 788 -316
2939c16q83J538j00o76J280m99n3R5m46o64J221n65J877k28j993n89P58R24O02
2958A283o82m48l9j99NO26k16l0o96n64J445o97O10K23j183M52j99O62m1j477
2978a165K04O52k70J130j46m7l02J55j080J467j05m50j811O18J784o01j332J180
2996a19k8J009n63m14J10J40r49P07n3R72j022O81m77p83J214j319J475r72Q49
3015D58J44n38l52J63J04l04K70m42P63O33p00q65Q14m71O85P2k18l01o36J550
3035H29p45K15M0k72q75P61N06n7j85K91q21l49R58m07J368n81m5j179P05M02
3055E59j476P64N8m82M09N1N64m8N32j836L51J309o07Q37k28l32k30m39R69n88
3075A37o63J380j748Q95j205J120R01l10o57p46J219K97j320j2J140m26Q99p94
$$ plain form
2939 -316 -1199 339 239 -437 843 344 291 386 -60 -724 497 -68 1809 1581 -412 -1001 -243 681 1283
2958 1283 601 153 114 -85 -80 546 330 300 -396 -960 485 -212 398 621 -562 -110 -309 353 312 -1165
2978 -1165 -961 -309 -579 551 405 358 56 211 -869 598 493 43 -1768 -1150 634 33 -1299 -119
2996 -119 -147 862 299 -115 -5 135 -814 -107 -160 812 -210 471 -6 -789 425 -894 581 -391 458
3015 458 602 64 -288 -125 -21 -325 -55 -497 266 899 199 -666 148 -323 362 434 216 -85 -721 829
3035 829 84 299 339 67 -808 -47 459 402 217 508 -313 -662 296 -111 1257 676 631 -548 157 559
3055 559 -917 -153 -95 -577 -168 -117 447 399 931 -905 -554 755 148 985 757 425 195 -244 725 137
3075 137 -526 854 -894 1 -1204 -84 817 507 -150 -896 323 620 -700 -712 428 2 901 107
3093A07l83M22P10r57j26O48L16j102M89k79q36R87p08J218K90j144L66N60l68
3112B10k08J90o2p15j4J154q77O26p37J132j424p8O43n28R71o73l70Q04l46k52
3132e54PJ123j30J02k25l33j114P29J610k0r05k47K0j116J079N23L79m23l89l70
3152b54N62j119K91k04N13N49q58K63J551j828M27k13o01P46L55o26J055j096
3170d87J199k34n70j098O91R21j592J553j262N50O88n07m14n4l2J220r0k18L68
3189F32r16K79O68j722Q98J655l050J384M89q15l21J965j266r44J435p66K0R15
3207E40n94l71L10p03K253j178J61r77R59J149j583K97p41n4O08n32l09P65J311
3226A311j286l09O51r98J99N77J275j579O83o44Nn16N44P0l65N12q06L69M82O76
$$ plain form
3093 107 -276 146 856 -101 -227 421 737 -365 124 -155 -991 -4 -712 506 796 -348 18 578 210
3112 210 2 192 130 -585 -599 555 -322 304 -433 699 -725 -803 -160 -688 283 -390 -760 44 -302 -554
3132 -554 -547 576 446 548 323 -10 -1124 -395 1215 1195 290 43 63 -1053 26 549 928 505 116 -254
3152 -254 308 -811 -520 -724 -211 338 -520 -257 1294 -534 -107 -320 -921 -175 180 -446 609 -487
3170 -487 712 478 -92 -1190 -499 422 -1170 383 -879 -329 359 -148 -562 -616 -648 572 482 264 632
3189 632 -284 -5 663 -1059 -161 1494 -1556 -172 317 -498 -819 1146 -120 -1064 371 -395 -375 540
3207 540 -54 -425 -115 -818 1435 257 418 -559 400 1549 -34 263 -478 -532 76 -456 -765 0 1311
3226 1311 25 -284 367 -631 -432 145 1420 -159 524 -120 -115 -631 -87 -17 -382 130 -676 -307 175 851
3246H51n66P21j143L31j748j89K168n47N74j07j149J061L05j52q00J619j821m42
3264a034J727p06L70m70J80J12n69L20J36M58j161P70K68l18L60j063k50J406
3282E36m05j271J162N73l8j648P82m24J553q28J079o97K54l72J93o58l41N2J395
3301H97o10n91L4J136m94k51O59j313k01j21J061j422J143R96j221j48J396r36
3319A4J79l89k92K34m34N05Q23j030K68M53p34O65j20k40N84J23j2o67o3P67l71
3340B63N02j070m18R48m33K73j163J225P54o57n87K30J172l52j92l46m71r69J766
3359D75j17r5r32L20J38N07o89Q95q17P02p13L16J635j425J367j630M57K2j208
3378g92M24P25L06K9q6r20k14J150l82O30j105l7l69r6J019m47o74k67N99J590
$$ plain form
3246 851 285 1006 -137 194 -1554 -1743 425 -122 452 345 -804 257 562 410 -390 1229 -592 -1034
3264 -1034 693 -13 357 -113 67 179 -390 -70 66 524 -637 133 401 83 443 -620 -870 536
3282 536 131 -1140 22 595 557 -1091 -309 -733 820 -8 1071 374 628 256 449 -209 -550 -498 897
3301 897 287 -304 -270 866 372 121 780 -533 -734 -855 206 -1216 -73 923 -298 -446 950 14
3319 14 193 -196 -488 -254 -688 -183 640 -390 -122 331 -403 262 142 -98 486 609 597 -70 -133 634 263
3340 263 765 -305 -723 225 -208 65 -1098 127 881 224 -363 -133 1039 687 495 149 -322 -1291 475
3359 475 358 263 -669 -349 -211 296 -393 502 -315 387 -326 -10 1625 200 1567 -63 394 416 -792
3378 -792 -368 357 663 692 606 -314 -528 622 240 870 -235 -272 -641 -737 282 -165 -839 -1106 -507 1083
3398A083j226J162j555Q26k73J97J094j276J56N06j24l01k43N93O63j397pj306
3416a428J205M68J91l82L38J49M74j255P35l1n59Q53l34m80k05k43k52J498j516
3435g74J010j24M09n10M25K08m92j626J289l83J72K92p50K82M69K22p37L11J271
3454I64j605m86J158O3J66L67k80j428O50N88J38n28j234J035J083q13K74j154
3472a042J640N59j868J031m79L7M70o17L53q28J321m72K67R6l42n23j344J302
3490d39M5J054j220J75O54n53J338j545N19J171j713O0P2J31Q5J32L17o22J17
3509b22L92n35K28J249p29k56L4N69m99k01P60q94m49k05O07K5Q08j415L03Q83
3529D53r59J41J712j327J95r99R66m63k99J156r28m96K33J293r19j68J065o03
$$ plain form
3398 1083 -143 1019 -536 290 17 214 1308 32 188 694 570 269 26 619 1282 -115 -122 -1428
3416 -1428 -223 245 436 54 392 541 1015 -240 495 464 -95 758 424 -56 -261 -504 -756 742 -774
3435 -774 236 112 521 11 436 644 152 -1474 -185 -568 -396 -104 -854 -572 -103 119 -618 -307 964
3454 964 -641 -1127 31 94 260 627 347 -1081 -431 157 295 -233 -1467 -432 651 -162 112 -1042
3472 -1042 598 1157 -711 320 -159 -122 348 -269 84 -744 577 105 372 468 126 -397 -1741 -439
3490 -439 -394 660 -560 -385 269 -284 1054 -491 28 1199 -514 -454 -382 -251 -166 -34 283 -339 -222
3509 -222 170 -365 -137 1112 383 127 161 730 231 30 790 -104 -553 -758 -151 -126 682 -733 -430 453
3529 453 -506 -365 1347 20 215 -784 182 -281 -580 576 -352 -848 -615 678 -241 -409 656 53
3547E3n00q0J300j00J17q70q31L95Q52k1L54o41L15j99O54l87J732k690J196j193
3567e44Q67M13o05K85j406J183O14R8N83r01n90L20Q5j307J069J61R1L3j76J93
3587D66K64r52R20m9l58l26o90R72m49J131j214M04l62o9K34Q9R7J53l68n49J73
3608d83M63k5l67Q70p95J201r25j005J832q24M36l17m71L82NJ103r11m74n76N78
3628c03O85N60j101K20L50j281J669p34j91L43Q75l97l66m83N01k30m5l56P1P50
3648E37l60p30J219l04K23q96J02M4R18k69o71l58J137q08M89q86R74k17o64N43
3668B3j00m70l9J467r18L65j992J431R43r73k96J020p12l62J038k79j189J118
3686G5O12k05m4l03k99l88m43L22N38l92K85k31R44o71K65p27q3L87J002j300
$$ plain form
3547 53 -447 -527 773 673 790 -80 -911 -516 336 315 669 28 343 144 798 411 2143 -547 649 -544
3567 -544 323 736 131 416 -990 193 807 905 1488 587 -3 317 402 -905 164 325 416 449 273 466
3587 466 730 -222 698 649 291 -35 -725 247 -202 929 -285 119 -243 -312 -78 11 108 261 -107 -656 -483
3608 -483 -20 -45 -412 458 -337 864 -61 -1066 766 -58 378 61 -410 -28 -23 1080 169 -305 -881 -303
3628 -303 382 942 -159 61 411 -870 799 65 -126 217 1092 695 329 -154 347 117 72 -284 -213 537
3648 537 177 -553 666 362 585 -311 -209 -165 753 484 -187 -545 592 -216 273 -613 361 144 -520 23
3668 23 -77 -547 -586 881 -37 328 -1664 -233 710 -263 -559 461 -251 -613 425 146 -1043 75
3686 75 687 482 438 135 -164 -552 -995 -673 -135 -527 -242 -473 471 -200 65 -662 -745 -358 644 -656
3706f56o5J561j108J208p84p62J43N08m98J224j147J834j557J31J010j030j83
3723a71L56J20j021N71M85l46J42L3L36k72o28M55k86K9p08J027m97N37n86O15
3743A91o6j278J593P88p82K2l57P9J94j231Q58J87l25j89Q66j90K87n1j009K14
3763a99q08Q57M04j95M05o14K76j56l54J32K23P47r16K64L90K66r16l92J687j066
3783C5o21l09k25P65Q36k56j059L72J177m35K42q28R06l15O7n69k48L45j44L97
3803A33r84L80N84M4r05J981k189O69n04K63R16p12K36P5O8M64j23q82L89l89
3823d86N64l14n25K52J87L60J408j710O95l99K85N47K82j004N18j339p42O51J198
3842D28m12Q26k79P4r44N09p48k49J86Q62j000K79Q87j10j062J240j109L58J073
$$ plain form
3706 -656 -721 840 -268 940 156 -606 -463 45 -453 771 -376 1458 -99 32 1042 12 -171
3723 -171 185 305 -716 -145 340 -6 136 169 505 233 -395 60 -226 -197 -905 122 -375 162 -424 191
3743 191 125 -1153 440 1228 446 468 111 190 384 -847 11 198 -127 -316 550 360 647 596 -413 -199
3763 -199 -1007 -150 254 59 464 -150 126 -30 -384 -252 -29 718 -198 66 456 722 -194 -586 1101 35
3783 35 -586 -895 -1120 -355 481 225 -834 -462 715 280 522 -306 600 285 352 -217 -465 -120 -264 133
3803 133 -851 -471 113 157 -748 1233 -956 -287 -791 -528 388 -324 -88 -13 55 519 396 -486 -97 -486
3823 -486 78 -236 -761 -509 -322 38 1446 -264 431 32 317 864 1146 142 660 -679 -1421 -770 428
3842 428 16 842 563 637 -307 202 -546 -795 -609 253 -747 -468 419 309 -753 487 -622 -264 809
3861H09r89O22j59k11n41J92j49O72K84K72j501L25k15M7R23o27P20M77l95N04
3881A060m59m01q79K47K38J8J121n73k98M04o70l8M70n69R19m28l2j03J08n94
3901d59L58J374j600K27O75j245J449j87n31J73k49j94m08N83Q8l38J037o90J8
3920H1pn26l43N68J322o53j76O04j263J91R59r40N71r27K30K26Q16r44Q2N59p48
3941c18J49P00M0n43M25p15k37P36p06R52N66n25N28j076k74K29J121j06j953
3960a007K015q98J48L50k609L199j730M72j97K63J1N9j00K9M56K53j384M80Q89
3979F99r59j44lN26o98J142j462O32J31L54j214Q58o35J446j0j9j99n55j310J372
3999d8J367p76r87O35n78Q72k92J69Q28r71n05m26R75j42J1Q19K85j666M58r23
$$ plain form
3861 809 -180 442 283 72 -469 -277 -426 246 530 802 -699 -374 -589 -542 381 -246 474 951 556 1060
3881 1060 601 200 -679 -432 -194 -176 945 372 74 478 -192 -230 240 -329 590 162 130 27 135 -459
3901 -459 -101 1273 -327 -100 575 -670 779 592 61 234 -15 -209 -617 -34 54 -284 753 63 81
3920 81 74 -452 -795 -227 1095 442 266 870 -393 -202 757 -183 388 -539 -309 -83 733 -211 -129 430 -318
3941 -318 -169 531 571 28 453 -262 -499 237 -469 483 1049 524 1052 -24 -298 -69 1052 946 -1007
3960 -1007 1008 110 258 608 -2001 1198 -532 -60 -257 6 17 76 -24 5 461 714 -670 -190 699
3979 699 -260 -404 -407 119 -579 563 -899 -267 -136 218 -996 -138 -773 673 663 644 445 -110 -1420 -48
3999 -48 1319 543 -444 191 -387 485 193 362 1190 219 -286 -712 263 121 132 951 1236 -430 28 -895
4019h95K268o55l92j273J995L03j336R3j9k70Q34k171Q71J410p98O57r50j300
4037a628K273o15j45j37q9J76J025p06n74N29J89j67m64j79l61Q01r1L3k91K27
4057a94J36k50K59K51J06q35J008n58P26q46n00J563r53R3O79o99N50K80j035
4076b19J113j842J336p11N41m65j087R97l3M74j045J426k78J10o12J08M49K73
4094E35n63L1M01l84j4J358j434L86n32K58p8k39m07J406j977Q52O33o64O48n80
4114c64L97m64R04N08m60O6l47p11L49p6Q38m17N35m95j33j7l95L29J124j728
4134e57J245J5j1r12J061o51k4J73M2R32j764k19J326o53m90M5J254j035J031
4153H08l11p6j459J128J31K5J94p87J213o32J93p17m7j38J226m32n00l94L06Q13
$$ plain form
4019 -895 1373 718 326 -947 1048 1351 15 108 89 -181 653 -1518 -647 763 -35 622 -328 -1628
4037 -1628 645 30 -115 -252 -341 -165 860 154 -420 109 298 131 -333 -512 -873 -72 -163 -130 -421 -194
4057 -194 -58 -308 -49 202 308 -527 481 -77 649 -197 -697 866 -87 6 685 -14 536 816 -219
4076 -219 894 -948 388 -323 218 -247 -1334 -337 -370 104 -941 485 207 317 -295 -187 262 535
4094 535 -28 3 404 20 6 1364 -70 316 -216 42 -36 -275 -682 724 -1253 -401 232 -432 216 -364
4114 -364 33 -431 473 981 521 587 240 -471 -122 -198 640 223 758 263 130 113 -282 47 1171 -557
4134 -557 688 703 692 -220 841 190 166 339 381 1313 -451 -670 656 3 -487 -442 812 -223 808
4153 808 497 421 -1038 90 221 246 440 -347 866 234 427 -290 -337 -475 751 319 -181 -575 -269 544
4173E44j051m7J57N49L3o90K99J069r72O40n58R7k52n67N08P32j049m43J450m6
4193D03m50J25k91M23L4K03m03k4n18J490m17l75o53n11J171O4m62K90J438r57
4213E80o1o23L26k43k02l13P60l11J46k63k27J88J503j117N77m37l6k80N61r48
4233d20L54O45o80l50J401k03Jj550P56M00K2j076j119J258J557j319J723n20
$$ plain form
4173 544 -507 -554 -397 152 185 -505 -206 863 -109 531 -27 70 -182 -749 -241 491 -558 -1001 449 403
4193 403 -47 78 -213 210 244 447 44 20 -498 992 575 200 -453 -964 207 271 -191 99 1537 580
4213 580 519 -104 222 -21 -223 -536 224 -87 59 -204 -431 -243 1260 143 720 283 247 -33 528 -420
4233 -420 -66 579 -101 -451 950 747 748 -802 -46 354 376 -700 -1819 -561 996 -323 1400 880
$$ [...]
8191E94
##END NTUPLES=NMR FID
##END=
