##TITLE=1H_IPACAT-21
 DMSO=d6, 108 sc, 
 6.5.2019
##JCAMPDX= 6.0         $$ Bruker NMR JCAMP-DX V2.0
##DATA TYPE= NMR FID
##DATA CLASS= NTUPLES
##ORIGIN= UXNMR, Bruker Analytische Messtechnik GmbH
##OWNER= root
$$ XWIN-NMR		Version 3.5
$$ Mon May  6 17:51:16 2019 Russian Standard Time (UT+4h)  she@DPX200
##.OBSERVE FREQUENCY= 200.1315
##.OBSERVE NUCLEUS= ^1H
##.DELAY= (6, 6)
##.ACQUISITION MODE= SIMULTANEOUS
##.ACQUISITION SCHEME= undefined
##.AVERAGES= 108
##.DIGITISER RES= 18
##SPECTROMETER/DATA SYSTEM= spect
##.PULSE SEQUENCE= zg30
##.SOLVENT NAME= DMSO
##.SHIFT REFERENCE= (INTERNAL, DMSO, 0, 15.7039)
##AUDIT TRAIL= $$ (NUMBER, WHEN, WHO, WHERE, WHAT)
$$ ##TITLE= Audit trail, XWIN-NMR		Version 3.5
$$ ##JCAMPDX= 5.01
$$ ##ORIGIN= Bruker BioSpin GmbH
$$ ##OWNER= she
$$ F:/spectra/data/she/nmr/H-F/1/audita.txt
$$ ##AUDIT TRAIL=  $$ (NUMBER, WHEN, WHO, WHERE, WHAT)
(   1,<2019-05-06 17:49:55.01 +0400>,<she>,<DPX200>,
      <continue with go, POWCHK disabled, PULCHK disabled
       configuration hash MD5:
       00 E9 B6 7A A2 85 ED C7 34 08 36 98 17 FE 4E 26
       data hash MD5: 16K
       AC AF 03 0D 76 24 31 27 10 AB 2D 64 DB 82 63 96>)
$$ ##END=
$$ 
$$ hash MD5
$$ 55 79 73 C1 0B DC CF E8 C8 ED C6 B5 5D 55 0C 13
##$RELAX= 
##$RELAX= 
##$RELAX= 
##$RELAX= 
##$RELAX= 
##$RELAX= 
$$ Bruker specific parameters
$$ --------------------------
##$DU= <F:/spectra>
##$EXPNO= 1
##$NAME= <H-F>
##$PROCNO= 1
##$TYPE= <nmr>
##$USER= <she>
##$AMP= (0..31)
100 100 100 100 100 100 100 100 100 100 100 100 100 100 100 100 100 100 
100 100 100 100 100 100 100 100 100 100 100 100 100 100 
##$AQSEQ= 0
##$AQ_mod= 1
##$AUNM= <au_zg>
##$AUTOPOS= <>
##$BF1= 200.13
##$BF2= 200.13
##$BF3= 200.13
##$BF4= 200.13
##$BF5= 200.13
##$BF6= 200.13
##$BF7= 200.13
##$BF8= 200.13
##$BYTORDA= 1
##$CFDGTYP= 0
##$CFRGTYP= 5
##$CHEMSTR= <none>
##$CNST= (0..31)
1 1 145 1 1 1 1 1 1 1 1 1 1 1 1 1 1 1 1 1 1 1 1 1 1 1 1 1 1 1 1 1 
##$CPDPRG= <>
##$CPDPRG1= <>
##$CPDPRG2= <>
##$CPDPRG3= <>
##$CPDPRG4= <mlev>
##$CPDPRG5= <mlev>
##$CPDPRG6= <mlev>
##$CPDPRG7= <mlev>
##$CPDPRG8= <mlev>
##$CPDPRGB= <>
##$CPDPRGT= <>
##$D= (0..31)
0 1.2 0 0 0 0 0 0 0 0 0 0.03 0 0 0 0 0 0 0 0 0 0 0 0 0 0 0 0 0 0 0 0 
##$DATE= 1557150254
##$DBL= (0..7)
120 120 120 120 120 120 120 120 
##$DBP= (0..7)
150 150 150 150 150 150 150 150 
##$DBP07= 0
##$DBPNAM0= <>
##$DBPNAM1= <>
##$DBPNAM2= <>
##$DBPNAM3= <>
##$DBPNAM4= <>
##$DBPNAM5= <>
##$DBPNAM6= <>
##$DBPNAM7= <>
##$DBPOAL= (0..7)
0.5 0.5 0.5 0.5 0.5 0.5 0.5 0.5 
##$DBPOFFS= (0..7)
0 0 0 0 0 0 0 0 
##$DE= 6
##$DECBNUC= <off>
##$DECIM= 24
##$DECNUC= <off>
##$DECSTAT= 4
##$DIGMOD= 1
##$DIGTYP= 9
##$DL= (0..7)
0 120 120 120 120 120 120 120 
##$DP= (0..7)
150 150 150 150 150 150 150 150 
##$DP07= 0
##$DPNAME0= <>
##$DPNAME1= <>
##$DPNAME2= <>
##$DPNAME3= <>
##$DPNAME4= <>
##$DPNAME5= <>
##$DPNAME6= <>
##$DPNAME7= <>
##$DPOAL= (0..7)
0.5 0.5 0.5 0.5 0.5 0.5 0.5 0.5 
##$DPOFFS= (0..7)
0 0 0 0 0 0 0 0 
##$DQDMODE= 0
##$DR= 18
##$DS= 0
##$DSLIST= <SSSSSSSSSSSSSSS>
$$ [...]
##$SUBNAM2= <"">
##$SUBNAM3= <"">
##$SUBNAM4= <"">
##$SUBNAM5= <"">
##$SUBNAM6= <"">
##$SUBNAM7= <"">
##$SUBNAM8= <"">
##$SUBNAM9= <"">
##$SW= 24.9337058887773
##$SWIBOX= (0..15)
0 0 2 0 0 0 0 0 0 0 0 0 0 0 0 0 
##$SW_h= 4990.01996007984
##$TD= 16384
##$TD0= 1
##$TE= 0
##$TE2= 300
##$TE3= 300
##$TEG= 300
##$TL= (0..7)
0 120 120 120 120 120 120 120 
##$TP= (0..7)
150 150 150 150 150 150 150 150 
##$TP07= 0
##$TPNAME0= <>
##$TPNAME1= <>
##$TPNAME2= <>
##$TPNAME3= <>
##$TPNAME4= <>
##$TPNAME5= <>
##$TPNAME6= <>
##$TPNAME7= <>
##$TPOAL= (0..7)
0.5 0.5 0.5 0.5 0.5 0.5 0.5 0.5 
##$TPOFFS= (0..7)
0 0 0 0 0 0 0 0 
##$TUNHIN= 0
##$TUNHOUT= 0
##$TUNXOUT= 0
##$USERA1= <user>
##$USERA2= <user>
##$USERA3= <user>
##$USERA4= <user>
##$USERA5= <user>
##$V9= 5
##$VALIST= <valist>
##$VCLIST= <CCCCCCCCCCCCCCC>
##$VD= 0
##$VDLIST= <DDDDDDDDDDDDDDD>
##$VPLIST= <PPPPPPPPPPPPPPP>
##$VTLIST= <TTTTTTTTTTTTTTT>
##$WBST= 1024
##$WBSW= 4
##$XGAIN= (0..3)
0 0 0 0 
##$XL= 0
##$YL= 0
##$YMAX_a= 1958747
##$YMIN_a= -2278023
##$ZGOPTNS= <>
##$ZL1= 120
##$ZL2= 120
##$ZL3= 120
##$ZL4= 120
##$ABSF1= 10
##$ABSF2= 0
##$ABSG= 5
##$ABSL= 3
##$ALPHA= 0
##$AQORDER= 0
##$ASSFAC= 0
##$ASSFACI= 0
##$ASSFACX= 0
##$ASSWID= 0
##$AUNMP= <proc_1d>
##$AZFE= 0.1
##$AZFW= 0.1
##$BCFW= 1
##$BC_mod= 2
##$BYTORDP= 1
##$COROFFS= 0
##$CY= 11.3945322036743
##$DATMOD= 1
##$DC= 2
##$DFILT= <>
##$DTYPP= 0
##$F1P= 18.9103706918063
##$F2P= -1.10871071338519
##$FCOR= 0.5
##$FTSIZE= 0
##$FT_mod= 4
##$GAMMA= 1
##$GB= 0.15
##$INTBC= 1
##$INTSCL= 1
##$ISEN= 128
##$LB= 0.24
##$LEV0= 0
##$LPBIN= 0
##$MAXI= 10000
##$MC2= 0
##$MEAN= 0
##$ME_mod= 0
##$MI= 1.114404
##$NCOEF= 0
##$NC_proc= 0
##$NLEV= 6
##$NOISF1= 3.799351
##$NOISF2= 2.8
##$NSP= 1
##$NTH_PI= 0
##$NZP= 0
##$OFFSET= 15.70392
##$PC= 1
##$PHC0= -8863.396
##$PHC1= 23.40026
##$PH_mod= 1
##$PKNL= yes
##$PPARMOD= 0
##$PSCAL= 0
##$PSIGN= 0
##$REVERSE= no
##$SF= 200.130013532006
##$SI= 16384
##$SIGF1= 3
##$SIGF2= 2
##$SINO= 400
##$SIOLD= 16384
##$SREGLST= <1H.CDCl3>
##$SSB= 0
##$STSI= 0
##$STSR= 0
##$SW_p= 3612.71676300578
##$SYMM= 0
##$S_DEV= 0
##$TDeff= 0
##$TDoff= 0
##$TI= <>
##$TILT= no
##$TM1= 0
##$TM2= 0
##$TOPLEV= 0
##$USERP1= <user>
##$USERP2= <user>
##$USERP3= <user>
##$USERP4= <user>
##$USERP5= <user>
##$WDW= 1
##$XDIM= 8192
##$YMAX_p= 0
##$YMIN_p= 0
$$ End of Bruker specific parameters
$$ ---------------------------------
##NTUPLES= NMR FID
##VAR_NAME=  TIME,          FID/REAL,        FID/IMAG
##SYMBOL=    X,             R,               I
##VAR_TYPE=  INDEPENDENT,   DEPENDENT,       DEPENDENT
##VAR_FORM=  AFFN,          ASDF,            ASDF
##VAR_DIM=   8192,          8192,            8192
##UNITS=     SECONDS,       ARBITRARY UNITS, ARBITRARY UNITS
##FACTOR=    0.0002004,     1,               1
##FIRST=     0,             0,               0
##LAST=      1.6414764,     0,               0
##MIN=       0,             -2278023,        0
##MAX=       1.6414764,     1958747,         0
$$ Real data points
##PAGE= N=1
##DATA TABLE= (X++(R..R)), XYDATA
0@%%%%%%%j06K14k16K16k16K19l27M33n39O48p58R09j021J196j416J652j929K238
$$ 0 0 0 0 0 0 0 0 -106 108 -108 108 -108 111 -216 217 -322 326 -432 477 -544 652 -764 888 -1041 1197
25A197k587K938l333L816m306M856n485O139o865P691q573R533j0605J1776j3057
$$ 1197 -1390 1548 -1785 2031 -2275 2581 -2904 3235 -3630 4061 -4512 5021 -5584 6192 -6865
40f865J4477j6031J7743j9643K1752k4126K6787k9790L3232l7195M1829m7361
$$ -6865 7612 -8419 9324 -10319 11433 -12693 14094 -15696 17536 -19659 22170 -25191
52b5191N4058o2356P3030q7278J07392j38265J92135l13213J100835m95245k368556
$$ -25191 28867 -33489 39541 -47737 59655 -78610 113525 -199688 901147 405902 -1962654
63a962654L27709J780763J604425n37040j513447r83025N12013R38120N30597
$$ -1962654 -1634945 145818 1750243 1213203 -300244 -1283269 -771256 166864 697461
72F97461j69483k80826l73832m14991k54666N43121J062649N16261r53850j582015
$$ 697461 527978 247152 -126680 -541671 -796337 -253216 809433 1325694 371844 -1210171
82a210171m59282J437834J829407J59365j815173j759074K40090J939830J417400
$$ -1210171 -1669453 -231619 1597788 1757153 -58020 -1817094 -1577004 362826 1780226
91A780226n63428j750027r49650O53810J281381N33283m35564o72879l40939n7213
$$ 1780226 1216798 -533229 -1482879 -829069 452312 985595 550031 -122848 -463787 -521000
101e21000J26613M49385O77999K01580q25132j235774k14891J330219J560063
$$ -521000 -394387 54998 732997 934577 109445 -1126329 -1341220 -11001 1549062
110A549062m4442j773102j567224M49257J987074J275479q13764j873701q23051
$$ 1549062 1504620 -268482 -1835706 -1386449 600625 1876104 1062340 -811361 -1634412
119a634412R56377J454463L99224p74976q70607j90978K97770L24067L00333L29567
$$ -1634412 -678035 776428 1175652 400676 -469931 -660909 -363139 -39072 261261 590828
129E90828p67o87372r01329j0921J209297J237878k50223j667323j265128O39309
$$ 590828 590061 -97311 -998640 -1009561 199736 1437614 1187391 -479932 -1745060 -1105751
139a105751J892891J025204r76534j826599o49222J110197J501958L01487r79764
$$ -1105751 787140 1812344 835810 -990789 -1640011 -529814 972144 1273631 293867
148B93867j030966j17200O05956N64689J73246p6174k38601m74489m63852J58277
$$ 293867 -737099 -854299 -248343 316346 489592 413418 174817 -299672 -763524 -605247
158f05247R39594Q54657l36659j418688r85032O95865J737506Q30243j071862
$$ -605247 334347 1189004 852345 -566343 -1551375 -855510 881996 1712239 640377
167F40377j777112m83732J284994J525518J16106j221344j080584R9359Q78828
$$ 640377 -1136735 -1620467 -335473 1190045 1306151 84807 -995777 -896418 -17590
176a7590O16692n2827l61106k96309k55614j76552K29396P26482N60921m16996
$$ -17590 599102 546275 185169 -111140 -366754 -543306 -313910 412572 973493 556497
186E56497j206465o98495P66030J535704N78583j130356j619717k81669J359233
$$ 556497 -649968 -1348463 -582433 953271 1531854 401498 -1218219 -1499888 -140655
195a40655J440779m7782j346298j074150K56488J078183O68987k41274o34399
$$ -140655 1300124 1252342 -93956 -1168106 -911618 166565 835552 594278 -40121
204d0121l71904r205J51294K77991M25946K31394m13259q79741m13816P13110
$$ -40121 -412025 -421230 -269936 8055 434001 665395 252136 -627605 -1041421 -328311
214c28311J239402L65900j061386j395703j36147J327540J315048j62248j397299
$$ -328311 911091 1276991 215605 -1180098 -1316245 11295 1326343 1164095 -233204
223b33204j033120L94395J222313O65022m37698q41893l57582K34846L74713K44139
$$ -233204 -1266324 -871929 350384 1015406 577708 -264185 -621767 -386921 -12208 231931
233B31931J61220J4790l70733o25937k04144O81070R98405J53671j044295j160856
$$ 231931 393151 407941 37208 -588729 -792873 -111803 886602 1040273 -4022 -1164878
243a164878P6689J307053J091694l52012j376742q51116N48339J227753N49362
$$ -1164878 -1088189 218864 1310558 958546 -418196 -1269312 -720973 506780 1056142
252A056142n73672r14546l08416M01233N33685K15036p3303j96091l06867l27730
$$ 1056142 482470 -432076 -740492 -339259 194426 409462 336159 140068 -166799 -494529
262d94529N79N58342O89756Q783q88315r07154J59767J180906R22105m14836j327360
$$ -494529 -493950 64392 754148 762931 -125384 -1032538 -872771 308135 1230240 815404 -511956
273e11956p49376O43875J263723M74738p31602j010566k21126O17066O54759R7339
$$ -511956 -1261332 -617457 646266 1121004 389402 -621164 -842290 -225224 429535 526874
283E26874l21451l12701j65560p4443J03726M10445M47448q7588p46843o84589
$$ 526874 205423 -107278 -272838 -347281 -243555 166890 614338 526750 -220093 -904682
293i04682K49831J056343P19090n03275j226271n70471P30385J191003L25197
$$ -904682 -654851 401492 1120582 617307 -608964 -1179435 -449050 741953 1067150
302A067150q23132r76555j01049P22207O69316M640m59692l81659p7994J17887
$$ 1067150 244018 -732537 -833586 -111379 557937 562577 102885 -278774 -356768 -238881
312b38881K10302K96867K05125j97110n84012m20265L16626Q57272M87367n14364
$$ -238881 -28579 268288 473413 276303 -307709 -727974 -411348 445924 933291 418927
322D18927j035837m12433P14249J070694K39876q35371r53680m2368Q17076P17895
$$ 418927 -616910 -1029343 -315094 755600 995476 160105 -793575 -835943 -18867 699028
332F99028q7400o37799m47675P8580L38488K43237R2571o802j86192l77845k47417
$$ 699028 611628 -26171 -473846 -395266 -56778 186459 279030 272228 86036 -291809 -539226
343e39226K86650O87219L44950n07074r00408k77990P32602R57984R9934q68515
$$ -539226 -252576 434643 779593 272519 -627889 -905879 -173277 784707 884641 16126
353A6126q50652Q7116Q53020O39983j96176o86198m10545J67740M21962K55020
$$ 16126 -834526 -747410 105610 745593 549417 -136781 -547326 -379586 42376 297396
363B97396m350j44945k21260k46429o4305L14868N07696J55436m93771p04591
$$ 297396 293046 148101 -73159 -319588 -383893 -69025 438671 594107 100336 -604255
373f04255j16867O86360P78689j0361q15550p23762J60067Q33892N74085k58446
$$ -604255 -721122 -34762 743927 733566 -81984 -805746 -645679 188213 762298 503852
383E03852p26997l92296K60081N22121K46458j44722k80527j88984o6249O6628
$$ 503852 -223145 -615441 -355360 166761 413219 268497 -12030 -201014 -267263 -200635
393b00635K47629L18338N3677m05633n39173n2041O09443O58683o0495p79756
$$ -200635 46994 365332 419009 13376 -525797 -577838 31605 690288 629793 -149963
403a49963o43131K25861Q39366N09864l54735p59878l22685L72454N65693J75372
$$ -149963 -793094 -567233 272133 781997 427262 -332616 -655301 -282847 282846 458218
413D58218k59498l30639j31607M6195J37948K08882J92716m6955l66000l83789
$$ 458218 198720 -131919 -263526 -217331 -79383 129499 322215 275260 -90740 -474529
423d74529N8718N47412M85502j50899o86937m84182K72025P44785M03049l67311
$$ -474529 -415811 131601 617103 466204 -220733 -704915 -432890 311895 714944 347633
433C47633p04418k78786L91726N80638J64765l29214m02662j09330J76517K29931
$$ 347633 -356785 -635571 -243845 336793 501558 172344 -230318 -339648 -163131 66800
443F6800J41491K9279j18335k62056k26898R5974M34975L59269j64661n97600
$$ 66800 208291 237570 119235 -142821 -369719 -273745 161230 520499 355838 -241762
453b41762l93143K86905O89534L31860m00115o81571k15177M47893N78322J00403
$$ -241762 -634905 -348000 341534 673394 273279 -408292 -623469 -175576 402746 503149
463E03149m02307m14746m4080K61543K53878P8720o8534j53900j95865j17162
$$ 503149 100842 -313904 -357984 -96441 157437 236157 167623 13723 -182142 -299304
473b99304J40607L61895K38270k09225n10672k69063L16673N96343K20219m10098
$$ -299304 -158697 203198 441468 232243 -278429 -547492 -230819 365524 585743 175645
483A75645n92592j33368M43985N16455N5689m03469m00625k3942K98048K88225
$$ 175645 -416947 -550315 -106330 410125 465814 62345 -338280 -362222 -64174 224051
493B24051N1148j54185k07759j36890O782J79342K63758J11652k12702l98817
$$ 224051 275199 121014 -86745 -223635 -216853 -37511 226247 337899 125197 -273620
503b73620j76291K96314N06631J64825l95975n45796r4933M64009N02201Q79m55703
$$ -273620 -449911 -153597 353034 517859 121884 -423912 -518845 -54836 447365 448244 -7459
514g459l93393N4662L65188K67731l8543k14421j78781n6568N6097J62591J99561
$$ -7459 -400852 -346190 18998 286729 248186 33765 -145016 -201584 -145487 17104 216665
525B16665N8140k15690l39933j03562L07812M37103Q1701l97964m65383k3699
$$ 216665 274805 59115 -280818 -384380 -76568 360535 442236 44272 -421111 -444810
535d44810M49097M33024l7290m41275l57608P1000L73992K73507n4741k67847
$$ -444810 4287 437311 400021 -41254 -398862 -327862 46130 319637 264896 -2951
545b951k09337j1646J46669J88599J14923m6251k12713k31096j5005K76503L26653
$$ -2951 -212288 -223934 -77265 111334 226257 180006 -32707 -263803 -278808 -2305 324348
556C24348K7188l52448l82947L562M11103L87757n4224m32575l41699R4279L99633
$$ 324348 351536 -912 -383859 -380297 30806 418563 364339 -68236 -409935 -315656 83977
567H3977K70515j03526l13892k00445N6058J98899J64922M3833q6844j89205j69274
$$ 83977 354492 250966 -62926 -263371 -207313 -8414 156508 200341 113497 -75708 -244982
578b44982K2498K59800K78986j6198l51469l35653N9580M16999L31350j14735
$$ -244982 -222484 37316 316302 300104 -51365 -387018 -327438 89561 420911 306176
588C06176m29795k81449J44285L85475K23822j28573l06853j84912O8755K23998
$$ 306176 -123619 -405068 -260783 124692 348514 219941 -86912 -271824 -203069 20929
598B0929J81235J1994j54856k06111r9342J08393K52018J77664q8468l06495k36365
$$ 20929 202164 214158 59302 -146809 -246151 -137758 114260 291924 203456 -103039 -339404
609c39404R5110L55200K64031j16448l88831k57435J43897L85664K23129j52007
$$ -339404 -244294 110906 374937 258489 -130342 -387777 -243880 141784 364913 212906
619B12906l41869j83033J24593K67334J60563n5826j89151j74867l7334J34318
$$ 212906 -128963 -311996 -187403 79931 240494 184668 -4483 -179350 -216684 -82366
629h2366K22113J30927j13313k94734j94910J31863L58403K18014j68126l92270
$$ -82366 139747 270674 157361 -137373 -332283 -200420 157983 375997 207871 -184399
639a84399k03172J99207L83854J67980k01433l33965j36742J60964K66788J30605
$$ -184399 -387571 -188364 195490 363470 162037 -171928 -308670 -147706 119082 249687
649B49687q6580k06033j59861K648J67869K13751P4638j62146k76448j23094J75606
$$ 249687 163107 -42926 -202787 -200139 -32270 181481 256119 93973 -182475 -305569 -129963
660a29963L22345J47539j91052l50580j54484K02853L55277J48757k00258l42152
$$ -129963 192382 339921 148869 -201711 -356195 -153342 201935 350692 150434 -191718
670a91718j39191J82507L11214J33095j47746k66259j38417R0729K19074J63934
$$ -191718 -330909 -148402 162812 295907 148161 -118098 -256515 -165786 53288 217222
680B17222j5648j85325k16498n6305J81628K78329J05245k02418l32312j18221
$$ 217222 201574 16249 -200249 -256554 -74926 203403 308648 106230 -226082 -344303
690c44303K34644L50973J05270k45322l36510q5842K25488K95741Q6796j75236
$$ -344303 -109659 241314 346584 101262 -235248 -321090 -95602 200139 286935 111699
700A11699k54840j14958J10229K33133J60690m9767k28293k14301M141K38549
$$ 111699 -143141 -258099 -147870 85263 245953 196186 -32107 -246408 -242267 -3718
710c718K59932K3947k52559k89799l8953K59732L05197M7657k57377l06516n3834
$$ -3718 256214 280161 27602 -262197 -301150 -41418 263779 311436 54059 -252457 -306291
721c06291K40861K94679O7411k12577k79080q7724J72532K61332J18221j25765
$$ -306291 -65430 229249 296660 84083 -194997 -282721 -110189 151143 269364 143599
731A43599k49144j56126P4671K45968K03285l2639k53088k47050J924K68720K82781
$$ 143599 -105545 -261671 -187000 58968 262253 229614 -23474 -270524 -268600 120 282901
742B82901J2018k84232k97865j4275K85527K92083J4655k62968k69560l0870K16795
$$ 282901 294919 10687 -287178 -301453 -15926 276157 290812 27844 -241716 -272586 -55791
753e5791K52501O6784j61965k47083j23955J14457K65259J79315q8082k90338
$$ -55791 196710 263494 101529 -145554 -269509 -155052 110207 289522 201440 -88898
763h8898k18211P7779L07971K36899p0511l10530k41606N7490K93575K45039l1745
$$ -88898 -307109 -229330 78641 315540 245029 -65501 -307107 -249617 43958 288997 257252
774B57252k70932k50823r66K47291K57958L3198k20972k64753o4021J89769K66626
$$ 257252 -13680 -264503 -265469 -18178 239780 272978 52006 -212747 -276768 -86999 179627
785A79627J03408j55690k73560j47173J22828K88677J89137r9420l07247k22417
$$ 179627 283035 127345 -146215 -293388 -170560 118117 307254 207834 -99413 -321830
795c21830R0525L19873K37365q2388l20276k37736P0169K98442K35253m2479k65420
$$ -321830 -231305 88568 325933 243545 -76731 -314467 -244298 54144 289397 246918 -18502
806a8502k35718Q73K29228K49586M6779j98244k73355r4216J81428K95708J31155
$$ -18502 -254220 -253347 -24119 225467 272246 74002 -199353 -293569 -112141 183567 314722
817C14722j70875l13372j54235J60961L16785J67480j40560l10115j82474J12835
$$ 314722 143847 -169525 -323760 -162799 153986 321466 180906 -129209 -311683 -198848
827a98848K95411K01331p5838k81150k26776L9778K70510K51663p640k63172k68963
$$ -198848 96563 297894 222056 -59094 -285870 -246092 24418 276081 268441 5269 -263694
838b63694k0726K49227K79795M8576k27114k88203q2807K02922L01425J16630
$$ -263694 -284420 -35193 244602 293178 66064 -222139 -304946 -102024 199401 316031
848C16031j82826l13761j45873J67082L23483J62306j52152l14357j73338J25594
$$ 316031 133205 -180556 -326429 -159347 164136 326442 174290 -140067 -313405 -187811
858a87811K94930J87511q4654k72312k14260L5976K59252K50503M769k58239k80502
$$ -187811 107119 294630 209976 -62336 -276596 -240620 18632 269135 273904 15665 -264837
869b64837l4494K57887K99856N1520k48645l05930o7336K29329L01758R0844j97938
$$ -264837 -299331 -41444 258412 309932 61287 -244643 -311979 -82650 219108 309952 112014
880A12014k97695j25319J63787L01670J58056j34417l05562j89544J11421L06188
$$ 112014 -185681 -311000 -147213 154457 312513 178096 -127466 -317010 -205589 100599
890A00599K11393q6674k98355k29961N6971K85890K48390k5158k71688k65851
$$ 100599 311992 225318 -73037 -302998 -246027 39863 288253 263095 -8593 -274444
900b74444q915K57171K83896M1965k44530k98027o7439K29174L05967Q9629k10866
$$ -274444 -283359 -26188 257708 299673 55143 -242884 -310323 -81149 224818 314447 103581
911A03581l02396j13272J79907K96702J42311j42339k94356j76819J08601K94525
$$ 103581 -198815 -312087 -132180 164522 306833 164494 -129862 -306681 -198080 96445
921I6445K11604p7474l00902k38956N5030L03155K56683l7809k93537k64997J5882
$$ 96445 308049 230575 -70327 -309283 -254253 48902 305585 267776 -25761 -290758 -274876
932b74876K71322K69013K0205k46446k79145o0647K22367K99143R3158k06844
$$ -274876 -3554 265459 285664 39218 -239927 -300574 -78207 220936 314094 107250
942A07250l12051j18420J90225L16762J37792j69921l07112j56791J35090K97610
$$ 107250 -204801 -323221 -132996 183766 321558 151637 -155475 -312266 -177176 120434
952A20434J82006r6770k87447k15720N9445K86983K47375l4325k86574k66488
$$ 120434 302440 205670 -81777 -297497 -238052 48931 296306 261981 -24593 -291081
962b91081J2705K78033K76427J1098k59221k82388m0525K34318K89085P7537k09498
$$ -291081 -278376 -343 276084 287182 27961 -254427 -294952 -60634 228451 305988 96490
973I6490l02368j11009J90650L10830J40467j72198l18216j58334J49815L13510
$$ 96490 -205878 -316887 -126237 184593 325060 152862 -165354 -323688 -173873 139637
983A39637J77496j24186l02167j95042Q9590K87035K19450n1877k75079k47174
$$ 139637 317133 192947 -109220 -304262 -214672 72363 291813 239936 -35143 -282317
993b82317J7766K67455K69881J1712k61084k86077l4212K47802K92237N9796k27873
$$ -282317 -264551 2904 272785 284497 23413 -262664 -296876 -49074 243163 302959 75086
1004G5086k94787q6294J99241K95792J19546j69919k99520j54418J43457L08612
$$ 75086 -219701 -305995 -106754 189038 308584 138665 -160855 -315273 -171816 136796
1014A36796J82911j22732l13031k02194J04895L06634K13195p8886k89420k26240
$$ 136796 319707 196975 -116056 -318250 -213355 93279 306474 227588 -61832 -288072
1024b88072M3888K67407K46118l484k52940k68540l2673K44931K90392N5298k33909
$$ -288072 -244184 23223 269341 265857 12917 -255623 -288296 -43365 247027 302325 68416
1035F8416k99734p4903K16367K98559R6272j88914k93443j25455J56151K91059
$$ 68416 -231318 -306221 -89854 208705 304977 116063 -177380 -302835 -146684 144375
1045A44375J60195j24684k95864j91460J01164K98589K12906p9425k94734k27852
$$ 144375 304570 179886 -115978 -307438 -206274 92315 305221 225796 -68938 -296790
1055b96790N6981K80032K37476k4648k61393k51546j0861K41639K72835M5147
$$ -296790 -239809 40223 277699 253051 -8342 -259888 -270749 -29110 243725 288872
1065B88872k29509k88699p3910K17789L00036R4554k01349l00655j14723J79212
$$ 288872 59363 -229336 -303246 -85457 214579 309133 107784 -192871 -307594 -128382
1075a28382K95966J34129j49361k86529j60928J14342K83308J88518q3622k78528
$$ -128382 167584 301713 152352 -134177 -295105 -180763 102545 291063 207441 -71087
1085g1087k16122N5620K77414K35499l1523k70426k47484P688K55708K55819J9184
$$ -71087 -287209 -231589 45825 281324 249801 -20625 -268109 -260421 -4713 251106 270290
1096B70290k34290k62893n4237K10175K76889Q7414j91397k91130j15152J74215
$$ 270290 36000 -226893 -281130 -70955 205934 293348 101951 -189179 -304331 -130116
1106a30116L02237J36058j62099k99556j49430J39121K88993J65518j06117k75983
$$ -130116 172121 308179 146080 -153476 -302906 -163785 125208 290726 184609 -91374
1116i1374j88305P0817K66225K15109l9661k62124k37926J5031K57639K51830
$$ -91374 -279679 -208862 57363 272472 232811 -29313 -267239 -252208 5431 257261
1126B57261N445k44656k55627k8715K20184K58525O0978j92523k68210r5766J69133
$$ 257261 262706 18050 -237577 -266292 -46108 212417 273395 80872 -187338 -283104 -113971
1137a13971K81444J27138j53599k91534j48817J39601K94255J61674j21050k85572
$$ -113971 167473 294611 141012 -150522 -299339 -159738 134517 296191 175141 -110431
1147a10431j74586R4965K68732J92272o1562k53673k14329K8716K43336K34382
$$ -110431 -285017 -190052 78680 270952 209390 -44283 -258612 -229896 13440 247822
1157B47822K853k37183k51096k6221K26586K60211M7134k09966k63915p0718J89203
$$ 247822 250675 13492 -237604 -263825 -37239 222972 270106 60140 -203775 -274493 -85290
1168h5290K65812R3329j61640k66017j23383J37897K68625J51056j15824k71838
$$ -85290 180522 273851 112211 -153806 -277189 -139292 129333 280389 164565 -107273
1178a07273j71140R5098K68936J88400p5122k59317j99023M8006K42322K14601
$$ -107273 -278413 -183315 85621 274021 198899 -60418 -259441 -211435 30887 245488
1188B45488j5810k28621k30451j7279K15747K49834M5205k10230k62004o2806
$$ 245488 229678 1057 -229394 -246673 -30926 218908 264113 53883 -208121 -270927
1198b70927J98728K64731P8136j80527k59626r5052J50732K52298J21375j18370
$$ -270927 -72199 192532 270668 90141 -169485 -264537 -113805 138493 259868 141498
1208A41498k50158j53499R1855K54551J80270p2322k57566j96069N5315K52204
$$ 141498 -108660 -262159 -170304 84247 264517 192195 -65371 -261440 -206125 46079
1218D6079K03525l5839k36157k09900R152K16502K18623K3041j96129k33617n4634
$$ 46079 249604 213765 -22392 -232292 -223140 -6638 211985 235026 38897 -194720 -249354
1229b49354J82852K48456P7172j70327k55399r4551J52939K54836J14768j33553
$$ -249354 -66502 181954 259126 88799 -166600 -261151 -108212 146624 261392 127839
1239A27839k50919j34249J07421K47860J56338q2661k46082j77219O2503K43460
$$ 127839 -123080 -257329 -149908 97952 254290 171629 -74453 -251672 -189169 54291
1249E4291J91970m3582k36645k00931K6147K20987K03933k076j97788k09561l1307
$$ 54291 246261 202679 -33966 -234897 -208750 12237 216170 214094 16306 -193255 -224562
1260b24562J75535K21182O1420j56016k32699r2640J42430K46001J15968j32048
$$ -224562 -49027 172155 233575 77559 -155140 -247780 -105350 140651 256619 124571
1270A24571k53962j29117J20639K50365J38562j03297k38748j48769P5982K25265
$$ 124571 -129391 -258508 -137869 112496 251058 147761 -90987 -239756 -163774 61491
1280F1491J65787m5964k15158j83762J8786K08009K00960K523k01491k11256k1548
$$ 61491 227278 181314 -33844 -217606 -198820 9189 210149 212672 11181 -200075 -221623
1291b21623J89981K15147M1755j70583k17034o5328J47131K23262R2769j30112
$$ -221623 -31642 183505 225260 54677 -162357 -227685 -80554 142708 235477 105365
1301A05365k31553j13905J15554K36588J26912j02294k31222j35476Q2306K17239
$$ 105365 -126188 -240093 -124539 112049 238961 136667 -94555 -230031 -147725 69514
1311F9514J47642n4558k01785j65646K2970J91995J86561N655j88823k06673k2748
$$ 69514 217156 162598 -39187 -204833 -181863 10132 196693 202348 13525 -193148 -215896
1322b15896J87708K14835L5658j79361k17141m6079J61460K11628O4168j39092
$$ -215896 -28188 186647 222305 42944 -174197 -220276 -58816 152812 216980 77888
1332G7888k06580q6625J12606K07236J09953q7759k09188j35413P2438K11007
$$ 77888 -128692 -215317 -102711 104525 214478 126719 -82469 -217882 -145444 65563
1342F5563J49467n4123k08989j60910L8333J99161J71502j8522j87409j79147
$$ 65563 215030 160907 -48082 -208992 -170659 28502 200004 181482 -5927 -185074
1352a85074n898J74614J88195K8071j61942j98040m5956J50506K02396O1557j37041
$$ -185074 -190972 -16358 171837 199908 37966 -160074 -206030 -55524 146872 208429 71388
1363G1388k00122p6924J15094J95602R7931r0435j94111j23179O9123J98195J44152
$$ 71388 -128734 -205658 -90564 105038 202969 112534 -81577 -204756 -135633 62562 206714
1374B06714n2834k01714j60433M2333K03641J65540l5156j93585j61647J9756
$$ 206714 153880 -47834 -208267 -165934 37707 203247 168091 -25494 -187141 -167385
1384a67385J71751J61081M962j48923j65365l6760J31544J77431O3888j16642
$$ -167385 4366 165447 170409 21486 -143879 -180639 -49095 128336 192224 75582
1394G5582j92600q3850J08060J99689R5701r8146j96841j07112Q2946J90077J21641
$$ 75582 -117018 -200868 -92808 106881 202582 104436 -92405 -199517 -116571 73506 195147
1405A95147o2530j86682j35381M2868J82333J49864k8358j77187j56707J4055
$$ 195147 132617 -54065 -189446 -146578 35755 185619 157261 -19926 -176633 -162578
1415a62578J66847J59150L308j51368j61885k4170J32460J67076M9289j16522
$$ -162578 4269 163419 166727 15359 -146526 -170696 -38236 128840 178129 61607
1425F1607j76437p2792J05137J85122Q9430r6424j89719r7936Q8101J85227J03516
$$ 61607 -114830 -187622 -82485 102637 192067 95643 -94076 -192012 -103911 81316 184832
1436A84832p2464j74001j12581N2138J60570J22406k1791j53222j38754N46J43999
$$ 184832 112368 -61633 -174214 -122076 38494 160900 139109 -14113 -152867 -152321 -8322
1447h322J57600J9455j44403j71443k8431J40362J73719L8427j30249j70768m9605
$$ -8322 149278 168733 24330 -147113 -175544 -35182 138537 176964 46715 -124053 -173658
1458a73658J14135J65257O6283r3302j64506q4963P5920J64746J00837o1071j66360
$$ -173658 -59523 105734 172017 78715 -85791 -170754 -94834 69912 170749 109678 -56682
1469e6682j10404M7566J58447J19847l0462j48826j28878J0338J39805J38787
$$ -56682 -167086 -119520 38927 158774 128312 -20514 -149392 -139054 751 139538
1479A39538J3057j31674j55577k9508J29841J64384L8581j26751j63460m2660
$$ 139538 152595 20921 -134656 -164164 -34323 130061 168642 41891 -121569 -164229
1489a64229J13538J54036N3493r1885j47522p0389O7198J46760R1054m6751j48765
$$ -164229 -50691 103345 156838 64953 -82569 -152958 -85760 61000 152054 105303 -43462
1500d3462j13335L5838J53290J26615k7556j53829j32972J8976J49187J32228
$$ -43462 -156797 -120959 32331 158946 131390 -22439 -155411 -136435 12752 144980
1510A44980p165j35422j32527r556J19274J36995K8266j06468j41737m6156R4509
$$ 144980 137815 2393 -130134 -139690 -20416 116579 144845 38377 -103360 -149516 -55007
1521e5007J46197O1247q3746j46608p2767O9654J44981Q5124n5749j40159r8402
$$ -55007 91190 152437 68691 -77917 -150684 -81030 63951 149075 93326 -46833 -145235
1532a45235L6958J39025J12044k1149j39242j24492J2628J36144J30823l589j32161
$$ -145235 -108277 30748 142792 121643 -17599 -142091 -129463 6681 137504 133915 1754
1543A754j29465o112J19541J27142J9370j00207j27189m0902Q4046J33022O0935
$$ 1754 -127711 -133823 -14282 112860 132230 32023 -95166 -136068 -52022 81000 141935
1554A41935p0732j41860p8362O7492J46585Q4976o1450j44478q7543N1024J34397
$$ 141935 71203 -70657 -149019 -81527 65058 150034 88584 -55894 -143437 -92413 41984
1565D1984Q9666l1044j22016j01120J0491J13491J14232R040j10202j26214k2553
$$ 41984 131650 100606 -21410 -122530 -112039 1452 115684 124724 14522 -111692 -134245
1576a34245J08350J33472K9508j01229j33125l8031Q9293J30251N0779p3614j31968
$$ -134245 -25895 107577 137085 35856 -97269 -135300 -46007 84244 135023 61409 -70559
1587g0559o6598O2409J33403P9939n2610j34328q9130M5828J30569Q9890l1923
$$ -70559 -137157 -74748 58655 138594 85984 -48344 -137474 -91646 38923 128813 96890
1598I6890j21675r3391J5994J07839J02302M045r8626j13209k2251R3160J24053
$$ 96890 -24785 -118176 -102182 5657 107959 112004 13378 -99831 -122082 -28922 95131
1609I5131L6782r0908j31713m4225Q6784J33391M8710p9083j28432n4829O4890
$$ 95131 131913 41005 -90708 -134933 -48149 85242 133952 54869 -73563 -128392 -63502
1620f3502J21088O5584m6915j14783q1170K9345J14978R4893j6997j15902j05359
$$ -63502 57586 123170 76255 -38528 -119698 -90353 24625 119518 102521 -13381 -118740
1631a18740R347J14093J09623j761j07486j08446j0454R4999J09873K5203q1679
$$ -118740 -109393 4700 114323 112562 5076 -103370 -113824 -18825 91048 116251 34572
1642C4572j16400m0932P3939J21706N2923o8213j23348o0637O2712J20362O2844
$$ 34572 -81828 -122760 -48821 72885 125808 57595 -65753 -126390 -63678 56684 119528
1653A19528m8077j11530p1825K9838J04178Q5528j2791j01560r9610j017J03420
$$ 119528 71451 -40079 -111904 -82066 22112 107640 94849 -6711 -106321 -107338 -3918
1664c918J11095O231j02472j13477j3016R7324J11082K1689q4655j09221l4898
$$ -3918 107177 113408 10936 -102541 -115557 -18233 92849 114538 29883 -79338 -114236
1675a14236O9583J09996N0167n7259j12838o5563M8911J18534P3971m2764j16399
$$ -114236 -44653 65343 115510 58251 -54587 -120150 -71239 47295 121266 78502 -37897
1686c7897q0159L6006J10688Q1569k3264j00938q7840P525R4754R2892Q644q5814
$$ -37897 -118056 -82050 28638 110207 86943 -13995 -101835 -94310 444 93336 101980 16166
1698A6166j03587k3270Q3377J10330L2382p9148j12294l8904O9310J12073M6525
$$ 16166 -87421 -110691 -27314 83016 115398 36250 -76044 -114948 -45638 66435 112960
1709A12960n7542j08096n9031M3749J07734P3123l3395j09829q3521K5709J12053
$$ 112960 55418 -52678 -111709 -67960 39774 112897 79502 -30327 -113848 -88139 23914
1720B3914Q8775k0084j08778q9069J1759R8538Q9894M10q5526r2037j8131P3995
$$ 23914 112689 92605 -16173 -105242 -93483 5055 94949 95359 9833 -82204 -100335 -26340
1732b6340J00403L4662o7633j08901m6511O3269J15232N2932n9629j13136n6418
$$ -26340 74063 108725 41092 -67809 -114320 -51051 64181 117113 57484 -55652 -112070
1743a12070N0344J06552O3224l6942j00014p2962J8394R7959Q6849q519r8494
$$ -112070 -61726 44826 108050 71108 -28906 -101868 -83474 14485 101334 92815 -5679
1754e679r4603L56R7502J00366M012r1573r7736j4252Q1089R7277K5811o7606
$$ -5679 -100282 -99926 -2424 97942 101954 10381 -87355 -101607 -20518 76759 102570 34964
1766C4964j00611m1067N7970J05602N3621n0109j11069o2543M6459J08991O8113
$$ 34964 -65647 -106714 -48744 56858 110479 60370 -50699 -113242 -66783 42208 110321
1777A10321l7636j05791p1634K8699R5657P7144j0727r1180q6360m164Q6806R7663
$$ 110321 72685 -33106 -104740 -76041 19616 96760 86033 -5147 -91507 -95671 -8865 88798
1789H8798J4218q4362j03592k1750P9998J06134K7825p2861j03505l6836O2246
$$ 88798 103016 18654 -84938 -106688 -26690 79444 107269 34408 -69097 -105933 -43687
1800d3687J00564M7259m7618j00926o0249L5214J04092P3489k8801j07073q1391
$$ -43687 56877 104136 56518 -44408 -104657 -69443 34649 108138 79337 -27736 -109127
1811a09127K5440J04764Q2652j7532r9626q2408P275Q6744Q6435Q536p7054r2995
$$ -109127 -83687 21077 103729 86197 -13429 -95837 -88562 -1818 84617 93153 16099 -76896
1823g6896k4264P1734J01864L4863o7936j06522m1154O2471J05492M6520n3469
$$ -76896 -101160 -29426 72438 107301 39365 -67157 -108311 -45840 59652 106172 52703
1834E2703j00139n4649L9107R6701O6346k5321r6282q0523J5668J01069Q8156
$$ 52703 -47436 -102085 -62978 33723 100069 74748 -21534 -102057 -86389 14680 102836
1845A02836j0813r9820r1221M316R5043R0736L235q4695r1095j5486P2710R4476
$$ 102836 92023 -7797 -99018 -94702 341 91077 94312 9617 -81478 -96964 -24254 70222
1857G0222L0228o2293r9504m4655N7016J04559N3232n0865j07330n8182M4538
$$ 70222 100450 38157 -61347 -106002 -48986 55573 108805 57940 -49390 -107572 -63034
1868f3034J03155O3027l2868r7195p0524J8990R1794Q0482o097q8616r1327m168
$$ -63034 40121 103148 70280 -26915 -97439 -78449 13345 93827 87730 -886 -92213 -96381
1880i6381Q7853R8337J1919q7752r9437j7034Q0856R9633K3364o9398r7283l5960
$$ -96381 -8528 89809 101728 13976 -85461 -102495 -21639 77994 101358 31960 -65323 -101283
1892a01283N7849R6986M9541m6145j02112o0790L8619J05211O8569l3744j04035
$$ -101283 -43434 53552 103093 56948 -45164 -105954 -67335 37876 106445 72701 -31334
1903c1334p2770K7512R8795P4842j5738q8223q1647l06Q1974R0702J3142p8690
$$ -31334 -104104 -76592 22203 97045 81307 -6916 -88563 -88869 -6895 83807 96949 18259
1915A8259r6933k4814P6491J03673L0479p2361j03526l5764O3377R9734M4480
$$ 18259 -78674 -103488 -26997 76676 107155 34794 -68732 -104496 -41119 58615 103095
1926A03095n2507r6637n5243L7387R9162O8729k8724j01977p6794K2777J00411
$$ 103095 50588 -46049 -101292 -63905 35257 103986 75262 -26715 -103509 -80732 19679
1937A9679Q3042j8396r6583q2779P908Q9187Q5416L326p7974r0570j9856P1282
$$ 19679 102721 84325 -12258 -95037 -87129 2058 87474 90800 12826 -77744 -97600 -26318
1949b6318R8783L1251o7363j04369l9044O3701J05862M3955n7189j03690m8101
$$ -26318 72465 103716 36353 -68016 -107060 -43359 62503 106458 49269 -54421 -102522
1960a02522M5796R7412N9323l5094r3036o8986K0765R2096P9445q666r2404q9932
$$ -102522 -56726 40686 100009 64915 -28121 -97107 -76342 15754 95199 86533 -5871 -95803
1972i5803J197R2814R4897L660q8237r5330j0966P9690R4354K2878o9787r7472
$$ -95803 -94606 -1792 93105 96765 8528 -86802 -97768 -18078 76276 99154 29367 -68105
1984f8105l5082O1663J01997M6011n4492j06344n2843N1063J01854N7396m1542
$$ -68105 -103187 -41524 60473 106484 51992 -54352 -107195 -56132 45722 103118 61576
1995F1576r7651n9523K6543Q8806P1843j2682q6317q1669j096Q5198R4001R413
$$ 61576 -36075 -95598 -69055 19751 91594 78912 -7405 -89074 -90170 -4972 89029 98442
2007I8442q8567r7782j5089Q6648R9280J7606p8361r5542k4647O5761R2883L7633
$$ 98442 9875 -87907 -102996 -16348 82932 100538 22177 -73365 -98012 -32251 60632 98265
2019I8265n1180r6777n0128M2050R7936O4280l6710j02014p0148L1937R9756P4313
$$ 98265 47085 -49692 -99820 -57770 40166 104446 67736 -34278 -104426 -72489 27267 101580
2031A01580k4638r5314p6485J2961Q7431Q2632j36q3421q6839j2063P8459R5016
$$ 101580 76942 -18372 -94857 -81896 5535 88167 88031 4610 -82229 -94292 -15833 79183
2043G9183J8817p3090r6527k8390O6427R6514L6406n6480r4431m8199M5443R6425
$$ 79183 98000 24910 -71617 -100007 -33580 62934 99340 42860 -51571 -99770 -54327 42098
2055D2098N8646l4384j00756o8651K8507J02720P5929k4692j01688q0618K2102
$$ 42098 100744 66360 -34396 -103047 -74540 28180 104109 79417 -22271 -102889 -80787
2066h0787R6839P7045j2674q5074p7668p85P1774Q4023J8178o5090r0856l3333
$$ -80787 16052 93097 80423 -4651 -82319 -83104 -11330 72693 90871 25781 -65075 -98408
2078i8408N9802J02157M0645n9633j04622m6302N6489J03195N0698m8885r9949
$$ -98408 -38606 63551 104196 44563 -60059 -106361 -49872 53323 104021 55136 -44813
2089d4813n4754L8371R3838O1836k4326r1355p0918J3968R0192P7703p632q4561
$$ -44813 -99567 -61196 32642 94478 70152 -21203 -92121 -78153 12039 89742 82110 -2451
2101b451q2204k415P6883Q7123J4345o9992r0238k9703O5285R8409L9986o1284
$$ -2451 -84655 -87070 -10187 76936 91281 21289 -68949 -98652 -33367 65042 105028 43744
2113D3744j06643m5133O0943J07484M5008n6241j01994m7759M9310R0166N2402
$$ 43744 -62899 -108032 -47089 60395 105403 49162 -52832 -100591 -51281 38885 91287
2124I1287l2314q3069n9067J2661P7695P4462J384p8724q6652j1115Q1174R5643
$$ 91287 58973 -24096 -83163 -70502 7193 81655 83039 4315 -82337 -93452 -12278 83365
2136H3365J5913q3295r6615j8831P8966R5494K2358p0563r2846k9605N9174R0922
$$ 83365 99278 15983 -80632 -99463 -20497 74997 97355 26792 -66054 -95659 -36485 54437
2148E4437M0428m7491r1669n0213L8021Q9826O0631k9543q9595o6531J9262Q7001
$$ 54437 94865 47374 -44295 -94508 -56487 33339 93970 64427 -25168 -91699 -72437 14564
2160A4564P4091r359q4662q1520j04Q3322Q9324N697q3229r2108r063Q0323Q9912
$$ 14564 88655 79296 -5366 -86886 -86990 -3668 85656 91353 8124 -83984 -93047 -12724 77188
2173G7188J2657p1111q3360j9933N5046P8826L3717l7325q1199n1327K5168Q7778
$$ 77188 89845 18734 -64626 -84559 -29513 49313 83030 45705 -35494 -86821 -61653 26125
2185B6125O9745k1805r6593p9772K2684J03268P9140k3442j00451p4150J9714
$$ 26125 95870 74065 -22528 -102300 -79616 23652 102792 79350 -21101 -95251 -75537
2196g5537Q9804P1694j0278p8677p1077l099O4829P7142J7473n6169q2786l2177
$$ -75537 14267 85961 75683 -2994 -74071 -77170 -12341 64801 82274 26105 -56681 -88858
2208h8858N1279Q8057M1935m4849r2382n1449M0002R6130N8627l5745r8394o3367
$$ -88858 -37579 50478 92413 47564 -44818 -96267 -56265 39865 98492 62747 -35647 -99014
2220i9014L0881R8418O5474k7295r3473o5018K2713Q2162O3939j1602o9691o4522
$$ -99014 -68133 30285 95759 68464 -25009 -90027 -67314 14848 78787 67185 -2506 -67028
2232f7028n510N7605P2951K3737n0377q6868l7377M9253R8996M7273n4040j05296
$$ -67028 -72538 -14933 58018 81755 31378 -55490 -92867 -43614 55382 102655 48615 -56681
2244e6681n0166N9374J05508M2981n6285r5631l9943M5062Q1846M3600k7809p1047
$$ -56681 -106847 -47473 58035 101016 44731 -50900 -90843 -45781 36065 79665 51856 -19191
2256a9191n3005R104O6238O4800O696o5022p8326j5458O5532Q8963K0267o6131
$$ -19191 -72196 -63092 3146 67946 74642 9620 -68706 -84164 -18632 70331 90598 24467
2268B4467r3028k5494O4652R3174L1989o2399r4641l1081N7256Q9593L4113n0958
$$ 24467 -68561 -94055 -29403 63771 95760 33361 -61280 -92361 -35105 54488 88601 37643
2280C7643q2593l6997L9532P3289M2738k0508o7431n6089K945O6309P4009Q920
$$ 37643 -44950 -81947 -42415 30874 73612 53104 -14327 -70416 -67471 -1162 72847 81767
2292H1767p1399q8675j4148Q0172R6676Q754q4931r0484m803Q0423P9996M513
$$ 81767 10368 -78307 -92455 -12283 84393 93147 8216 -82268 -87071 -6648 73348 77861
2304G7861o5234p0898j2047M7034O2866K9452k7576o5140m7991J3686P3036O4401
$$ 77861 12627 -58271 -70318 -23284 39582 69034 41458 -23682 -71673 -57987 15049 79450
2316G9450r193q2935p4184J0253Q7928P9294j1713q9211p8538J1735Q5727P4966
$$ 79450 70257 -12678 -86862 -76609 11319 90613 78900 -10311 -88849 -77114 8613 83579
2328H3579j0160p8434o8780L581O6414O5102N353n1761o1743j9718L5353O4390
$$ 83579 73419 -5015 -73795 -70214 -3800 61302 66655 14894 -46849 -66567 -31214 33176
2340C3176L6659k3642o9273n6010J7414Q1704O8319j8014r2989p3857K4860R8400
$$ 33176 69835 46193 -23080 -79090 -61676 20028 88347 70333 -22656 -96513 -71653 26747
2352B6747O8894l0244r2951n8082K8507P7521M9023j7665n7054m7381l566M0107
$$ 26747 95641 65397 -27554 -85636 -57129 20392 69415 51750 -5304 -52685 -56251 -16144
2364a6144N6479K7460l3536p1006m4557L3675Q7084N2652m0787r4625n1937M4409
$$ -16144 40335 67795 34259 -36747 -81304 -47629 39455 92107 51320 -43305 -95242 -50833
2376e0833R6922M6952m4860r0282m3096M0517P9189M0273k9722o7456m1363J5262
$$ -50833 46089 93041 48181 -42101 -85197 -44680 34509 74782 45060 -22396 -63759 -48497
2388d8497N5841M6904M76m5860n5253j9605M1675O8737L4482m1131q4868m2365
$$ -48497 7344 54248 54724 8864 -46389 -65994 -24319 44418 78900 37769 -47099 -89464
2400h9464M8207R4537M1797n6115r7239l4911O0590Q8186K5664n3587p3156k0841
$$ -89464 -41257 53280 95077 38962 -58277 -93188 -32598 55588 81252 27665 -45491 -66332
2412f6332L6748N6847K5789j4297m3513m2419p892M2100O3787K4367n2559q2808
$$ -66332 -29584 27263 53052 38755 -4758 -47177 -55069 -12969 50818 75185 22626 -60182
2424f0182k5524O3833R0846K0843p2675r0200j1227P2705P7392P528o2050o5828
$$ -60182 -85706 -21873 68973 89816 17141 -73059 -84286 -11581 65811 73339 11289 -54539
2436e4539q159M6570N4938J6406k8037m9370l0905J1045M8743M7886K147n3538
$$ -54539 -62698 -16128 38810 55216 27179 -22191 -53096 -42051 6692 54578 56725 3187
2448C187o2827j1661O1742P7817J2544p2475q4373o971Q0148Q2286j915q0062
$$ 3187 -59640 -71301 -9559 68258 80802 8327 -76046 -83017 -2869 79417 77502 -2560
2460b560p2169J0706O8768N4553p017m8643m2471n650K3713L8152K9248l439m7053
$$ -2560 -74729 -64023 4745 59298 52281 3638 -38833 -44483 -20770 17382 46630 43191 -3862
2473c862n3234m422O2654P0230O01p9243p7296J1171Q8643O9725j8642q7037n7861
$$ -3862 -57096 -61518 1136 71366 71967 -7276 -84572 -73401 15242 84967 66325 -20712 -78573
2486g8573K4518P1309M5731j7196n3475l8878K705L5998L9929J5434k0698m8449
$$ -78573 -54055 17254 62985 45789 -7686 -46564 -43859 -7861 32068 47502 26804 -21645
2498b1645l5655J4828N9561M9327j1995p2007n9536J8192Q1009O2360k7181q5463
$$ -21645 -57300 -42472 17089 66416 54421 -17586 -77122 -58930 22079 84439 57258 -28205
2510b8205n5124L3291Q0737M3826l2203o9749l1967K5541M7860K6083p421k7101
$$ -28205 -83329 -50038 30699 74525 42322 -27427 -59394 -33853 14007 40090 32669 5568
2522E568l0163j7822J3187M7641M2153j3956o9001n6023K5641Q7305N4213l9925
$$ 5568 -24595 -42417 -29230 18411 60564 46608 -22393 -78416 -52775 34530 88743 48818
2534D8818r4656m3376N3758Q3272K8534n0245o7317j6903L5360M8085J7599j6282
$$ 48818 -45838 -89214 -35456 47816 76350 26105 -41212 -58115 -22755 25330 42929 26647
2546B6647l2322k7900n896K5254M4816K3450k7433o0529l4458L4277P5261L6927
$$ 26647 -5675 -33575 -39471 -14217 30599 54049 26616 -33913 -68371 -34094 41167 78094
2558G8094m4031q4066l1112N2097Q1789K3979n6346p2884j3775N2497N5481R557
$$ 78094 34063 -50003 -81115 -29018 52771 76750 20404 -52480 -66255 -13758 41723 51280
2570E1280l7060m0087j0488J4221K5937K5618R554k2714m7273k6512K8497P0358
$$ 51280 14220 -25867 -36355 -22134 3803 29421 38975 16261 -31012 -57524 -29027 41331
2582D1331L4236m6738q4297k9313O5055Q6360J0352o9968p3816L182O5142N4014
$$ 41331 75567 28829 -55468 -84781 -19726 66634 76986 7018 -66798 -63616 1526 55540
2594E5540p987m6932l5844O65K3865K4443J6572J57k6469l9935j2616L6918N7899
$$ 55540 47553 621 -35223 -34558 -10693 13750 30322 30479 4010 -35925 -48541 -11623 46276
2607D6276J7437n1012p1146j1949O4078P2210K678o9603o5041N223O7105N4860
$$ 46276 63713 12701 -58445 -70394 -6316 65894 68572 -1031 -66072 -60849 6256 61116
2619F1116j0584n7400m0810Q418M0746K9187N57j7988k5127j9103m85K8827M1785
$$ 61116 50532 -6868 -47678 -39260 1486 30673 31230 13242 -11885 -30988 -31473 -2646 39139
2632C9139J1271m3819o1284r036O2923O9760p61p8086o6015J7925P8527N1488
$$ 39139 50410 6591 -54693 -63729 -806 68954 68193 -9893 -75908 -57983 20544 72032
2644G2032k8910o7741l1874K9111M2687J8660j0210k1797j6466j2760K684K9998
$$ 72032 43122 -24619 -56493 -27382 15305 33965 23755 1958 -14508 -27268 -24584 5414
2656E414L4881L358m6344n4593M363O3683N8107j3752p4338n4342K5078P5637
$$ 5414 40295 43653 -2691 -57284 -52921 10762 68869 55117 -19221 -73563 -48485 27152
2668B7152M3932l3137o6970l0567L1556N2693K0874k2595l4759j7520N063J9266
$$ 27152 71084 37947 -29023 -59590 -28034 24659 45533 22938 -11821 -29341 -24278 -5012
2680e012K1879J4671o625l5429l4793M514N2792M9953j3242o9766n2590K7603
$$ -5012 16867 31538 24913 -10516 -45309 -40795 11997 61950 48708 -21058 -73648 -46045
2692d6045Q1187M2025m2806p6230k5054M6437O0226J1362l9956l7581m299J7867
$$ -46045 35142 77167 34361 -41869 -66923 -20486 39740 51102 11146 -26435 -30734 -12867
2704a2867J8464J0395R132p086l1251l1086J2116N1340M1520k2534o9331l9808
$$ -12867 5597 15992 25124 18038 -13213 -44299 -32183 19157 60677 38143 -31188 -70996
2716g0996L6658P6667L0204m8629p1030j8190N0356O0022O226m2190m2870n036
$$ -70996 -34338 42329 72533 23904 -47126 -65316 -14960 45062 51288 9098 -33772 -38808
2728c8808K8265K8725R064r767j7846j9389r896J4573L6355K5588k0731n5649
$$ -38808 -10543 18182 27246 17479 -367 -19756 -29652 -15079 21276 46864 26133 -29516
2740b9516l1977L2384O8913K8921m5884p3750j6528N6743O4773K423n6266m7042
$$ -29516 -61493 -29109 39804 68725 22841 -50909 -67437 -10694 54079 56502 236 -46806
2752d6806P340M2234K6517n024j9373j3182j0404m266J3634L1524K1063k2635
$$ -46806 -39466 2768 29285 24261 4888 -8294 -18698 -22964 -9330 22194 43257 20622
2764B0622n4517k4677M0341O6733J5502n6046o5378m701O3020N7660q723n7879
$$ 20622 -33895 -58572 -18231 48502 64004 7958 -57420 -62121 899 58559 49836 -8043
2776h043m2415J3637M3772K7783p453k6557j9183m099P488J8458K1148N033k3842
$$ -8043 -50458 -36821 6951 34734 27281 724 -18459 -22558 -15070 3388 24536 29569 5727
2789E727l7851j2983L6557N2339J0019m7994n9757l796O0825N7686q021o4396
$$ 5727 -32124 -45107 -8550 43789 53808 5814 -53943 -57739 3086 60772 52751 -11645
2801a1645m8916J8961N8761L1384k1816m0116j7187J1533J9345J2874N063J604
$$ -11645 -60561 -41600 17161 48545 26729 -13387 -30574 -19041 304 13178 18241 19845
2813A9845j8269l0131j0570L4867M8039O001n1612n6216M818O6279N1334k0110
$$ 19845 1576 -28555 -39125 -4258 43781 49782 -1830 -58046 -53228 13051 64385 44275
2825D4275o7468l7587K8072N7644K4955k6426m2212j5549J6908K1590J5352M08
$$ 44275 -23193 -60780 -32708 24936 49891 23465 -18747 -34296 -17388 4202 19554 19962
2837A9962q094k2057j9472L769L3043L4420m840m7287m2134J1201N6142M5891
$$ 19962 11868 -10189 -29661 -25892 7151 41571 36731 -10556 -52690 -41489 14653 60544
2849F0544k0816o3628l7727K8499O2001K8432l3440n2325j6563K9347L6831Q840
$$ 60544 39728 -23900 -61627 -33128 28873 57305 23865 -28460 -45023 -15676 21155 29995
2861B9995j6862j7706j1290m458P838K1146K2815k835l9050l8602J1361N8431
$$ 29995 13133 -4573 -15863 -20321 -12483 8663 31478 28643 -10407 -49009 -37648 20783
2873B0783M0843k6807o6324l1950L8645O3067J9266m1737n2544p268L4868L5862
$$ 20783 61626 34819 -31505 -63455 -24810 38257 57523 15786 -36758 -44026 -9158 26704
2885B6704L105j9386k0741r521N58J4381K2511J4967j5662l7546k4410K2702N0186
$$ 26704 29809 10423 -10318 -19839 -19281 -4900 17611 32578 16916 -20630 -45040 -22338 27848
2898B7848K3918k9309n6971k1640L7416N8847J4133m0456n3655q103M2286M0177
$$ 27848 51766 22457 -34514 -56154 -18738 40109 54242 13786 -39869 -47972 -5686 34491
2910C4491J959l0393l0223j761J5775J9033J0272J076j3823k5609j5804J8266
$$ 34491 36450 6057 -24166 -25927 -10152 8881 19153 20229 6406 -19203 -35007 -16741
2922a6741M3512K1821k7857n7258k0549M2455O0752J0180n0776n5297J855N0231
$$ -16741 26771 48592 20735 -36523 -57072 -14617 46135 56315 5539 -49758 -47903 2328
2934B328M1588q402m0224k6515P039K1900J7869O466o430j6342k1871p733K4016
$$ 2328 43916 35514 -4710 -31225 -24186 -2286 15583 22049 15619 -723 -22594 -30327 -6311
2947f311L8081R209l4534m5657p978M3916M9116J588m8784m6623M400M8586L9823
$$ -6311 31770 40979 6445 -39212 -47190 -3274 45842 47430 -1354 -47977 -43577 5009 44832
2960D4832r366m1295l1696P650L2732K3384j400j9071k0144q030N437K1893K2921
$$ 44832 35466 -5829 -37525 -29875 2857 26241 24841 5770 -14374 -22404 -16967 4926 27847
2973B7847K486k9588l6187n688L9055M8562j122n1508m8125J1082N7083L9771
$$ 27847 30333 745 -35442 -41130 -2075 46487 45365 -6143 -54268 -43186 13897 53668
2985E3668j9318n1972k6436K0286L8747J7256j2467k2414j4937k348Q179K1848
$$ 53668 34350 -17622 -44058 -23772 14975 32231 19764 -2650 -17587 -19935 -11756 10092
2997A0092J7952l578l1827l0354M828M3459L6791j2124m9949l5644J8290N0834
$$ 10092 28044 24466 -7361 -37715 -32887 10572 47363 35239 -14710 -50354 -32064 18770
3009A8770L1570k1996m8019k5189K0906M0913K0597j5209l2608j8720P239K3375
$$ 18770 50340 28344 -19675 -44864 -23958 16955 37552 22343 -10265 -28985 -21746 1629
3021A629J8909M269j3462k7328j5612J0974L4928K5356j3321m4038l1220J9487
$$ 1629 20538 24807 11345 -15983 -31595 -20621 14307 39663 26342 -17696 -48916 -29429
3033b9429N2625K9529k6984n4448k0844L1271M6234J2786k7358l4861r041J8573
$$ -29429 23196 52725 25741 -28707 -49551 -18280 27954 40740 13382 -21479 -30520 -11947
3045a1947K1385J1674k107j3711k2668j1390J3563L3935K1939k0395m5461k1832
$$ -11947 9438 21112 19005 5294 -17374 -28764 -15201 18734 40673 20278 -25183 -47015
3057d7015K6974N1144J7353l2650m9750j1861L3266M3863R422k9929l6445p908
$$ -47015 -20041 31103 48456 15806 -33944 -45805 -12539 31324 40746 10817 -25628 -33536
3069c3536K0964K9445J3034j4253k4241j6984K726K3357K3834O482k4753l1818
$$ -33536 -12572 16873 29907 15654 -8587 -25571 -22845 512 24346 30828 6075 -25743
3081b5743j3125K7424M1534J3643l1445m7113j1892L8232M6468N002l7696l9683
$$ -25743 -38868 -11444 30090 43733 12288 -34825 -46717 -8485 37983 42985 5289 -34394
3093c4394k566L3231L1300N14k0506k5536n775R919J8044K0552R47k2608l2363
$$ -34394 -36960 -3729 27571 28085 7579 -17957 -23732 -13813 4231 24783 25730 3122 -29241
3106b9241n573L2240L8873M237l9078m3436K601M3057L7867n442m1204l2024O027
$$ -29241 -34814 -2574 36299 40536 1458 -41978 -39377 3680 41547 36105 -5099 -37123 -31096
3119c1096L3915K7215j890k5475k5008n298J7628K6027J2363j1325k7960k1326
$$ -31096 2819 30034 28144 2669 -22339 -27637 -10009 16018 28381 17056 -10904 -32230
3131c2230Q026L1534K6837m171l5032l3426M899L8937L3973m162m1813l4785R152
$$ -32230 -24204 7330 34167 29996 -5036 -38462 -33563 5374 39347 35185 -6628 -41413 -32261
3144c2261M0721L1403j0507l6061k5173P282K6798K0688R38j7168k3232j0750
$$ -32261 8460 39863 29356 -6705 -31878 -24596 2202 22890 23828 6660 -16572 -27322
3156b7322J0668K6814K4100q609l6391l0885J3325M3371K9170j6810m4615k7408
$$ -27322 -16654 10160 34260 25651 -10740 -41625 -28300 15071 44241 27431 -17184 -44592
3168d4592K0865M1029K1744j8282l3726j8874J0425K6337K0178k07k3212k3264
$$ -44592 -23727 17302 39046 20764 -12962 -31836 -21411 4926 25104 24897 1685 -21579
3180b1579o452K0587K8534J1547j8979l3406j6798J9446L6430J9103j8590m0558
$$ -21579 -28031 -7444 21090 32637 13658 -19748 -36546 -17100 19330 38433 19843 -20715
3192b0715j8877J9236M0748J9868j9779m0145j8648J8600L5855J6373j5008k8597
$$ -20715 -39592 -20356 20392 40260 20481 -19664 -38312 -19712 16143 32516 17508 -11089
3204a1089j6827P649K3420J9988J100j8468k8041q949J9801L4674J5223k4653
$$ -11089 -27916 -20267 3153 23141 24241 5773 -22268 -31217 -11416 23258 38481 13828
3216A3828m0776j4140K7853M1175J1954k9316l7700r766K8239L0188R023j6913
$$ 13828 -26948 -41088 -13235 27940 39894 10578 -27122 -36888 -8649 21539 30562 13649
3228A3649k8642j3376J0070K6360J9283l663k6668k6643K664K7190L0566P25k9935
$$ 13649 -14993 -28369 -18299 8061 27344 23681 -2987 -29630 -26966 224 30790 31515 1580
3241A580l2505l091L1265L2508M264k8815l4023o759K8297L3622O982k4435l2792
$$ 1580 -30925 -34016 -2751 29757 34021 5206 -28817 -35576 -7279 26343 33325 8890 -23902
3254b3902p733K1255K8311J1314j6288k5931j4134R809K3275K1376k867k5328
$$ -23902 -31635 -10380 17931 29245 12957 -12974 -27108 -17299 5976 27352 24485 -843
3266h43k9432o59L2176L2695j132l4732l3795L413L4930K9186k534l1390k6721
$$ -843 -30275 -30934 1242 33937 32805 -1927 -35722 -32309 2621 31807 29273 -2117 -28838
3279b8838J636K4947K3710N183j7539k5756j2178J3805K8470J8882j1517l3268
$$ -28838 -27202 -2255 21455 26638 9099 -16657 -28835 -15030 13440 32322 20805 -12463
3291a2463k1351J2147L4164K3108j1472l4716k3401J0175L1805K4284p928k9939
$$ -12463 -33814 -21667 12497 35605 24133 -10583 -33984 -23809 7996 32280 24352 -5587
3303e587k5011M815K7723K5378r31k4353k8395j396K3853K4575O073j9009k4365
$$ -5587 -30598 -25783 1940 27318 26387 2034 -26361 -27757 -3904 20671 26744 7735 -16630
3316a6630j2490J4281K8968J7558j2055l3413k2391J3678L7063K1981j5304l5324
$$ -16630 -29120 -14839 14129 31687 19632 -13781 -36172 -22494 14569 36550 21246 -14078
3328a4078k1147J4987L3625J7459j1909k6909j8371N038K3427K1277Q53k0250
$$ -14078 -35225 -20238 13387 30846 18937 -7972 -26343 -21305 2122 23399 24252 4002
3340D002k5874p747K1714L0598Q724k1577l2783r316K1809L2191J0343j9767l0464
$$ 4002 -21872 -29619 -7905 22693 31417 9840 -22943 -32259 -10450 21741 32084 12317 -18147
3353a8147j1411J4378L0474J4329j1804k9135j7833R068K8602K0806p586k7204
$$ -18147 -29558 -15180 15294 29623 17819 -11316 -29149 -20081 8521 29327 21741 -5463
3365e463k2098M165K5562K3072J02k3301k4991m874K2148K7934P785j9807l2950
$$ -5463 -27561 -23396 2166 25238 25340 2039 -22952 -27826 -5678 22256 30041 10234 -22716
3378b2716r877K3403L1426J0080k3518k9242p680J7876K6801J1744j5066k4069
$$ -22716 -32593 -9190 22236 32316 8798 -20444 -28124 -10248 16553 28297 13231 -10838
3390a0838j5011Q566K3467J9611l893k3958k4355j557K8537K7102k05k8227k5942
$$ -10838 -25849 -17283 6184 25795 21902 -2056 -26411 -27968 569 27671 27466 -761 -26703
3403b6703J19K6376K5334J065k3123k4820n112J9369K6047Q300j5890k8294j1208
$$ -26703 -26584 -208 25126 26191 3068 -21752 -26864 -7495 18552 26852 10962 -17332 -28540
3416b8540J5429K8984J2564j3081k7374j6865J2232K5871J7028o241k5230k1225
$$ -28540 -13111 15873 28437 15356 -12018 -28883 -16651 9220 26248 20007 -5223 -26448
3428b6448K985K5933K4624j662k6733k5172L70K7408K4919m96k4258k3400k013
$$ -26448 -23463 2470 27094 25432 -1301 -26473 -26103 1305 26224 25728 1470 -21930 -23943
3441b3943J9763K2046O873j6287k2096j2449J1968K6958J4355j0882k8511j7453
$$ -23943 -4180 17866 24739 8452 -13644 -26093 -14125 12833 27188 16306 -12205 -29658
3453b9658J1818K8710J8423j1537k8964j7047R404K5105J9267n540k2935j9564
$$ -29658 -17840 10870 29293 17756 -11208 -28255 -18851 6254 25521 19981 -2954 -22518
3465b2518J12K0696K4086K152k1018k4765l811J9678K3735P895j9240k5054n906
$$ -22518 -22406 -1710 22376 24528 3510 -21255 -25066 -5388 18347 26242 7002 -18052 -23958
3478b3958J4903K3254J0979j1945k4330j4799R738K6414J8359j1192k7036j7664
$$ -23958 -9055 14199 25178 13233 -11097 -25896 -16158 10256 28615 17423 -9613 -27277
3490b7277Q833K6658J7327o477k3613j6967J423K1226J8451J545j7530k2733n839
$$ -27277 -18444 8214 25541 19064 -4549 -21516 -20093 1133 19584 21129 3599 -19134 -24973
3503b4973J8798K6013P758j9530k6120r534J9176K6691P004j6215k3518q527J2000
$$ -24973 -6175 19838 27596 8066 -18054 -27588 -8412 18279 25283 9068 -14450 -22977 -10977
3516a0977K1549J2859q332k2717j6410N912K3384J8910m668k2379k1749L940K1987
$$ -10977 10572 23431 15099 -7618 -24028 -18116 5268 24178 19510 -2869 -24618 -20678 1309
3529A309K0262p40k0588k0108k697J8410K1783N977j7558k2676p399J5057K5512
$$ 1309 21571 20831 243 -19865 -22562 -4152 17631 23608 6050 -16626 -24025 -8968 16544
3542A6544Q948j5152k5729r305J3640K4356J1484j3049k1382j2914P817K1331
$$ 16544 25492 10340 -15389 -24694 -11054 13302 24786 11737 -9645 -22559 -14742 6589
3554F589J5349m532j9366j9652L15K2341K1983j577k0873k2502k43K1708J9909
$$ 6589 21938 17406 -1960 -21612 -21297 1044 23027 21450 577 -21925 -22168 -460 19449
3567A9449J223j8976j8374m353J4186J9624Q076j0755k1517j2833J1323K4598
$$ 19449 20672 1696 -16678 -21031 -6845 12779 20855 10100 -11417 -24250 -12927 11671
3579A1671J3070j1553k4096j2582R027K3832J3145p704k0621j4094J918J9796
$$ 11671 24741 13188 -10908 -23490 -14463 9369 22514 14810 -5811 -19905 -17987 1809
3591A809J8459j250j8981j9639j645J9565K1363K660k0308k0268l514J7722K0489
$$ 1809 20268 19018 37 -19602 -21247 -1682 19681 22341 2033 -18235 -21749 -4027 16462
3604A6462M759j4886j8319p740P994K1953J1090p687k1135j6056Q321K4115J3964
$$ 16462 21221 6335 -11984 -19724 -11730 10223 21313 13626 -7509 -23565 -15244 8871 22835
3617B2835o251k2907j5124N941K0070J4595m724j6008j5580j386J6298K0187L220
$$ 22835 16584 -6323 -21447 -15506 4564 19159 14435 -1573 -17153 -18539 -2241 17946 21166
3630B1166j6138k2905l231J5684K2689N136j5305k2821m692J2364J9780R496j0981
$$ 21166 5028 -17877 -21108 -5424 17265 22401 7096 -15725 -20417 -8053 11727 21223 10242
3643A0242j8838j1183P766J8794J3836m137k2512j7026O317K0538J6719m347j9819
$$ 10242 -8596 -19779 -12013 6781 20617 16480 -6032 -23058 -16741 3797 20516 16169 -3650
3656c650j4343J719J7407J5157O28j3880j7208n215J3240K0148P522j3693k1404
$$ -3650 -17993 -16274 1133 16290 16918 3038 -14170 -19385 -6145 14003 21525 7832 -13572
3669a3572r187J3864K3224O988j1840k1289q973J0788J8338J0323p454j5996j3305
$$ -13572 -22759 -8895 14329 21317 9477 -11812 -20785 -9997 8341 18664 11210 -4786 -18091
3682a8091K335J8738J6697k127j9005j8583J954J9723J5738Q80j9224j5502j43
$$ -18091 -15756 2982 19679 17552 -1453 -20036 -18082 1641 17379 18259 -965 -16467 -16610
3695a6610J3274J6348M480j1304j7715p514R311K0126J0867j1086k1296j0177
$$ -16610 -3336 13012 17492 6188 -11527 -19041 -9730 10396 21263 10177 -11119 -21296
3707b1296J1911J9863Q375p947j9031r362M446J6665J2281j397j6244j4948K5
$$ -21296 -9385 10478 18853 10906 -8125 -17487 -13041 3624 15905 14508 -1736 -16684 -16659
3720a6659J5600J7278J935j7193j7258j927J5889J8570J349j3745j7285l540J1571
$$ -16659 -1059 16219 18154 961 -16297 -18224 -2335 16235 17584 3839 -13446 -16986 -5415
3733e415J6545O802r814j6430j0420Q125J7623J3875p544k0634j3068Q439J8653
$$ -5415 11130 17932 8118 -8312 -18732 -10607 7016 20891 13347 -7287 -20355 -11916 6737
3746F737J0959n105j5737j2662J672J4606J4360O36j3063j5727m115J4725J7464
$$ 6737 17696 12591 -3146 -15808 -14136 470 14830 15466 2403 -13324 -17439 -2714 14750
3759A4750L588j4205j8145m953J4004J7890M294j1696j5301n595P197J4276J1204
$$ 14750 18338 4133 -14012 -18965 -4961 12929 17223 5527 -9774 -15369 -8172 6104 17308
3772A7308o273j6233j2169L103J9300J3143l948j7755j5029N017J6173J2645k192
$$ 17308 11035 -5198 -17367 -14264 5036 18179 14231 -3524 -18553 -13536 2637 15282 13090
3785A3090j3211j3300p68J0495J6459K360q184j8077o757J0749J8504Q383j2297
$$ 13090 -121 -13421 -14189 -3694 12765 15125 6941 -11136 -17893 -7144 11360 19743 7446
3798G446j8516o627R710J6394R054q628j5267j0199M884J5720J1423k278j5380
$$ 7446 -11070 -17697 -7987 8407 17461 8833 -6434 -16633 -11749 3971 15394 13116 -2264
3811b264j4631J731J6617J5560j064j6488j5171K052J4023J2995m40j0597j3920
$$ -2264 -16895 -15164 1453 17013 15949 -539 -15710 -13658 365 13360 12920 2323 -11597
3824a1597l340R855J4730O499r363j5446q683Q481J7796P996q940j6264q955Q696
$$ -11597 -14937 -5082 9648 16147 6784 -8662 -17345 -8864 8932 16928 7988 -8276 -17231 -8535
3838h535J4686Q626l520j2746j1564l76J3441J4871j53j4144j5161p81J3993J4873
$$ -8535 6151 14777 11257 -1489 -13053 -13429 12 14883 14730 586 -14575 -15356 -1363 13510
3852A3510L327j4806j5564j983J1570J6277K304q828j4764n892P215J5125R019
$$ 13510 16837 2031 -13533 -15516 -3946 12331 14635 5807 -8957 -14849 -7634 7491 16510
3865A6510p562j5304j0630O149J7591J0160o202j6707r342M351J3401R762j72
$$ 16510 8948 -6356 -16986 -10837 6754 16914 10712 -5995 -15337 -10986 2415 12177 12005
3878A2005j2132j2951j152J0152J6625K007r831j7911k584J1438J6452L257j1513
$$ 12005 -127 -13078 -14230 -4078 12547 14554 4723 -13188 -15772 -4334 12118 15375 3862
3891C862j4927l969R795J2568P030o028j4000j0179N555J5120J0754m198j6038
$$ 3862 -11065 -15034 -5239 7329 14359 8331 -5669 -15848 -10293 4827 15581 11383 -4655
3904d655j1792M295J6764J1433l950j5072j0640J466J2883J0575J725r282j4168
$$ -4655 -16447 -12152 4612 16045 12095 -2977 -13617 -12151 732 11307 13032 3750 -10418
3917a0418m092R285J5484M892r091j5836o468R153J5725O700r018j3357p598O220
$$ -10418 -14510 -5225 10259 15151 6060 -9776 -16244 -7091 8634 15334 6316 -7041 -14639 -8419
3931h419J3972P959l548j1908j1992J487J4762J3492k089j5048j4209J991J4157
$$ -8419 5553 13512 9964 -1944 -13936 -12449 2313 15805 13716 -1332 -15541 -13550 607
3944F07J2842O81j2663j1963j616Q691J2955M641p843j4593p811Q168J5955Q531
$$ 607 13449 14130 1467 -10496 -12112 -3421 9534 14175 6332 -8261 -16072 -7904 8051 16582
3958A6582p930j6313q286P518J5999O624o965j2046p402J906J2461J0234o68j2200
$$ 16582 8652 -7661 -15947 -8429 7570 14194 7229 -4817 -12219 -10313 2148 12382 11714 -486
3972d86j3057p04J2540J5987O31j2803j4728k219J4289J1593K316r628j2727l762
$$ -486 -13543 -14247 -1707 14280 14911 2108 -12620 -14839 -550 11043 13359 3731 -8996 -12758
3986a2758O531J3871Q317p526j5574p635N472J5940R034o301j4697r156N483J2824
$$ -12758 -6227 7644 15961 8435 -7139 -14774 -9302 6638 15672 9371 -5326 -14482 -8999 3825
4000C825Q757k859j1498j0377J339R802J2302J280j0275j3305l475J0364J6367
$$ 3825 12582 9723 -1775 -12152 -10813 -1011 11291 12571 2296 -11009 -14484 -4120 12247
4013A2247L262j1720j3963m512J1097J2025N479q220j1610o394N366J1854R096
$$ 12247 15509 3789 -10174 -14686 -3589 8436 13915 5695 -5915 -12309 -6943 4911 14007
4026A4007m390j2848j1214L075J4995J1517m923j3855r957K834J3112R331j579
$$ 14007 9617 -3231 -14445 -11370 3625 15142 10219 -3636 -13593 -10759 2353 11684 10105
4039A0105j0257j0137j683Q802J2173M199q220j3609o317R544J4872M212q471
$$ 10105 -152 -10289 -11972 -3170 9003 13202 4982 -8627 -14944 -5400 9472 13684 5213
4052E213j3178o186P895J2182O700m404j2629q449K697J0965J2242o45j3215j2878
$$ 5213 -7965 -14151 -6256 5926 12626 8222 -4407 -12856 -10159 806 13048 12403 -812 -13690
4066a3690K124J2508J4299m013j2320j1296Q55J1653Q917L143r662r622n955P743
$$ -13690 -11566 942 15241 11228 -1092 -12388 -11533 120 9037 12180 2518 -7104 -13059 -5316
4080e316J2704P012p803j4413o996P280J5152N926p159j2696p434O401J0624R111
$$ -5316 7388 14400 6597 -7816 -14812 -7532 7620 13546 6387 -6309 -13743 -7342 3282 12393
4094A2393k926j0571j0516m16J2504J1514L51j0323j3309k368J3108J1152J526
$$ 12393 9467 -1104 -11620 -12036 468 11982 12333 2010 -11299 -13667 -559 10593 12119
4107A2119r688j2227l591J0895R838N582p053j2262o799N186J4658P548n840j4333
$$ 12119 2431 -9796 -13387 -2492 7346 12928 5875 -6387 -13186 -8000 6658 14206 8366 -5967
4121e967p488N367J3614Q404n361j2909p711L955R055R624J23r764j0724k825
$$ -5967 -13455 -8088 5526 13930 8569 -4340 -12051 -8096 959 10583 10706 942 -9782 -12607
4135a2607J0601J1417L557j0502j2676l861J0322J3758K805q471j1760n356Q959
$$ -12607 -2006 9411 12968 2466 -10210 -14071 -3749 10009 12814 4343 -7417 -12773 -3814
4148c814R993O715n064j2371r035M304J3072J0100l756j3972q842K849J2471J0075
$$ -3814 6179 12894 7830 -4541 -13576 -9272 3800 13900 10144 -3828 -12670 -9821 2650 12725
4162A2725k879j2286q974L63J0053J0506J429q628j1542l261P589J2739N505r393
$$ 12725 9846 -2440 -11414 -11051 -998 9508 10937 2309 -9233 -12494 -4905 7834 13339 3946
4176C946j2796l476Q007J1464M672o340j1300o569N740R805Q707k289j1263r414
$$ 3946 -8850 -12326 -4319 7145 11817 5477 -5823 -12392 -6652 3153 11860 9571 -1692 -11106
4190a1106M90J2460R991j133j2015j1445K238J2024R564m02q619j1335j393P227
$$ -11106 -10616 1844 11835 10702 -1313 -12758 -10520 1504 11068 10666 2047 -9288 -10681 -3454
4204c454J0783M123n427j3089o356P971J2247O967q229j2162p880Q330J2543N877
$$ -3454 7329 11452 6025 -7064 -13420 -5449 6798 13765 5536 -6626 -14506 -6176 6367 12244
4218A2244l819j1973q339L035J1003R139j657j0142j1119n81J1629J2766k96j1186
$$ 12244 8425 -3548 -11887 -8852 2151 11290 9633 -509 -11628 -12209 -580 12186 11890 704
4232G04j2902O08R456J1941J341q580r992m790O576J1543O044m524j3837p564
$$ 704 -12198 -11590 -2134 9807 11148 2568 -7424 -12214 -5638 5905 11949 7425 -6412 -13976
4246a3976N487J4451P434n787j1829q442M758J1198Q725l982r747q768n05J1415
$$ -13976 -8489 5962 13396 7609 -4220 -12662 -7904 3294 12019 8037 -1710 -10478 -10983 432
4260D32R719R45r296j1904k333R470J3292K523r676j2350r44O883J1753K598n898
$$ 432 10151 11096 1800 -10104 -12437 -2967 10325 12848 3172 -9178 -10122 -3239 8514 11112 5214
4275E214j0382o307M382J1509P721k753j2856r909L637J4031Q012l399j2494r042
$$ 5214 -5168 -11475 -7093 4416 12137 9384 -3472 -13381 -9744 4287 12299 8900 -3594 -12636
4289a2636L429J0105R332o40p687j0824k061Q610J1648K865q752j2620l104R126
$$ -12636 -9207 898 10230 9590 1903 -8921 -10982 -2372 9276 12141 3389 -9231 -12335 -3209
4303c209J1904L777q707j1223l906P096J0438M754m055j0028q672L208J1178J0158
$$ -3209 8695 12472 3765 -7458 -11364 -4268 6170 10924 6869 -3159 -11831 -8623 2555 12713
4317A2713l058j1716r765K214J1518R060j311j2036q875J337R855R204J575q274
$$ 12713 9655 -2061 -11826 -9612 1906 10966 9655 -2381 -11256 -9919 -64 9140 10715 2441
4331B441r966k548N513J3303M297q201j3289m723P876J2344N101p354j0120o344
$$ 2441 -7525 -10073 -4560 8743 13040 4839 -8450 -13173 -5297 7047 12148 4794 -5326 -11670
4345a1670M252J0532P280k805r290r039K75J1385J0615p81j1730r584j095J1638
$$ -11670 -7418 3114 10394 7589 -1701 -10740 -10465 920 11535 10754 -976 -10560 -11655 -17
4359a7J0222j1j0005r318p96O655J1677J935n516j1154o130N399J2553P703o649
$$ -17 10205 10194 189 -9129 -9925 -3270 8407 10342 4826 -6328 -12458 -7059 5494 13197 6548
4374F548j2654o309O302J2772N114o096j0173o173M230P239Q371N14r596j0671
$$ 6548 -6106 -12415 -6113 6659 11773 5677 -4496 -10669 -6439 800 9171 9685 89 -10582
4388a0582p91J1007J0914R71j0358j2140j110J0451R888K999r196r470l201N471
$$ -10582 -11373 -366 10548 11519 1161 -10979 -12089 -1638 8250 11249 2053 -7417 -10618 -5147
4402e147J1220M807m054j1603o602M359J2037Q365n854j1473p759M543J1415O782
$$ -5147 6073 10880 6826 -4777 -11379 -7020 5017 13382 7528 -3945 -11704 -7161 4254 11036
4416A1036m508q274p386M98Q578Q790K571q539j2434j499R645J0312K609q328
$$ 11036 6528 -1746 -9132 -8634 -56 8734 11305 2766 -9668 -11167 -1522 8790 11399 3071
4430C071j1608l062Q229J0701L826o897r954n709N003J0661N536k468j0283r431
$$ 3071 -8537 -11599 -3370 7331 11157 4260 -5694 -11403 -6400 4261 9797 7329 -2954 -12385
4444a2385M558J0485R544k659j1864q888K508J1485O861q97q798q972r65P861
$$ -12385 -7827 2658 12202 9543 -2321 -11209 -8701 2784 9645 8748 -50 -9022 -9987 -2126
4458b126J0032K530p363j1131l717P951J1753L935q124j1084l448O785J0329L255
$$ -2126 7906 10436 3073 -8058 -11775 -3824 7929 11864 3740 -7344 -10792 -4007 6322 9577
4472I577m774q691m803Q95R126Q871j378j0409r792K373J0404R185j166j0503
$$ 9577 4803 -3888 -8691 -7796 1330 10201 8823 -1586 -11378 -9005 1399 10584 9418 -1085
4486a085r429P70J0424P831R6o100j0474j766O267R875M670n493j2590n030P370
$$ -1085 -10514 -9744 680 8511 8607 2507 -7967 -9733 -3466 6409 11079 5586 -7004 -12034 -4664
4501d664J0603N147o261j1458l979M736J0054O239l132r595p646J984Q651R118
$$ -4664 5939 11086 4825 -6633 -10612 -5876 4178 10417 7285 -2310 -9956 -7972 679 9797
4515I797m08q620j0774l20J0640Q365J474r167j0355L02Q064Q171J802n397r505
$$ 9797 9389 769 -10005 -10325 315 8680 10154 987 -9368 -9066 -1002 7169 8971 3574 -5931
4530e931m310N469J1206N064n453j0744o436L914J3483N128l947j1208o665K962
$$ -5931 -10241 -4772 6434 11498 6045 -4699 -11135 -7221 6262 11390 7443 -3765 -10430 -7468
4544g468Q790Q000k376p551p157j719P801R391L031q576j0913o10Q343J0746O00
$$ -7468 1322 9322 6946 -605 -7762 -9481 -1680 7711 10742 2166 -8747 -9357 -1014 9732 10332
4559A0332p915j0299j079N313Q711M749n840p895o082L220J0612P222m903r489
$$ 10332 2417 -7882 -8961 -3648 5063 9812 3972 -3923 -10005 -6785 3827 11049 6146 -3343
4573c343p809L960J0541O385k224r768o134J860O611Q405j16p096q654k928Q709
$$ -3343 -11152 -7192 3349 9734 7510 -2258 -8392 -6532 79 8484 8368 1272 -7382 -10310 -1601
4588a601R406K757p210j1648k857Q147J0300L380p493r285k314M428Q210M112
$$ -1601 7805 10562 3352 -8296 -11153 -3006 7294 10674 3181 -6104 -8418 -3990 4220 8332
4602H332k990p604p375K611P953Q281j370j0184q772L063R787O891j040o897q776
$$ 8332 5342 -2262 -9637 -7026 927 9208 7838 -2346 -11118 -8055 1732 8623 7583 686 -8090
4617h090o7P030Q672J135n048j0552k729N317J0548L520m986j1505l053O121R320
$$ -8090 -8157 -1127 7545 8680 3632 -6920 -9649 -4332 6216 9736 4750 -6755 -9808 -3687 5633
4632E633K658l568r221n293L929R050N067L06r078r319K048Q077J0004j163r730
$$ 5633 8291 4723 -4498 -9791 -5862 3188 8255 8561 -517 -9836 -7788 289 10293 9130 -600
4647f00q701R01Q068P973P67p705p040k417O141Q453K870l062j0630n293M682
$$ -600 -9301 -8400 -332 7641 8408 703 -6337 -8754 -2613 5840 8710 5648 -4982 -10275 -5593
4662e593J1155M753m925r714n621N036R472M137k503q710o286L366P030O914L00
$$ -5593 5562 10315 5390 -4324 -9945 -4909 4563 8700 6197 -2513 -8799 -5433 1597 8511 8811
4677H811p825r825L43Q045R349r08p609p169n91M560Q972K680o000p422l907M276
$$ 8811 986 -8839 -8496 -451 8898 7990 381 -6788 -7379 -2819 6153 8833 2833 -4589 -8496 -4220
4693d220R104L926k927j1093n688N011J0912L981l347q779n545K213Q107M805
$$ -4220 4884 8810 5883 -5210 -10898 -5887 5025 9006 5659 -3120 -8665 -6452 1655 6460
4707F460r73n328o501m70N738Q020K045o653r148k901O631J0690L126q550r088
$$ 6460 5487 159 -6342 -6812 -1074 6946 8991 2338 -6810 -9711 -3080 7610 10736 2186 -6902
4722f902k747P813P531J842m037p064m448K636Q648N794m313p337o346K692Q924
$$ -6902 -9649 -1836 5695 7537 3500 -3564 -8012 -5376 3272 9066 4753 -2584 -8930 -6238 2686
4737B686N665j494q852n274n94Q872O463j7o645p145k028O331R423J922n380j0740
$$ 2686 8351 6857 -1995 -7269 -7863 1009 7472 7455 810 -6335 -8363 -2032 7391 9313 3933 -6807
4753f807j835O198R186K126n837q470k690N381O397K105j588n698o365J761N841
$$ -6807 -8642 -2444 6742 8868 3031 -5439 -8129 -2748 3649 5754 4166 -1532 -7897 -6136 -295
4768b95P972n2q753q653L173Q993O498j763p964n686R9O012N933J532n016p064
$$ -295 7677 7625 -1128 -9781 -6608 2385 8883 7120 -844 -6530 -6431 -419 5514 7046 2030 -5034
4784e034k031M415O990M910n170q205m439M363P628N322n300o612m260K010P017
$$ -5034 -7065 -2650 4340 9250 4080 -4125 -8564 -4201 3427 8749 3449 -3163 -7423 -5413 1604
4799A604O716k890o519o551J184P566P645j187r033o642J049O828O575J255p750
$$ 1604 8320 5430 -1089 -7640 -6456 1110 8755 7568 -1465 -8107 -7058 -230 6345 7600 -150
4814a50n722j283O175M151M064k496q672m106K948Q539N975m573q550n888N346
$$ -150 -5872 -7155 -980 3171 7235 4739 -3933 -8039 -5091 3448 9423 4850 -3700 -9588 -4242
4829d242Q607L764l943p017m089J778P314L547J45m702p958p5N051P221K374o819
$$ -4242 4365 8129 4186 -2831 -6920 -5142 2172 5719 5864 1162 -6796 -6871 -1820 5401 7775 956
4845I56q760m06O347P186K372m938p729k867L662Q676M001m094q550m237M098
$$ 956 -7804 -8210 -1863 5323 7695 2757 -4972 -7839 -4177 4499 8500 4406 -4144 -8381 -4283
4860d283P498N443l023p532m206J531O696M183k158m313n397l32L811P779J120
$$ -4283 3215 8658 5635 -1897 -6103 -4572 2124 6307 4149 -164 -5561 -5893 -2082 5697 6817
4875F817n051p410l573O008R619K603n975r626m54M708Q107P97l914o570k962
$$ 6817 1766 -5644 -9217 -3209 6410 9013 3038 -6588 -7042 -2334 5773 6570 2656 -3914 -6876
4890f876K507N827N497l6o818q252J693P682O525j108o940o241m37Q302N557N8
$$ -6876 -4369 1458 6955 6919 101 -8151 -6458 1224 7749 6641 -299 -6540 -6977 1325 6882 6940
4906F940m750p776j518N742O817J729m962p544k429N562O043L155m428n183m018
$$ 6940 2190 -5586 -7104 -1362 5455 7184 2222 -5322 -7751 -2189 3854 7009 2581 -2602 -6620
4921f620K598O335L458j316m803o610M04N506Q985N4r482o743K10R389O984j449
$$ -6620 -4022 2313 5771 4455 -348 -6958 -6554 -1048 7937 7991 -1491 -8234 -8024 1365 8349 6900
4937F900p899m818J002M072N904N81l729m956l531K475O094O144l840o210o949
$$ 6900 -999 -5817 -4815 -743 5161 5742 2013 -2943 -6474 -3999 2095 8239 4399 -1811 -8760
4952h760L462Q340N001k344q692m458L206P438L335q29o780n597M46O240O313
$$ -8760 -5298 3042 8043 5699 -2993 -7451 -4245 3193 6528 5699 -1081 -6678 -6232 8 6321
4967F321j49n789n697r91M987P101O02l919p761j674M193N119N007k382p965n912
$$ 6321 6172 383 -5314 -6305 -1318 5783 6385 2466 -5295 -6969 -2776 2343 7350 4968 -2997 -8909
4983h909L144R273M695l677p534n155L936O210N566l970n313l986J242N703K621
$$ -8909 -5765 3508 8203 4526 -3008 -8163 -4227 1983 7549 3579 -1734 -5720 -4478 1225 3846
4998C846J321l493n729k583M233P955K751n385q260l230O717Q394Q64n675p475
$$ 3846 5167 1674 -4055 -6638 -2405 5550 8301 2916 -5344 -8574 -1857 6537 7401 1726 -5749
5013e749j388N324M745L803l323o645l062J673N397L996J78n909n620J698N601
$$ -5749 -7137 -1813 2932 6735 3412 -3233 -6295 -4622 775 4771 4949 -960 -6580 -4882 719
5028G19N249r11l604n761k546N066O995J508n027o188k718M108R144L051q180
$$ 719 5968 5057 1453 -4308 -6854 -1788 5207 6715 1688 -4500 -7218 -3110 6034 9085 905
5043I05n898j230M247N364Q72k597l288m061K167L657N300J68n160o939L06N998
$$ 905 -4993 -6223 -1976 3388 4260 1663 -1625 -5686 -3519 138 5438 5606 446 -6493 -6187 -189
5059a89O510J524r085n068P9O458N232N92o248n342M75L275P016O08k581o526
$$ -189 6321 7845 -1240 -6308 -6229 229 5461 6053 -195 -5537 -5062 -1787 5229 5837 3256 -3270
5075c270l255K239P469M060l338n619n226K103O055N992j280p750l522j215P500
$$ -3270 -6525 -4286 3183 7243 3905 -1714 -6940 -4837 1218 7210 5930 -1820 -5342 -6557 943
5090I43N771q29o017o645P04N940O834m11o648n921J610M792L741J425l356m920
$$ 943 6714 5885 -132 -6777 -6073 -133 6701 6290 -358 -6279 -4669 123 3864 5289 1933 -2987
5106b987k529R34O850M204j191q091o192K823Q544N344k583q394m081L002O996
$$ -2987 -5516 -4582 2268 6472 5281 -2810 -9002 -6179 2365 7709 5126 -3268 -7349 -4347 2649
5121B649L033q75o281q56l18J193N345K188l140o226l343M395N950K942m526o159
$$ 2649 5682 4807 -1474 -2330 -2648 -1455 3890 6078 2938 -3288 -6631 -2236 3714 6656 2130 -4029
5137d029l736M306O788L390k543o639m558K720O907L729k072p321m159K517O300
$$ -4029 -7765 -3459 3329 6719 4176 -2463 -7021 -4301 2606 6335 4263 -3058 -7217 -4700 1600
5152A600M028j651m866l891J54L924N010L25k469o299k840K949Q848L345n713
$$ 1600 5628 3977 -889 -4780 -4626 -702 4308 4633 2164 -4135 -6975 -4026 4822 8167 2454
5167B454r095j499N591P875J785n780n356j639L641N580J613j956l572m756J086
$$ 2454 -6641 -8140 -2549 5326 7111 1331 -4025 -5664 -2023 3557 5170 3214 -358 -5114 -4028
5182d028L847L919J631m981n048k200O456N904J168n223p102n05N399N087J824
$$ -4028 -181 3738 5369 388 -4660 -6860 -404 5500 6668 1445 -5657 -6162 -763 4324 6148
5197F148l151p727j453M104O390J471l042n839k375K648N702K415k449l579m270
$$ 6148 2997 -4730 -6183 -2079 4311 5782 2740 -3099 -5474 -2826 2876 5291 2842 -737 -5007
5212e007J46N164N326K47m771o851j227O816P083K67o957p744J268P094M607j191
$$ -5007 -4861 303 5629 5876 1105 -5746 -6973 -157 6926 7193 236 -7508 -6240 854 5461 4270
5228D270n383k583j381L946L391J144j097l203m362l15N468P163j145p447m632
$$ 4270 -1113 -3696 -5077 -1131 2260 3404 2307 -896 -5258 -5573 -105 7058 5913 -1534 -6166
5243f166J046O667O634m309n172m775R65O171M219q47n428l778j056M675N415
$$ -6166 -5120 1547 8181 3872 -1300 -6075 -5110 1061 5280 4433 -995 -4773 -5829 -1154 4261
5258D261J232l398n938k353M647M965K779l875m677l666J513P431M209k303o491
$$ 4261 5493 2095 -3843 -6196 -1549 3416 6195 2320 -2357 -6023 -4510 2921 7130 4827 -1664
5273a664n475L029P008N895m412o938m001L552N623K031j966k295m196j11K611
$$ -1664 -7139 -4110 2898 8793 4381 -2557 -6558 -3006 2617 4648 2682 387 -3809 -3920 -1309
5288a309M463K026j915o220l562K233Q690L624o069o447k832M331Q333K281l875
$$ -1309 3154 5180 3265 -2955 -6517 -4284 4406 8030 1961 -4486 -7318 -2987 5346 7627 3752
5303C752p338k400L641M511K647j320m221m316K26N524L495P70l939o170Q5L962
$$ 3752 -3586 -5986 -2345 2166 4813 3493 -728 -5044 -4818 706 4201 4971 1032 -5138 -5053 -1091
5319a091N033J931m396m303l849M894O411L042m251p574l026M656O438K470l988
$$ -1091 3942 5873 1477 -2826 -6675 -1781 4630 7672 3421 -4153 -7179 -2523 3915 6385 2397
5334B397n765j095K490M283O49K0k754l802o46L026N337K285n216o867j986O788
$$ 2397 -3368 -4463 -1973 2310 2959 2979 225 -3577 -4223 -1197 4140 6425 1209 -5658 -7644 -856
5350h56P457J48p613m436q75O525N121j92m425m084j518K438N124J272j450n217
$$ -856 6601 6749 -864 -5300 -6175 350 5471 5279 854 -3230 -4748 -2310 2814 4086 2636 -2581
5366b581l279K521M715N376k821n015m993N93N534O452j435n114o212J94O086
$$ -2581 -5860 -3339 1376 6752 3931 -1084 -6077 -5484 50 6502 5067 -47 -6259 -6065 21
5381B1N669M75o094n507O26N336M246j18m719m334P75N49M615K462j95m977m797
$$ 21 5690 6165 71 -5436 -4810 526 4772 4654 -65 -4399 -3624 -3075 1540 4002 3807 -1170 -5967
5398e967J029O730N362j360p530n428K468O919N266k930o539l939K516N980J848
$$ -5967 -4938 1792 7154 5794 -1736 -7164 -4696 2223 7489 4559 -1980 -5919 -3403 2577 4425
5413D425j367m065l693R21K743M190J692j94p566k570K877N073L586l326n808
$$ 4425 3058 -1007 -4700 -3779 -1036 3154 4846 4652 -2914 -5484 -2607 2466 6052 2726 -3082
5428c082k577K989M659N277m271n404l845K375O330L466j601m945n094J515N085
$$ -3082 -5659 -2670 1989 7266 2995 -2409 -6254 -3879 2451 5917 4316 -629 -5723 -4208 877
5443H77L076j6m517l266M01K105L837K319k048n579l615L176O764M450m627q261
$$ 877 3953 3937 -580 -3846 -3445 -1340 2497 4816 2768 -2811 -6426 -3250 3514 7964 3337 -4924
5459d924k157N279N897J714l496n231j695K897L595J745j56l295l953n54K680
$$ -4924 -7081 -1802 4095 5809 2313 -2918 -4613 -1716 1879 3624 3468 173 -3780 -4334 -1654
5474a654O362N64m000o232k130N960O014J440m963n161j871M164M684K434m267
$$ -1654 4708 5272 1272 -4960 -7090 -1130 4884 6324 1361 -3800 -5671 -1507 3177 5611 1344
5489A344m440k074K767N189L221m393l431l632M332L045J924N35m826m162J211
$$ 1344 -3096 -5170 -2403 2786 6007 1614 -1817 -5449 -1117 1928 3852 4387 -439 -4601 -3390
5504c390K914M989J769n625p096o14O620N576N25n638n654J259M759L350L72l658
$$ -3390 -476 4513 6282 657 -6439 -7053 -433 5143 5668 30 -5624 -4365 394 3744 4116 458
5520D58l692q19J326M152K112n26l847m398j62O262M872m46m986n957JP316M275
$$ 458 -3234 -4053 -2727 1425 3537 3011 -836 -5234 -5396 866 5738 5292 306 -5651 -5650 1666 5941
5537E941j118o230l876O82L861N942p78l484n742J08L947L968J480k562m435k141
$$ 5941 4823 -1407 -5283 -4601 -740 5202 4424 940 -4802 -4694 -747 3221 4701 2139 -2296 -4437
5553d437K089L827K725l7n656m038J364O411L998j545o669m688J830O618N054
$$ -4437 -2348 1479 4204 4167 -1489 -5527 -4163 2248 6246 4701 -1968 -6656 -4826 1792 6846
5568F846k529o493l961L376M460J569j66l309k409o81J527M682J846j834n624
$$ 6846 4317 -2176 -6137 -2761 1699 3268 3102 -207 -2616 -3297 -1770 2912 4758 2924 -2700
5583b700l707L145P015L891n933m663k226K631M640M066k660n579k835J522M166
$$ -2700 -6407 -3262 3753 7644 1711 -2952 -5178 -2547 2093 6159 3499 -2080 -4915 -3393 773
5598G73M001l57m982l456O85L746L570j74k537m621k925N677M758J199l520n682
$$ 773 4774 4417 -565 -4021 -3336 410 3980 3806 1269 -3352 -6277 -600 4158 5357 1837 -3845
5614c845k186L462N677L039l463o633j988M217L930K760l757k311l006J388L580
$$ -3845 -6031 -2569 3108 6147 2684 -3949 -5937 -1720 2210 4970 1213 -1098 -4104 -2716 864
5629H64K249J749o052k443k204N392N847K55m636p344R1N343N366J193m916n741
$$ 864 3113 4862 -1190 -3633 -5837 -445 5402 5657 1021 -6323 -6232 -889 4477 5670 754 -4987
5645d987K53M160L754J481k462n362j136K581M155K514l122k730m217J568M666
$$ -4987 -4734 -574 3180 4661 2199 -3163 -4299 -1718 2437 4951 1829 -901 -5118 -3550 1116
5660A116L096K97n783l909J536L300N650m62l816n243j569M777N648Q19m891m695
$$ 1116 4212 4509 -1274 -5183 -3647 -347 5303 4841 1025 -4218 -5787 -1010 4638 5457 566 -4129
5676d129j081L779N366P37l094m035j623K835K102K910q43l616m613Q71N364M686
$$ -4129 -5210 -1431 3935 4672 1578 -2457 -4080 -1245 857 3767 2924 -692 -5305 -4434 930 5616
5692E616j260o455m706K557N904M307k324m665l986P47N647K112Q24l014m847
$$ 5616 4356 -2099 -6805 -4248 1656 5963 3639 -1026 -5012 -4265 1382 3494 4318 1304 -3543
5707c543j288L185L704K054j499n952k018K908N188K755k457n913m301L315N588
$$ -3543 -4831 -1646 2058 4112 2613 -3339 -5357 -2449 2739 5494 3037 -2876 -7177 -3862 1726
5722A726K682n17n961l543K923L575M691k897l963l731J444L803K870r04q97m526
$$ 1726 4408 3891 -2070 -5613 -2690 885 5576 2679 -1284 -5015 -3571 232 3102 2198 1301 -3225
5738c225j609K320N692K422k901m824m086L524P338K012l920o059j896L812L942
$$ -3225 -4834 -2514 3178 5600 2699 -2125 -6211 -2687 4651 6663 2743 -3316 -5212 -1400 2542
5753B542K699k872l501k634J746K084L736O62l973m435K92K933M911J213m770
$$ 2542 5241 2369 -1132 -3766 -2020 64 3800 4462 489 -3946 -3654 -721 4190 5403 633
5768F33m536j452K426N378P44o52m973l034L554N109J223j565l947l176Q75N832
$$ 633 -3903 -5355 -2929 2449 3193 2541 -2432 -5466 -1912 3197 4420 2855 -1092 -4268 -3393 2439
5784B439J491k618j835l728K175K784L277j707l238l165k26L805L807K529n818
$$ 2439 3930 1312 -523 -4251 -2076 708 3985 2278 -960 -4125 -4351 -546 3261 5790 -28
5799b8l892j471M490N051K79m240l038o21J467M273J934j499l965l062J817L937
$$ -28 -3920 -5391 -901 4150 4429 189 -2849 -3470 -2003 2270 4204 2705 -1260 -4322 -2505 1432
5815A432L112j390k685m271P47M630L711j949l856l568M1K952N109M22n416k195
$$ 1432 4544 3154 469 -3802 -3055 1575 5286 3337 -519 -4087 -4046 -1094 4015 4437 -979 -3174
5831c174r47L430M617M47l350m640n89K285M776N94j524m380q74J302M272J907
$$ -3174 -4121 -691 3926 4373 1023 -3617 -4206 -1921 2855 3449 1925 -2455 -3329 -2027 2245 4152
5847D152j446l768l419L36M432N649j070n554l250j166N530L464l93l375l513
$$ 4152 2706 -1062 -4481 -4145 287 5936 4866 -688 -3938 -5104 426 3890 3497 122 -3391
5862c391K06K918K755J625l128k407l079K278M121K726k070m803l545L079N125
$$ -3391 -3185 -267 2488 4113 985 -1422 -4501 -2223 1898 4624 2554 -2249 -5794 -2715 2410
5877B410K231j516o116r62J637M112K405Pm004m393J433L534K492J506m866l513
$$ 2410 4641 3125 -2991 -3953 -2316 1796 4201 4208 204 -4189 -2756 778 3270 4776 -90 -3603
5893c603n5L019L928L17k167m037r34J753L298L746l228l763k484J441N887K648
$$ -3603 -3658 -639 3289 3606 1439 -2598 -3532 -1779 1519 5265 2037 -1726 -4210 -2769 3118 5766
5909E766m014m905j305L440L495K030k898k051l074J04L079L833j33l814k859
$$ 5766 1752 -3153 -4458 -1018 2477 4507 1609 -442 -3516 -3412 -333 3500 3367 -447 -3306
5924c306j061L672L338K609m586l846n31L277L873o41k623k151k643K928L487
$$ -3306 -4367 -695 2643 5252 666 -3180 -3711 -434 3439 2798 175 -1976 -4619 -1691 1796
5939A796K387j449m073k917J275M644L245j231l775l320K86M097M111j784m164
$$ 1796 4183 2734 -1339 -4256 -2981 1663 4908 3677 -98 -3418 -3132 965 5076 3292 -872
5954h72k836j049M010M162K97l229m322L42K637M002J420m173m264j46K331L087
$$ -872 -3708 -4757 -747 3415 3712 483 -3839 -3497 -860 3142 4562 389 -3875 -4021 -1690 1397
5970A397K554k197l086k647J075L425L388L5l467l288n26M294K647j85m296l132
$$ 1397 3951 1754 -1332 -3979 -2904 521 3909 3944 477 -2811 -3337 957 3604 3419 -877 -4009
5986d009J095K328L586Q2l265k651n54J979L830K335m625l285j648K666M796P03
$$ -4009 -2914 -586 3000 3082 -183 -2834 -3388 -1409 2421 4756 131 -3154 -4802 -2136 2660 3363
6002C363l43m848k082J456M255K316j737k526m090M84M469L712l83m654j933j127
$$ 3363 3020 -1828 -3910 -2454 1801 4117 2380 -146 -4236 -3752 717 4429 4046 -608 -2541 -3668
6018c668M216L359q97k267m009n94L776L334j82j541l818j418J862M710J531k634
$$ -3668 548 3907 3010 743 -3266 -3860 -84 3250 3068 1527 -2291 -3709 -1847 2863 4394 1760
6034A760m116k585K843M515K107k205l061k805M05L995J822K05k609l450n79L225
$$ 1760 -2356 -4941 -2098 2417 4524 2319 -742 -3547 -3142 853 2675 2880 271 -3179 -3758 -533
6050e33L781J78l279l710N21J674M089R4k157l118k41J853L585O38j152m414k042
$$ -533 3248 3426 147 -3563 -3042 -1368 2721 2815 658 -2460 -2701 -848 2737 3375 2223 -2191 -4233
6067d233J562N242K501k546l065l428J118N424J052k037k421j857J40J686L377
$$ -4233 -2671 2571 5072 2526 -539 -3967 -2849 2575 3627 1590 -831 -2688 -2548 -862 2515
6082B515J682l369l739n88K930K733L271m300m334M11J304M088J624k101l604
$$ 2515 4197 828 -2911 -3499 -569 2164 5435 1135 -3199 -2788 -1484 2604 4228 2127 -1477
6097a477k042J662M041L07n51k710l595P19N515J829k92l707l751O92L634L317
$$ -1477 -3519 -1857 2184 2491 1940 -770 -4365 -3646 1869 3698 3406 -301 -4052 -3360 274 3591
6113C591K17m164k406j624L819K964K72k271l382j066K637L077K824l187m539
$$ 3591 3808 -356 -2762 -4386 -567 2397 2669 398 -2984 -4050 -1413 1664 4488 1301 -3238
6128c238K50K190K588J793j869m047j201Q93K439L066M39k690l989j048N208K456
$$ -3238 -2988 -798 1790 3583 1714 -2333 -3534 -2641 -202 2864 3303 613 -3376 -4424 784 3240
6144C240K72l543k672o28K922L630j156j447l634n03K943J970K638k611j634k567
$$ 3240 3512 -31 -2703 -3331 -409 3221 2065 618 -3016 -3519 -576 1394 4032 1421 -213 -2780
6160b780j71M765J469o54n138o32R7L099K633p98k372k518n1K492L806J032m538
$$ -2780 -2951 1814 3283 2629 -2509 -3141 -3044 55 2688 1890 -482 -3000 -3051 -559 3247 4279 -259
6177b59k647p58L427L884Rl287k907o36L517K074M27j758l884q85J945L518L055
$$ -259 -2906 -3664 -237 3647 3656 369 -2538 -3174 343 2417 2844 1086 -2798 -3683 -1738 1780 4835
6194D835k209l641k323J167M601K224j547m938k597J652M507J903q50l309l060
$$ 4835 2626 -1015 -3338 -2171 2430 4654 3107 -1831 -4428 -2776 1731 3634 2784 -525 -3585
6209c585J50K646M101J273l971m405Q37K284M543M23l194l948j252K325M656m23
$$ -3585 -3435 -789 3312 4585 614 -3791 -2954 -670 3873 4296 1102 -2846 -4098 -1773 2883 2460
6225B460r07j981k346O15K409L683l20n171k795J402M424K625j053l765k470L43
$$ 2460 1553 -428 -2774 -2159 250 3933 3613 -1558 -4353 -2951 1473 4098 3045 -720 -3190 -2847
6241b847L323K617q56n16l344j449K908L068N98k868l191j136K939L633N37j962
$$ -2847 476 3093 2237 1721 -1623 -3072 -164 2904 3502 634 -2557 -3693 -754 2879 3416 1454
6257A454k942k073K219P79K982j113j037l156j24K401M595q07m419k183N08L520
$$ 1454 -1488 -3561 -1342 -563 2419 1306 269 -2887 -3011 -610 3985 3178 -1241 -3424 -2916 604
6273F04L240j343l162j005j612L820J653J216k331k777j934K150K760K338j473
$$ 604 3844 2501 -661 -1666 -3278 542 2195 3411 1080 -1697 -3631 -1481 1279 3617 2144
6288B144l164k525J437L557J706o71m212l49K01J853K215N14l420j229j274L219
$$ 2144 -1020 -3545 -2108 1449 3155 2484 -1728 -2077 -1876 -23 2192 2706 -714 -1943 -3217 2
6304BL688n75k733l838k16M110K349J91k895k642n38J700K876K369j620l619k436
$$ 2 3690 3115 382 -3456 -3672 438 2787 2978 83 -2559 -3097 -1397 1479 3848 2228 -1391 -3827
6321c827J493M013K318j745m243r11j73M159J718r16l462j760P72K064L626M91
$$ -3827 -2334 1679 3997 2252 -1991 -2902 -3075 1084 2802 1886 -1576 -3336 -2564 -500 3126 3617
6337C617l243k113k035L144K824N6r08n039P7L165L644N90l406k250j390J658
$$ 3617 374 -1739 -3774 -630 2194 2250 1342 -3697 -3620 -455 3189 3779 373 -1877 -3267 -1609
6353a609K845K717j667k264l503R31L043K199l3m005k445K82M663J681k03k922
$$ -1609 1236 3953 2286 22 -3481 -2550 493 2692 2659 -1346 -3791 -3509 1154 2835 2632 -290
6369b90k213M85J863J896J560l027l715l17K575M058J370k615m581j139K960L245
$$ -290 -2503 -2018 -155 1741 3301 274 -3441 -3758 -1183 2875 4245 1630 -2951 -4090 -1130 2115
6385B115N90j197k085k160P43K333K331o20k409k105n87L938K135p19k466l325
$$ 2115 2705 1508 -577 -2737 -1994 339 2670 2050 -359 -2464 -3051 887 3022 2303 -163 -3488
6401c488K257J694K209J85k784k256p72J375L483J761k717m137m81K027L047K204
$$ -3488 -1231 463 2672 2857 73 -2183 -2955 -1580 1903 3664 947 -3190 -3671 -1644 1403 3607
6417C607j231m314j879J911L817k48J087k868k678J7J875M103O73m557k046q98
$$ 3607 2376 -1938 -3817 -1906 1911 1663 2750 -118 -2796 -2779 -904 3199 3872 -685 -2731 -3629
6433c629M064K387N09l256k200J91J654J421K035k913k390k204L287K393K029
$$ -3629 435 2822 3331 75 -2125 -1934 -280 1141 3176 263 -2127 -4331 -1044 1349 3378
6448C378j556l151k515K185M076P20q36k812k219M27L160K439j268k266l005m10
$$ 3378 1822 -1329 -3844 -1659 2417 3137 2301 -511 -2730 -2303 857 3296 2028 -238 -3243 -3653
6464c653L800L089j59l002m444J75M509K288L72k722k792k32J470K412J652q30
$$ -3653 147 3236 3077 75 -4369 -4194 315 2603 2975 253 -2539 -2771 -1301 1111 2763 1933
6480A933m143j180K543J818L257l147j433k189j45L496K828j265k347k064r44
$$ 1933 -2210 -3390 -847 971 4228 1081 -352 -2541 -2686 810 3638 2373 26 -2038 -2982
6495b982L078K557q3j107l267j501K469K794J501l311l170O91J576K959M72k227
$$ -2982 96 2653 2570 1463 -1804 -3305 -836 1958 3459 148 -3022 -2331 -755 2204 2676 449
6511D49k045o39R13J938K712j495k395j507j331K767L763J0n260j944J193L455
$$ 449 -1596 -2235 -1322 616 3328 1833 -562 -2069 -3400 -633 3130 3140 -2120 -4064 -2871 584
6527E84L139j742k531j601L09K225J693J472l137k462q58K461K224J942k053m188
$$ 584 3723 1981 -550 -2151 -1842 383 2076 3548 411 -2051 -2909 -448 1776 3718 1665 -2523
6543b523L43l81M375O27k15l691r85J126J139K454l67k219k453l57L628K566O3
$$ -2523 -2180 -2561 1814 2441 2226 -1465 -2450 -1324 -185 2269 1902 -317 -2770 -3127 501 3067 3130
6560C130l268k251N28J845K056k53j847r17j749R59L892J43j299k232j867R64
$$ 3130 -138 -2389 -1861 -16 2040 1787 -60 -977 -2726 -1767 2125 2268 969 -1263 -3130 -2166
6576b166L531J036l69l672j383J053L036J734j340l267m87n42K662K889J480l572
$$ -2166 1365 2401 2032 -1640 -3023 -1970 1066 2800 1460 -1807 -2294 -2836 -174 2715 4195 623
6592F23l531O02K099K198J203l204k703m84K805K727k50j335k774j1J060K115
$$ 623 -2908 -2306 -207 1991 3194 -10 -2713 -3197 -392 2335 2085 750 -2024 -2035 -975 1140
6608A140J753j157l089j364P2M073J861j676k849j944M62K408K965j92j844k268
$$ 1140 2893 1736 -1353 -2717 -2645 1428 3289 1613 -1236 -3180 -2718 -310 2655 2463 619 -1649
6624a649k18J496K569L22j496l901j059K981L569J659l902k178o79J697K099M25
$$ -1649 -1867 -371 2198 2520 1024 -2877 -3936 -955 2614 4273 371 -1807 -2486 -789 1310 1735
6640A735P33l111q86L77J638J953r82k470k450J897K476J694j364j979j735O66
$$ 1735 2468 -643 -1529 -1152 486 2439 1457 -1013 -3463 -1566 910 2604 1240 -739 -2474 -1808
6656a808K953J040q33j563j716j3J513J250J553j328l367q08K193K610O26j588
$$ -1808 1145 2185 1352 -211 -1927 -1940 -427 823 2376 1048 -2319 -3127 -934 1676 2302 714
6672G14j892j080K350J48K515M64l251k832K043J096K612l58k239k342m66L845
$$ 714 -1178 -2258 92 240 2755 3219 -32 -2864 -821 275 2887 2529 290 -2052 -2518 1327
6688A327Q11N59l004k049k12K339K081P00k657k398M29R35K749K329k455l753
$$ 1327 2138 2697 -307 -2356 -2568 -229 1852 2552 -105 -2503 -2074 -1139 1610 3939 1484 -2269
6704b269m86J348K070K314j377k577j359Q22L237J033p13k165j986q1K148L052
$$ -2269 -2755 -1407 663 2977 1600 -977 -2336 -1514 1723 2756 2043 -122 -2108 -2189 -41 3011
6720C011K92l343k746P36K574J354N06j239k459o48N05K763J670j144k647k239
$$ 3011 3303 -40 -2786 -2050 524 1878 2384 1145 -1314 -1962 -1457 1306 2976 1832 -815 -3054
6736c054J287L396J135j481k438j090P13L366J161q15k581j931J123J931K028
$$ -3054 -1767 1629 2764 1283 -1155 -2245 -1532 1834 2995 2180 -401 -2332 -1209 722 2750
6751B750p91k078k370L32J637L176P0k808k813l89K443L120o52j180k036n85R96
$$ 2750 1959 -119 -2489 -2157 -520 2656 2726 -82 -2895 -3284 -841 2279 1627 447 -1589 -2174 -1178
6768a178J605K582p33m040m89O02K581K111o32l443k093N48L047J828j123q95
$$ -1178 427 3009 2276 -1764 -2253 -1651 930 3041 2409 -1034 -3127 -2579 468 2296 1173 278
6784B78k450p14L521J374J75k227o19j386J184L190L20j661l593M26J728K140
$$ 278 -2172 -2886 635 2009 2184 -43 -662 -2048 -864 2326 2646 985 -2608 -2182 -454 1686
6800A686J005k241k072M99N19M19K546q56j036k641k10K585K821r30j753k747
$$ 1686 2691 450 -1622 -1123 -604 -185 2361 1505 469 -2172 -2382 203 3024 2094 341 -2406
6816b406J93J924J373R21j881k003j558L229R94J419j470k109o81K039J838J325
$$ -2406 -2213 -289 1084 2005 124 -1879 -3437 -208 786 2205 735 -1374 -2055 -16 1822 3147
6832C147k489k173j847K006K398J084L44k750k148j47K370L024r57j359k925L14
$$ 3147 658 -1515 -3362 -1356 1042 2126 2470 -280 -2428 -2575 -205 2819 1862 503 -2422 -2108
6848b108K740K605j12k644k845N46J157J679P07j041k899O82m0L443J205r12l522
$$ -2108 632 3237 3125 481 -2364 -1818 -661 1018 1725 684 -2215 -1533 -1573 1870 3075 2163 -1359
6865a359L10L03K000K060k182k103j250K56K078J012J377k523k255R73K328J889
$$ -1359 -1049 -746 1254 3314 1132 -971 -2221 -1965 113 1125 2502 -21 -2276 -1303 1025 2914
6881B914q71k380j879j145L758K412l01k719j338j585K340K425J013o88l658j308
$$ 2914 2043 -337 -2216 -3361 397 2809 2508 -211 -1549 -3134 -794 1631 2644 1956 -1702 -3010
6897c010R25K941O07J71k085k897R84L869J048j235j438k198K07K610J499Q12
$$ -3010 -2085 856 1463 1634 -451 -3348 -2364 1505 2553 1318 -120 -2318 -2111 499 1998 2810
6913B810k559k877J419P13K024L39j723k695o47K525K285m85l7l170l6O41K664
$$ 2810 251 -2626 -1207 -494 1530 1869 146 -2549 -3196 -671 1614 1129 1092 -2078 -2114 -1473 1191
6930A191P12J45k494k982L29L098L335j625k322j551R28K537J595j877l91k733
$$ 1191 1903 2048 -446 -3428 -3099 -1 3334 1709 -613 -2164 -1236 1301 2896 1019 628 -2105
6946b105n02K097K469P5p49k780l93R17J978K049k230l076j439L592J464o7M31
$$ -2105 -2607 -510 1959 2034 1285 -1495 -1888 -971 1007 3056 826 -2250 -3689 -97 1367 1300 1731
6963A731k413j322M46K285J941P4k838k431J141J034L437p22l699q34m51L311
$$ 1731 -682 -2004 -1558 727 2668 2742 -96 -2527 -1386 -352 3085 2363 -1336 -2170 -2621 690
6979F90R70R18k360j636m31J364J903J579k323k024j221J471J845J462j347l871
$$ 690 1660 2578 218 -1418 -1849 -485 1418 2997 674 -1350 -2571 -1100 745 2207 860 -3011
6995c011K58R34K380M21J21n57k369j242K683K561m31j820k372K77K186J938J310
$$ -3011 -2753 -1819 561 982 1103 546 -1823 -3065 -382 2179 1748 -72 -2444 -2167 19 1957 3267
7012C267l635k021L73J319K037l91r93j663p86K60L146J705j125q63l566J230
$$ 3267 -368 -2389 -2016 -697 1340 949 -44 -1707 -2493 -2233 913 2618 1493 630 -2936 -1706
7028a706L092M22l9k569j826R38J641K481o57p32l100L04Q18J645J233j289l427
$$ -1706 1386 1808 1769 -800 -2626 -1688 -47 2434 1777 1045 -2055 -1751 -933 712 1945 656 -2771
7045b771M96J369K692O7p57l005k80J310K508R09j537k302q13N89J186K560r45
$$ -2771 -2275 -906 1786 1853 1096 -1909 -2189 -879 1629 2538 1001 -1301 -2114 -1525 -339 2221 1276
7062A276j148k832Q27J761K012M07l663l25N15J026K220j079o99l208J267J209
$$ 1276 128 -2704 -1877 -116 1896 2303 -1360 -1685 -1170 -144 2076 997 298 -2910 -1643 -434
7078d34J382O32L63k888j115J489J845J337j861L9k590O51J696J234N5j929j963
$$ -434 948 1580 1943 -945 -2060 -571 1274 2611 750 789 -1801 -1150 546 1780 1835 -94 -2057
7095b057rK143K618j112j839j805L04K451J735n16j365k017N11l58K833m52p34
$$ -2057 -2066 77 2695 1583 -256 -2061 -1757 694 2429 1913 548 -1469 -958 -1316 1517 1065 331
7112C31k257j06P59K627J308p22l571r6j24K788J519j427j253j437J166J015J301
$$ 331 -1926 -2032 -1273 1354 2662 1940 -1631 -1727 -1851 937 2456 1029 -224 -1661 -495 520 1821
7129A821J44j895r41k00Q59L267o08j761j772k49J435K165K75k110k236l45J386
$$ 1821 1965 70 -871 -1071 -212 3055 2447 686 -1086 -1335 100 2265 2540 430 -1806 -2151 -765
7146g65J562J512j527k616J60k87L066K508j547l510m17K66L073j19N54q66k042
$$ -765 797 2309 782 -1834 -1674 -1961 1105 3613 2066 -1444 -1861 -1595 1478 1359 1913 1047 -995
7163i95l62K031J432l92j719r04j082K928N82Q6j392j221j435K778J242n8o46
$$ -995 -1357 674 2106 1714 -5 -909 -1991 937 1519 1605 213 -1008 -2443 335 1577 1519 873
7180H73k631o07J346J384J553K79l540j855K429K073N42l5k292q67l90J679J648
$$ 873 -1758 -2365 -1019 365 1918 2197 -1343 -3198 -769 1304 1846 1811 -481 -1348 -1738 -59 1589
7197A589K47j493j758l00M23K837k39r90j775j343J806K716J566k916k085J852
$$ 1589 1836 343 -1415 -1715 -1292 1545 1306 316 -1459 -2802 -996 1720 3286 370 -1715 137
7213A37k285K565J002r68J01k683J212J069L164j475k936j637J743J346J858M10
$$ 137 -2148 417 1419 451 552 -2131 -919 150 3314 1839 -1097 -2734 -991 355 2213 2623
7229B623j641l550R84K886k36R17j149j931r25J434J416Q47n15k707q42N99K765
$$ 2623 982 -2568 -1584 1302 1066 1983 834 -1097 -2022 -588 828 1675 1160 -1547 -2389 -1790 975
7246I75R23j353k354q66J915R28K539m77k981j390O23J890R20J007j779l498J829
$$ 975 1898 545 -1809 -2675 -760 168 2707 2230 -751 -2141 -1518 372 1292 2299 520 -2978 -1149
7263a149P26L521j614j159j760l86J495J263J300r67k593r34J404J113K522j949
$$ -1149 -423 3098 1484 325 -1435 -1821 -326 937 2237 1270 -1323 -2257 -853 260 2782 833
7279H33j718j308R26J735J755j384j316r03o95K181K099q73j709j568J254Q88
$$ 833 -885 -2193 -1267 468 2223 839 -477 -1380 -2075 106 2205 1332 -377 -1945 -691 197
7295A97L87K002j946k263K55Q59J695J43p76j172r83J262J092k83J345k860p25
$$ 197 584 2586 640 -1623 -1368 -509 1186 1329 553 -619 -1602 -340 752 469 1814 -1046 -1771
7312a771J345J354J372r51k253n56p22K788R30Kk206k87L05L91K254p21l53j512
$$ -1771 -426 928 2300 1349 -904 -1460 -2182 606 1536 1538 -668 -955 -650 -259 1995 1274 921 -591
7330e91j801J669K576O75l857n08m53J949R98J062l55k680j22P33J982N46l61
$$ -591 -2392 -723 1853 2528 -1329 -1837 -2290 -341 657 1719 1364 -1316 -1438 -705 1277 1823 1462
7347A462j442k910J319K314P36K2j508j830R60J365J104M13j812o17l7O16M36
$$ 1462 20 -2890 -1571 743 1479 1501 -7 -1837 -877 488 1592 2005 193 -424 -461 155 591
7364E91J416j158j809j237J092K493J317j564k771l37J870J049Q38o22j242j019
$$ 591 2007 849 -960 -2197 -1105 1388 2705 1141 -1630 -1967 -97 952 1790 1168 -74 -1093
7380a093m52J508J455J077k886j191J84K155N74M92j446k010r23K470L07J898
$$ -1093 -1545 -37 1418 2495 -391 -1582 -1398 757 1331 1823 377 -1633 -2556 -86 221 2119
7396B119j886j027q10L72K270J322j37k326k548Q14L902l13p15j750p20K98J920
$$ 2119 233 -794 -1604 -1232 1038 2360 2223 -103 -2651 -1837 2065 1752 1037 -713 -1433 -1135 785
7413G85R30n74j218r66n01P65K286N36k135j718m0J244K371j24j130k434O75k04
$$ 785 1715 1141 -77 -1043 -1544 -779 1507 2043 -92 -1810 -1850 -606 1765 1641 511 -1923 -1248 -1452
7431a452J516J534j162j562J54o79K115J193l15k525k45l39L592L72j005j118
$$ -1452 64 1598 436 -1126 -972 -1651 464 1657 1342 -1183 -1428 -1767 1825 2197 1192 74
7447G4j620q53K480J092J02j548n34l03O60K394o90j16k177j323K098L181m94
$$ 74 -1546 -2399 81 1173 1275 -273 -807 -1110 -450 1944 1254 1138 -1039 -2362 -264 2917 2423
7464B423j770k344j0J766j07J799r43j073r26r22K272J538K63k739j116N16J345
$$ 2423 653 -1691 -1701 65 -42 1757 814 -259 -1185 -2107 165 1703 1966 -773 -1889 -1373 -28
7481b8K539j267j942j040l9K622P04q86J22j902j059K010R67J257j009j801k60
$$ -28 2511 1244 -698 -1738 -1777 845 1549 663 785 -1117 -2176 -166 801 2058 1049 -752 -1012
7498a012L83J627J253j094k948n16R39K961M65j129j033j393R93r16L236m09j411
$$ -1012 -629 998 2251 1157 -1791 -2307 -1368 1593 2058 929 -104 -1497 -504 -1420 1816 1407 -4
7515dj750L00K827P7M65k392p63L12Q20M67J762k076j389q76J279K126N79p22
$$ -4 -1754 -1454 1373 1450 1915 -477 -1240 -928 -108 359 2121 45 -1344 -2220 -941 1185 1764 1042
7533A042j858k092K098J923M31q70r26j55j50J074Q75n89j636m76q71K374J815
$$ 1042 -816 -2908 -810 1113 1544 674 -252 -407 -557 517 1392 803 -833 -1309 -2180 194 2009
7550B009N05j727l405J393O50K518k87j060j922q36J523Q59J731j60k272n50k65
$$ 2009 2514 787 -2618 -1225 -575 1943 1656 596 -1326 -2162 -639 220 1951 1791 -481 -1031 -1296
7567a296J341J606j91j537j495Q98N13J566p84n45j566n66K600P99o3k0j462j384
$$ -1296 45 1651 1460 -77 -1572 -674 -161 1405 621 76 -1490 -2056 544 1343 1280 1260 -202 -1586
7585a586J395K010q3j190k081o54J002K117J94n07k554N47L22J727J114r50j695
$$ -1586 -191 1819 1736 546 -1535 -2189 -1187 930 1124 617 -1937 -1390 -1068 659 1773 823 -872
7602h72r53K33J989J459o57j667k086J467R33J486L02j049j513k96R85J902p86
$$ -872 -1825 -1592 397 1856 1199 -468 -2554 -1087 -154 1332 1634 585 -928 -1224 -239 1663 877
7619H77j064o53j068J585J406J438k075j17j771N39K683j537J012m54j841lK208
$$ 877 -187 -840 -1908 -323 1083 2521 446 329 -1442 -903 1780 243 1255 801 -1040 -1043 1165
7636A165J169j65j934k526M67K337J844k280J89j009q74J571J525J23r92k150
$$ 1165 2334 2169 235 -2291 -1824 513 2357 77 266 -743 -1617 -46 1479 1602 610 -1540
7652a540L57K68J576M83K40k981q8Q70K022P02j316j467j208J299O1L245p49k550
$$ -1540 -1183 -915 661 1144 1384 -1597 -1685 -815 1207 1909 593 -874 -2082 -783 -722 2523 1774 -776
7670g76K93n89K649l30O45k227n84k5K120M1J25j271p30n97n97L032N84j606o67
$$ -776 -483 -1072 1577 1247 1892 -335 -919 -944 1176 1217 1342 71 -659 -1256 -1853 1179 1763 157 -510
7689e10k59R84J43K184j146k519j54L82J064N75J419l121L83q21K282K11k34p28
$$ -510 -769 215 358 2542 1396 -1123 -1277 -895 169 744 2163 -958 -575 -1396 886 1097 863 135
7707A35k495J209J882K32J000k148j317j39J534J366J249j988p24j397J398R12
$$ 135 -2360 -1151 731 963 1963 -185 -1502 -1641 -107 1259 2508 520 -204 -1601 -203 709
7723G09O78n47o14j748J308N60J353q3j524j463P81J645j25j16j840m20K46J081
$$ 709 1387 840 226 -1522 -214 346 1699 1616 92 -1371 -590 1055 930 814 -1026 -1446 -1200 -119
$$ [...]
8191b61
##END NTUPLES=NMR FID
##END=
