##TITLE=1H_IPACAT-14
 Dmso-D6
 48 sc, 
 27.11.2023
##JCAMPDX= 6.0         $$ Bruker NMR JCAMP-DX V2.0
##DATA TYPE= NMR FID
##DATA CLASS= NTUPLES
##ORIGIN= UXNMR, Bruker Analytische Messtechnik GmbH
##OWNER= root
$$ XWIN-NMR		Version 3.5
$$ Mon Nov 27 15:39:10 2023 Russian Standard Time (UT+4h)  she@DPX200
##.OBSERVE FREQUENCY= 200.1313
##.OBSERVE NUCLEUS= ^1H
##.DELAY= (6, 6)
##.ACQUISITION MODE= SIMULTANEOUS
##.ACQUISITION SCHEME= undefined
##.AVERAGES= 57
##.DIGITISER RES= 18
##SPECTROMETER/DATA SYSTEM= spect
##.PULSE SEQUENCE= zg30
##.SOLVENT NAME= DMSO
##.SHIFT REFERENCE= (INTERNAL, DMSO, 0, 15.7039)
##AUDIT TRAIL= $$ (NUMBER, WHEN, WHO, WHERE, WHAT)
$$ ##TITLE= Audit trail, XWIN-NMR		Version 3.5
$$ ##JCAMPDX= 5.01
$$ ##ORIGIN= Bruker BioSpin GmbH
$$ ##OWNER= she
$$ F:/spectra/data/she/nmr/H-F/1/audita.txt
$$ ##AUDIT TRAIL=  $$ (NUMBER, WHEN, WHO, WHERE, WHAT)
(   1,<2023-11-27 15:38:00.31 +0400>,<she>,<DPX200>,
      <continue with go, POWCHK disabled, PULCHK disabled
       configuration hash MD5:
       00 E9 B6 7A A2 85 ED C7 34 08 36 98 17 FE 4E 26
       data hash MD5: 16K
       9F 64 44 67 59 B0 19 A6 34 E5 93 E2 B6 A4 1B BE>)
$$ ##END=
$$ 
$$ hash MD5
$$ 63 D8 B6 4F 51 ED 4D 6B D3 85 05 9C 58 F7 C0 86
##$RELAX= 
##$RELAX= 
##$RELAX= 
##$RELAX= 
##$RELAX= 
##$RELAX= 
$$ Bruker specific parameters
$$ --------------------------
##$DU= <F:/spectra>
##$EXPNO= 1
##$NAME= <H-F>
##$PROCNO= 1
##$TYPE= <nmr>
##$USER= <she>
##$AMP= (0..31)
100 100 100 100 100 100 100 100 100 100 100 100 100 100 100 100 100 100 
100 100 100 100 100 100 100 100 100 100 100 100 100 100 
##$AQSEQ= 0
##$AQ_mod= 1
##$AUNM= <au_zg>
##$AUTOPOS= <>
##$BF1= 200.13
##$BF2= 200.13
##$BF3= 200.13
##$BF4= 200.13
##$BF5= 200.13
##$BF6= 200.13
##$BF7= 200.13
##$BF8= 200.13
##$BYTORDA= 1
##$CFDGTYP= 0
##$CFRGTYP= 5
##$CHEMSTR= <none>
##$CNST= (0..31)
1 1 145 1 1 1 1 1 1 1 1 1 1 1 1 1 1 1 1 1 1 1 1 1 1 1 1 1 1 1 1 1 
##$CPDPRG= <>
##$CPDPRG1= <>
##$CPDPRG2= <>
##$CPDPRG3= <>
##$CPDPRG4= <mlev>
##$CPDPRG5= <mlev>
##$CPDPRG6= <mlev>
##$CPDPRG7= <mlev>
##$CPDPRG8= <mlev>
##$CPDPRGB= <>
##$CPDPRGT= <>
##$D= (0..31)
0 1.2 0 0 0 0 0 0 0 0.06 0 0.03 0 0 0 0 0.0002 0 0 0 0 0 0 0 0 0 0 0 0 
0 0 0 
##$DATE= 1701084854
##$DBL= (0..7)
120 120 120 120 120 120 120 120 
##$DBP= (0..7)
150 150 150 150 150 150 150 150 
##$DBP07= 0
##$DBPNAM0= <>
##$DBPNAM1= <>
##$DBPNAM2= <>
##$DBPNAM3= <>
##$DBPNAM4= <>
##$DBPNAM5= <>
##$DBPNAM6= <>
##$DBPNAM7= <>
##$DBPOAL= (0..7)
0.5 0.5 0.5 0.5 0.5 0.5 0.5 0.5 
##$DBPOFFS= (0..7)
0 0 0 0 0 0 0 0 
##$DE= 6
##$DECBNUC= <off>
##$DECIM= 32
##$DECNUC= <off>
##$DECSTAT= 4
##$DIGMOD= 1
##$DIGTYP= 9
##$DL= (0..7)
0 120 120 120 120 120 120 120 
##$DP= (0..7)
150 150 150 150 150 150 150 150 
##$DP07= 0
##$DPNAME0= <>
##$DPNAME1= <>
##$DPNAME2= <>
##$DPNAME3= <>
##$DPNAME4= <>
##$DPNAME5= <>
##$DPNAME6= <>
##$DPNAME7= <>
##$DPOAL= (0..7)
0.5 0.5 0.5 0.5 0.5 0.5 0.5 0.5 
##$DPOFFS= (0..7)
0 0 0 0 0 0 0 0 
##$DQDMODE= 0
##$DR= 18
##$DS= 0
##$DSLIST= <SSSSSSSSSSSSSSS>
$$ [...]
##$SUBNAM2= <"">
##$SUBNAM3= <"">
##$SUBNAM4= <"">
##$SUBNAM5= <"">
##$SUBNAM6= <"">
##$SUBNAM7= <"">
##$SUBNAM8= <"">
##$SUBNAM9= <"">
##$SW= 18.0517328524113
##$SWIBOX= (0..15)
0 0 2 0 0 0 0 0 0 0 0 0 0 0 0 0 
##$SW_h= 3612.71676300578
##$TD= 16384
##$TD0= 1
##$TE= 0
##$TE2= 300
##$TE3= 300
##$TEG= 300
##$TL= (0..7)
0 120 120 120 120 120 120 120 
##$TP= (0..7)
150 150 150 150 150 150 150 150 
##$TP07= 0
##$TPNAME0= <>
##$TPNAME1= <>
##$TPNAME2= <>
##$TPNAME3= <>
##$TPNAME4= <>
##$TPNAME5= <>
##$TPNAME6= <>
##$TPNAME7= <>
##$TPOAL= (0..7)
0.5 0.5 0.5 0.5 0.5 0.5 0.5 0.5 
##$TPOFFS= (0..7)
0 0 0 0 0 0 0 0 
##$TUNHIN= 0
##$TUNHOUT= 0
##$TUNXOUT= 0
##$USERA1= <user>
##$USERA2= <user>
##$USERA3= <user>
##$USERA4= <user>
##$USERA5= <user>
##$V9= 5
##$VALIST= <valist>
##$VCLIST= <CCCCCCCCCCCCCCC>
##$VD= 0
##$VDLIST= <DDDDDDDDDDDDDDD>
##$VPLIST= <PPPPPPPPPPPPPPP>
##$VTLIST= <TTTTTTTTTTTTTTT>
##$WBST= 1024
##$WBSW= 4
##$XGAIN= (0..3)
0 0 0 0 
##$XL= 0
##$YL= 0
##$YMAX_a= 869622
##$YMIN_a= -1101189
##$ZGOPTNS= <>
##$ZL1= 120
##$ZL2= 120
##$ZL3= 120
##$ZL4= 120
##$ABSF1= 10
##$ABSF2= 0
##$ABSG= 5
##$ABSL= 3
##$ALPHA= 0
##$AQORDER= 0
##$ASSFAC= 0
##$ASSFACI= 0
##$ASSFACX= 0
##$ASSWID= 0
##$AUNMP= <proc_1d>
##$AZFE= 0.1
##$AZFW= 0.1
##$BCFW= 1
##$BC_mod= 2
##$BYTORDP= 1
##$COROFFS= 0
##$CY= 11.3945322036743
##$DATMOD= 1
##$DC= 2
##$DFILT= <>
##$DTYPP= 0
##$F1P= 15.7292609196834
##$F2P= 12.9074282941183
##$FCOR= 0.5
##$FTSIZE= 0
##$FT_mod= 4
##$GAMMA= 1
##$GB= 0.15
##$INTBC= 1
##$INTSCL= 1
##$ISEN= 128
##$LB= 0.24
##$LEV0= 0
##$LPBIN= 0
##$MAXI= 10000
##$MC2= 0
##$MEAN= 0
##$ME_mod= 0
##$MI= 1.114404
##$NCOEF= 0
##$NC_proc= 0
##$NLEV= 6
##$NOISF1= 3.799351
##$NOISF2= 2.8
##$NSP= 1
##$NTH_PI= 0
##$NZP= 0
##$OFFSET= 15.70392
##$PC= 1
##$PHC0= -24233.33
##$PHC1= 11.8527
##$PH_mod= 1
##$PKNL= yes
##$PPARMOD= 0
##$PSCAL= 0
##$PSIGN= 0
##$REVERSE= no
##$SF= 200.130013532006
##$SI= 16384
##$SIGF1= 3
##$SIGF2= 2
##$SINO= 400
##$SIOLD= 16384
##$SREGLST= <1H.CDCl3>
##$SSB= 0
##$STSI= 0
##$STSR= 0
##$SW_p= 3612.71676300578
##$SYMM= 0
##$S_DEV= 0
##$TDeff= 0
##$TDoff= 0
##$TI= <>
##$TILT= no
##$TM1= 0
##$TM2= 0
##$TOPLEV= 0
##$USERP1= <user>
##$USERP2= <user>
##$USERP3= <user>
##$USERP4= <user>
##$USERP5= <user>
##$WDW= 1
##$XDIM= 8192
##$YMAX_p= 0
##$YMIN_p= 0
$$ End of Bruker specific parameters
$$ ---------------------------------
##NTUPLES= NMR FID
##VAR_NAME=  TIME,          FID/REAL,        FID/IMAG
##SYMBOL=    X,             R,               I
##VAR_TYPE=  INDEPENDENT,   DEPENDENT,       DEPENDENT
##VAR_FORM=  AFFN,          ASDF,            ASDF
##VAR_DIM=   8192,          8192,            8192
##UNITS=     SECONDS,       ARBITRARY UNITS, ARBITRARY UNITS
##FACTOR=    0.0002768,     1,               1
##FIRST=     0,             0,               0
##LAST=      2.2672688,     0,               0
##MIN=       0,             -1101189,        0
##MAX=       2.2672688,     869622,          0
$$ Real data points
##PAGE= N=1
##DATA TABLE= (X++(R..R)), XYDATA
0 0 0 0 0 0 0 0 0 0 0 0 0 0 0 0 0 0 0 0 2 -55 57 -57 57 -57 59 -83 114 -114 123 -153 173 -196 227 -250 287
35 287 -318 353 -394 443 -492 547 -608 673 -746 822 -914 994 -1107 1218 -1342 1475 -1628
52 -1628 1800 -1981 2195 -2434 2715 -3030 3403 -3856 4403 -5086 5971 -7160 8850 -11432
66 -11432 15831 -24810 50354 -270361 -1101189 -506876 421030 460661 -137125 -78645 642674
77 642674 869622 133722 -454673 -49349 657257 511322 -219165 -383143 223060 526296
87 526296 -33185 -640670 -394440 241201 217207 -445877 -686539 -129870 331611 -34113
97 -34113 -607958 -429287 261131 400922 -173499 -474973 48835 604316 341944 -271859
107 -271859 -203578 458803 651667 64677 -352290 58769 595769 345980 -323309 -371661
117 -371661 221938 437062 -117566 -580479 -246845 299950 151133 -457483 -546827 17488
127 17488 327443 -91357 -531465 -257361 314829 301610 -230290 -382262 123868 506111
137 506111 181722 -294851 -132619 420128 479266 -48015 -307642 109281 508405 217110
147 217110 -315915 -253541 266951 363396 -155764 -476154 -108414 316121 83688 -438825
157 -438825 -410878 108607 270430 -174505 -483553 -140602 308344 165071 -298752 -300601
167 -300601 183457 398693 35553 -284831 -30595 400286 334181 -105392 -207964 185182
177 185182 433521 129111 -255341 -124486 285002 283188 -159154 -361232 -26992 271400
187 271400 20410 -400949 -325835 108033 184259 -223247 -443269 -104245 254852 73788
197 73788 -318222 -246953 203717 333108 -26488 -249398 55834 412814 267406 -121017
207 -121017 -113736 271400 398845 54106 -220351 -12804 302158 181830 -212875 -284732
217 -284732 38462 197124 -94127 -391335 -238915 102579 75340 -272109 -368616 -41269
227 -41269 206069 4433 -283585 -149087 230364 281529 -38758 -172526 129774 399070
237 399070 215104 -110028 -46151 290910 334451 -6135 -201830 25277 260946 82620
247 82620 -252898 -242695 54232 121461 -168703 -363209 -162718 97424 7400 -270824 -270239
258 -270239 29437 175187 -28639 -216858 -49224 240963 222474 -44586 -102443 163477
268 163477 339900 146112 -105065 -12704 259855 249583 -57422 -190468 34539 216398
278 216398 20250 -265346 -202132 76147 91189 -195381 -320809 -86640 123114 -21462
288 -21462 -261942 -186228 97907 155013 -68849 -177369 28042 236648 141462 -75323 -48828
299 -48828 182179 254311 59504 -91639 29657 216342 151813 -79012 -129126 56883 155177
310 155177 -17752 -207902 -129254 74934 58204 -166821 -241006 -44135 105524 -30777
320 -30777 -220748 -140105 96739 120604 -85694 -161739 37793 206494 88797 -100691 -37819
331 -37819 182647 209853 7621 -90947 67248 214629 104223 -91174 -74054 105505 136437
342 136437 -45663 -165456 -54528 88234 16612 -165459 -176838 -11323 61122 -76102
352 -76102 -198497 -101500 68343 52120 -107638 -132374 40893 152390 42833 -86143 -3934
363 -3934 173772 169351 2726 -45496 105629 204317 84213 -66909 -17489 127630 109043
374 109043 -62628 -131847 -15594 68112 -35460 -172899 -142128 -9061 3502 -121226 -179656
385 -179656 -73522 38497 -1083 -107055 -85918 53616 118109 31647 -42995 38608 167704
396 167704 151440 25524 -1242 116836 183449 75345 -48367 -4768 110085 79302 -76966
407 -76966 -129917 -20810 40767 -67981 -186140 -133268 -8277 -20957 -141123 -164030 -38372
418 -38372 44389 -22229 -98911 -33672 91767 103646 15349 -4272 92339 163734 109234 23340
430 23340 41434 124462 129634 31838 -31681 13257 68416 18887 -84225 -101936 -28553 -3397
442 -3397 -84482 -153593 -105591 -18847 -31340 -115380 -118242 -17696 43960 -10048 -65301 -4382
454 -4382 96190 94555 17207 9477 95718 142289 80572 13478 43364 107932 89157 3097
466 3097 -29229 18065 45053 -10870 -80660 -74081 -21805 -20087 -81605 -116044 -72166 -17114 -33440
479 -33440 -88334 -80338 -6266 32393 -10104 -47252 2831 79018 71792 7754 5469 80474 114481
492 114481 52790 -1043 39067 97282 67547 -11409 -21698 35567 46270 -20356 -68546 -36844
504 -36844 3291 -25493 -80840 -82190 -37825 -22363 -55887 -78490 -50032 -11145 -7025 -29492
516 -29492 -29834 6527 39298 34716 13939 20607 59332 79360 52929 25662 44936 79171 67139
529 67139 17717 1868 34414 46552 -849 -46748 -30993 988 -19972 -75017 -83416 -43272
541 -43272 -27087 -65789 -91297 -57699 -15634 -21598 -49932 -34971 13445 36746 19200 10930
553 10930 43286 75873 72192 51474 52863 71754 79585 58408 32777 27710 34946 26572 -6868
566 -6868 -33359 -33716 -25230 -41659 -75076 -83218 -61214 -49800 -70710 -85160 -58686 -23544 -23260
579 -23260 -37258 -20168 23142 42599 29500 28340 59933 86048 75548 58039 64539 80950
591 80950 72237 45030 29219 30005 23015 -389 -23455 -34058 -40222 -49439 -61118 -72649 -76643
604 -76643 -70181 -61702 -60661 -63821 -50899 -24040 -8271 -10820 -3990 26052 51142 47287 39216 57712
618 57712 82484 75917 52455 49738 67154 61625 29464 8891 15003 14434 -14020 -41360 -40563 -33493
632 -33493 -48790 -69603 -69583 -55025 -52576 -59705 -56224 -37767 -24425 -20538 -11792 5533 17973 25178
646 25178 33797 44751 49533 49317 53778 58467 52988 42565 38976 39343 29918 10813 -149 609 -5245
661 -5245 -25668 -37774 -34114 -33037 -45485 -56461 -48439 -37659 -41050 -45944 -36153 -19113 -13509 -14562
675 -14562 -5400 12298 21930 21341 26286 38423 45196 41780 42343 46494 45527 38302 33619 31589 23131
690 23131 11062 4208 589 -8935 -23172 -28504 -28374 -35834 -46387 -48417 -41310 -40282 -46684 -43751
704 -43751 -28497 -20203 -21738 -16438 1211 15466 15672 18484 34957 47097 44093 40519 50161 57990
718 57990 48596 35432 36068 37247 24213 4585 -1102 -1949 -15004 -35213 -41554 -38114 -45203 -59449
732 -59449 -61278 -48568 -45185 -50398 -46995 -26695 -12477 -13261 -6943 13451 30584 32685 32759 48958
746 48958 62017 58440 50063 53772 59062 49057 32211 25134 23354 9829 -10417 -20707 -23356
759 -23356 -32770 -50020 -57732 -53412 -53973 -61544 -62020 -48774 -37998 -36346 -29303 -11062 4956 11214
773 11214 17459 33556 47370 50556 49823 56890 63086 58287 48604 44292 41704 30326 13862 4550
787 4550 -1026 -14787 -30294 -37161 -39584 -47935 -55954 -57340 -50577 -49916 -49809 -42257 -28307 -20672 -16026
802 -16026 -3354 12492 21661 24384 33484 45851 49634 46860 47299 52809 49424 36812 30196 30761
816 30761 21731 5394 -6435 -6314 -13187 -29508 -38819 -35931 -34788 -46128 -50977 -42159 -32434 -34741
830 -34741 -37434 -23985 -8174 -5273 -6546 5257 22252 26830 22582 28002 41862 44413 34305
843 34305 32450 40092 38408 25521 16719 18719 15597 1066 -10099 -10083 -12366 -24247 -33658 -32312
857 -32312 -29918 -36926 -41763 -36598 -28565 -29210 -30208 -20867 -8635 -4611 -5354 4951 19541 23501 20232
872 20232 27318 38888 40792 32925 31884 38982 39081 25902 16807 19006 17183 3361 -10618 -12765
886 -12765 -13476 -24121 -35554 -37204 -34434 -37911 -43348 -41540 -33390 -29962 -28357 -21279 -10675 -3680
900 -3680 3414 12611 22124 27536 32395 40398 46749 43630 40324 42949 44696 34087 21557 18678 17279
915 17279 4440 -13569 -20483 -17994 -27483 -42806 -48424 -41608 -40020 -48975 -49266 -37630 -26536 -26700
929 -26700 -22893 -8691 7009 12819 16718 26937 39239 42299 42862 47538 50595 46612 40990 38796
943 38796 33254 20763 9835 5306 -1175 -16644 -30064 -31823 -32126 -42386 -53889 -49800 -39775
956 -39775 -40447 -46548 -37946 -19155 -10559 -12537 -6921 14556 28302 25580 25161 38386 51096 46768
970 46768 36515 38518 45957 38259 22987 15274 15910 9573 -6782 -17441 -19186 -23591 -32691 -39279
984 -39279 -39821 -39522 -40814 -39393 -33492 -28399 -25748 -17904 -6262 -1171 2084 10917 24067 28655 26268
999 26268 28775 39285 42421 32516 26115 31524 33004 20155 6425 6360 8522 -2350 -17404 -21461
1013 -21461 -16157 -20606 -31979 -36251 -29939 -27073 -30431 -31117 -24501 -16596 -13561 -10554 -5319 2277 7894
1028 7894 13886 19170 20457 23702 30270 33945 29280 23985 28291 32031 23899 11990 9468 13685 7047
1043 7047 -9876 -15668 -10965 -11959 -26701 -35619 -28725 -22143 -29651 -37451 -30047 -17476 -15875 -20779
1057 -20779 -14656 127 7412 5620 9529 21054 27934 27403 28134 32384 36154 32880 29747 27953 23333
1072 23333 16563 10879 8229 -79 -11618 -16964 -17970 -22976 -34839 -38717 -32737 -31009 -37431 -39749
1086 -39749 -28258 -16057 -16498 -18773 -6253 11232 15524 11638 19400 36150 40699 33205 31074 39994
1100 39994 43307 32527 21169 21934 21628 10093 -3713 -9350 -11700 -19527 -29493 -34957 -36343 -37225
1114 -37225 -40047 -38151 -35849 -32513 -26472 -17736 -12479 -7568 1416 13144 21871 22277 26125 36490
1128 36490 42861 37921 32989 36383 38758 29902 16658 13389 13617 4677 -10019 -17847 -17827 -22010 -32948
1143 -32948 -37907 -34328 -32700 -36390 -35603 -29004 -21475 -19683 -14690 -3696 3425 7943 13867 22553 26966
1158 26966 27262 30115 36338 36285 29498 26427 28404 25803 13418 3918 4673 3263 -9106 -21229 -20557
1173 -20557 -16985 -24504 -33521 -32750 -24280 -23648 -29747 -27623 -16212 -7937 -10798 -8744 3352 14134
1187 14134 12889 11636 19875 28621 26216 21820 24689 29348 26094 19093 15607 16129 11177 2463 -1469
1202 -1469 -2220 -8495 -15854 -17552 -18064 -21757 -26963 -27497 -21297 -21784 -25059 -22440 -11988 -8568 -10128 -5558
1218 -5558 5578 11207 9551 11209 21145 26825 23251 21033 25711 29424 23914 17509 15874 16517 10315
1233 10315 2173 -1541 -3975 -9993 -17001 -20614 -21079 -25010 -28909 -29121 -25123 -25669 -25906 -20485 -12760 -10690
1249 -10690 -8514 909 9674 12534 13621 20120 28623 29591 26664 28577 33015 30961 22248 18810 19249
1264 19249 13703 1835 -5603 -6056 -9640 -20690 -27490 -26755 -26768 -31283 -35527 -30547 -24880 -24423 -23244
1279 -23244 -15088 -5023 -1584 774 9176 19387 23697 22838 27285 35482 35430 29299 28629 29916 26203
1294 26203 15494 8381 8109 3388 -9464 -17303 -17301 -19985 -28769 -33770 -31039 -27394 -30601 -32191 -25193
1309 -25193 -15920 -14591 -12973 -3950 7744 12053 12046 19374 28398 30308 26073 27980 32357 30828 23883
1324 23883 18285 19328 14954 4305 -2817 -4371 -7352 -16791 -24232 -23264 -23314 -28103 -30579 -26244 -22547
1339 -22547 -22575 -20989 -14767 -7052 -4502 -1276 5927 13182 15838 16474 21446 25832 24716 22853 23856
1354 23856 24418 20146 14641 12319 10870 4788 -2543 -5686 -6346 -11695 -19063 -19672 -18576 -20335 -23694
1369 -23694 -22438 -17692 -16308 -18686 -15068 -7460 -3257 -3728 -33 9096 13568 12378 14270 20314 23479
1384 23479 20046 18361 21109 22803 17282 11185 11097 11603 3899 -3174 -5574 -4827 -10811 -18518 -19841 -17034
1400 -17034 -19288 -24388 -23745 -18110 -15714 -17826 -15274 -7103 -1697 -3122 -90 9510 15023 14919 15615
1415 15615 21912 26126 23138 19891 23565 24723 18496 11232 10071 10154 2554 -6857 -9924 -9817 -15688
1430 -15688 -23440 -25607 -22090 -23512 -28557 -27508 -19671 -15431 -16992 -13843 -3688 2960 4394 7837
1444 7837 15577 21853 22346 22511 26058 29299 27025 22881 22404 20003 13987 7790 4044 -835 -7931 -14235
1460 -14235 -16273 -19851 -25242 -28300 -26648 -24419 -27724 -26855 -20489 -13632 -12238 -9921 -2094 8293 10655
1475 10655 11669 17876 25431 27550 24400 25243 28951 27694 20864 16117 14732 12125 4017 -3469 -7207
1490 -7207 -9646 -16315 -21582 -22568 -23502 -25880 -26403 -22906 -20971 -20401 -16897 -9612 -4611 -3095 792 9398
1506 9398 16384 15733 15151 21522 27880 24921 18254 20224 24735 20390 9261 5140 9217 6096 -6616
1521 -6616 -13418 -9899 -8801 -17754 -24319 -21950 -17054 -18077 -22951 -19944 -12565 -9165 -9221 -7379 -366
1536 -366 5685 6400 9329 12944 16127 17861 20027 19308 17902 16797 18451 17140 10669 6102 6647 6989
1552 6989 -842 -9876 -9404 -6156 -10396 -20453 -20975 -14143 -13158 -19417 -22611 -14812 -7745 -9799 -12784
1567 -12784 -6572 3088 6700 3219 5012 13994 19056 16844 15218 17116 21323 20719 16484 11663 11151
1582 11151 11010 7577 205 -5411 -5382 -4760 -10330 -19025 -21142 -15539 -15240 -22197 -26076 -18156 -9335 -10820
1598 -10820 -16393 -10585 3414 8347 1744 2163 15811 24890 19801 12903 19332 28196 25176 14618
1612 14618 11097 15765 15165 5138 -4274 -5038 -3939 -8949 -18077 -22146 -20546 -18684 -21526 -25016 -23919
1627 -23919 -18544 -12690 -10177 -11846 -6873 4137 11058 8166 7246 16678 28030 25254 15011 17495
1641 17495 28349 28298 13632 5826 12005 17044 3187 -12353 -12060 -2962 -8497 -24675 -28745 -18917
1655 -18917 -13986 -22635 -29519 -21266 -9074 -7485 -13245 -10151 2109 11488 10355 7599 12107 22284
1669 22284 26017 20499 15624 19469 25330 21626 9385 3392 8376 10681 -94 -14330 -13132 -4991
1683 -4991 -8325 -23450 -27958 -16405 -8941 -18504 -27349 -18227 -2660 -2724 -12180 -10063 5565 14905
1697 14905 8798 2543 11163 23935 23634 12766 10056 18364 23671 14958 3910 3308 9300 8763 -3713
1712 -3713 -12276 -9334 -2509 -7094 -20071 -23397 -11767 -6422 -16108 -25419 -17286 -760 -890 -13619
1726 -13619 -13716 3876 16076 5236 -4808 6128 24123 21838 6395 4391 21006 27072 12234
1739 12234 -342 7123 18222 10526 -7204 -10576 -426 2606 -9911 -21187 -16866 -7333 -9159
1752 -9159 -20043 -24244 -13744 -4332 -6976 -15456 -12704 2510 10255 2856 -3744 6524 23428 21730
1766 21730 7336 7135 22017 28907 14397 587 8063 21873 14276 -7516 -12988 1760 5224
1779 5224 -12291 -27878 -19296 -5227 -10359 -27500 -28058 -11420 -2628 -11880 -20354 -9897 8304
1792 8304 10697 -564 -1517 13765 26887 20184 7992 12432 26639 29166 12707 1163 10436
1805 10436 20730 10276 -10804 -13654 88 2787 -17059 -31017 -20251 -4999 -12869 -30421
1817 -30421 -28930 -7092 581 -13740 -21411 -4076 14551 11423 -2502 1735 21538 29039 16329
1830 16329 6719 16195 29519 23664 6558 1273 11266 16493 2959 -13213 -12642 -1660 -2655 -18822
1844 -18822 -28899 -18514 -4859 -11011 -27532 -25423 -4678 4364 -10080 -19147 -2035 18794 14409
1857 14409 -3763 616 23510 31205 13143 266 14529 30254 20710 -1364 -2976 14132 16940
1870 16940 -4412 -18303 -8145 4567 -4678 -22674 -24483 -9936 -1649 -14498 -25839 -16237 184
1883 184 2311 -11257 -15173 2314 16643 9729 -3895 1967 21435 25472 9131 -1610 13176
1896 13176 27853 17565 -3329 -2882 15138 17812 -4225 -17532 -5142 8804 -2726 -24151
1908 -24151 -22497 -2607 314 -17402 -27205 -13342 4042 -990 -17490 -14943 5134 14242 2797
1921 2797 -7929 3739 22062 20098 4459 1358 15948 27739 15518 -2734 146 17441 18006
1934 18006 -4336 -15411 -2819 10490 -3182 -24333 -22355 -2454 290 -20648 -29978 -13570
1946 -13570 5073 -3958 -21726 -16466 8651 14327 -2511 -8605 9186 25092 18628 1493 5766
1959 5766 23780 27193 10641 -869 8247 19460 11612 -6893 -12349 191 5564 -8059 -25027
1972 -25027 -20950 -4348 -5050 -22117 -29192 -12482 3068 -5453 -20893 -13134 9563 16354 -576
1985 -576 -7756 11748 29403 20085 1915 5960 26696 29220 7709 -2827 9773 20866 7859
1998 7859 -12976 -12815 2022 3289 -15557 -27050 -16048 -3126 -9358 -25439 -25033 -6884 2713
2011 2713 -7696 -17539 -6633 13134 14406 -430 -3057 14989 27480 16714 1496 7100 24746
2024 24746 24706 4322 -5341 8415 18588 3475 -15483 -12983 2863 3069 -17724 -26594 -12068
2037 -12068 833 -9514 -25223 -19407 -524 3881 -9206 -14784 -652 14082 10583 -2154 -160
2050 -160 15793 22422 10686 807 7856 21682 18919 1873 -4310 7296 15686 2525 -13924
2063 -13924 -11406 4566 3071 -15954 -23744 -8147 3444 -8159 -24650 -17115 2979 5021 -12788
2076 -12788 -16197 1907 15266 5379 -6990 1179 18696 19353 5084 -186 12724 21882 13452
2089 13452 -404 728 11648 13074 -403 -10103 -4603 5299 79 -14979 -19011 -7632 9
2102 9 -10349 -22241 -16120 -323 615 -13224 -16317 -284 12569 4430 -7768 451 17493 19575
2116 19575 4546 231 14050 24538 13700 -654 3081 16300 13856 -2388 -9565 -1387 5991
2129 5991 -4567 -17347 -16531 -5326 -3889 -15670 -21963 -13796 -2243 -3643 -14299 -11861 1510
2142 1510 10134 2914 -3888 3745 18699 18394 6074 3524 16089 24535 13605 -1 3885 16098
2156 16098 12481 -4464 -11359 -641 4592 -7782 -20938 -16006 -4381 -6527 -18049 -21692 -9647
2169 -9647 -907 -6633 -13144 -6998 5431 8583 2158 -113 9227 18029 15520 8176 7404 16133 20060
2184 20060 10599 1005 3846 11376 8426 -6004 -12152 -3029 1986 -8139 -19742 -16494 -4323 -5216
2198 -5216 -17109 -19695 -6619 2058 -4157 -12278 -4686 9204 10219 558 -84 11660 18523 11952
2212 11952 4097 8103 16888 15328 5698 1137 5580 8280 2038 -6496 -8080 -1387 -1051 -10560 -15195
2227 -15195 -11691 -4328 -6239 -14069 -14500 -5036 1302 -4507 -9100 -3147 7431 8689 -809 -210 9775
2242 9775 16026 9133 1671 7503 16056 12778 2906 297 6826 9515 1467 -6588 -4456 1015 -1864
2257 -1864 -9681 -12560 -7621 -4382 -7811 -12889 -11565 -4351 -1644 -5481 -8194 -2837 4579 4759 384
2272 384 457 8465 13558 9009 2946 7066 15314 13235 4291 2358 8534 11246 1607 -5985 -2938 2270
2288 2270 -1065 -11439 -12781 -5564 -3549 -10998 -15219 -9594 -3692 -5086 -8716 -7972 -1056 3645 1744
2303 1744 1028 3923 9918 11531 9270 6853 9406 13094 12280 6521 4478 7395 8194 2256 -3495 -3288
2319 -3288 -32 -2704 -9935 -13787 -7660 -5958 -10601 -15933 -11027 -4596 -4697 -8959 -7563 325 4561
2334 4561 2298 202 5524 12788 11501 7068 7670 13065 13684 9789 5487 6325 7749 4997 -466 -3378
2350 -3378 -2769 -3235 -6039 -10059 -11741 -8573 -7393 -10305 -13072 -9888 -4538 -3165 -6732 -5536 1937
2365 1937 6128 3968 2795 6137 12728 11379 6798 8062 11494 11633 6451 3361 5214 6662 886
2380 886 -3603 -3311 -3321 -3768 -7788 -10191 -8545 -7942 -8202 -9173 -9415 -6903 -4471 -3099 -3138 -2577 1450 3681
2398 3681 5032 2997 5177 10357 9944 5965 5680 8830 10316 7136 2504 3121 6458 2506 -3543 -3475
2414 -3475 -2081 -1935 -6619 -10303 -7065 -4471 -7163 -10150 -7945 -4246 -3894 -4208 -4380 -942 1501 1151
2430 1151 1781 3757 6101 6755 7391 6712 7874 8235 7239 6281 4441 3974 4477 2953 -975 -2776 -1942
2447 -1942 -1895 -4145 -7587 -7087 -5333 -6496 -9356 -8640 -5921 -3936 -4784 -5435 -1450 1295 2286 896 2366
2464 2366 6899 6978 6547 7039 8605 9817 7857 6890 6034 6174 4100 2048 438 -732 -2515 -3765 -4876
2481 -4876 -8064 -8342 -6839 -6951 -8613 -9223 -7566 -4615 -4989 -5127 -3069 1784 2663 1393 3174 7320
2497 7320 8284 6892 6862 9633 10362 8343 5532 5985 6541 3736 -48 -1002 -932 -3566 -6620 -7295 -6757 -7831
2515 -7831 -9480 -8850 -8351 -7205 -7790 -5626 -3948 -2503 -1944 1188 3818 3924 5195 7033 8801 9248
2531 9248 7912 7379 8708 8137 4918 3309 5064 3907 667 -2984 -2253 -3243 -5601 -8008 -7821 -6841
2547 -6841 -7109 -8878 -8056 -5289 -4335 -5004 -3131 -35 305 1057 3334 4590 6928 6776 6513 8019 8320
2564 8320 7025 6850 6340 5673 3174 2298 2198 729 -2169 -3703 -3628 -4732 -6971 -7558 -6131 -5981 -6682
2581 -6682 -7308 -4692 -3293 -3543 -3229 -1324 1546 1813 1688 2965 5607 5330 4943 6163 7302 6896 4812
2598 4812 4965 5821 4104 2556 1310 851 -253 -2485 -3867 -3840 -3950 -6471 -6328 -4809 -5433 -6446 -5786
2615 -5786 -4402 -3240 -3169 -3006 -999 2055 1626 2085 4650 6025 5557 4324 6523 7736 6216 4753
2631 4753 4162 5264 3686 1464 -65 -190 -1067 -3537 -5074 -4459 -4951 -6667 -6485 -6090 -6026 -5678 -5956 -4879
2649 -4879 -2681 -2420 -1251 793 2808 3617 3872 5744 7430 7126 6566 7009 8406 7457 4873 4038 3990
2666 3990 2887 -199 -934 -1280 -3204 -5455 -5641 -5743 -6232 -8378 -7761 -5642 -5490 -4981 -5453 -2554 -367
2683 -367 -334 357 3083 4573 4978 5586 7562 8333 7594 6328 7083 6717 4785 3634 2158 1500 -260 -2998
2701 -2998 -3958 -3610 -5188 -6531 -6038 -6292 -6290 -7995 -6262 -4703 -3703 -3610 -2577 465 1409 2190 2385 4612
2719 4612 6586 5653 6294 7374 7343 5873 5269 4801 4328 2182 794 648 664 -2562 -4288 -4034 -4489 -5517
2737 -5517 -6927 -6183 -5146 -5204 -6158 -3871 -2729 -1901 -2467 -336 1630 2410 2784 4045 5636 5962 5030
2754 5030 5796 6607 6057 5032 2631 3554 3257 1018 -252 -159 -1063 -2858 -4493 -4336 -5022 -4960 -6191 -5279
2772 -5279 -4182 -3670 -5000 -3739 -1010 -666 -96 -158 2316 2794 2477 3580 5014 5196 6001 5321 5217 5461
2790 5461 4108 2985 3639 2265 474 -536 -364 -1019 -2199 -4400 -4500 -4480 -5454 -6883 -5208 -4351 -4584
2807 -4584 -4444 -3110 -1237 -1437 -1069 1681 3230 3197 2904 5059 6301 5371 5110 5610 6867 5350 3697
2824 3697 3202 2486 1678 -967 -1581 -1507 -3169 -4591 -5897 -4444 -4927 -6512 -5934 -4656 -4246 -4514 -3428
2841 -3428 -1421 -18 856 1343 2924 4619 5182 4766 6024 6737 5721 5026 5613 5586 4130 1369 1756
2858 1756 1132 -278 -1670 -3427 -3484 -3953 -6409 -6662 -5450 -5143 -6097 -5531 -3934 -2258 -2296 -2062 702 2606
2876 2606 1841 3007 4280 6379 5830 4691 6266 7199 6165 4070 3452 3600 1764 404 -797 -460
2892 -460 -2222 -3793 -4262 -4347 -5248 -6448 -5274 -4293 -4313 -5162 -3968 -2242 -1142 -619 11 2478 2502 3363
2910 3363 4306 5506 5951 4382 3984 5637 5543 3525 2548 1942 2484 198 -1181 -1525 -1691 -3195 -4342
2927 -4342 -5010 -4287 -4447 -5534 -4911 -3789 -2955 -3590 -2659 -545 -187 -605 1097 2628 2194 3800 3568 4991
2945 4991 5471 3794 3235 4717 4794 2818 1471 2222 1112 -107 -1923 -1214 -1735 -3844 -4525 -4636 -3604
2962 -3604 -4798 -5393 -4916 -3190 -2642 -4020 -2241 -63 175 606 1504 3294 3637 3712 4029 5527 5784 4044
2980 4044 4394 4495 4187 2803 1379 1532 815 -717 -3058 -2614 -2863 -3824 -4921 -4943 -4216 -4674 -5706 -4285
2998 -4285 -2927 -2485 -2702 -1427 439 2189 1556 3366 4134 4875 4616 4748 5715 5595 4459 4366 4107 2956
3016 2956 1303 -328 515 -415 -2575 -3624 -3097 -4503 -4911 -5555 -4911 -4789 -4807 -4175 -3223 -1973 -1315 -801
3034 -801 948 2115 1884 3012 3405 4922 5188 5000 6202 5832 5178 3052 3070 3374 1389 -404 -1670
3051 -1670 -1556 -2889 -4103 -4761 -3975 -4355 -5514 -5394 -3963 -3269 -3406 -2600 -1055 364 133 385 2159
3068 2159 3983 3413 3369 4390 5452 5258 4386 4189 4686 3682 1672 1952 1899 -281 -1634 -2164 -1802 -2191
3086 -2191 -4474 -4945 -3579 -4445 -4578 -4283 -3167 -1794 -1998 -2049 665 1037 1142 761 2479 4309 3230
3103 3230 3127 3664 4204 4553 3717 3801 2863 2741 905 591 541 -266 -1304 -2286 -1990 -3018 -3685 -5101 -3411
3122 -3411 -3579 -3979 -3874 -2226 -1723 -1704 -500 817 1100 912 1546 3017 3996 4140 3605 4346 4241 3482 3057
3141 3057 3360 2484 1738 823 -204 336 -883 -2265 -2813 -2430 -4118 -4518 -3750 -3548 -3865 -3743 -3317 -1398
3159 -1398 -1416 -1050 -1404 1099 1420 1707 2713 3740 4233 3359 3627 4522 5057 3553 2778 3406 2102 283
3177 283 -172 -510 -1384 -2127 -2590 -2951 -2703 -4910 -4528 -4020 -3033 -3080 -3702 -2382 -1212 -202 -1321 861
3195 861 2507 2540 3029 3095 4379 4961 4016 4134 4209 3849 2410 1940 1455 1219 -767 -1022 -852 -1924 -3456
3214 -3456 -4277 -3884 -3604 -3728 -3755 -3809 -2626 -2626 -2270 -810 476 1225 362 1849 3500 3751 2884 3852 5269
3233 5269 4444 2729 3978 3171 3533 2193 508 226 -1169 -1750 -2719 -2154 -3155 -3752 -4457 -3276 -3562
3250 -3562 -3222 -3763 -2975 -1169 -1967 -1493 521 1798 1557 2014 2643 3734 2822 2590 4202 4191 4106 2476
3268 2476 2265 1935 1780 76 -147 -672 -1107 -1850 -2516 -2357 -3027 -2695 -3254 -2538 -2773 -3225 -3201 -1337 -1260 -1584
3288 -1584 -1387 714 949 2029 1369 3254 3155 3233 3196 3216 2782 3153 1768 2957 1934 1679 -347 -775 -430
3307 -430 -1218 -3174 -3043 -2465 -2666 -4071 -4378 -3042 -1909 -2785 -3152 -1407 -522 -722 83 537 1566 2746
3325 2746 3109 3287 4017 3451 3824 3551 3420 3251 1797 1272 1519 86 -892 -1164 -1101 -2859 -3077 -2923 -3396
3344 -3396 -3261 -3672 -4151 -2258 -2498 -2799 -2599 -807 524 -100 1471 2279 2990 2695 3002 4034 4015 3684
3362 3684 3397 3269 3742 1734 1349 173 575 -152 -1565 -1844 -2729 -2803 -3577 -3154 -2926 -3710 -3505 -3074 -2365
3381 -2365 -1846 -1849 -918 976 715 1260 1275 3237 4065 2716 3318 3321 3986 2575 2184 2744 2561 825 -344
3400 -344 -454 -1182 -1883 -3037 -3256 -2209 -3307 -2960 -3606 -2514 -3302 -3330 -1747 -1127 -707 -608 643 1368 2207
3419 2207 1965 2329 3307 3742 2569 3416 4542 3004 1353 1399 1823 1386 232 -1268 -939 -1559 -2518 -3121
3437 -3121 -2531 -2714 -3277 -3808 -2601 -2309 -1911 -2504 -1165 -470 461 614 897 1339 2061 2343 2125 3482 2722
3456 2722 3186 2428 2394 2288 2237 1882 1189 813 -598 -717 -736 -977 -2889 -3007 -1989 -1803 -3170 -3184 -2137
3475 -2137 -1661 -1181 -2031 -907 91 197 -331 1130 2122 1896 2401 2763 3710 3163 2707 2557 2615 2745 2173
3494 2173 852 -423 80 -1155 -1020 -1499 -2343 -3143 -3321 -2540 -3097 -3614 -2909 -2077 -2376 -1412 -1270 26
3512 26 589 403 606 1621 3298 3114 2573 4243 4563 3193 2406 2091 3285 2099 479 -534 862
3529 862 -288 -2348 -2314 -2761 -2733 -2842 -3314 -2787 -3237 -3325 -2380 -1772 -1085 -37 -270 1230 1280 2170 1346 2393
3549 2393 2887 2854 3391 3474 4169 2637 2354 1899 1192 859 -1037 -675 -941 -1755 -2814 -3075 -2277 -2663 -3377
3568 -3377 -2780 -2013 -1070 -1778 -1830 -417 666 459 97 1335 2481 2921 2480 2826 2866 3152 2472 2411 2401 1569
3588 1569 1716 413 -194 -978 -975 -957 -977 -2403 -2638 -2147 -2538 -3284 -3430 -2153 -801 -1590 -1818 -971 919
3607 919 1551 239 891 2243 2520 2542 1748 2705 3212 2033 1272 1911 2497 1674 806 76 651 334 -420
3626 -420 -2127 -998 -2153 -2306 -2448 -3034 -1940 -1902 -1527 -1002 -1649 -994 -469 783 -111 -26 1284 2449
3644 2449 2572 2107 3000 3396 3607 1967 1543 2328 2464 740 -139 433 292 -601 -1825 -2328 -1729 -2217 -3190
3663 -3190 -3329 -2381 -2394 -2165 -2272 -1664 -294 -259 944 425 975 1793 3177 2532 2100 2615 3534 3329 2744
3682 2744 1900 3151 2633 1377 -390 -330 -286 -472 -3206 -2354 -1853 -1493 -2998 -4111 -2971 -2150 -2015 -2629
3700 -2629 -1774 -145 -435 127 38 1846 2638 2590 2257 2606 3457 3334 3439 1838 1608 1739 1763 1030 -89
3719 -89 -453 -576 -1261 -2149 -3126 -2501 -2586 -2741 -4145 -2810 -1423 -2107 -2486 -1972 527 1123 250 -264 2305
3738 2305 2914 1467 1744 2384 3267 3592 1607 1501 2057 2380 -148 191 227 -188 -1174 -1428 -2470 -2175 -1693
3757 -1693 -2554 -2897 -2499 -2448 -1375 -1343 -1587 -1182 -283 1487 802 1117 1125 2492 2768 812 2273 3127 3319
3776 3319 2416 1359 1473 1897 1358 -237 -551 419 73 -859 -2126 -1113 -1441 -2342 -2433 -2244 -1586 -2076 -2521
3795 -2521 -1709 -1149 -675 663 367 186 1020 1795 1743 1162 1758 2440 3425 2405 1480 2226 2078 1673 -803
3814 -803 -251 276 -428 -1430 -2193 -1768 -1650 -2037 -3486 -2281 -1713 -1001 -2150 -3369 -669 488 -72 -1064
3832 -1064 763 1715 1813 1310 1382 3107 2551 3390 1682 2162 1881 2071 895 654 -454 121 91 -1621 -2318
3851 -2318 -2011 -1658 -2729 -3051 -2916 -1878 -1409 -1740 -2006 -1408 330 287 17 393 2662 2333 535 1825
3869 1825 2887 2895 2894 2296 2626 1950 1701 209 326 49 -253 -1394 -1907 -2056 -1836 -1014 -2000 -3237 -2518 -1565
3889 -1565 -1554 -1228 -1165 -582 516 684 392 612 3080 3303 2105 1861 3421 2567 2181 1833 1526 1671 1293
3908 1293 259 -367 9 -64 -1886 -2127 -2142 -1606 -2047 -2845 -2685 -1910 -1778 -1221 -1539 -384 548 344 1060
3927 1060 583 1095 2148 2709 1563 1779 2459 2475 1849 1521 1769 1677 2527 -177 -957 82 576 -803 -2064
3946 -2064 -2301 -1591 -1184 -2375 -2473 -1707 -1171 -963 -2078 -115 304 785 -55 214 797 1593 1541 1181 2093
3965 2093 2493 2388 1657 1970 1443 1742 1401 90 141 -308 117 -943 -1721 -1238 -2428 -1522 -1938 -3480 -2180
3984 -2180 -687 -842 -1827 -1465 560 470 -29 41 2214 1810 620 1024 984 2711 2143 2094 1399 2500 2016
4003 2016 944 492 736 334 310 -1378 -1197 -1106 -1775 -1985 -2832 -2794 -1689 -1521 -2059 -2232 -1559 61 -434
4022 -434 -428 291 1350 1665 1663 1407 1766 2486 2518 1772 1444 1820 1826 407 -266 210 282 -185 -1524 -1710 -1247 -619
4044 -619 -2540 -2864 -2385 -988 -1671 -1571 -1343 -843 496 468 669 1036 1624 1864 1993 1764 1911 2035 2479
4063 2479 2303 631 2492 1029 598 -932 -719 10 -392 -1760 -2523 -1439 -1285 -1772 -2657 -1553 -572
4080 -572 -1175 -2142 -757 -307 203 188 74 1263 1589 2736 1353 1534 2356 2110 1853 1116 1360 1636 375
4099 375 149 -268 -157 218 -1090 -1778 -2606 -1983 -1177 -2033 -2423 -1489 -1051 -602 -1167 -1155 560 396 334 -655
4119 -655 1498 2401 1631 1051 1240 2550 2966 1838 1675 1203 1060 1259 79 870 -242 132 -810 -445
4137 -445 -645 -1557 -816 -1855 -2109 -1611 -877 -1585 -1702 -1223 18 198 -253 412 696 1444 1735 1006 1144
4156 1144 1937 1634 1441 1156 778 1385 1035 532 536 455 4 -1158 -980 -813 -1008 -1524 -2174 -1558 -868 -966 -1154
4177 -1154 -1465 -170 -822 -729 284 53 1067 1516 2409 762 2496 1814 2785 2647 1132 975 1940 1634
4195 1634 104 341 522 682 -982 -1517 -1784 -1322 -1710 -2419 -2208 -1550 -1618 -1452 -1306 -983 -318 228 380
4214 380 647 1121 1712 1075 2083 2027 2121 2799 2125 2177 1322 1084 1039 -100 227 -488 -716 -441 -1807 -1581
4234 -1581 -1885 -698 -1295 -2009 -1800 13 -1531 -865 -957 103 359 475 906 1481 1974 960 1568 2149
4252 2149 2204 1495 1548 1107 914 827 314 -286 211 -184 -857 -822 -806 -1186 -1774 -1198 -1502 -1730 -1296 -850 103
4273 103 -1771 -606 448 927 578 327 1315 1633 1698 1506 1313 1917 1398 1181 398 1180 553 410 -26
4292 -26 -248 -62 -184 -1640 -1047 -1392 -1334 -2054 -1174 -846 -949 -767 -222 -95 -598 -87 505 815 888 1325 1214
4313 1214 653 387 920 1370 1710 667 1197 661 1064 202 329 -254 323 -473 -1196 -1739 -685 -733 -1396
4332 -1396 -2150 -1338 -1046 -1088 -807 -759 -532 -429 35 -586 360 1465 659 1674 1283 1061 1643 1834 845 1165
4352 1165 1050 1330 1078 25 -865 -257 -363 -818 -1397 -1863 -1802 -1289 -1710 -2407 -1551 -1301 -1503 -459 44
4371 44 344 -34 122 723 1596 2059 1349 2288 2568 2024 1760 1288 2123 921 1012 788 409 10 -319 -1208
4391 -1208 -1340 -1381 -1634 -1950 -1264 -1847 -809 -1211 -1292 -106 -923 -207 141 566 473 588 835 1466 1214 1514
4411 1514 2115 2289 1483 1508 925 795 884 -83 -75 -1153 -588 -1146 -1077 -593 -1243 -1908 -989 -1132 -850 -563 -538
4432 -538 -337 -501 -406 -61 959 896 805 1589 1293 1587 1785 1029 552 1188 1877 1211 554 142 152 -57 -799
4453 -799 -59 -791 -1433 -565 -949 -1022 -683 -714 -279 -1339 -1110 -86 -247 -434 -687 -409 -135 864 590 665
4473 665 1125 1567 1398 1962 877 1351 565 525 3 -111 543 -222 202 472 -771 -290 -190 -1423 -1052
4492 -1052 -1912 -1656 -1109 -1048 -1120 -34 -1204 -370 165 430 697 661 637 1381 1470 1581 1130 954 617 683 755
4513 755 -9 1727 277 -751 -762 -297 -966 -713 -1536 -902 -1542 -1532 -995 -966 -568 -1158 -495 -1182 -146 222
4533 222 357 799 1176 796 1005 1711 1158 1977 894 1450 1500 923 473 409 26 177 -520 -731 -1882 -1041
4553 -1041 -1328 -1059 -1411 -1556 -1165 -1681 -669 -740 -153 349 789 489 512 1297 914 1320 1198 1298 1176 1639
4573 1639 1700 645 1112 1088 916 150 -155 -684 -1114 -945 -1280 -1491 -1559 -1953 -2341 -1409 -839 -936 -507 -125 87
4594 87 51 229 615 1233 1226 1272 991 1257 1404 1168 766 1183 1023 307 778 471 -40 -1184 -1024 -1881 -195
4615 -195 -915 -878 -831 -1332 -589 -1236 -852 -534 -923 -412 -229 99 165 1231 880 829 1468 1440 631 1428 1368 1098
4637 1098 753 440 696 134 723 -121 -871 25 509 -424 -927 -969 -1013 -869 -514 -875 -490 -1530 -1091 -1454
4657 -1454 -709 267 436 -42 527 786 990 1020 645 1372 876 1153 928 1037 1302 430 1134 -55 201 309
4677 309 -24 -1147 -1035 -481 -1348 -1328 -1494 -1063 -33 -1014 -410 -786 -461 484 412 975 235 576 908 1503
4697 1503 1219 1424 1765 1389 494 1227 951 568 351 -166 -31 -485 -674 -294 -544 -233 -1209 -980 -947 -282
4717 -282 -1226 -288 -641 -507 -703 -133 -44 284 1246 575 1035 1855 1550 864 1582 1328 1141 687 1343 1165
4737 1165 672 842 -584 -828 -921 -1334 -1188 -1258 -1128 -1142 -1444 -666 -922 -754 -1060 -946 337 428 547 513 1150
4758 1150 342 1044 1451 1807 1653 760 731 1165 943 -403 276 413 -520 -534 -590 -976 -1087 -1248 -1020 -1035 -1105
4779 -1105 -757 -329 -949 419 -58 -288 339 831 289 832 1417 1484 598 1395 1208 389 1603 1008 760
4798 760 818 1396 -128 252 96 -252 -702 -500 -929 -351 -470 -760 -1171 -876 -745 -787 -317 -439 -139 133
4818 133 82 738 172 64 986 1227 785 274 692 808 923 261 272 1135 -35 -166 -197 -117 -56 -1061 -761
4839 -761 -451 -547 -472 -1202 -440 -560 -1147 -819 -620 -390 -1052 -49 628 569 -215 295 1149 1644 799 973 972
4860 972 1331 764 1064 1255 27 -329 -614 315 -11 -631 -1021 -1373 -356 -1002 -1308 -837 -727 -456 -297
4879 -297 -169 -147 289 612 952 1080 823 217 610 1569 2111 908 1290 1365 1251 461 980 431 -279 -654
4899 -654 -227 -79 130 -1053 -1394 -884 -1015 -594 -1012 -340 -94 -523 -210 -45 207 -296 -238 799 1180 480
4919 480 1227 1715 1196 1030 637 1155 1324 1153 -176 605 178 -182 -221 -1381 -759 -754 -676 -811 -812 -1068 -791
4940 -791 -501 -608 -591 335 -107 542 316 1088 423 957 1389 1593 707 1095 1115 854 497 1026 159 240 -109
4961 -109 70 55 -1311 -998 -346 -79 -141 -562 -456 -745 -738 -765 -1217 2 292 125 -485 630 910 86 460
4982 460 761 789 809 1109 698 652 -50 412 -40 14 -82 93 -137 -583 -532 -23 -560 -190 -854 -971 -1021 -675
5004 -675 266 -1768 -271 -440 1211 252 -136 470 719 809 328 539 1287 974 557 295 778 541 -59
5023 -59 399 529 286 227 -885 -353 -699 -1036 -202 -708 -1010 -359 -1095 -87 -500 -334 -1003 -206 -571 398
5043 398 694 513 822 590 691 890 1583 1838 948 -18 -150 765 51 351 117 -110 -299 25 32 -582 -921
5064 -921 -1115 -459 -943 -574 -437 -118 -180 -135 935 -185 -146 731 1111 867 1317 513 1174 1127 1703 1225 934
5085 934 904 600 -669 -542 295 -85 -467 -931 -494 75 -346 -1608 -992 -630 -639 -688 159 155 102 228 875 874
5107 874 1506 1179 921 1039 1156 737 757 468 747 680 44 -165 40 245 -59 73 -731 -123 -1012 -926 3
5128 3 -782 -1047 -901 237 -879 -34 585 331 -157 519 688 508 1172 681 378 674 783 1502 464 602
5148 602 102 765 11 112 198 -105 -597 -344 -157 -328 -515 -827 -885 -210 -305 -213 -599 201 399 572 60
5169 60 -12 695 226 718 594 62 85 791 517 313 688 279 530 432 -197 -883 -360 -83 -223 -177 -222 -806
5191 -806 -1063 -518 4 -477 -764 -491 -329 -298 349 -549 522 752 190 597 -102 347 -461 1150 588 759
5211 759 967 598 450 254 335 215 -166 -171 173 -356 -509 274 75 139 -744 -434 -3 -290 -297 -322 -362 -466 501
5234 501 616 814 960 1263 -19 520 460 1701 787 659 420 136 194 260 -112 -77 -255 -143 -750 -923 -567
5255 -567 -493 -470 -504 -511 94 -139 234 252 -575 -332 -155 992 485 656 610 650 976 154 348 172 425 38
5277 38 101 113 -9 -442 -734 -168 -685 -855 -501 -294 -105 -526 -807 -891 -334 -535 144 -392 10 299 240 -34
5299 -34 320 1653 306 597 994 552 330 345 710 -240 194 -398 -54 332 146 -439 -570 146 -127 -521
5319 -521 250 194 -553 -449 -537 -191 -389 -90 469 319 830 299 -266 320 699 554 -184 423 532 596 -160
5340 -160 -363 -153 113 500 -22 74 1010 -214 -183 -418 -740 -404 -344 -790 -175 -675 -672 -316 -13 336 150
5361 150 -9 162 386 129 600 651 767 -73 783 -231 266 466 -110 497 9 -480 -627 -231 -704 -814
5381 -814 -170 219 529 -728 -489 -456 -244 -126 415 237 402 -119 -21 459 687 249 421 436 789 463 368
5402 368 592 309 579 391 310 349 377 -52 -534 -770 -34 -1178 -827 -453 129 -685 -725 -57 -604 -119 -438
5423 -438 -125 247 719 870 669 923 611 382 602 709 582 174 624 485 -70 -167 -149 -539 -766 -448 214
5444 214 -298 -168 -790 -795 -233 -263 -4 -902 -132 -76 -236 -330 1145 691 249 390 -39 681 466 211 581
5465 581 513 512 304 203 284 448 -140 129 276 -539 -187 -27 -475 -213 -462 -278 -71 152 309 -316 185
5486 185 -278 51 156 352 86 811 785 450 -350 167 -409 1057 171 -55 95 589 174 44 -511 -405
5506 -405 -287 -843 -371 -140 -287 228 -14 159 200 -139 389 209 27 -324 631 479 871 484 321 224 882
5527 882 -263 485 42 429 183 663 -181 277 -20 445 -433 -583 -250 -808 -80 -560 -956 -545 -60 428
5547 428 -194 452 275 -619 -209 358 -142 277 310 -300 48 810 295 -199 339 874 1087 274 936 475
5567 475 53 -359 577 -49 -279 -357 -211 -547 -463 -910 -602 -223 455 -709 26 -497 162 447 -388 520
5587 520 -797 1059 782 -89 560 206 683 922 110 197 408 51 180 -35 180 313 -26 -815 -448 -627
5607 -627 -1053 -659 0 -128 -507 415 -684 197 721 66 -189 -118 723 746 467 -32 773 50 602 191
5627 191 -185 399 216 -67 507 -790 50 436 -160 -802 -19 -757 387 537 -168 -70 27 -283 185 -412
5647 -412 32 408 581 550 338 862 -56 1035 629 65 -161 452 218 223 473 275 -274 -225 70 -548 490
5668 490 -582 248 -763 -151 -37 133 -24 145 177 -128 133 -218 722 973 1123 294 714 -178 426 -88
5688 -88 77 406 -9 178 171 266 -373 163 -67 -486 -671 -716 -200 -577 -229 -227 -141 -526 383 225 152 41 82
5711 82 -518 355 186 299 764 762 712 87 -257 520 498 88 466 390 929 673 -2 93 -301 -504 411 -325
5733 -325 -692 -1035 -560 -400 -492 -44 402 -178 346 -124 -80 569 -11 54 112 382 -146 775 -361 -405 1222
5754 1222 590 263 526 193 78 118 84 -41 411 178 -816 -327 133 -99 -784 -672 -242 -206 -351 -328 124
5775 124 31 238 152 484 111 476 1119 565 -57 -272 743 118 -369 -29 -59 336 -235 -745 182 -105 -8
5796 -8 -932 -875 -594 -43 -457 -329 178 31 -48 -218 331 358 74 196 303 112 545 198 -732 -299 92 972
5818 972 413 51 648 119 -218 -558 -133 -253 9 -530 631 -494 104 -855 258 251 73 85 -145 685
5838 685 336 -234 343 109 237 249 -336 66 819 -144 311 169 -30 747 -397 169 3 320 -373 -37
5858 -37 273 -158 -358 13 -225 266 -473 -125 -239 -68 -31 494 191 501 578 362 277 772 371 595 250
5879 250 -5 952 816 95 371 399 -306 549 123 374 -510 -269 -248 -145 -174 -365 0 -578 -146 102 168
5900 168 -618 260 -225 329 -63 281 -288 725 420 475 137 439 -597 613 -14 465 841 510 1067
5919 1067 455 -44 68 -492 -130 -809 395 92 -3 -10 145 -361 384 194 244 42 318 733 -435 529
5939 529 166 263 48 11 -115 -281 -313 61 199 -659 -96 191 -583 -375 -36 448 -25 -630 -341 -839 79
5960 79 499 -315 807 -744 464 329 -600 56 -218 87 -648 994 737 -120 181 245 243 -40 104 578
5980 578 298 36 109 60 266 496 -326 -124 -353 514 -190 -93 66 309 188 -606 343 338 -311 -375 -29 199
6002 199 657 -9 2 359 968 332 -302 578 -78 303 -145 -319 -957 10 553 -425 402 574 488 106 77
6023 77 -254 -98 -1 55 26 476 -245 304 322 774 -26 29 -143 185 484 90 117 -219 -363 420 -66 -408
6045 -408 23 594 557 304 -691 335 -364 542 -161 -208 9 61 123 -39 447 127 -9 -429 646 342 -227
6066 -227 776 634 -199 -617 156 -255 261 17 220 820 -518 169 -288 -66 395 340 846 -7 26 484
6086 484 267 -640 -379 466 -11 27 -24 24 394 -19 241 217 250 -261 372 1038 12 568 1458 -128 497
6107 497 165 310 183 20 -1006 -255 26 -258 -495 -541 -543 -12 106 98 850 217 -196 455 277 154 -466
6128 -466 335 -106 140 -784 194 746 -195 926 751 257 -62 514 -367 -215 468 186 178 459 -451 -96
6148 -96 -521 413 -295 -149 -73 -197 -295 396 332 -520 -87 302 -49 366 330 -465 122 7 -111 95 -33 -81
6170 -81 -9 82 467 309 739 -199 -128 -253 779 825 349 -163 -402 -308 523 -55 190 -592 118 368 -188 4
6192 4 195 168 210 148 -121 362 627 -465 82 573 78 190 416 332 423 34 -242 -342 60 718 495 364
6214 364 -295 3 347 599 -147 0 478 -75 701 354 356 189 16 -244 388 15 -144 649 74 -250 -160
6235 -160 -354 195 395 76 -372 -146 763 97 -265 -831 704 37 -15 323 -307 480 43 -218 957 595
6255 595 -287 -103 393 1070 933 181 -205 513 -95 135 322 222 215 347 -308 160 242 750 -12 396 42
6276 42 -466 335 778 -96 93 -118 -466 24 -427 57 -157 -137 793 533 -59 584 219 1106 296 227 126
6297 126 22 700 348 -360 384 170 -154 -137 -14 -400 -46 204 144 -280 -309 503 -83 221 -113 -501 28
6318 28 -216 -41 20 -492 -393 582 727 148 -290 171 -15 -604 20 -219 -82 308 255 321 -208 135 -51 341
6340 341 208 -313 -35 408 838 -141 -293 -223 -677 802 -503 -83 307 414 522 -167 574 -89 26 559
6360 559 439 153 68 119 96 -7 241 -45 -442 -355 253 -114 -608 28 557 155 -248 530 -844 -755 -48
6381 -48 -407 4 25 -376 31 277 -432 357 -63 -290 210 -27 684 -226 -69 454 197 90 527 483 281
6402 281 -256 203 -519 -267 -597 -113 -223 -177 106 187 -121 202 -237 589 251 1 262 426 340 1060 868
6423 868 918 -91 461 -188 512 395 215 282 -82 289 105 1051 319 -327 31 -104 -337 -295 -274 558 -56
6444 -56 -217 -347 -314 -481 147 314 -122 69 -175 266 320 376 -192 282 688 -322 -15 106 97 650 316 733
6466 733 90 285 603 421 148 -521 -316 -227 -589 713 533 -836 -131 204 502 279 -685 -448 -238 -164
6486 -164 157 347 636 349 -259 -36 200 -245 -39 221 423 -478 -228 -520 132 -39 343 27 -52 256
6506 256 -113 700 986 191 250 -197 289 816 -490 189 356 225 636 103 321 216 738 123 -159 774
6526 774 146 -169 -452 -736 -44 -229 204 -308 406 -121 614 -299 -308 -559 -120 126 255 644 -43 21 -455
6547 -455 252 379 166 -105 342 856 -322 81 831 86 475 279 -382 33 504 298 -480 215 -69 438
6567 438 112 45 -203 362 818 404 203 -62 -719 452 139 -496 -627 -180 -220 -122 -102 303 -11 636 323
6588 323 -26 659 22 -13 -361 539 284 69 -38 -303 272 -304 -329 -311 229 221 -292 19 -911 52 -146 -219
6610 -219 143 90 -388 283 -269 -126 -2 -43 -63 277 -645 -266 1079 436 3 697 433 128 -284 -422 -186
6631 -186 288 298 -594 72 -51 169 307 250 -217 64 477 353 484 757 -517 349 412 -105 -652 682
6651 682 202 502 330 465 -135 -1042 442 198 -299 -381 265 -210 372 448 -103 315 128 -399 -240 -415
6671 -415 539 -255 286 332 8 -41 70 385 717 848 301 731 11 517 -538 -158 -423 11 497 83
6691 83 -358 582 212 66 -383 -619 -403 142 470 -146 -227 -16 -13 -127 439 -309 861 -365 195 546 326
6712 326 386 -121 -798 354 747 550 412 240 -337 227 -272 402 127 -202 -348 -42 -380 241 -318 -138
6732 -138 672 -41 -73 -288 596 628 -63 430 152 218 181 244 252 270 164 560 675 -59 -13 -55 790 20 122
6755 122 -102 378 531 -727 741 -215 -442 -604 -555 504 753 82 468 -92 282 294 -386 -50 -257 534
6775 534 -278 -6 478 -86 212 294 -135 -26 -50 -6 -301 95 -575 67 -100 34 572 491 -652 122 76
6796 76 -115 -522 300 335 325 538 345 -236 214 119 -29 452 -78 -192 316 -6 574 -48 -225 222 -57
6817 -57 -251 82 493 641 107 353 -485 -547 -464 -563 627 479 -458 523 46 -246 -280 -40 -204 -71 49
6838 49 394 -312 458 365 12 -220 191 308 -19 -324 -350 316 -413 490 109 831 10 256 279 107 -488
6859 -488 -534 -440 199 53 -436 -100 -239 241 663 661 -425 294 -652 49 416 -244 654 -66 242 200 -142
6880 -142 -284 1170 -757 -146 771 238 396 178 516 265 -291 -270 -823 -254 -166 364 546 -71 -660 -101
6900 -101 432 575 294 464 138 200 916 386 153 514 667 -25 438 -727 -15 210 50 -53 -588 207
6920 207 42 -166 -158 130 90 -214 341 -504 -284 -720 52 244 397 -184 340 -88 -160 370 -567 526 -656
6941 -656 27 398 -33 406 138 -95 142 469 393 255 -9 -374 -287 -599 -83 -229 -103 -558 184 173 -157
6962 -157 -218 505 -643 847 -392 -140 192 -618 -120 -140 927 87 -479 -235 531 -295 255 -721 156
6981 156 423 161 265 326 262 -755 -128 -334 17 -729 156 148 -241 444 -28 -671 -418 -185 88 454 383
7002 383 90 607 284 306 380 421 1067 -102 105 460 803 -183 -73 -239 251 -302 -467 -115 -767 74 -288
7023 -288 341 485 -49 267 24 651 218 -563 646 426 -268 36 -76 -69 -89 -296 -86 602 294 -493 635
7044 635 -683 90 -108 500 82 -734 208 -330 -68 41 52 -113 130 552 41 -81 153 174 513 410
7064 410 -46 468 -357 515 -41 302 330 593 461 704 -350 -954 488 -26 357 -441 13 -609 133 -238
7084 -238 -112 372 165 -39 -72 31 -92 -110 -80 493 -502 309 189 178 134 285 437 172 74 239 314 -316
7106 -316 -146 -152 139 -5 -105 113 282 12 -166 -198 97 -499 489 -198 158 -151 280 640 69 132 122 545
7128 545 -126 1379 314 113 31 136 -248 -291 190 517 -1008 -10 326 9 339 -316 -82 580 -817
7147 -817 -667 -883 -162 446 -44 623 77 1 250 412 544 -17 287 434 438 31 467 -354 -489 -431 -63
7168 -63 307 170 -191 271 555 -301 -1152 264 530 311 35 -633 -378 187 531 282 217 -480 -394 138 206
7189 206 -892 -200 329 136 -202 -44 -93 28 -100 687 -531 513 -147 -252 -197 241 123 -184 -224 -617
7209 -617 116 180 89 501 169 -321 451 -57 -245 -143 598 399 260 628 -36 366 317 -102 463 125 -86
7230 -86 207 -200 395 24 235 -54 -107 190 33 -82 -165 47 565 -506 7 452 -206 96 17 219 862
7251 862 377 521 238 61 73 125 -46 427 -274 -631 920 7 -216 -186 -211 21 139 -394 -51 904 412
7272 412 -213 -138 -466 45 -51 -537 102 -172 140 682 -430 -8 582 449 448 -123 76 765 332 1316 775
7293 775 277 117 622 476 -132 -200 172 296 -76 383 -325 -590 -805 -98 -353 374 -172 56 366 899
7313 899 168 320 153 148 370 84 828 212 358 29 590 250 162 -398 124 921 -568 162 260 95 328
7334 328 523 61 145 -70 32 28 -674 -235 494 489 -12 166 726 94 57 -185 830 566 214 685 -22 219
7356 219 -34 139 72 399 -890 195 97 -238 -40 -244 -268 -262 216 77 -250 -453 135 268 -235 -134 -307
7377 -307 -381 656 116 -259 -93 562 -212 659 481 897 898 277 -241 125 -89 -425 -27 -323 66 -346 -192
7398 -192 149 29 -297 -196 473 -497 -182 -1016 -423 -496 6 344 -447 -54 -320 227 55 483 265 -189
7418 -189 626 233 -220 26 265 489 261 65 -72 -156 -55 -600 -824 -500 472 -250 -714 389 -284 -598
7438 -598 -36 533 122 32 206 703 -295 599 647 436 390 490 -216 443 118 -194 -51 26 331 -381 -225
7459 -225 80 393 -113 58 -246 -324 496 -70 -555 437 -271 95 462 492 544 -414 472 906 872 685 337
7480 337 59 -389 111 243 202 -195 513 -117 422 64 -265 -503 156 -401 254 -573 2 710 -561 -142
7500 -142 306 255 -504 -485 508 -79 273 140 138 -244 919 272 -201 497 676 138 90 242 579 -535 479
7521 479 -11 -369 9 327 48 15 196 36 -370 159 168 -895 435 325 7 -124 574 -273 21 100 475
7542 475 420 646 294 -130 659 466 38 490 109 -99 364 619 -169 -216 -314 -258 13 135 -383 4 -61 148
7564 148 251 111 261 96 364 -406 -458 -526 -331 424 -153 57 -140 889 20 566 885 60 -29 152 538
7585 538 735 115 -3 -85 128 -98 -336 -58 -300 -184 -43 660 415 374 174 357 -137 321 1130 350 48
7606 48 303 565 2 -432 989 995 -195 514 -485 -360 874 -450 -12 633 163 408 -710 225 -151
7625 -151 -62 -67 -75 555 -230 143 130 476 -321 -270 -212 301 58 193 495 -142 947 81 884 -104 -450 -656
7647 -656 -341 227 -256 563 -569 -47 444 -482 53 -222 -680 131 577 -623 -244 -522 92 -354 578
7666 578 589 -187 661 534 32 -97 1116 -174 443 -171 200 50 -351 -473 -449 271 -63 158 -113 479
7686 479 -312 -445 -622 154 765 256 -199 554 449 20 -175 -288 -132 127 414 383 -235 808 61 217
7706 217 37 -352 436 -498 -53 557 375 -233 13 369 -685 -244 -245 250 -240 -157 480 537 -53 -446 -675
7727 -675 127 -352 671 156 -11 386 728 867 365 422 -166 191 538 92 -168 451 -572 66 -128 -439
7747 -439 -185 763 -37 -473 369 -682 460 82 780 597 183 264 739 -203 294 541 297 -224 584 244
7767 244 -358 435 -186 -343 -726 240 -19 711 517 -270 -703 -366 -420 450 372 -467 -172 330 107 -727 348
7788 348 121 -108 -11 171 15 285 1025 388 255 -330 136 262 175 793 416 65 721 -436 -480 -668 639
7809 639 77 -931 274 268 -431 16 -19 -590 -135 108 -148 272 139 342 170 268 -585 757 573 575 143
7830 143 -432 -257 -63 332 52 299 80 -227 543 1014 691 -192 -26 -635 -305 241 -127 -395 -526 -406
7850 -406 150 316 -81 553 -57 134 810 406 252 834 656 231 502 646 262 333 336 -193 -210 -161 -399 -223
7872 -223 -346 132 -265 211 142 -66 201 221 583 125 -49 188 171 0 214 -36 563 183 -77 -709 423
7893 423 276 -137 -93 -616 411 -69 -279 -178 -327 492 467 -267 141 629 281 338 -57 308 51 -271 45
7914 45 556 570 -171 -136 319 -21 247 -186 44 423 543 352 1634 667 465 635 67 117 488 -327 -598
7935 -598 113 -313 625 -389 -741 353 -640 -452 -234 -162 110 -475 -591 350 -404 103 1038 32 432
7954 432 432 252 -517 -20 924 341 43 -201 237 478 452 -135 -87 -402 -189 257 -342 282 -357 309 -374
7975 -374 -44 -17 -322 228 173 766 116 228 -84 -190 195 -513 471 78 1022 319 1030 237 141 -122 737
7996 737 -218 1071 301 65 443 332 -29 65 -66 228 -737 -341 -426 95 117 -460 -234 166 321 159 716
8017 716 343 411 585 -344 -346 78 526 242 233 897 257 206 -64 91 -170 43 229 460 -279 -245 45 154
8039 154 334 220 397 -605 542 259 -229 480 357 576 400 88 -3 -120 -67 468 276 355 1106 476
8059 476 -25 -409 166 -365 -713 -123 322 -356 50 -260 289 -622 -58 -150 -394 -711 18 86 4 475 -125
8080 -125 746 336 611 581 674 247 797 -239 51 197 266 -517 -467 -645 -251 -284 200 -43 -871 342 287
8101 287 -197 -458 -204 258 -1258 54 12 -194 575 284 623 572 1010 602 165 435 600 812 -13 104
8121 104 813 -44 355 139 -300 -796 475 -161 -625 264 528 -420 -203 -361 321 -334 -148 253 239 -75
8141 -75 -436 51 -37 1082 -142 442 366 1024 457 259 383 1170 281 -776 544 86 -337 13 556 -496
8161 -496 834 -371 -548 255 -104 102 263 212 -520 -530 510 -122 71 518 810 114 -864 57 -661 -61
8181 -61 557 782 1002 370 -136 335 183 188 20 -323
8191c23
$$ Imaginary data points
##PAGE= N=2
##DATA TABLE= (X++(I..I)), XYDATA
0 0 0 0 0 0 0 0 0 0 0 0 0 0 2 -57 57 -57 57 -103 114 -114 171 -173 228 -236 289 -346 402 -460 528 -630
30 -630 695 -806 919 -1037 1169 -1320 1484 -1657 1857 -2065 2299 -2558 2842 -3144 3478 -3844
46 -3844 4243 -4678 5154 -5679 6256 -6892 7597 -8387 9265 -10254 11385 -12685 14188
59 14188 -15964 18108 -20726 24028 -28341 34245 -42847 56612 -82289 146846 -699879 -744124
71 -744124 506894 204621 -394009 -431514 307418 347756 -321252 -720769 -34575 671373
81 671373 482350 -227863 -192548 477379 731949 113990 -350594 25510 644251 461190
91 461190 -232997 -401061 176961 477195 -32383 -607675 -361221 249811 214617 -446722
101 -446722 -671058 -108972 343715 -37510 -600944 -399062 291537 397024 -194856 -463854
111 -463854 84017 603677 296996 -294073 -177000 472272 605851 12813 -348502 80591
121 80591 568938 293919 -327996 -333595 229881 401146 -128126 -536467 -205697 293119
131 293119 135862 -431887 -504084 30866 315031 -93255 -511751 -241389 307753 281954
141 281954 -239912 -375502 131160 490147 151069 -305865 -114626 431153 451832 -79260
151 -79260 -297788 141910 506195 181191 -322620 -214291 291179 334757 -179282 -441556
161 -441556 -61159 306271 46993 -428031 -362679 119142 233577 -189266 -451972 -122964
171 -122964 277830 135495 -286409 -282320 165098 367362 33961 -269024 -30234 388132
181 388132 330874 -97868 -198482 193118 440706 128946 -254737 -110001 302260 277453
191 277453 -177772 -355627 -2816 268765 -15267 -416012 -298818 122442 151185 -255991
201 -255991 -425988 -73317 241704 37402 -316436 -209725 213098 302996 -40262 -219731
211 -219731 82147 400059 244151 -111164 -86901 273205 377838 47422 -206612 -6969
221 -6969 288491 166481 -215695 -281791 34328 184197 -106265 -394812 -233170 104133
231 104133 64147 -282232 -359930 -20242 209489 -7571 -278453 -119612 248817 267795
241 267795 -50113 -149497 155919 386746 185538 -106942 -20353 288405 297846 -23719 -185576
252 -185576 33386 235516 58685 -246065 -225326 47007 103177 -165392 -343202 -155054
262 -155054 93914 9885 -257700 -258075 35947 182528 -23630 -214457 -41848 251186 221572
273 221572 -56007 -105139 175436 339154 122614 -122231 -2369 268892 224048 -85733
283 -85733 -182019 58472 203939 -11406 -261442 -168080 83684 65791 -198688 -284486 -63298
294 -63298 105987 -35444 -236690 -157475 89059 133492 -63209 -156863 23481 213502 132501
305 132501 -66778 -50201 166794 242707 58214 -95163 23603 213825 149592 -84274
315 -84274 -130545 65476 162323 -23372 -211862 -115127 92236 54242 -176771 -231234 -23229
326 -23229 104291 -50201 -222966 -121032 101103 97890 -102291 -149741 48147 187989 65406
337 65406 -97643 -23787 174686 187742 6198 -72365 74319 202329 99730 -75695 -58601
348 -58601 103344 130543 -38803 -153674 -50205 83601 13653 -164225 -174958 -10552 55853
359 55853 -84937 -203082 -97125 69350 40206 -120550 -125419 53753 147061 27151 -83468
370 -83468 17996 180134 155196 376 -23328 120718 192928 72157 -53313 408 119948
381 119948 91325 -59799 -117310 -19745 48659 -40126 -164927 -142970 -23856 -3119 -114604
392 -114604 -177380 -80835 37643 5915 -102730 -87466 58805 127450 33015 -45185 46618
403 46618 180482 150021 15858 3021 132447 181238 56679 -52607 8801 110583 56641
414 56641 -91118 -117881 -12280 24733 -87227 -178070 -116598 -13928 -37426 -137802 -142132
425 -142132 -31536 33249 -22753 -81082 -21561 86249 98460 24309 4679 87335 155499
436 155499 109565 25828 35283 115726 123855 29108 -38438 7475 67055 15488 -90290 -103207
448 -103207 -24168 -2940 -88964 -152875 -94525 -11019 -35147 -115336 -105472 -6010 39189 -17423
460 -17423 -56796 7516 92031 82165 16117 19384 92771 125948 72044 18816 42557 94919
472 94919 80266 7620 -26424 11405 40338 -5914 -75185 -75126 -19339 -11448 -75923 -116242 -67252
485 -67252 -5896 -28757 -92662 -79095 3524 34115 -21800 -52391 11399 80749 55533 -4981
497 -4981 13015 86576 100877 38426 6682 52069 91138 53859 -4930 -2533 37897 33576 -18095
510 -18095 -49390 -29945 -8901 -28607 -67175 -74250 -47105 -29938 -48026 -72320 -59514 -20202
522 -20202 -4772 -25784 -37564 -2058 41594 38295 6800 14648 64969 85600 48714 21671
534 21671 52310 89242 64815 12036 8543 45585 44884 -9639 -44826 -21914 -1201 -32512 -78787
547 -78787 -76890 -42686 -41038 -73732 -86091 -54946 -24579 -29704 -42583 -27074 9993 29847 25466
560 25466 22594 43734 70984 76867 60663 53286 68706 80706 61910 29915 21240 33289 26138
573 26138 -11786 -40950 -33883 -24016 -49191 -83262 -82329 -55715 -54359 -78264 -82762 -49511 -22424
586 -22424 -29367 -35095 -8632 26783 37065 30333 40781 66165 78379 71948 65956 69282 71392
599 71392 63132 49120 33374 19238 12042 1234 -20285 -41678 -49387 -46148 -54759 -75381 -81577
612 -81577 -64445 -49757 -60720 -66216 -42559 -11573 -7994 -15821 2014 37003 50892 37403 39848
625 39848 66180 80646 63889 47865 56481 65996 48248 21723 15067 17939 4138 -21254 -34644
638 -34644 -33416 -39017 -54462 -61389 -58252 -55234 -57357 -53521 -43616 -36426 -30017 -18624 -2993 5692
652 5692 10249 21791 38008 43424 39374 43910 55479 57197 44415 37646 42053 40826 23652 7458
666 7458 6971 6754 -9326 -27453 -29826 -26933 -34932 -48267 -50022 -40705 -40427 -46795 -43097 -30629 -23077
681 -23077 -22146 -15074 -1913 7956 11946 20201 30911 35860 36725 41595 47644 46074 40189 39017 40716
696 40716 33294 19388 13082 13009 3751 -14103 -23047 -21403 -27007 -42303 -49230 -42739 -40266 -48722 -51375
711 -51375 -38586 -28585 -28776 -28305 -11094 6306 8060 10255 24663 42817 44036 39195 48098 59516
725 59516 55096 43019 41383 45492 35574 15811 6168 6642 -3990 -25910 -37617 -34587 -39292 -55181
739 -55181 -63231 -53877 -46696 -53062 -54555 -39186 -21737 -18957 -15268 1406 21618 28250 29172 40116
753 40116 55758 59397 52517 54444 61025 55801 41398 32298 31029 20709 195 -13216 -17288 -24946
767 -24946 -41598 -53829 -53033 -52778 -60582 -64376 -54826 -43571 -40437 -36424 -22356 -4486 3311 9238
781 9238 23830 39279 44641 45165 52527 60108 57676 50412 47072 46285 36463 22291 13064 6903 -5177
796 -5177 -21950 -29540 -32165 -41584 -52157 -54338 -49592 -49824 -52752 -46056 -32770 -26726 -23501 -13543 2988
811 2988 12679 15615 24762 38750 44898 41313 42470 51091 51399 39447 32210 34572 30871 14486 1313
826 1313 -231 -2422 -18151 -31817 -32124 -28643 -38249 -48610 -44278 -33380 -33940 -39508 -32507 -16367
840 -16367 -10223 -13405 -6011 11297 19627 17817 20272 32260 40027 34697 32155 37608 41255 31956
854 31956 24319 25005 23311 11782 -331 -3259 -3893 -14774 -26190 -28245 -26425 -33414 -41742 -39362
868 -39362 -31387 -31676 -36864 -29526 -15501 -11088 -12684 -6611 9499 18708 16267 18083 32291 41122
882 41122 36227 31153 38017 43185 35264 25894 22438 23394 14093 52 -6241 -9229 -17417 -28805 -33966
897 -33966 -36573 -40547 -44817 -42744 -39515 -39011 -35785 -27231 -17267 -13253 -6995 6814 19187 22597 24336
912 24336 35968 46643 45753 39999 42689 49560 42991 28312 21799 24085 16017 -2816 -15392 -15771
926 -15771 -19932 -35017 -45655 -43939 -41914 -46218 -50878 -44681 -34588 -30723 -27039 -16053 -3733 4497
940 4497 10674 22602 33006 35995 39616 48112 52314 46594 40385 42685 41010 28191 12867 9870
954 9870 8219 -6520 -25139 -30706 -25885 -33261 -49097 -52999 -41791 -35859 -44093 -45273 -29588 -14128
968 -14128 -12658 -14505 198 19659 25098 22039 28557 42275 47015 40372 37346 41141 40721 31494
982 31494 22572 18826 12604 2326 -7058 -12301 -19562 -28315 -32620 -32577 -36324 -42430 -39997 -31538 -29795
997 -29795 -31886 -26390 -11747 -2615 -5676 -1267 14816 25088 23520 20762 30655 40902 35386 27062
1011 27062 27515 33793 29357 15986 10011 10678 7418 -5482 -13753 -14995 -17255 -23045 -29579 -30051 -30687
1026 -30687 -29902 -28278 -27453 -25696 -21837 -14354 -7953 -6965 -4052 6490 17482 17308 14223 22403 33586
1041 33586 33714 24354 25489 34049 33550 19181 10596 15921 17722 3167 -10804 -10312 -6480 -15735 -29578
1056 -29578 -31790 -24356 -26943 -34886 -36076 -27650 -21617 -22196 -20500 -10779 -2424 1109 6507 15515 21338
1071 21338 23959 28676 34778 35701 31235 31375 34993 31449 20066 13807 15586 9916 -5421 -17006
1085 -17006 -15313 -15048 -27898 -40426 -37967 -29073 -33550 -42492 -38346 -22931 -17465 -21805 -16950 574
1099 574 12573 11834 13718 26606 37720 36098 32935 37753 42323 38859 29730 25281 22365 16458 6373
1114 6373 -1884 -9249 -16798 -23567 -27680 -32840 -40005 -40835 -36626 -34489 -37285 -34302 -22922 -13589 -12389
1129 -12389 -7664 5304 18256 20025 20710 29141 40018 40625 33346 33234 38587 35816 23517 15565
1143 15565 14794 10827 -1518 -11947 -14475 -18401 -26422 -32510 -33401 -32977 -35531 -35021 -29601 -26502 -24349
1158 -24349 -19138 -8120 -1856 -201 6041 17907 24270 22614 23533 32299 37154 31208 24932 26696
1172 26696 30376 21229 8610 6297 8963 1422 -13715 -19019 -13832 -17094 -27654 -32329 -26358 -21569
1186 -21569 -26573 -30130 -21904 -12968 -11482 -13666 -5141 5182 8381 8560 13110 22011 23385 20854 23843
1201 23843 28137 25888 21025 20524 21081 16097 7775 4926 4911 -1660 -11425 -14618 -12914 -17277 -25468 -28189
1217 -28189 -22200 -21159 -26443 -26764 -19025 -12862 -13415 -12447 -2748 5687 6853 7110 14752 22026 23009 21746
1233 21746 25121 28961 27532 23380 21569 21227 15269 8233 4989 2072 -5699 -13057 -16020 -18287 -24477
1248 -24477 -28969 -27792 -25889 -28049 -30183 -25676 -17256 -15724 -14537 -7653 4172 8771 9683 15616 24984
1263 24984 29688 26731 27787 33468 34284 26761 21531 20872 19045 8668 -555 -2217 -5105 -14497 -24055
1278 -24055 -25561 -25574 -30544 -36060 -34177 -27828 -26889 -27095 -20971 -11203 -4953 -3920 3732 14810 20796
1293 20796 20673 24169 32606 35800 30712 28168 31218 30343 20078 12509 11398 8813 -2599 -12941
1307 -12941 -14901 -16104 -23779 -31610 -31356 -27894 -29132 -33757 -28080 -19466 -16662 -16289 -9315 2399 7810
1322 7810 8097 13225 23274 27506 24964 25192 30398 31248 24895 20798 21816 18201 9666 2697 329
1337 329 -2791 -10705 -18015 -19413 -20195 -25347 -28842 -26086 -23353 -23841 -23382 -17592 -10365 -8193 -6203 995
1353 995 8134 10538 11460 17115 21826 22479 20869 22713 25083 22354 16742 14760 14969 9815 2543 -1728
1369 -1728 -1930 -5746 -14421 -16802 -16105 -17727 -22499 -24232 -19421 -18195 -20252 -18983 -12378 -7472 -7451 -4912
1385 -4912 2007 8135 9573 9429 15669 21712 19966 18174 20798 24140 21325 14412 14673 14891 10340 1277
1401 1277 -2164 -1768 -5796 -14280 -17836 -16317 -17166 -24024 -25778 -21384 -18020 -21299 -20553 -12892 -6369 -6823
1417 -6823 -4693 3809 11283 11884 12676 18714 25588 24401 21026 23026 26913 23301 14562 12208 14143
1432 14143 8141 -2474 -6513 -6621 -11204 -20728 -24030 -23103 -22763 -27414 -29000 -23850 -19703 -19766 -17516 -9920
1448 -9920 -2707 1320 3977 11670 18136 20086 22498 26047 28610 26616 25717 25979 23563 16670 10934
1463 10934 8430 4480 -4455 -11962 -12800 -15415 -21899 -28431 -26989 -24031 -26669 -28501 -24680 -17008 -13453
1478 -13453 -13061 -7926 2276 7833 9260 13293 19883 25430 25208 24054 26701 27622 24182 19212 17097
1493 17097 14017 7195 2065 -1645 -6713 -13673 -17340 -18370 -20285 -25546 -27300 -22677 -20326 -21940 -21999
1508 -21999 -13850 -5663 -5596 -6475 1402 12654 15006 11532 14333 24825 26811 19712 17014 22452 24420
1523 24420 15428 6512 7735 9767 2605 -7027 -9025 -7813 -11246 -18247 -21072 -18447 -17311 -19689 -20636
1538 -20636 -17474 -14611 -11829 -8919 -5406 -2805 761 6687 10658 10166 11888 17067 21915 18161 13894
1553 13894 16893 21870 17125 7679 6804 10734 8199 -3434 -9649 -5288 -4330 -12254 -20132 -18523 -13024
1568 -13024 -16092 -21808 -21856 -14184 -9249 -12304 -11720 -5869 1574 4016 4582 6405 11776 17367 19020 16141
1584 16141 16510 20205 22377 17827 11352 10089 12735 10730 -382 -8214 -5216 -2616 -12245 -22956
1598 -22956 -21546 -14105 -15976 -26300 -27130 -16028 -9105 -14259 -18015 -7801 5645 6137 837 6508
1612 6508 18108 24380 18464 16066 22088 27642 23554 15242 13389 15227 13040 5016 -2673 -6976 -6639
1627 -6639 -9507 -16273 -23683 -24176 -19300 -18562 -25261 -27398 -18168 -8211 -10330 -14764 -7170 8678 12498
1642 12498 5355 6791 20856 30133 22516 12821 19385 30867 25964 10498 6434 14530 14403 -634
1656 -634 -12731 -10287 -4588 -11526 -25101 -25873 -18820 -16106 -21422 -26179 -21163 -10212 -6632 -9789 -9440
1671 -9440 489 12184 12376 6621 10327 20990 27716 20288 11789 17774 26603 21538 5725 1032
1685 1032 10295 11467 -2859 -16475 -10990 -2697 -9143 -25502 -26083 -14034 -8599 -19057 -25758 -15198
1699 -15198 -2902 -4150 -11899 -8022 5661 13462 8423 3216 9809 21889 22384 13511 8411 16318
1713 16318 23046 16302 3772 1450 10765 11689 -2880 -14781 -8539 635 -5547 -21826 -24159 -9518
1727 -9518 -3978 -17664 -26902 -14856 1757 -3365 -16470 -13385 6354 13980 1332 -4811 9887
1740 9887 24058 17755 5694 7943 22029 24365 11287 2025 8718 16458 9449 -3894 -8785 -1501
1754 -1501 1702 -9473 -19801 -19567 -9072 -7796 -20512 -25784 -16106 -2480 -6096 -18248 -14976 5189
1768 5189 12367 220 -5811 9290 25925 21112 4853 7961 26347 30089 12858 322 10959
1781 10959 22215 11453 -8219 -10165 2208 2942 -14746 -26699 -18293 -7539 -12756 -27019 -27725
1794 -27725 -13016 -3120 -11257 -19409 -9337 8228 11873 1175 -1695 14627 28387 20682 6919
1807 6919 11611 28862 29919 10095 -706 11628 22109 7865 -14075 -13919 1891 955 -19826
1820 -19826 -31198 -17613 -4127 -15235 -31730 -26060 -6336 -1000 -14075 -18221 -2208 14553
1832 14553 11526 -268 3259 20203 28386 16276 7154 14138 26744 23559 6664 -1183 9381
1845 9381 16778 2521 -15396 -14971 -65 168 -19894 -31126 -16485 -168 -11932 -30693 -23394
1858 -23394 482 5231 -13345 -19560 2044 20554 11233 -4660 2766 25025 27884 8963 1080
1871 1080 16025 29036 16904 -1999 -1179 12850 13940 -3415 -17032 -8498 3073 -2506 -20498
1884 -20498 -24722 -9943 -1078 -11968 -25629 -18230 1160 4401 -12310 -16356 2300 17896 8753
1897 8753 -7953 638 23460 24940 5096 -2027 15589 28543 13935 -5066 -203 17790 16532
1910 16532 -6036 -16053 -2282 8650 -4109 -23024 -20489 -3873 -1158 -17137 -26534 -14043
1922 -14043 2560 -1342 -17218 -15448 3958 14440 2969 -7958 3057 22029 21927 4808 -692
1935 -692 17318 28861 14738 -4271 2699 20692 17302 -6552 -16352 48 10762 -5892 -26147
1948 -26147 -19821 -600 -2384 -23199 -28740 -10432 2157 -7988 -21527 -13060 8031 12115 -1769
1961 -1769 -6620 9792 24524 18364 4726 6466 22241 26742 12706 -223 5940 19320 13764
1974 13764 -6889 -14249 -65 7795 -9647 -26531 -22031 -3058 -3630 -25368 -29564 -10642 4412
1987 4412 -7853 -22071 -10659 12571 15021 -2760 -5298 15478 28460 17306 2081 8518 26331
2000 26331 25733 6755 -2043 9392 19315 6407 -12246 -13126 311 2393 -14069 -26652 -16302
2013 -16302 -2751 -8369 -24478 -24331 -6124 3934 -7147 -18085 -5631 14663 13712 -2072 -2740
2026 -2740 16163 28471 15169 -93 8461 25589 22177 1217 -5097 9511 17165 1406 -15521
2039 -15521 -10612 2724 -21 -17110 -23944 -11077 -1200 -9411 -22987 -18921 -2371 2627 -7762
2052 -7762 -14109 -1912 13706 10968 -2480 -775 14889 23016 11245 -863 7037 22998 18766
2065 18766 -350 -5591 8847 17158 1034 -16219 -8630 7768 1719 -18203 -22771 -5518 2345
2078 2345 -11790 -24102 -13723 2871 1239 -13013 -14102 2322 11717 3892 -6046 2283 16173
2091 16173 18493 6157 185 11381 20331 14336 1012 -324 11448 14552 924 -11524 -5177
2104 -5177 5860 722 -15918 -19898 -6033 468 -11642 -23814 -15065 642 -190 -15817 -15111 1417
2118 1417 11366 1492 -7700 2733 18399 17560 4688 3459 14882 22983 12503 -31 3901 14642
2132 14642 12614 -1528 -9858 -1981 4631 -4110 -17805 -17827 -6558 -3695 -14692 -22601 -14446 -1012
2146 -1012 -2838 -14523 -13193 2203 12038 2872 -4724 5254 19891 18998 4959 3906 18075 23503
2160 23503 10965 -312 5919 15518 8614 -6709 -10126 -232 2527 -9573 -18957 -14972 -5983 -8136
2174 -8136 -17359 -20044 -10015 -1767 -5065 -10938 -6904 5002 9109 3833 -115 7842 18459 17235
2188 17235 6322 5524 16187 20206 9570 -1440 3282 12118 7740 -8274 -11545 -1402 1694
2201 1694 -10836 -19933 -13509 -3386 -6649 -17605 -17517 -5304 612 -6104 -10240 -2722 7468 8407
2215 8407 814 811 10130 15740 11203 4674 7371 14521 14417 5640 592 4367 8782 3946 -7349 -8066
2231 -8066 -1183 -405 -9034 -15783 -11371 -2429 -5499 -14947 -14984 -4201 1108 -5432 -10349 -2172 8280
2246 8280 6761 -834 -58 10493 13868 7907 2666 7636 14868 11732 3551 1912 6052 8335 1972
2261 1972 -4671 -4546 -400 -622 -7912 -12069 -9195 -3731 -7146 -13404 -12615 -5701 -42 -6480 -9945 -3250
2277 -3250 6134 4667 -974 570 9999 14541 7591 2937 8807 16524 11796 2756 3466 10209 8997
2292 8997 -183 -5131 -1262 1804 -3221 -10692 -10352 -6573 -6229 -10641 -13419 -11018 -5539 -6614 -7686
2307 -7686 -7643 -1762 2983 3246 949 2782 9331 12775 9091 6164 9683 14431 12010 5498 3814 8294
2323 8294 8916 1250 -5815 -3161 84 -4165 -12289 -12695 -7917 -7327 -12542 -14653 -10248 -4314 -5495 -7819
2339 -7819 -5500 1573 3709 2097 2315 6357 11728 11570 8928 8678 11197 12414 9728 5504 4534 6295
2355 6295 5068 -666 -5192 -4316 -2616 -5486 -11510 -12378 -8097 -6603 -10513 -13015 -8466 -2669 -3696
2370 -3696 -6744 -3541 2773 5845 2717 2681 7544 12320 8953 6937 8053 11603 11176 5912 4634 4447
2386 4447 4684 1362 -2364 -4142 -3628 -4591 -6386 -8853 -10365 -8733 -7188 -7310 -9213 -7583 -3244 -2331
2402 -2331 -3485 -3959 2290 5648 3213 1526 5823 10747 8706 5099 5635 10496 9454 4445 2679
2417 2679 4592 5285 1196 -3261 -3544 -1340 -3096 -6714 -7896 -6671 -6322 -7697 -9489 -6641 -5374 -4607
2433 -4607 -3987 -3956 -1744 1056 2340 2984 2918 4269 6592 7734 6105 6640 8058 8813 6251 3949 4070
2450 4070 4630 3403 -691 -2390 -1178 -1854 -6281 -8525 -6746 -4932 -7408 -10256 -9083 -5509 -5323 -5664
2466 -5664 -4979 -1659 340 692 2354 3368 6136 6640 7255 7755 8168 7433 8464 8213 5814 3903 3782
2483 3782 3743 77 -2246 -2725 -2621 -6262 -8677 -8111 -6804 -8083 -10029 -9590 -6769 -5290 -6370 -5405 -1004
2500 -1004 1926 1950 1696 5244 8552 7802 7111 8679 10622 8916 7247 6842 6223 4661 2531 684 737
2517 737 -1645 -4139 -5179 -7366 -7898 -8990 -8639 -7924 -7861 -9017 -7031 -4897 -3399 -3609 -1766 2302 4136
2534 4136 3383 4516 7585 8919 7506 6984 7852 9182 6247 4607 3958 5001 2070 -1236 -1999 -2666
2550 -2666 -3943 -6440 -7545 -6863 -6528 -7981 -8105 -6790 -5737 -4747 -4662 -1770 -258 87 1300 3293 4718
2567 4718 4707 5579 6842 7778 6451 5979 6845 6083 4810 2504 2581 2203 -682 -2563 -3012 -1778 -4795 -6678
2585 -6678 -6269 -5098 -6846 -7723 -5199 -4592 -3886 -4153 -2408 244 331 197 2782 4159 4388 4013 4688 6858
2603 6858 6238 5438 5174 5688 5222 3681 1809 1773 965 -1738 -2590 -2471 -3585 -5749 -6520 -5832 -4225 -6791
2621 -6791 -7422 -5150 -3439 -4394 -4388 -1892 -34 430 444 2145 4853 5492 5016 5891 8222 7815 5769 5268
2639 5268 5532 4947 2961 1750 1425 179 -1738 -4263 -4309 -4335 -6096 -7310 -6329 -5982 -7451 -6951 -5262
2656 -5262 -3143 -3412 -3155 -1099 1550 2027 1873 4468 6218 6660 6387 6853 8414 7025 5670 4956 4988
2673 4988 4099 2260 27 -724 -2453 -3874 -5962 -5396 -6242 -8124 -7773 -6841 -6152 -6003 -5478 -3589 -1815
2690 -1815 -2172 -68 1392 3573 3989 4820 6690 7832 7170 6672 7519 7243 5416 3846 3021 2172 438
2707 438 -1425 -2516 -2570 -3639 -5997 -7000 -5549 -6540 -7356 -7112 -4895 -3764 -4591 -4440 -1112 107 176
2724 176 1090 4435 5298 5405 4851 7034 7653 6839 4526 5660 5173 3229 1487 172 1187 -1306 -3740
2741 -3740 -3631 -3069 -5077 -6469 -6602 -5034 -5722 -6632 -6472 -3350 -3046 -2745 -1469 721 2227 2240 2110 3783
2759 3783 5040 4632 4679 5370 5776 4863 4139 3889 3820 2790 983 528 -365 -1836 -3251 -3212 -3640 -4296 -5806
2778 -5806 -5827 -4924 -4734 -5702 -4809 -3048 -2435 -2693 -1014 417 2194 2047 3290 4361 5442 4823 3906 5253
2796 5253 5966 5190 3681 4460 3364 1974 -22 433 -714 -1914 -4361 -3974 -3971 -5741 -6187 -5186 -5597
2813 -5597 -5155 -5667 -4413 -2597 -1660 -2267 -59 2098 2497 2821 4460 5829 5763 5100 5360 6157 5720 4613
2831 4613 4084 4346 2655 484 -1013 -940 -1711 -3528 -5358 -5614 -5669 -6207 -7376 -6067 -5024 -4893 -5377 -2117
2849 -2117 -1110 -603 41 1822 3814 5098 4264 4473 7303 7131 5241 5539 6266 4665 2688 1888 1041
2866 1041 -77 -1776 -3155 -2898 -3399 -5302 -6846 -6173 -5757 -6092 -6332 -4764 -3838 -3484 -2793 -720 740
2883 740 1637 1859 3609 5096 6211 5058 5573 6246 6587 5456 3867 4291 3841 1607 467 60 -1011
2900 -1011 -3123 -4327 -4333 -4704 -5834 -6396 -4776 -4909 -4878 -4559 -3347 -1803 -2070 -1055 811 2110 2645 3040
2918 3040 4473 5293 4192 4949 5023 4936 4188 2238 3708 3420 1982 74 -505 -1095 -1783 -4066 -4969 -3647
2936 -3647 -4570 -4812 -5441 -4396 -3736 -4165 -3391 -1616 -542 -535 683 1960 2488 2770 2651 4284 5219 3936
2954 3936 3851 5155 5627 3412 1614 2656 2747 1024 -293 -1281 -1320 -2435 -3599 -4517 -3380 -4515 -5607
2971 -5607 -4597 -3945 -3595 -3742 -2902 -988 -308 -1266 681 2427 3667 3778 3365 4545 5169 4845 4735 4135
2989 4135 4425 3472 2664 2078 1803 -198 -1851 -2314 -2254 -4530 -4840 -5685 -4984 -4189 -5839 -5540 -3729 -3149
3007 -3149 -3408 -2487 -640 600 865 1895 4153 4246 3934 4862 5434 5039 5054 3989 4119 4717 2575 1175
3025 1175 870 350 -1810 -3317 -3252 -3253 -4999 -5979 -5762 -4921 -5160 -5391 -3486 -2616 -2577 -2144 -516 1474 1960
3044 1960 1693 3717 4983 5360 3851 4580 5638 4578 3613 3324 3419 2643 783 -540 21 -2095 -3166
3061 -3166 -3874 -4297 -3797 -5325 -5613 -4890 -4246 -3850 -3687 -1752 -795 -1103 -62 1222 3162 3009 3297 3907
3079 3907 4980 5523 4658 4057 4672 3596 2019 2244 1694 1140 -491 -1758 -1998 -2392 -3330 -4056 -3668 -3447
3097 -3447 -4557 -4185 -3452 -2308 -3098 -1977 -1955 -105 -353 524 1776 2177 2918 2453 4002 4782 4022 3545
3115 3545 3137 3052 3217 2224 1914 644 763 -921 -1361 -1202 -2872 -3550 -3387 -2762 -4208 -4153 -4452 -3144 -2023
3134 -2023 -2385 -2111 -1024 664 22 1321 2315 2990 3414 3467 3309 4593 3444 3156 3376 3536 2658 1350
3152 1350 497 757 -195 -1893 -2347 -2161 -3702 -4194 -4256 -4550 -4121 -4457 -4311 -2484 -2015 -2117 -1442 636 465
3171 465 1181 1458 3751 4237 3941 3513 4742 4663 3782 3368 3137 3367 2311 415 309 -269 -1873 -3137
3189 -3137 -3609 -3410 -3397 -5096 -4544 -3981 -3410 -3760 -3406 -1586 -1971 -1283 219 1851 2365 2621 3862 3960 5313
3208 5313 4058 4174 4767 4384 3790 2065 2217 2062 530 -612 -1078 -1669 -2551 -4339 -4464 -3303 -4562
3225 -4562 -4286 -4028 -3039 -3177 -2590 -2401 -501 -339 111 1748 2992 3604 2868 3396 4327 4328 3579 2838 3701
3244 3701 2857 2354 1511 456 270 -766 -1564 -668 -1454 -2807 -3537 -3736 -3122 -4104 -3979 -2389 -2275 -2019
3262 -2019 -1599 -643 891 179 709 1727 3478 2816 2527 3140 3923 4139 2813 2321 2935 1940 1433 364
3280 364 91 -459 -2283 -2198 -1356 -2241 -3077 -4215 -3425 -2649 -3517 -4092 -1832 -1658 -1797 -1679 -303 1324 801
3299 801 1239 2050 3086 2833 2637 2256 3774 2793 3076 2974 2710 2596 296 -39 473 -916 -2058 -2619
3317 -2619 -2774 -3451 -3652 -3993 -3518 -2994 -3134 -3458 -1567 -1970 -640 -863 320 1509 1711 1587 2136 3087
3335 3087 3733 3279 3356 3830 3141 2306 2090 1953 1438 -143 -973 -731 -1457 -2656 -3482 -2527 -3309 -3829 -4077
3354 -4077 -3484 -2893 -3118 -3041 -1385 -782 -607 269 1707 3345 2898 2958 3472 3910 3713 3256 3394 4013 2697
3373 2697 1077 2145 1585 -411 -1261 -1029 -1835 -2527 -3457 -3142 -3588 -3456 -4615 -3631 -2458 -1849 -2487 -1885
3391 -1885 256 456 517 391 1935 3704 3675 2310 3299 3706 3732 1897 2788 2274 2020 293 -14 201 -988
3410 -988 -1891 -2411 -2491 -3184 -3474 -3365 -2896 -2865 -2935 -2489 -1294 -1134 -1311 231 1190 1292 1403 1896 2899 2756
3430 2756 2915 2915 3777 3322 2338 2165 1261 1707 307 225 -765 -332 -1342 -3078 -2034 -2288 -2723 -3812 -3184
3449 -3184 -2783 -2688 -2488 -2115 -1326 -1140 -175 624 413 1127 1135 2119 2814 2444 2716 2832 3707 2086 2452 1898
3469 1898 2426 834 -306 -376 -432 -304 -2214 -2833 -2853 -1926 -3144 -3789 -3461 -2721 -2468 -2402 -1080 -729 -6
3488 -6 -671 161 1946 1893 2577 2839 3234 2989 2283 2764 2821 3145 2473 2200 1509 352 305 -745 -925 -1616 -3065
3509 -3065 -2528 -2294 -2523 -4256 -3188 -2912 -2601 -1982 -2248 -738 209 605 505 2314 3104 3488 2324 2865
3527 2865 3956 3189 2504 2880 3214 2497 820 465 244 259 -1192 -2298 -2463 -2460 -3200 -3325 -3503 -2971 -3753
3546 -3753 -3336 -2235 -2185 -1291 -899 326 1087 1045 1562 3403 3636 3348 2575 2858 3774 3393 1346 2567 2499
3565 2499 1578 737 -419 -411 -1888 -2527 -2806 -2468 -2440 -2782 -3364 -2694 -2373 -2325 -1857 -2299 -1203 -108 -68 729
3585 729 1250 1665 2292 2400 2389 2322 2963 3159 2342 1340 1330 1486 1790 -806 -1370 -882 -518 -1915 -2627 -1864
3605 -1864 -2253 -2228 -2727 -3230 -1483 -1160 -2721 -2067 -795 605 -35 -23 1030 2121 2404 2278 2383 2338 2732
3624 2732 2570 1466 1951 1787 1266 1259 546 -670 -916 -1081 -608 -1619 -2624 -2197 -1959 -3303 -3692 -2246
3642 -2246 -1056 -1206 -2522 -1391 65 -53 -385 -189 2318 2338 1379 2082 2643 3422 3074 1593 2080 2677
3660 2677 1581 1036 -550 1049 265 -1067 -2108 -1559 -2389 -2661 -2446 -2811 -3449 -2661 -2065 -2096 -2159 -861
3678 -861 199 431 64 975 1624 3342 2228 1563 3329 3482 3356 2136 2365 2425 2275 1064 -546 -205
3696 -205 -73 -984 -2681 -2627 -2001 -2442 -3024 -4179 -2348 -2525 -2084 -2521 -1859 -626 -580 183 980 1889 1448
3715 1448 2869 2741 2567 2924 3143 3367 2335 1636 1844 1649 419 253 -400 368 -1415 -3088 -3190 -1711
3733 -1711 -2193 -3126 -3571 -2468 -893 -1423 -2472 -1701 402 757 94 140 1409 2613 2329 1434 2554 2874
3751 2874 3016 1863 1658 1479 1201 1005 -769 -22 -732 -1566 -1480 -1813 -2746 -1302 -2087 -3049 -2761 -2085 -1122
3770 -1122 -977 -1980 -1615 60 1133 -622 328 1483 2617 3201 1004 1892 3399 2813 1430 780 2083
3787 2083 1465 864 8 -528 -228 -539 -1750 -1559 -1700 -843 -1830 -2784 -2435 -1793 -1502 -1464 -1535 -1319 -285 277
3807 277 305 -799 717 2018 2096 1432 2000 2934 3313 1449 1712 2095 1960 1575 -682 105 157 -354 -1380
3826 -1380 -2022 -1562 -881 -2628 -2890 -2343 -2178 -2000 -2757 -1242 -1036 -408 434 -327 554 1840 2136 2265 1820
3845 1820 2353 2669 3988 1952 1751 1841 2258 1324 334 -980 131 -416 -2362 -2297 -1594 -2136 -2289 -3530
3863 -3530 -2836 -1429 -1797 -2372 -1396 -101 618 127 62 1476 2281 2071 1829 2150 3334 2532 2149 1602 1225
3882 1225 2261 1267 678 -44 -536 -39 -1321 -2009 -2253 -2502 -1601 -2436 -3095 -2771 -1402 -1438 -1950 -1601 -140
3901 -140 923 330 -312 754 2472 2367 1450 1436 2810 3363 1515 1074 1516 1539 1172 -188 -149 -590 -263
3920 -263 -1296 -2948 -1771 -1626 -1854 -2881 -1473 -2464 -1219 -1422 -1295 -926 -491 491 610 -321 1354 1973
3938 1973 2879 1810 1758 2270 2302 2006 329 1411 1523 1161 208 -893 -250 219 -839 -2017 -1387 -314
3956 -314 -1520 -2012 -2243 -1275 -586 -2300 -786 -482 671 -189 -611 28 978 1563 1664 990 1058 2165 2658
3975 2658 2118 1310 1135 1305 1476 99 -482 -287 577 -861 -2488 -1587 -1195 -1497 -2558 -3228 -1213 -1123
3993 -1123 -2428 -2209 -977 -18 386 -273 -45 1836 2083 986 983 1902 2880 2083 1616 2191 2621 1996 918
4012 918 337 269 -52 -187 -842 -1863 -1677 -1533 -1650 -2686 -3139 -1822 -1330 -1592 -1696 -1298 -264 -9 -57
4031 -57 -112 1500 2914 1462 1293 2377 3964 2444 2174 1581 1737 2210 1084 -456 446 -352 -1474 -1380
4049 -1380 -2127 -1466 -1921 -2577 -3070 -1666 -2055 -1439 -1400 -1860 -1467 446 -480 -347 224 1282 2082 1951 398
4068 398 1459 2694 2625 1250 1462 1769 2033 54 -908 -260 -39 -901 -1907 -1782 -1441 -1612 -2640 -1974
4086 -1974 -1773 -661 -1456 -1450 -532 -281 739 -68 309 344 2095 1906 1334 1693 1723 2541 2237 882 1681 717
4106 717 909 541 -304 -387 -149 -707 -1330 -2040 -1750 -784 -1354 -2494 -1990 -480 -875 -1506 -1150 643 371
4125 371 571 1054 948 1845 1113 774 1311 1586 2742 710 1969 1542 1405 973 803 -306 -740 195 -311
4144 -311 -1110 -1635 -1557 -426 -1619 -2342 -2004 -1005 -1466 -1777 -1245 71 377 28 -124 -160 1010 1315 1188
4163 1188 1545 2634 1971 1800 1183 1515 1375 345 365 96 -17 58 -267 -977 -1327 -1082 -1567 -1778 -1794 -2405
4183 -2405 -1697 -1500 -1348 -793 -456 747 196 -139 937 1273 1155 1561 1228 2283 2709 1226 903 1523
4201 1523 1185 947 47 482 298 -202 -785 -1597 -1642 -1371 -2051 -2012 -2052 -1019 -1193 -1759 -1251 -125 32 109
4221 109 359 -159 802 971 1414 1517 1139 2016 2236 1928 1371 797 1451 815 -632 -141 -146 -242 -1492 -1704
4241 -1704 -1805 -1744 -1487 -1503 -1743 -1405 -891 -797 -1547 -616 69 907 9 993 777 1934 1039 1348 2177 2500
4261 2500 1622 801 1459 811 569 -136 475 -154 -329 -463 -1763 -1874 -1258 -1408 -1064 -1483 -1781 -1583 -254
4280 -254 -1214 -1243 -599 930 772 11 90 869 2302 922 652 1888 1692 1357 533 1282 315 705 381
4299 381 55 -2 -480 -757 -412 -1280 -645 -969 -1498 -1683 -2055 -1181 -1108 -1415 -1405 -667 -169 158 615 840 179
4320 179 915 1265 1656 1212 1920 1862 1068 670 1080 975 880 501 -108 104 -834 -1414 -1050 -1401 -1497 -1493 -2061 -2137
4342 -2137 -651 -1457 -644 -733 35 -52 498 670 1285 919 401 974 1645 1953 754 1481 1651 1292 975 600
4362 600 580 122 -273 147 -1095 -1607 -1164 -1199 -1034 -1537 -2072 -1487 -1504 -744 -1634 -888 -26 538 -100 634 1330
4383 1330 1810 1008 2216 1492 1635 1565 1660 1550 1757 883 783 822 -479 -571 -106 -1019 -1923 -1684 -1255 -999
4403 -999 -1338 -2189 -1706 -1340 -657 -475 -1452 32 564 326 343 1198 1854 1400 1304 955 1857 2334 400 1505
4423 1505 868 449 451 -112 -455 -424 -484 -919 -608 -1410 -710 -1551 -1611 -1302 -1577 -1010 -671 -290 -554 -528 991
4444 991 401 538 607 919 1472 840 1185 1445 1345 1439 950 469 1064 565 -133 -457 -775 -1018 -327 -1576
4464 -1576 -811 -1129 -1460 -1271 -751 -419 -701 -1611 -211 -868 -170 -366 391 1028 931 1091 570 552 1023 831
4484 831 1822 1186 410 1281 1070 1092 8 -357 909 -69 -384 -443 -1485 -493 -986 -1620 -1289 -155 -1028
4503 -1028 -1069 -637 -370 683 -292 -693 68 1113 606 900 865 1625 1313 1204 1496 1564 1529 830 1215 448
4523 448 259 -211 136 -696 -564 -1589 -653 -771 -1804 -928 -1859 -1324 -1100 -1168 -1025 -33 -35 -352 167 633
4543 633 681 1225 1608 1646 1998 1940 1285 1038 1678 278 575 339 -375 -1069 -401 -421 -343 -1859 -1098 -1652 -1149
4564 -1149 -1147 -1406 -925 -835 -108 -122 -321 444 1059 205 672 1624 1134 1185 1892 1707 755 1408 1005 5 120
4585 120 -381 -369 -415 -1139 -772 -1168 -1789 -684 -861 -1643 -974 -536 -799 -1377 -126 154 -228 438 502 365
4605 365 955 1501 845 1227 1519 1194 1150 1127 1278 828 1086 1540 -84 -89 -524 -438 -485 -856 -793 -842 -986 -1609
4627 -1609 -693 -190 -1340 -755 -701 -477 -229 -208 2 514 858 497 263 1797 1519 951 -188 1276 1370
4646 1370 690 782 684 -9 -458 -226 -1028 -137 -611 -1081 -561 -679 -974 -628 -919 -809 -906 297 -683 -795
4666 -795 381 636 81 126 926 654 217 1467 1267 987 1144 857 1231 967 669 482 265 65 -48 -774
4686 -774 290 -1006 -1264 -1071 -915 -1336 -823 -299 -1400 -948 -659 -754 393 30 -484 579 918 765 881
4705 881 882 1256 1595 1065 900 1385 1345 676 241 128 104 -581 -1014 -81 -918 -1108 -658 -740 -1002 -713 -1536 -528
4727 -528 -531 -781 -399 29 409 621 897 1078 1933 1095 1283 1446 1129 1491 263 177 297 606 -28 64 -38
4748 -38 -756 -946 -1150 -1304 -1101 -1660 -1836 -664 -1385 66 -590 -179 -859 335 -62 -223 1212 1036 898
4767 898 1207 1102 1617 673 996 511 765 62 -139 885 1019 -296 -729 -1173 -295 -1119 -1690 -89 -1357
4786 -1357 -1446 -1055 -747 181 -760 -531 268 189 727 778 236 353 629 676 1232 843 1346 82 1129 883
4806 883 741 977 473 -342 -366 -923 -323 351 -608 -725 -810 -201 -817 -832 -1025 -287 -61 -256 -323 -159 -284
4827 -284 186 700 341 586 388 1121 494 1196 1251 472 422 987 413 139 -93 242 23 -1069 -1188 -898
4847 -898 -550 -1107 -1488 -1371 -1420 -533 -271 -459 -601 -48 403 -230 245 747 86 602 813 705 857 290
4867 290 1310 1060 288 848 246 730 276 611 -242 -80 -1368 -682 -1000 -702 -746 -239 -855 -759 -575 -174
4887 -174 -231 -179 -643 -411 423 688 1269 728 384 546 759 1150 638 1006 698 685 785 -6 27 -203 -493
4908 -493 -751 -452 -967 -1024 -1498 -744 -1056 168 -352 -1022 -692 -82 -8 -100 271 263 213 1084 1097 1298 846 820
4930 820 779 1030 725 613 478 68 -345 -215 -160 -532 -287 -221 -1253 -705 -762 -607 -335 -967 -684 -62 -451
4951 -451 -386 -89 198 -141 1370 792 530 535 -345 553 680 756 730 237 685 92 73 -280 -689 -74 -86 -854
4973 -854 -699 -333 -644 -1289 -370 -656 -389 -426 -269 -419 464 -835 246 367 973 -13 600 769 709 433
4993 433 511 68 1022 646 852 681 636 177 163 -830 -92 -224 13 -394 -315 -214 -647 -340 -180 -110 -836 -436
5015 -436 -243 242 -396 -144 439 397 -48 893 795 403 726 938 995 631 1337 485 -15 176 -218 -195 -421
5036 -421 -544 -628 -237 -456 -298 -1362 -1174 -1149 -354 -712 -585 -70 208 401 125 673 31 891 710 914
5056 914 938 1317 1294 522 1155 1366 186 711 235 456 -682 -91 -1438 -733 -411 -841 -1187 -1277 -1055 -827
5076 -827 -489 -618 -352 -114 -319 877 598 106 799 2056 469 343 1148 1000 1061 1071 949 -746 143
5095 143 -331 -473 -387 -82 -930 -674 -525 -642 -1187 -1108 -549 -858 -555 -907 296 18 300 -742 120 55
5115 55 636 95 720 1070 441 1070 1516 1115 512 -188 805 178 22 -434 88 -832 -703 -1319 96 -5
5135 -5 -695 -294 -1378 -277 -423 -381 -2 -153 -545 -356 846 524 -518 439 651 567 732 366 577 521
5155 521 540 434 257 -695 401 -44 -737 -618 54 -1048 -906 -558 -619 -573 -496 452 162 -187 -74 -1162
5175 -1162 295 -287 340 119 301 394 133 1332 888 714 421 784 569 75 -255 191 204 -609 -719 47
5195 47 -180 -387 -131 -440 -746 -953 -944 -675 -539 -785 6 -177 -239 -24 221 435 -311 622 1087 251 79
5216 79 992 750 723 1197 1288 510 -470 -147 -148 -144 96 -169 -707 -649 -498 -272 -823 -114 -924 -746 -446 -230 -429
5239 -429 -354 -249 -177 159 193 879 -327 78 683 511 971 926 906 329 409 527 403 393 -577 -432 -803 -1135
5261 -1135 -459 50 -1125 -1417 -583 -670 -495 -681 -500 -13 -3 509 865 283 415 667 164 572 741 679
5281 679 465 549 245 301 680 34 -345 -567 -720 -1123 -677 -366 -879 -718 -1449 -242 -467 -125 -195 -138 -331
5302 -331 -173 206 232 285 -433 389 613 742 1066 432 624 269 498 431 258 -114 187 -631 -282 -413 -748
5323 -748 566 -627 -275 -1235 -258 -504 -365 8 -299 -109 446 515 168 322 723 376 -573 532 -90
5342 -90 112 -117 292 91 1027 528 -42 -447 372 -215 1044 -488 -370 -145 -164 -32 -819 -369 -62 -57 -618
5363 -618 -430 -309 -722 370 392 -408 127 -98 594 250 815 436 408 855 34 450 479 351 -131 -183 -219
5384 -219 278 76 -316 -757 -466 -803 -389 -710 -559 274 -189 -634 -908 -378 -444 -307 377 428 -604 436
5404 436 183 361 1092 86 213 784 303 762 -99 107 -327 -341 -660 43 38 -498 -1423 -522 -494 -1087 -544
5425 -544 -628 -568 -719 349 -31 -108 -463 -159 538 -286 764 -153 170 1092 202 868 321 803 637 27
5445 27 831 -83 -665 -571 -207 -384 -829 -661 -566 -430 -253 -684 -299 -327 94 340 81 360 -428 -27 558
5466 558 -290 687 561 84 134 899 651 654 358 565 201 -603 -328 395 -499 260 -163 -761 -382 -376 128 -29
5488 -29 -82 -382 -174 -57 -325 262 544 -507 422 760 417 413 -40 932 325 -326 129 505 331 -121 -305
5509 -305 -491 -344 48 -264 -578 115 -628 -15 329 -1353 -150 -518 167 225 63 -592 171 -327 110 -328
5529 -328 153 -68 70 736 -307 651 542 566 -389 444 699 125 32 154 283 77 634 -635 -507 -391
5549 -391 -826 25 -516 -337 -423 -162 -564 -584 151 474 -219 647 1146 440 315 -64 -353 278 288 698 127
5570 127 714 135 -83 190 150 -286 331 -488 248 -612 -702 -270 424 -392 -10 -172 -159 -615 -1019 98 40
5591 40 155 -263 -388 -167 473 230 608 413 -1 -10 362 241 366 235 280 127 -355 -52 889 355 -228
5612 -228 -370 -966 -302 -336 -132 -176 -508 339 27 -96 324 221 165 -119 -195 689 392 397 549 115 389 39
5634 39 -85 429 313 674 -360 -189 -979 -349 -568 -896 800 -334 -192 -144 340 -555 -25 124 109 -128
5654 -128 -207 620 479 561 658 530 921 -246 894 -53 141 41 -439 -274 -157 -137 -109 -586 25 147 -216
5675 -216 -583 5 -208 277 -388 -621 84 -184 295 -620 -216 -338 -401 915 1016 149 -30 414 723 -210
5695 -210 213 396 575 378 284 52 -383 -152 -389 -56 -581 -400 -511 -287 458 -71 424 135 -415 -23
5715 -23 -592 -838 473 -615 85 575 -12 -321 -263 1138 233 1276 858 22 105 279 122 177 201 375
5735 375 264 -552 752 -532 -478 -800 -728 -42 -436 428 115 -21 115 77 78 -181 -385 -116 -176 814 -272
5756 -272 343 1150 158 406 171 813 708 -89 -255 545 367 -265 -689 -259 -711 82 -758 -63 -535 -540 -788
5777 -788 -483 -650 -141 817 -372 222 217 -44 630 151 474 -19 279 -40 133 409 103 -58 244 107
5797 107 -107 247 -243 80 178 -343 -919 145 -510 -893 735 -337 -137 -416 -137 425 -389 -43 243
5816 243 150 -309 491 1170 -190 854 14 480 -35 -158 95 66 190 -163 104 -264 -485 -65 189 53
5836 53 -908 -471 -260 -299 -877 -758 48 202 -491 701 964 -377 743 868 374 -114 -18 -7 368 -303
5856 -303 199 512 149 -2 -229 -71 -274 299 229 124 7 74 -469 271 931 114 644 112 -129 261 -217
5877 -217 336 129 84 296 -130 465 644 240 292 -65 -539 495 495 330 -23 -190 300 290 73 268 -126
5898 -126 45 -406 -194 267 -57 -499 25 54 -167 -20 285 -835 -588 182 234 496 167 278 354 331 -241
5919 -241 489 -214 -120 195 79 -604 100 259 359 490 -390 -246 -234 -272 -963 -938 -675 -298 32 271 -232
5940 -232 273 -242 504 73 -130 -414 692 -81 783 62 430 35 179 584 264 267 214 158 -390 -640 123
5961 123 -272 71 -369 -339 163 -552 -38 -732 -622 58 117 -116 -228 485 396 272 262 516 -145 504 679
5982 679 302 -158 100 -805 -420 550 142 -243 19 -262 -478 -556 -15 546 -566 -636 278 -289 -235 -222 -411
6003 -411 151 383 670 131 304 439 10 -400 -216 146 -374 532 8 793 -61 532 -134 498 -294 -171
6023 -171 368 233 -584 163 -192 -885 690 235 98 -361 -89 107 509 -396 1007 -352 -406 53 584
6042 584 387 333 166 38 95 110 524 -600 711 51 307 698 83 -23 438 -268 -113 -833 -732 -295
6062 -295 37 -104 -638 -661 491 -428 -443 -20 208 -318 787 245 116 301 -52 167 -303 311 449 621
6082 621 363 451 318 695 -189 788 11 155 -90 -331 -395 -610 -365 -604 277 -297 -379 -120 430 464 181
6103 181 632 -461 15 216 74 455 505 -105 49 143 -282 -354 -144 -47 -442 -268 23 72 -458 -40 -558
6124 -558 345 -395 -318 -333 510 -3 -301 -170 320 219 -145 55 -203 121 -524 310 712 756 402 -335 1003
6145 1003 -169 44 599 407 -415 75 95 872 -86 -710 44 -467 405 -221 -216 480 -303 225 2 -50 241
6166 241 -797 -243 -515 -32 232 119 392 -72 349 122 73 439 -422 -252 28 -219 118 -203 -252 276
6186 276 469 -508 -385 -298 16 -665 -477 154 220 581 226 167 457 101 -185 -241 714 -199 661 -120 150
6207 150 461 544 -365 363 542 -158 28 611 -975 -180 -767 -247 -129 346 65 690 -386 14 -664 -327
6227 -327 -151 -289 150 211 537 -472 844 148 179 491 159 571 38 -607 -271 709 130 -502 917 235
6247 235 123 43 -132 -134 53 -177 611 380 -478 436 -62 -597 -253 -127 -72 -364 -1109 36 -238 368 58
6268 58 -140 7 997 -46 -74 38 -398 -108 532 253 678 104 65 -228 -331 -249 233 -401 0 -87 -452
6289 -452 -545 444 237 -153 -5 -423 -55 -145 540 204 928 144 574 -190 -263 532 -223 69 -263 -403 -655
6310 -655 440 -15 151 -432 -172 -232 96 15 -249 191 -19 -189 -293 -200 -128 24 448 309 -340 261 119
6331 119 169 789 129 253 -111 123 340 -152 -50 770 497 228 200 -302 297 133 176 -152 3 117 -41
6352 -41 187 -194 173 60 742 216 421 472 -58 415 120 356 -582 346 436 -524 472 -146 -501 153 -209
6373 -209 215 -140 208 252 -163 188 -10 -104 685 489 455 633 -565 -337 -43 182 -247 262 -95 208 -552
6394 -552 1012 -835 598 -107 -156 173 -697 115 -169 -570 -275 142 -166 -188 736 369 -666 276 -239
6413 -239 -519 -38 -384 -835 -190 342 37 -1128 174 464 -658 -404 -597 -406 19 105 84 573 180 190
6433 190 154 -74 140 -137 280 303 -151 -307 -408 -502 -348 168 -136 316 44 44 -166 -226 365 -442 -41 -215
6455 -215 122 423 108 -123 437 169 118 249 51 -132 -23 198 340 -208 401 69 841 -148 811 305
6475 305 -77 327 30 496 -313 -322 -492 -147 -182 59 241 175 -608 239 137 300 -60 264 -93 57 -126
6496 -126 207 97 97 179 390 201 -302 -211 438 -25 -313 194 177 24 -223 -94 -336 -732 439 336 -11
6517 -11 166 -18 -497 237 -53 94 -463 174 -134 -231 -201 -41 -34 15 376 61 88 332 399 -38 201 -72 519
6540 519 -492 -46 415 528 -186 221 -185 51 331 543 3 483 -401 427 -354 -827 32 -524 434 -147
6560 -147 220 677 761 247 199 673 104 508 458 442 638 379 -157 -7 635 331 410 -243 -521 332 37 263
6582 263 120 318 -192 -279 720 -142 61 -296 336 378 394 409 879 344 -236 288 190 526 -457 -138 -731 -164
6604 -164 128 -400 310 243 -44 152 -1327 392 97 -336 265 -610 314 -1 -198 56 412 305 351 366
6624 366 1358 429 -1046 -100 744 -232 630 123 -450 234 112 -192 110 -7 -462 326 -266 62 93 104
6644 104 280 -26 21 84 135 231 -113 171 97 253 194 658 849 194 445 154 207 -190 870 175 -147 -304
6666 -304 -1155 257 -376 584 -647 -632 -2 56 -609 -79 -353 -338 91 -119 466 -9 44 -287 91 258 365
6687 365 135 548 -273 -39 390 -170 -24 -9 359 -39 -70 -72 -697 -491 195 -510 -235 17 -147 -547 655
6708 655 248 693 379 -3 173 -479 164 -346 -39 -421 -30 588 8 325 813 -121 962 -262 -174 -301
6728 -301 27 -750 -661 -162 -66 -323 543 103 -244 87 -528 89 -475 -122 200 755 -584 -306 315 -283
6748 -283 -496 157 63 318 351 397 -681 -125 -59 432 464 -233 -236 -246 -43 -391 -867 76 -84 -528 -238 280
6770 280 347 -498 -80 450 259 -127 356 -407 -47 265 -427 313 -217 317 392 62 679 146 -81 114 -617
6791 -617 298 -487 107 16 -625 -683 406 -56 -490 98 -480 -109 69 46 -925 14 -37 623 130 -797 -6
6812 -6 -83 217 287 840 170 -20 362 614 632 -129 -175 440 64 71 450 -941 -90 -981 -260 -10 56 37 -393
6835 -393 19 -451 -719 94 571 -905 246 76 124 207 627 -234 117 -235 424 624 128 -544 -36 -527
6855 -527 -203 -276 -285 606 -212 -567 -400 164 -224 -45 508 -468 -556 -453 363 -142 -71 -407 -92 -26 -228 -34
6877 -34 465 721 50 -479 -60 672 -31 118 -108 -114 95 -864 532 -232 358 280 43 -213 27 -110 339
6898 339 -284 161 81 -95 200 50 151 326 196 528 -11 258 32 -5 848 -614 -425 442 779 -384
6918 -384 512 -344 -367 -159 -273 117 369 -427 -53 -205 296 -402 262 -42 25 -194 -87 363 270 -644 -290
6939 -290 -261 149 -152 604 -423 745 694 188 820 203 639 186 479 203 415 -261 603 117 327 -614
6959 -614 72 -463 -175 -395 170 -282 247 -110 -71 -225 921 392 -367 -41 -347 -139 625 577 169 821
6979 821 142 187 -760 622 420 -419 332 342 -433 -573 -205 -112 24 -324 -80 -129 -39 -571 216 3 60 -343
7001 -343 595 333 22 94 -630 410 -279 91 264 -564 -333 200 -185 13 196 162 178 -246 239 295 -91
7022 -91 -14 -131 -98 -74 734 -170 116 123 -209 22 256 15 329 -17 -242 -11 874 -132 -425 154 -183 -189
7044 -189 605 432 -69 358 104 -622 33 19 -370 -507 -43 -118 568 -222 167 -169 -246 216 -174 133 637
7065 637 501 -585 -300 -202 256 232 268 428 -257 368 427 931 1021 106 -301 314 -477 -154 164 -478 169
7086 169 -647 608 -461 681 -695 -340 204 118 90 -54 770 456 257 -369 414 -218 469 744 -74
7105 -74 232 742 324 -81 85 38 442 306 220 -46 -77 601 324 385 -348 -116 427 -787 -298 -903 -399
7126 -399 58 -120 -129 394 261 334 41 318 466 -401 -272 232 -495 444 -578 -31 214 324 88 151 220
7147 220 205 -520 -529 -376 -777 1035 -97 -177 656 22 -438 11 182 -993 331 -272 -43 319 -29 245
7167 245 200 5 161 -12 533 220 -32 548 152 -337 376 127 513 -326 -304 -677 -113 136 333 32 -545
7188 -545 478 163 -178 246 387 403 252 88 212 326 1235 362 537 185 102 -29 326 291 -187 105 -160
7209 -160 208 672 -169 -619 -351 -725 -882 58 -229 -1081 -81 -421 176 -34 -66 11 84 846 -58 156 -574
7230 -574 -418 136 166 350 621 -295 443 -817 -514 1014 -556 -206 -241 33 626 547 -152 -661 568 42
7250 42 2 -337 280 269 246 60 -47 -455 241 773 360 564 -222 -136 704 -480 -607 314 133 593 -108
7271 -108 566 -196 107 -338 -522 -298 -226 83 189 -645 -367 -311 213 -337 473 -146 126 83 51 53 156 -284
7293 -284 84 824 1067 419 555 -184 -23 278 -586 -42 -237 -371 -360 -98 -227 91 -409 -370 -376 -67 -117 85
7315 85 200 -554 29 148 827 65 9 -41 -173 259 -44 659 496 -425 -86 573 -147 177 521 768 127
7336 127 158 -112 -35 -192 26 -315 -4 554 -163 -341 295 113 288 80 21 -383 -300 116 -489 -77 186
7357 186 540 -500 266 865 -229 614 -100 633 -3 178 -313 -282 57 -432 -208 -180 -309 -209 278 -160
7377 -160 93 669 -250 -134 108 420 -157 -646 128 76 29 1175 228 -474 3 -145 821 649 472 43
7397 43 155 297 62 162 3 190 256 -542 -479 -494 -160 -288 304 -220 -67 -18 321 788 -151 381 -54 -22
7419 -22 493 708 -450 682 109 -51 491 -495 598 473 -439 -378 -252 -653 -47 -79 698 -187 -356 243
7439 243 -447 -188 -432 -181 16 -426 -682 203 55 -738 -191 561 742 -820 16 -263 -180 -226 301 -328
7459 -328 -102 -157 871 -211 -355 -1057 -24 -114 -254 -447 417 -429 519 30 381 -52 67 -232 -38 81
7479 81 -24 -632 308 -402 -271 641 -467 463 -36 349 -41 273 153 -311 -440 106 47 192 -41 230
7499 230 -6 -124 -72 316 -304 12 -206 -380 105 -301 -383 -658 377 482 -207 347 691 276 359 63 -438
7520 -438 136 -102 -206 122 -76 33 -363 -95 -8 -295 34 88 406 -568 -77 -247 412 -220 -206 -293 -1162
7541 -1162 -503 -137 169 -71 743 77 129 294 -431 -386 633 -126 462 -19 -98 395 -121 -530 30 -241
7561 -241 430 -10 -749 -321 -505 -251 -38 261 -515 -45 -324 -132 175 241 217 -68 284 -640 42 875 421
7582 421 -318 657 629 554 301 -439 418 -165 77 -620 227 536 -243 199 -349 -395 -794 -599 157 -427 85
7603 85 29 -603 208 -16 -213 -209 -132 256 166 222 350 88 524 -661 -120 119 217 -58 -887 623 210 781
7625 781 -441 -615 -36 -131 -885 -377 -762 -181 -41 301 466 -414 -433 35 295 323 3 -1274 610 447
7645 447 53 -513 -256 1 262 224 -19 325 -158 -533 -245 15 489 -28 -291 46 167 -547 -70 -260
7665 -260 -358 -169 153 488 -811 -123 -451 -254 308 497 207 213 -208 -285 285 216 -67 -275 439 226 454
7686 454 -628 306 550 -424 -48 144 -181 -361 -142 -314 105 732 -27 92 -143 172 -26 218 -41 296
7706 296 276 479 450 8 487 91 148 390 51 30 521 -5 230 58 12 -7 -103 35 -247 235 721 -622
7728 -622 -476 -120 233 611 125 -40 41 -496 261 354 256 75 -282 76 144 -25 407 136 -550 392 56
7749 56 -430 -292 149 -81 -375 -498 -179 46 -515 -147 -520 135 -280 -141 4 -506 -201 -189 -31 330 -412
7770 -412 249 894 -150 851 180 -485 400 554 382 -543 91 288 102 -373 174 -189 316 -100 -752
7789 -752 105 241 -782 -425 -491 -526 -346 -146 122 -227 570 79 -324 543 84 921 302 -180 379 641
7809 641 485 371 -58 45 -103 702 158 -358 -245 15 -342 -675 -569 -219 -32 464 -185 -140 943 -272
7829 -272 -146 618 375 -351 245 563 209 -277 -524 351 3 383 324 684 -578 470 -163 -53 334 -61
7849 -61 -279 -460 264 -208 -31 309 -1069 924 70 -736 329 -193 -358 -104 392 -477 -483 1129 -126
7868 -126 120 -544 79 420 -24 429 454 -306 -966 67 88 57 10 -481 -372 55 -324 -43 -333 -5 -665
7889 -665 -146 95 -200 109 56 99 -87 753 -117 1355 -78 411 265 114 297 14 108 83 143 493 -319
7910 -319 -163 -232 -185 -576 -264 -514 -426 -262 281 -98 -1063 -522 -257 272 235 125 22 351 295 -55 172 52
7932 52 -305 588 -88 -710 -36 108 -67 549 -175 -390 -126 -454 -677 -696 -161 -352 56 -12 99 -413 -332
7953 -332 -294 187 226 -240 609 103 -536 186 -438 365 -411 121 915 -128 -259 85 111 413 36 -208 -296
7974 -296 705 -448 -193 222 -525 -752 329 -675 174 -253 376 -256 605 131 528 330 -5 135 577
7993 577 -13 75 -197 117 -270 104 636 -180 -235 -148 335 -330 -402 21 -81 -348 -489 -226 387 -226 -644
8014 -644 640 199 -161 -381 -222 69 -433 225 -279 744 554 214 469 386 -470 297 -35 40 407 -179
8034 -179 335 555 131 175 -278 -172 -289 -270 -226 100 20 -23 278 109 -93 -157 -147 -251 -814 -237 -100 98
8056 98 -261 361 340 -434 540 321 533 251 181 458 -299 -394 18 -565 -50 -242 -267 190 -687 -522 -130 -764
8078 -764 -562 143 57 -380 17 -21 825 -460 39 -91 757 638 -384 153 -90 436 -365 -353 393 -27
8098 -27 381 468 -104 245 -777 -209 -281 299 -945 -267 67 -685 -569 -177 119 153 44 -465 635 -204
8118 -204 -59 720 821 -155 -184 64 545 171 598 257 96 -113 -95 -95 -493 51 -287 -576 681 41 296
8139 296 -46 -9 134 -361 -895 446 -535 103 142 36 92 354 456 -833 -31 744 534 4 1133 302
8159 302 213 -152 197 285 -240 -75 -529 -930 -27 160 295 -58 -139 -700 -584 -113 -211 -489 -325 -15 -113 -445
8181 -445 235 -20 215 71 389 50 -106 93 398 -3
8191c
##END NTUPLES=NMR FID
##END=
