##TITLE=1H_IPACAT-14-4
 DMSO-d6
 64 sc, 
 7.2.2024
##JCAMPDX= 6.0         $$ Bruker NMR JCAMP-DX V2.0
##DATA TYPE= NMR FID
##DATA CLASS= NTUPLES
##ORIGIN= UXNMR, Bruker Analytische Messtechnik GmbH
##OWNER= root
$$ XWIN-NMR		Version 3.5
$$ Wed Feb  7 13:56:00 2024 Russian Standard Time (UT+4h)  she@DPX200
##.OBSERVE FREQUENCY= 200.1313
##.OBSERVE NUCLEUS= ^1H
##.DELAY= (6, 6)
##.ACQUISITION MODE= SIMULTANEOUS
##.ACQUISITION SCHEME= undefined
##.AVERAGES= 64
##.DIGITISER RES= 18
##SPECTROMETER/DATA SYSTEM= spect
##.PULSE SEQUENCE= zg30
##.SOLVENT NAME= DMSO
##.SHIFT REFERENCE= (INTERNAL, DMSO, 0, 15.7039)
##AUDIT TRAIL= $$ (NUMBER, WHEN, WHO, WHERE, WHAT)
$$ ##TITLE= Audit trail, XWIN-NMR		Version 3.5
$$ ##JCAMPDX= 5.01
$$ ##ORIGIN= Bruker BioSpin GmbH
$$ ##OWNER= she
$$ F:/spectra/data/she/nmr/H-F/1/audita.txt
$$ ##AUDIT TRAIL=  $$ (NUMBER, WHEN, WHO, WHERE, WHAT)
(   1,<2024-02-07 13:55:01.57 +0400>,<she>,<DPX200>,
      <continue with go, POWCHK disabled, PULCHK disabled
       configuration hash MD5:
       00 E9 B6 7A A2 85 ED C7 34 08 36 98 17 FE 4E 26
       data hash MD5: 16K
       70 90 4F E7 84 9C AC C4 1A E1 0C 3A DC E8 31 4A>)
$$ ##END=
$$ 
$$ hash MD5
$$ 85 6D 13 1C 62 EC FF B3 FA 3D 9F B2 E8 E7 2E 49
##$RELAX= 
##$RELAX= 
##$RELAX= 
##$RELAX= 
##$RELAX= 
##$RELAX= 
$$ Bruker specific parameters
$$ --------------------------
##$DU= <F:/spectra>
##$EXPNO= 1
##$NAME= <H-F>
##$PROCNO= 1
##$TYPE= <nmr>
##$USER= <she>
##$AMP= (0..31)
100 100 100 100 100 100 100 100 100 100 100 100 100 100 100 100 100 100 
100 100 100 100 100 100 100 100 100 100 100 100 100 100 
##$AQSEQ= 0
##$AQ_mod= 1
##$AUNM= <au_zg>
##$AUTOPOS= <>
##$BF1= 200.13
##$BF2= 200.13
##$BF3= 200.13
##$BF4= 200.13
##$BF5= 200.13
##$BF6= 200.13
##$BF7= 200.13
##$BF8= 200.13
##$BYTORDA= 1
##$CFDGTYP= 0
##$CFRGTYP= 5
##$CHEMSTR= <none>
##$CNST= (0..31)
1 1 145 1 1 1 1 1 1 1 1 1 1 1 1 1 1 1 1 1 1 1 1 1 1 1 1 1 1 1 1 1 
##$CPDPRG= <>
##$CPDPRG1= <>
##$CPDPRG2= <>
##$CPDPRG3= <>
##$CPDPRG4= <mlev>
##$CPDPRG5= <mlev>
##$CPDPRG6= <mlev>
##$CPDPRG7= <mlev>
##$CPDPRG8= <mlev>
##$CPDPRGB= <>
##$CPDPRGT= <>
##$D= (0..31)
0 1.2 0 0 0 0 0 0 0 0.06 0 0.03 0 0 0 0 0.0002 0 0 0 0 0 0 0 0 0 0 0 0 
0 0 0 
##$DATE= 1707299442
##$DBL= (0..7)
120 120 120 120 120 120 120 120 
##$DBP= (0..7)
150 150 150 150 150 150 150 150 
##$DBP07= 0
##$DBPNAM0= <>
##$DBPNAM1= <>
##$DBPNAM2= <>
##$DBPNAM3= <>
##$DBPNAM4= <>
##$DBPNAM5= <>
##$DBPNAM6= <>
##$DBPNAM7= <>
##$DBPOAL= (0..7)
0.5 0.5 0.5 0.5 0.5 0.5 0.5 0.5 
##$DBPOFFS= (0..7)
0 0 0 0 0 0 0 0 
##$DE= 6
##$DECBNUC= <off>
##$DECIM= 32
##$DECNUC= <off>
##$DECSTAT= 4
##$DIGMOD= 1
##$DIGTYP= 9
##$DL= (0..7)
0 120 120 120 120 120 120 120 
##$DP= (0..7)
150 150 150 150 150 150 150 150 
##$DP07= 0
##$DPNAME0= <>
##$DPNAME1= <>
##$DPNAME2= <>
##$DPNAME3= <>
##$DPNAME4= <>
##$DPNAME5= <>
##$DPNAME6= <>
##$DPNAME7= <>
##$DPOAL= (0..7)
0.5 0.5 0.5 0.5 0.5 0.5 0.5 0.5 
##$DPOFFS= (0..7)
0 0 0 0 0 0 0 0 
##$DQDMODE= 0
##$DR= 18
##$DS= 0
##$DSLIST= <SSSSSSSSSSSSSSS>
$$ [...]
##$SUBNAM2= <"">
##$SUBNAM3= <"">
##$SUBNAM4= <"">
##$SUBNAM5= <"">
##$SUBNAM6= <"">
##$SUBNAM7= <"">
##$SUBNAM8= <"">
##$SUBNAM9= <"">
##$SW= 18.0517328524113
##$SWIBOX= (0..15)
0 0 2 0 0 0 0 0 0 0 0 0 0 0 0 0 
##$SW_h= 3612.71676300578
##$TD= 16384
##$TD0= 1
##$TE= 0
##$TE2= 300
##$TE3= 300
##$TEG= 300
##$TL= (0..7)
0 120 120 120 120 120 120 120 
##$TP= (0..7)
150 150 150 150 150 150 150 150 
##$TP07= 0
##$TPNAME0= <>
##$TPNAME1= <>
##$TPNAME2= <>
##$TPNAME3= <>
##$TPNAME4= <>
##$TPNAME5= <>
##$TPNAME6= <>
##$TPNAME7= <>
##$TPOAL= (0..7)
0.5 0.5 0.5 0.5 0.5 0.5 0.5 0.5 
##$TPOFFS= (0..7)
0 0 0 0 0 0 0 0 
##$TUNHIN= 0
##$TUNHOUT= 0
##$TUNXOUT= 0
##$USERA1= <user>
##$USERA2= <user>
##$USERA3= <user>
##$USERA4= <user>
##$USERA5= <user>
##$V9= 5
##$VALIST= <valist>
##$VCLIST= <CCCCCCCCCCCCCCC>
##$VD= 0
##$VDLIST= <DDDDDDDDDDDDDDD>
##$VPLIST= <PPPPPPPPPPPPPPP>
##$VTLIST= <TTTTTTTTTTTTTTT>
##$WBST= 1024
##$WBSW= 4
##$XGAIN= (0..3)
0 0 0 0 
##$XL= 0
##$YL= 0
##$YMAX_a= 806320
##$YMIN_a= -1200161
##$ZGOPTNS= <>
##$ZL1= 120
##$ZL2= 120
##$ZL3= 120
##$ZL4= 120
##$ABSF1= 10
##$ABSF2= 0
##$ABSG= 5
##$ABSL= 3
##$ALPHA= 0
##$AQORDER= 0
##$ASSFAC= 0
##$ASSFACI= 0
##$ASSFACX= 0
##$ASSWID= 0
##$AUNMP= <proc_1d>
##$AZFE= 0.1
##$AZFW= 0.1
##$BCFW= 1
##$BC_mod= 2
##$BYTORDP= 1
##$COROFFS= 0
##$CY= 11.3945322036743
##$DATMOD= 1
##$DC= 2
##$DFILT= <>
##$DTYPP= 0
##$F1P= 15.7292609196834
##$F2P= 12.9074282941183
##$FCOR= 0.5
##$FTSIZE= 0
##$FT_mod= 4
##$GAMMA= 1
##$GB= 0.15
##$INTBC= 1
##$INTSCL= 1
##$ISEN= 128
##$LB= 0.24
##$LEV0= 0
##$LPBIN= 0
##$MAXI= 10000
##$MC2= 0
##$MEAN= 0
##$ME_mod= 0
##$MI= 1.114404
##$NCOEF= 0
##$NC_proc= 0
##$NLEV= 6
##$NOISF1= 3.799351
##$NOISF2= 2.8
##$NSP= 1
##$NTH_PI= 0
##$NZP= 0
##$OFFSET= 15.70392
##$PC= 1
##$PHC0= -24601.91
##$PHC1= 19.65268
##$PH_mod= 1
##$PKNL= yes
##$PPARMOD= 0
##$PSCAL= 0
##$PSIGN= 0
##$REVERSE= no
##$SF= 200.130013532006
##$SI= 16384
##$SIGF1= 3
##$SIGF2= 2
##$SINO= 400
##$SIOLD= 16384
##$SREGLST= <1H.CDCl3>
##$SSB= 0
##$STSI= 0
##$STSR= 0
##$SW_p= 3612.71676300578
##$SYMM= 0
##$S_DEV= 0
##$TDeff= 0
##$TDoff= 0
##$TI= <>
##$TILT= no
##$TM1= 0
##$TM2= 0
##$TOPLEV= 0
##$USERP1= <user>
##$USERP2= <user>
##$USERP3= <user>
##$USERP4= <user>
##$USERP5= <user>
##$WDW= 1
##$XDIM= 8192
##$YMAX_p= 0
##$YMIN_p= 0
$$ End of Bruker specific parameters
$$ ---------------------------------
##NTUPLES= NMR FID
##VAR_NAME=  TIME,          FID/REAL,        FID/IMAG
##SYMBOL=    X,             R,               I
##VAR_TYPE=  INDEPENDENT,   DEPENDENT,       DEPENDENT
##VAR_FORM=  AFFN,          ASDF,            ASDF
##VAR_DIM=   8192,          8192,            8192
##UNITS=     SECONDS,       ARBITRARY UNITS, ARBITRARY UNITS
##FACTOR=    0.0002768,     1,               1
##FIRST=     0,             0,               0
##LAST=      2.2672688,     0,               0
##MIN=       0,             -1200161,        0
##MAX=       2.2672688,     806320,          0
$$ Real data points
##PAGE= N=1
##DATA TABLE= (X++(R..R)), XYDATA
$$ [...]
63 9065 -10817 13275 -16978 23241 -35668 70095 -381931 -1200161 -320323 728492 648818
74 648818 -198627 -263444 441129 702680 43330 -370147 170294 806320 429256 -402845
84 -402845 -436460 328357 600902 -65591 -645100 -270406 368323 220244 -484696 -614959
94 -614959 1410 359534 -112281 -631698 -356721 288447 297990 -296347 -505874 42631
104 42631 513385 206795 -337357 -202708 432822 586230 38110 -312300 109398 624598
114 624598 386852 -249285 -290581 293432 510322 -50691 -539840 -216518 345157 183494
124 183494 -484463 -600889 4529 335111 -147670 -644767 -319440 325593 274551 -340544
134 -340544 -464873 151831 545102 123709 -375092 -101150 518920 493319 -112572 -297561
144 -297561 225722 583949 181666 -338837 -164483 371402 357344 -209565 -444085 -16292
154 -16292 331937 10889 -476097 -366872 131377 201936 -257290 -493948 -122876 270944
164 270944 85046 -338463 -284692 189872 362863 3773 -268728 12232 421334 328974
174 328974 -95151 -163417 233066 451912 126312 -241315 -89261 307887 272710 -178990
184 -178990 -357787 -12304 264009 -10644 -421912 -321839 115588 171414 -246428 -450440
194 -450440 -91151 267614 64429 -337301 -246288 224313 340812 -51069 -275260 63828
204 63828 435169 249756 -171324 -130974 301958 410591 9129 -259731 17277 353127
214 353127 169407 -259043 -265108 118073 231523 -131128 -397865 -160256 170403 52769
224 52769 -314190 -330180 30019 196482 -70627 -304847 -105353 228365 196578 -107604
234 -107604 -163859 138353 336127 137108 -120044 -20170 275163 287384 -9764 -157268
244 -157268 56486 262298 102921 -197839 -189034 84917 154978 -121746 -323017 -139624
254 -139624 121246 29315 -271064 -286451 21879 170236 -64974 -278576 -91482 223020
264 223020 180398 -123360 -161989 155010 331327 94620 -153407 1771 307072 256960
274 256960 -72999 -156453 122634 279978 33022 -237646 -120222 156947 112446 -200868
284 -200868 -291450 -35372 129243 -66458 -298455 -189232 83975 91775 -148642 -222432 9303
295 9303 192129 66750 -127283 -54700 185784 226747 28707 -76673 79601 245811 154272
306 154272 -51946 -59298 123375 181565 1999 -156758 -66661 99858 51951 -157992 -214147
317 -214147 -42337 71940 -65540 -237516 -162180 50147 68421 -122926 -193600 -1660
327 -1660 169248 65248 -119027 -56059 178816 221286 16580 -87921 88336 258417 140145
338 140145 -80419 -52728 158604 184582 -39980 -169065 -19597 133687 14569 -199581
348 -199581 -178233 22769 59461 -129729 -233336 -83051 77078 57 -164364 -129926 62843
359 62843 122847 -15660 -98863 27444 174978 126409 -15366 -11966 132033 186042 66338
370 66338 -38299 23296 134605 99987 -42892 -90368 6425 67346 -23609 -144726 -122320
381 -122320 -8807 6279 -110695 -174785 -81727 27838 -9651 -123602 -110181 31609 97807
392 97807 1306 -78932 12472 151452 127966 -5558 -19435 117522 186152 67570 -48962
403 -48962 18272 144642 102327 -58091 -95895 29243 84718 -42662 -162638 -96745 28891
414 28891 -6166 -146992 -164589 -29943 38051 -58225 -142734 -60477 69635 57072 -50243
425 -50243 -50671 72184 136299 58433 -15169 43400 140161 122187 22809 -2808 70479 108327
437 108327 37442 -42687 -29601 30784 20323 -59364 -102687 -60933 -15131 -44723 -108916 -111444
449 -111444 -47101 -9971 -49219 -92509 -53662 25374 39925 -14541 -30030 40888 106966 75710
461 75710 10889 28736 112091 126094 43513 -7078 50549 108211 53170 -44326 -43864 34480
473 34480 36722 -61735 -117476 -53606 8361 -44994 -131250 -108816 -13478 454 -78576 -104395
485 -104395 -19792 52000 12136 -48289 -8519 81730 92800 25577 8171 75442 119251 73922
497 73922 16127 34286 83191 70323 6806 -20817 7916 23539 -16882 -62948 -61818 -36352
509 -36352 -38761 -71248 -87827 -70548 -44407 -42054 -57699 -55900 -27452 4724 9270 -3596 4684
522 4684 41008 68373 53770 31941 48860 86472 85770 42089 22078 52559 71427 31405 -21976
535 -21976 -16695 20129 6122 -56191 -80218 -40373 -15756 -60230 -105013 -76809 -21408 -26492
547 -26492 -74968 -70970 -7385 26553 -6936 -30019 17140 71527 60004 20067 32300 83237
559 83237 93184 48883 25804 54271 74933 41636 -971 -226 20258 6180 -35221 -51590 -36340
572 -36340 -32685 -57408 -74293 -64104 -48939 -51520 -57607 -48693 -32077 -20997 -13729 -1932 10803
585 10803 20501 31991 46566 53470 49796 52352 65755 68960 52561 38065 43285 49996 28410
598 28410 -3215 -8436 4037 -7162 -43347 -59712 -41863 -31977 -58699 -82089 -63454 -32188
610 -32188 -37415 -61004 -50812 -8079 9550 -9326 -13841 23843 55655 44136 24216 42622
622 42622 76866 71583 41312 36607 58885 61216 27127 2983 13274 20285 -6390 -37310 -38450
635 -38450 -26320 -37888 -63695 -67361 -50466 -44396 -58263 -60518 -38585 -22362 -24305 -23008 -1103
648 -1103 18924 21965 19932 36060 54752 53825 44751 51335 63404 57196 37718 32728 39321 31399
662 31399 5015 -9347 -4814 -8038 -31954 -51478 -44299 -36034 -50340 -68233 -59938 -37511 -36738
675 -36738 -50428 -41944 -13285 1626 -6838 -5208 22071 44519 38842 29409 44793 66653 61113
688 61113 41192 40648 55334 51077 23601 8227 16271 15281 -10553 -32639 -28956 -23012 -39841 -59386
702 -59386 -57176 -40644 -42593 -57985 -53977 -30238 -18658 -27016 -24216 665 20699 17574 15318
715 15318 33605 52897 50422 38982 45170 61396 55437 34290 27730 37355 32926 6526 -10290
728 -10290 -5858 -4990 -26197 -47363 -43552 -34412 -44772 -61289 -56258 -37354 -33339 -44176 -40203 -15026
742 -15026 533 -5271 -4079 18395 38005 34765 28181 41055 58464 54478 38203 37193 49233
755 49233 44751 21993 9694 15653 13291 -9997 -28240 -25363 -21508 -37500 -55485 -51594 -38286
768 -38286 -41475 -53887 -49270 -28120 -19919 -26306 -22108 1494 18535 14542 13825 31850 49782 45919
782 45919 35091 42908 56604 50662 31665 26333 34738 29055 6410 -9084 -4620 -4992 -25080 -42552
796 -42552 -38598 -31138 -41621 -56382 -51441 -33924 -31620 -41901 -37330 -13993 -1175 -5702 -4411
809 -4411 17208 35588 31420 25084 37921 55709 50923 35430 37151 48336 42642 20543 9798
822 9798 15870 12805 -9484 -26821 -22943 -18886 -34027 -50550 -47673 -34608 -37874 -50074 -46116 -26169
836 -26169 -17489 -23657 -20403 889 16722 14669 12875 28520 45186 42641 34049 39237 51428 47912
850 47912 31385 26158 32481 27374 7790 -6186 -3071 -5682 -23677 -37768 -34795 -30177 -40728
863 -40728 -52244 -46288 -32200 -32684 -40070 -32488 -12456 -2584 -8913 -3806 18078 32164 26090 23440
877 23440 37143 52016 44566 30464 33764 45678 38956 17102 8381 16708 13451 -9963 -26573
890 -26573 -20490 -15869 -32199 -49119 -44816 -31245 -34994 -48516 -45265 -24120 -14895 -22984 -21533 -1085
904 -1085 16110 13659 10911 24654 42087 41399 31625 34671 46600 45183 31225 23207 28155 25260
918 25260 8220 -4324 -3929 -5703 -20130 -32704 -32200 -28904 -36541 -45195 -40994 -31301 -31722 -35688 -27792
933 -27792 -12229 -4955 -7642 -1164 17396 27866 22487 22600 37335 48384 40268 28680 34922 44860
947 44860 34633 14822 9345 18768 12365 -10294 -24121 -15762 -13064 -31406 -47583 -40621 -25640
960 -25640 -32494 -46863 -42000 -20303 -13219 -22193 -22168 -414 16598 11805 6899 21561 39584 39391
974 39391 27969 30437 43912 43940 28479 20133 25129 25121 10349 -4391 -5404 -5114 -15964 -29799 -31871
989 -31871 -28332 -33527 -40707 -39144 -31558 -29578 -31330 -25843 -13159 -5872 -6426 778 15539 23613 21585
1004 21585 22084 34913 42084 34775 28046 34213 40255 30344 13466 11091 18602 9869 -11592 -20944
1018 -20944 -12303 -11516 -30358 -43466 -35121 -24269 -31081 -44686 -37812 -17493 -13678 -23621 -21577 1092
1032 1092 16087 9580 4361 20464 38270 35247 23352 27598 41639 41910 25249 17439 24865 25064
1046 25064 9000 -5486 -5979 -3011 -14173 -28221 -30636 -25625 -28751 -37622 -38112 -29585 -25500 -27016
1060 -27016 -24046 -13788 -5184 -4567 469 11520 19726 20190 21921 30476 37311 32348 28117 32707 35908
1075 35908 27687 14549 12677 16366 8177 -9363 -15459 -10830 -11977 -28518 -38220 -30117 -22073 -31460
1089 -31460 -41258 -33649 -15880 -13615 -23588 -17852 1739 13369 6886 4792 20953 35938 30517
1102 30517 20213 27070 40841 37647 20938 16625 24344 24018 7450 -6539 -3337 -597 -12900
1115 -12900 -28087 -27556 -21028 -25292 -36830 -36521 -26404 -22885 -26643 -25118 -13840 -4514 -3678 -1563
1129 -1563 7874 18861 19730 19523 26454 34027 30935 26625 29283 31370 24922 14666 11963 13446 6714
1144 6714 -6790 -14141 -10044 -13125 -26175 -33683 -28046 -22537 -29258 -36396 -28965 -16266 -16092 -21336
1158 -21336 -15228 3029 10500 4282 5360 20372 31755 26066 19311 26889 38346 33042 18969
1171 18969 16984 24993 22428 4886 -4735 -1168 33 -13171 -26779 -24204 -18895 -24699 -35527 -34052
1185 -34052 -22925 -20327 -26615 -24313 -11496 -3449 -5026 -2793 7971 18535 17775 16935 23179 31480
1199 31480 29820 23951 24989 29180 25670 15041 10844 11895 7429 -4304 -12262 -10578 -12289 -23325
1213 -23325 -30526 -27674 -22100 -26946 -32961 -27287 -16678 -15569 -18285 -13865 1155 7127 4545 6595
1227 6595 19236 27972 23806 18745 25997 34505 28886 18221 17565 22581 18530 4277 -3360 1142
1241 1142 -822 -13568 -24772 -21024 -16952 -23936 -32877 -30013 -20805 -19322 -25416 -22879 -10239 -3548
1255 -3548 -4746 -3613 8345 17420 16682 15234 22707 30971 28600 22160 22828 27563 24720 13638 8567
1270 8567 10999 7720 -3804 -12334 -10500 -10955 -20236 -28491 -26001 -21319 -24072 -30043 -25876 -16906 -14003
1285 -14003 -17171 -12752 -196 5954 4333 5169 15834 24728 21848 18279 24153 30565 27434 18313
1299 18313 18371 21657 17301 5238 -1243 895 -1517 -13339 -20872 -18144 -16581 -22639 -30022 -26932 -18704
1314 -18704 -19731 -23843 -19779 -8617 -3735 -6288 -3367 9156 16383 13864 12864 20853 28664 25842
1328 25842 19430 21785 26405 22450 13060 9007 11607 8290 -3506 -11066 -9769 -9456 -18047 -26322 -23764
1343 -23764 -18651 -22408 -28336 -24902 -16035 -13180 -16251 -12471 -1289 5917 4514 5706 15041 22538
1357 22538 21257 17532 22623 27353 24503 16360 16691 18892 14754 4992 -1431 459 -1857 -11832 -18884
1372 -18884 -17129 -15682 -21571 -27526 -25240 -18520 -18382 -23004 -19112 -8404 -4187 -5605 -2736 7192 14857
1387 14857 13050 13565 19522 26151 24102 18257 21092 25219 21189 12494 7660 10939 7758 -3054 -10280
1402 -10280 -7986 -8410 -16983 -23777 -21249 -18621 -20975 -26034 -22530 -13900 -11726 -14625 -11386 420 4598
1417 4598 3716 5273 15014 20686 18804 16856 22012 27084 22649 15906 15885 18565 15467 4573 -1316
1432 -1316 1895 -798 -10989 -18170 -15940 -13325 -20229 -27353 -24148 -16551 -17257 -21663 -18148 -7957 -3333
1447 -3333 -5446 -3757 6096 14481 12616 11294 17616 25421 22515 17310 18274 22599 20351 11804 8041
1462 8041 8656 7407 -2566 -8874 -7757 -9046 -15015 -21357 -20260 -18691 -19514 -23086 -20749 -14468 -12490
1477 -12490 -13221 -8836 -1605 3360 2676 6231 14500 18492 16247 16616 21110 24749 20013 14174 16496
1492 16496 18428 12865 2045 -283 3289 -616 -12258 -16872 -13032 -11751 -19463 -26519 -21922 -13717
1506 -13717 -15961 -21260 -17649 -6044 -2202 -6389 -4814 6583 14368 12249 8395 15707 24002 23031
1520 23031 15360 15639 22327 20909 12171 6111 7289 7935 338 -8372 -10239 -8160 -12453 -18565 -20876
1535 -20876 -18473 -17547 -19393 -19962 -17213 -11511 -9723 -7722 -3276 939 3368 8038 12395 13871 14614
1550 14614 16731 20762 21030 16840 14217 17750 17145 9271 1696 3138 5069 -2887 -13267 -15052 -8440
1565 -8440 -11145 -21260 -24791 -17705 -10621 -17286 -23243 -16383 -2777 -2044 -9327 -6492 8584 15599
1579 15599 9489 5113 14037 25070 21671 11420 12264 22412 22429 9757 2005 6682 10472 1941
1593 1941 -10789 -11109 -5858 -8341 -19084 -23050 -17328 -13289 -17539 -21614 -16786 -10236 -6096 -8073 -7009
1608 -7009 136 6869 9607 8455 9440 15750 19320 19327 15754 14223 17334 18888 14099 5253 3631 6794
1624 6794 4301 -6760 -13192 -9404 -5822 -11664 -23122 -22541 -12325 -10245 -20000 -22623 -11105 -468
1638 -468 -4440 -12275 -5084 11506 14745 4619 2117 16559 26932 18298 6794 12534 24808 21799
1652 21799 5132 -552 9787 13910 10 -14702 -10294 -562 -5722 -20703 -23974 -12842 -7227
1665 -7227 -17232 -23604 -16922 -4480 -3707 -11583 -9873 2316 10577 8034 3576 7900 18919 21254
1679 21254 15033 9806 15108 19679 16724 7808 3073 7323 9651 1588 -10067 -11082 -3962 -4635 -16212
1694 -16212 -23899 -16857 -6629 -12247 -23513 -21283 -4433 1391 -9467 -14776 -923 14478 11240
1707 11240 -1344 1957 21245 26165 11944 2555 14949 27460 18477 -100 -1050 13810 15328
1720 15328 -4365 -16616 -5924 5006 -6600 -23863 -23478 -7332 -5074 -19174 -26825 -13758 385
1733 385 -4021 -16108 -11133 6306 12504 3400 -2248 9432 21935 19676 8013 7279 18431 23150
1747 23150 13429 1940 4645 12995 10971 -4079 -12214 -6288 2360 -6050 -20634 -21691 -8864 -4261
1761 -4261 -15547 -24824 -15471 379 -1450 -13384 -13913 4360 14880 5054 -5057 5370 24407
1774 24407 23175 5671 1581 18756 29058 12335 -4682 2152 19008 13815 -10247 -16213 68
1787 68 7512 -9828 -27545 -19544 -458 -3506 -24217 -26688 -7014 5278 -6799 -19780 -8751
1800 -8751 11577 13012 -2729 -5216 13070 25478 15148 581 8255 23602 23565 6553 -1805
1813 -1805 8625 17416 7477 -9782 -10841 1389 3816 -12427 -24091 -15233 -2699 -5694 -21685
1826 -21685 -23693 -7721 2452 -5883 -18374 -10183 9437 13270 -1688 -6357 10719 25916 15768
1839 15768 -418 4320 23575 25646 5739 -7043 8369 22144 8101 -14967 -13221 7363
1851 7363 7679 -15350 -28670 -11077 3986 -7746 -28053 -23031 588 5671 -13144 -22259 -3164
1864 -3164 15720 7607 -9186 -3947 18371 25014 7839 -2511 12030 27240 19200 67 -1793
1877 -1793 13928 19046 1559 -13451 -5284 7755 2495 -16564 -22465 -8687 374 -10697 -24271
1890 -24271 -19332 -1533 2322 -12649 -18717 -2464 13579 8317 -7110 -4301 16365 24345 8721
1903 8721 -3603 9244 27069 20399 -1356 -4107 14160 21579 1443 -17388 -7152 11452 4686
1916 4686 -20687 -25616 -3810 5798 -13409 -29511 -17443 5189 2483 -18701 -19895 2812 16838
1929 16838 2335 -13261 -560 22830 21170 796 -2757 15912 27681 12899 -5282 1761
1941 1761 18609 16094 -4965 -13559 -164 10091 -2006 -21732 -18273 -1682 640 -16226 -24667
1954 -24667 -12923 2150 -2142 -17173 -15392 3305 12559 1240 -9539 813 19441 19911 1888
1967 1888 -1824 15100 26234 12229 -4606 662 18078 18165 -4556 -14965 -874 12135 -1671
1980 -1671 -22665 -18446 2080 4051 -18614 -27626 -9391 7536 -2067 -21875 -14886 7860 14800
1993 14800 -3986 -12542 4948 24562 14674 -4042 16 20408 25244 6378 -6458 6449 21140
2006 21140 10529 -9202 -10343 5612 9880 -8248 -21036 -10992 3455 -2517 -20149 -21466 -5521
2019 -5521 4183 -7094 -18707 -9465 8174 9382 -4462 -8048 7105 19468 11974 -2045 1947
2032 1947 18740 21880 5725 -4447 6409 18711 11416 -7914 -9989 4054 10198 -6934 -21503
2045 -21503 -12827 4375 -1587 -20368 -22512 -3776 6326 -7454 -20949 -8515 11049 9427 -8751
2058 -8751 -9599 10709 21156 7931 -5384 4125 22506 19021 -75 -4881 11838 20115 4815
2071 4815 -11848 -5452 9896 5728 -12062 -18412 -5615 3500 -7235 -20921 -15835 -230 1579
2084 1579 -11910 -17191 -3891 8770 3964 -7450 -5151 10642 16080 6580 -1570 6041 19794
2097 19794 15566 1513 -1332 10025 17437 5612 -8153 -5142 7656 5511 -10562 -17080 -6644
2110 -6644 3728 -5447 -20449 -16997 163 2117 -11234 -17834 -3648 10359 3462 -10153 -5401
2123 -5401 13450 17091 2815 -4908 9017 21787 13503 -2276 -571 13406 16965 891 -10317
2136 -10317 72 11326 1186 -13824 -13518 -258 1668 -11574 -19381 -10453 675 -2414 -13999
2149 -13999 -12962 292 6707 -1472 -7934 -392 12147 11855 1549 255 10076 17015 10081 -32
2163 -32 2485 11852 11984 712 -6711 -80 7308 1049 -10873 -12235 -1769 837 -9695 -17282 -11090
2178 -11090 490 -2250 -13323 -13089 83 7330 -985 -9516 -11 13208 11446 334 -1079 11275
2192 11275 18468 8013 -2657 3500 14295 11819 -3257 -6470 3397 8450 -2583 -13417 -9820
2205 -9820 1668 -1728 -13348 -15432 -5411 456 -6667 -13952 -9148 3180 3626 -4409 -5405 3549
2219 3549 10274 6710 404 2952 11558 13797 6032 2050 6376 11506 8046 -844 -2511 2803 5149
2234 5149 -2797 -9986 -7688 -424 -2127 -10210 -13549 -7327 -1426 -4944 -11858 -8632 1336 3090 -2999
2249 -2999 -6408 2291 10509 6855 -433 1830 11366 13681 5341 -182 6777 12384 7407 -1815 -2933
2264 -2933 5368 4454 -4680 -10791 -5260 683 -4459 -13198 -11930 -2982 -856 -8579 -11863 -4233 2874
2279 2874 227 -5560 -2509 5057 8623 3081 1300 5456 11601 9415 4049 3713 8060 9415 4708
2294 4708 -269 -844 3237 2044 -4110 -7042 -4846 -2258 -5241 -9648 -9980 -4850 -2835 -6596 -10141
2309 -10141 -6149 703 1225 -3773 -3723 3856 7719 4752 1090 4150 10940 10901 4109 2272 7364 9969
2325 9969 3668 -1992 -29 4642 2269 -5205 -8085 -2793 -520 -6369 -10787 -7784 -2237 -3168 -8807
2340 -8807 -9761 -2284 1325 -1642 -4857 -406 4865 5588 2035 2545 7616 9477 6878 3271 5033 7995
2356 7995 6875 2223 721 2889 2630 -948 -4206 -4233 -3265 -3377 -6100 -8117 -7395 -4576 -4687 -6447 -5956
2373 -5956 -3811 -224 -1224 -1879 -730 3551 5723 3465 2504 5203 8906 7477 3851 3213 7121 7906
2389 7906 2704 -299 1628 3949 -93 -4897 -5334 -1647 -2411 -7029 -9242 -5742 -3003 -4847 -8546
2404 -8546 -6501 -1424 -964 -2840 -3157 910 4689 3005 1092 3272 6672 8017 3965 4125 6929 7475
2420 7475 5111 2069 2240 2791 1813 -1834 -3367 -2703 -3511 -4296 -6195 -6269 -4187 -5152 -5900 -5568 -5215 -3504
2438 -3504 -2200 -1287 -1115 -337 2479 3398 3709 3921 5407 6801 6544 3777 4642 5827 5679 2902 1257
2455 1257 964 2129 -771 -4317 -3466 -2009 -2989 -6578 -7427 -4918 -3738 -5100 -6720 -4626 -1677 -931
2471 -931 -2822 -2506 1438 3906 1923 1969 4085 6151 6446 3449 4529 6229 5391 3650 1920 2348 2638
2488 2638 682 -1361 -2446 -1750 -3183 -4694 -4700 -4778 -4613 -6009 -5712 -4401 -4084 -3048 -2662 -317 -246 454
2506 454 1987 2328 3183 4321 3887 6352 5264 4856 4579 5355 4857 3214 1604 1493 1833 -524 -2658
2523 -2658 -2556 -2396 -3474 -4837 -6163 -4123 -3550 -4770 -5674 -3882 -2291 -2090 -2745 -1332 580 2623
2539 2623 1911 2559 4520 5455 4751 3922 4569 5800 4631 2951 2682 3235 2530 338 -786 -1187 -1650 -3471
2557 -3471 -4994 -4331 -4026 -5046 -5312 -4762 -4082 -3154 -3954 -2699 -936 485 373 902 2800 3377 2960 3035
2575 3035 5020 5428 4645 4097 4766 4441 2951 1882 461 866 54 -1745 -2255 -2753 -3591 -4885 -6077
2592 -6077 -5019 -4317 -4220 -5491 -3576 -2320 -1505 -1517 -1645 1057 2504 1627 2030 4043 4390 4155 4025 4814
2610 4814 5027 3948 2552 2785 2793 1741 134 -770 -1038 -675 -3158 -4056 -3861 -3267 -4385 -4801 -4736 -3294
2628 -3294 -3180 -3528 -3318 -1343 -275 -11 970 2270 3695 3400 3286 4148 5356 4894 3908 3745 3770 3241
2646 3241 2553 1472 1536 65 -2316 -2252 -2671 -2900 -4209 -3725 -3373 -3292 -3909 -4414 -3999 -2514 -1465 -2155 -1008
2665 -1008 912 1388 1208 1378 3382 4379 3651 3713 4706 5205 3864 2486 2803 2888 1515 650 -892 -1070
2683 -1070 -1818 -2462 -4023 -3713 -3324 -4367 -5003 -4585 -2934 -3130 -3326 -2070 -584 -672 -171 941 2303 2588
2701 2588 3472 2965 4077 5046 4525 3764 3227 3333 2498 1702 1076 1111 179 -1437 -1984 -1934 -2702 -3872 -4369
2720 -4369 -3859 -3954 -3650 -4473 -3348 -2282 -2484 -1977 -699 297 923 974 1770 3924 4072 4394 2683 4160
2738 4160 4635 4006 2450 2899 2696 1668 24 -1416 -419 -1629 -2558 -3692 -3240 -2423 -4010 -4653 -4345
2755 -4345 -3079 -3228 -2498 -1822 -1687 -29 -640 747 901 3145 3273 3026 4145 4453 3783 3290 2782 4299
2773 4299 3152 1640 1220 1175 597 -1842 -2011 -2014 -1958 -4420 -4745 -2890 -2956 -3811 -3874 -3079 -2019 -1824 -1539 -1892
2793 -1892 -183 1107 1191 2052 3231 3841 3718 3096 3533 4570 3919 2631 3251 2559 1297 -84 -1195
2810 -1195 -540 -1612 -2255 -2893 -3334 -3785 -3575 -3596 -3091 -2753 -2746 -2487 -2651 -761 411 -51 -232 2035 2332
2829 2332 2692 2411 3196 4415 3761 3214 2790 3640 2141 1253 1078 1454 -230 -920 -2255 -1655 -2397 -3210
2847 -3210 -4337 -3110 -2817 -3280 -4119 -2091 -2117 -2296 -2422 -617 979 669 668 1405 2671 3477 2998 2797 3737
2866 3737 4064 3337 2867 2086 2329 1492 -61 -850 -443 -856 -2654 -2499 -3360 -2400 -3390 -4583 -3251 -3121
2884 -3121 -2302 -2988 -2052 -555 -307 -917 955 1327 1830 1503 2239 2865 2588 3515 2731 2742 2687 2968 1357
2903 1357 1691 756 616 -1331 -1237 -1514 -2374 -3266 -3418 -2697 -3162 -3740 -3990 -2746 -1800 -1454 -1149 -1157 427 795
2923 795 1530 1678 2613 3051 3224 2960 3707 3666 2800 2501 1887 2268 1197 -131 -74 -25 -859 -2258 -2432 -2923
2943 -2923 -2753 -3206 -3874 -3448 -1969 -2438 -2823 -2183 -679 -156 -343 543 896 2266 1275 2063 2966 3549 3010
2962 3010 2232 2300 2829 2388 1072 797 1266 274 -883 -1436 -1032 -1166 -2577 -3383 -2436 -2934 -2659 -3315 -2320
2981 -2320 -1046 -1629 -1506 -67 140 1084 898 1371 2176 3754 2482 2524 3022 3254 2611 2324 1611 2079 1316
3000 1316 506 -967 -48 -1561 -1959 -3150 -2030 -2455 -3523 -3586 -3141 -1953 -3182 -2398 -1427 -434 -116 -325
3018 -325 229 1532 2249 2249 2174 2957 3930 2964 2098 2509 3476 1959 640 1347 745 -73 -1124 -703 -1030 -1595
3038 -1595 -2598 -2548 -3333 -2599 -2246 -2970 -2116 -1622 -1094 -2268 -984 446 843 213 1473 2127 2687 3080
3056 3080 2360 3480 3073 2841 2010 920 2220 1185 188 -64 -803 -1070 -2169 -2910 -1744 -1966 -2716 -3432
3074 -3432 -2821 -2015 -2008 -2375 -1674 -690 -592 251 374 1939 1910 865 1536 2179 3117 2708 2102 2252 2603 1298
3094 1298 439 1106 726 -87 -402 -1134 -965 -1771 -2337 -2703 -2756 -2689 -2847 -2921 -2320 -1441 -1340 -1890 -99 -30 128
3115 128 971 1436 2158 2949 1190 2018 2484 2741 2671 2628 2774 1762 1083 69 173 233 -645 -2391 -2438 -2494
3135 -2494 -2268 -3856 -2954 -2354 -2330 -2577 -2006 -1537 -807 -749 -396 282 1519 1871 1694 2341 2248 2724 2003 1876
3155 1876 2242 2393 2120 1294 967 1443 553 -1222 -1845 -1115 -1361 -2121 -2799 -2539 -2125 -2153 -3302 -2465 -1398
3174 -1398 -1266 -943 -1046 -429 393 929 623 2286 2486 1663 2327 2449 2768 2098 1729 1844 2449 703 -249
3193 -249 -282 -342 -295 -1398 -2265 -2169 -2140 -2880 -2472 -2189 -2397 -1420 -2823 -1574 -799 90 -1229 -256 1603 1382
3213 1382 1466 1637 2879 2753 1789 1536 2219 1892 2054 1352 791 1197 888 -755 -1109 -260 -2093 -2110 -2584
3232 -2584 -1349 -2136 -3115 -2093 -1331 -1270 -1345 -661 -1143 -50 86 812 784 2582 2408 2393 1964 2554 2837 2810
3252 2810 1984 1523 1048 1051 326 -663 -40 -739 -1230 -1920 -1635 -2180 -1584 -2679 -1968 -2302 -2250 -1808 -1218 -516
3272 -516 -216 58 -281 379 1498 1230 1366 2993 2320 2109 2000 2294 1801 1508 1237 585 1212 756 -659
3291 -659 -859 -868 -1414 -1699 -2621 -2209 -2075 -1529 -2141 -2514 -1100 -1147 -1250 -564 -122 392 -287 403 1495 1180
3311 1180 1628 1586 2259 2014 2072 1626 2028 1451 1680 -368 -1246 223 -1116 -1165 -1122 -1678 -2238 -2167 -2763 -1855
3331 -1855 -1988 -1561 -1750 -592 -770 -315 40 -230 1425 1783 590 1064 2438 1999 2285 1499 1722 2202
3349 2202 823 1745 1213 1405 151 -573 -1031 -1179 -1551 -2002 -2450 -1845 -1865 -2059 -2899 -2201 -1143 -1438 -1301
3368 -1301 -986 320 1017 1186 832 1792 2360 1998 1519 2838 2671 1398 1810 1842 1448 1254 395 -267 233
3387 233 -734 -1337 -964 -1463 -1852 -2140 -2692 -2835 -1478 -1622 -2315 -1092 -481 -410 -653 477 1233 721 1722
3406 1722 1823 2026 2413 1317 2251 1835 2139 1460 558 866 639 -29 -616 -1814 -985 -1015 -2031 -2361 -1890
3425 -1890 -2293 -2148 -2226 -1854 -1841 -674 -1358 -311 298 1030 649 821 1491 2837 2088 1476 2025 2081 2379 1435
3445 1435 1847 1218 1525 254 98 -808 -611 -1066 -1244 -1511 -2307 -1543 -1814 -2049 -2024 -1841 -959 -1692 -511
3464 -511 -438 -781 248 379 1384 1680 1350 2230 2251 1558 2152 2024 2299 1316 1134 1114 491 81 -698 -1168
3484 -1168 -966 -1244 -1786 -1746 -1725 -1058 -1694 -2226 -1997 -834 -1867 -1516 -230 309 1095 260 910 1000 1935 1390
3504 1390 1653 1781 1811 1537 1612 485 1665 1289 -488 -83 -66 242 -1107 -1013 -1587 -1101 -1353 -1899 -2391 -1190
3524 -1190 -1618 -2006 -1891 -713 -467 -215 688 274 916 1655 1820 1427 2185 1467 1906 2111 2245 1278 1622
3543 1622 530 65 -202 -674 -777 -517 -501 -1869 -2142 -1811 -1779 -2071 -2353 -2137 -682 -657 -1401 -553 340 642
3563 642 177 515 1237 1871 1399 1451 1888 1963 2098 1280 1483 1260 1070 -258 -327 234 -422 -1384 -2061 -2197 -1429
3584 -1429 -1622 -2128 -2168 -1212 -1418 -1790 -1190 -228 81 113 -343 878 926 1744 1825 1814 1978 2031 1565 2373 2343 950
3606 950 1059 904 1388 -547 -201 -977 -651 -698 -1711 -1417 -2162 -1343 -3148 -1865 -583 -1632 -1178 -1087 51
3625 51 649 463 -8 155 1408 1801 1496 1631 2540 2045 1761 707 858 1879 585 -794 -197 -376 429
3644 429 -869 -1544 -900 -1440 -1920 -2334 -2100 -1699 -1453 -1496 -1842 -908 233 333 5 462 1696 1603 1299 1558
3664 1558 1775 1467 1935 1584 1199 1772 504 725 536 -1479 -326 -307 -628 -1246 -2022 -732 -1682 -2486 -2129
3683 -2129 -2055 -768 -1518 -1596 -1604 629 1106 555 50 947 1874 1568 594 1694 2211 2615 982 7 1591
3702 1591 1209 1414 246 149 -137 -309 -352 -1807 -465 -1337 -2084 -1650 -1987 -1843 -605 -1389 -1405 -712 -370
3721 -370 148 393 666 1311 1406 1564 1147 2346 1494 1938 2097 1139 2264 1352 572 290 124 -240 -154 -1023
3741 -1023 -1825 -1290 -1725 -1305 -1236 -2474 -707 -917 -1838 -1848 -745 -86 -167 7 -236 1222 1258 915 856 2132
3761 2132 2184 2390 1684 1536 1417 1725 198 -53 343 368 -1037 -903 -1238 -740 -924 -1549 -2021 -1494 -1277 -1178
3781 -1178 -1340 -860 -149 139 137 333 992 2177 718 1065 1382 2399 1746 1173 1350 1247 1658 582 741
3800 741 482 570 267 -427 -1395 -1160 -1528 -901 -2081 -1329 -1809 -1561 -1357 -1342 -106 -751 314 -288 -285 111
3820 111 428 1543 1522 1403 1610 2888 1841 809 1120 2494 1244 298 -69 920 931 -726 -1517 -1711
3838 -1711 -866 -1423 -1991 -2052 -1621 -404 -1079 -1500 -1142 -554 540 -1024 423 835 1294 1085 512 1593
3856 1593 1582 2058 1355 1401 1492 2234 1085 45 884 55 85 -539 -755 -1096 -1171 -1226 -2301 -1597 -1384 -1521 -1376
3877 -1376 -2270 -1475 -564 -209 -348 121 289 979 801 -207 1792 1939 2324 1613 558 561 2282 1547 289
3896 289 -405 480 270 -653 -1851 -1308 -989 -1576 -1373 -1598 -1059 -1253 -1263 -1641 -1164 -1134 -221 -321 304 773
3916 773 1003 654 841 1574 2538 2180 1431 1056 1632 890 429 -509 388 688 -404 -1128 -580 -661 -698 -1971
3936 -1971 -1649 -1771 -1333 -1424 -1707 -1977 -422 -641 -1032 234 211 638 929 1033 862 1419 2110 2335 1260
3955 1260 1735 1111 1727 1421 81 268 775 -34 -748 -963 -1186 -1307 -708 -1933 -2055 -1023 -999 -1978 -1638
3974 -1638 -459 -253 100 -618 -846 768 1378 1025 642 942 1976 1862 908 1211 1446 1199 537 95 632
3993 632 548 -325 -730 -195 -814 -668 -1975 -1917 -1799 -1107 -1730 -1425 -1429 -755 -566 -634 -806 35 1068 992 295
4014 295 1197 1459 1933 1016 1128 1527 1742 1438 1358 936 462 338 329 -218 -914 -912 -1075 -2224 -1434 -1504 -1954 -828
4036 -828 -1682 -1541 -967 230 -313 -123 -73 1694 1011 924 867 1673 1421 1804 960 708 1946 1882 -41 311
4056 311 741 869 129 -665 332 -779 -1211 -2044 -1544 -981 -1380 -1805 -1643 -1312 -343 -683 -1152 107 457
4075 457 928 1185 556 553 1156 1020 1359 1848 1703 1380 1571 809 525 506 281 -284 -1067 -859 -668 -1026 -1745
4096 -1745 -2316 -1604 -1514 -1833 -1500 -751 -879 -903 -828 -711 129 499 1086 811 1096 1917 2234 1202 1339 1362 1683
4117 1683 1252 -13 590 663 -232 -749 -555 -653 -770 -1404 -1210 -1277 -1248 -1351 -1011 -1000 -744 -368 -426 -1459 116
4138 116 83 199 852 500 1227 1439 1383 1549 539 1315 1170 1693 1143 886 -111 522 -502 -858 -154 -771
4158 -771 -1343 -1612 -2255 -1468 -1165 -1532 -1930 -1573 -792 -610 -340 -1017 659 168 1070 180 1048 1670 1333 1351
4178 1351 1241 1438 1270 528 112 235 607 491 -558 -813 -290 -579 -1216 -1708 -1113 -1022 -1728 -1817 -835 -850
4198 -850 -925 -1251 -514 11 211 -365 115 1531 645 1377 1371 1079 1327 1654 1932 686 1241 1509 768 660
4218 660 -446 -299 -717 -227 -892 -1062 -1904 -1229 -1391 -1058 -2056 -2208 -1062 -617 -625 -364 143 1387 569 372
4238 372 1139 2159 1339 683 1424 1253 55 940 657 1375 954 -283 214 -943 -235 -815 -887 -2145 -1775
4257 -1775 -1760 -1833 -2159 -1830 -857 -1417 -557 -449 383 100 -163 456 920 1844 1487 1526 1054 1594 578 1010
4277 1010 1329 958 618 43 726 273 -254 370 -1009 -1075 -809 -1749 -980 -1370 -1879 -1200 -1015 -1083 -489 -462
4297 -462 6 4 406 672 500 464 1097 1703 386 716 1462 1251 1658 266 641 1382 579 -241 -675 -1015
4317 -1015 18 -1076 -1366 -822 -1023 -1465 -1582 -404 -442 -884 -267 -691 -223 -22 -175 187 310 1245 1110
4336 1110 650 1520 2074 647 895 738 1018 1874 635 255 -211 -543 -326 -1500 -1083 -1465 -1749 -1425 -741
4355 -741 -1338 -1573 -1478 -772 -12 -1441 -309 562 698 855 451 938 2025 2026 941 1562 1652 1612 1677 1668 1437
4376 1437 413 874 -60 -793 -872 -250 -1285 -1440 -1152 -1640 -1410 -1315 -1146 -1087 -1032 -962 -482 -503 92 424 237
4397 237 632 1679 868 1152 1173 1338 1053 784 666 1137 590 378 86 -260 -1037 -897 -486 -1382 -1214 -1523
4417 -1523 -840 -1030 -1771 -1448 -984 -1331 -450 -623 -256 10 731 690 -44 932 1322 832 1012 772 2389 1302
4437 1302 1287 909 860 1309 643 68 328 283 -281 -1201 -1310 -1708 -1013 -1545 -1290 -1768 -885 -1045 -464 -512 -401
4458 -401 -511 92 724 561 1336 1263 336 1541 1428 751 1118 1075 467 791 443 442 -584 -923 -965 -1222 -519
4479 -519 -1221 -1207 -1732 -1585 -1709 -1473 -1637 -1488 -479 -186 -365 -84 687 1091 618 987 1915 1851 979 965 2218
4500 2218 2003 784 991 864 758 161 130 -721 -507 -758 -1079 -1461 -1564 -1317 -1691 -1168 -1038 -1721 -261
4519 -261 -948 -453 23 -156 93 327 545 732 497 723 1575 1658 1031 1207 570 1034 306 684 -332 -272
4539 -272 -85 -1331 -1459 -1321 -1487 -1808 -1187 -1493 -919 -1530 -763 -1016 -617 -521 -584 -387 365 64 -342 737
4559 737 1154 802 1591 1791 1022 1578 1848 1178 275 1028 13 545 -427 -850 -670 -1236 -1178 -1362 -1256 -1076
4579 -1076 -1361 -1554 -966 -683 -1501 -270 536 -762 723 459 658 1300 1073 860 1148 2130 1954 1481 1370
4598 1370 840 1448 565 -272 -383 -569 -946 -294 -684 -1102 -1558 -2175 -1176 -1562 -915 -1044 -1127 -496 -1018 -711
4618 -711 -111 280 556 874 277 1743 2138 1098 1657 1732 1068 1301 37 1690 288 -553 630 83
4636 83 -17 -579 -748 -1468 -1169 -1209 -1669 -1536 -714 -980 -1298 -1205 -441 -225 526 -222 -76 1058 1065 916 1681
4657 1681 1606 1449 1538 1670 1359 1168 272 212 481 -15 -145 -210 -556 -572 -939 -1412 -714 -1752 -1646 -1042 -589
4678 -589 -1101 -935 -527 -948 132 -363 1009 312 459 1351 1297 1404 1489 916 1206 1187 582 1090 511 52
4698 52 -546 -197 -559 -573 -773 -1611 -1239 -1072 -1503 -1349 -1722 -1010 -1342 -1139 -785 -127 -820 699 1345 602
4718 602 503 708 1380 1391 888 1076 1519 1078 633 1267 748 467 168 -169 -423 -888 -1671 -1147 -1410 -1562 -815
4739 -815 -2308 -1781 -1467 -950 -710 -78 -554 39 79 373 1233 162 1188 627 861 667 1144 1128 881 1886
4759 1886 669 899 -91 -601 -704 184 -510 -1160 -1105 -1500 -1437 -1644 -1410 -1404 -694 -873 -962 -699 441 -381 -361
4780 -361 840 1075 1238 596 475 1708 1578 1196 1185 1031 1480 233 417 -101 -4 15 -659 -698 -905 -1748
4800 -1748 -394 -1666 -1766 -1016 -1303 -489 -684 -1007 -1149 -406 145 581 486 661 631 703 1597 908 1235 1569
4820 1569 1236 1275 766 1424 523 461 802 251 -608 -859 -801 -1457 -1111 -1223 -896 -860 -533 -622 328 -617 -355
4841 -355 103 -552 515 905 876 1116 779 1285 1273 639 750 1285 1048 1252 408 1108 -56 261 72 -622
4861 -622 -310 -1225 -740 -1564 -1971 -1246 -881 -1209 -1301 -696 -750 -160 -678 -731 75 187 186 420 565 996 1530 1180
4883 1180 1041 1177 1219 1310 326 902 335 -7 -443 -484 -896 -684 -1088 -1004 -877 -1107 -1769 -1365 -717 -1138 -821
4904 -821 -773 -583 -263 -510 -62 397 686 1190 873 867 1173 1111 1154 777 353 494 786 869 -149 -429 -508 -1409
4926 -1409 -173 -1175 -378 -1893 -1048 -971 -1170 -780 -768 -596 -1129 -642 -83 -377 302 699 1116 396 1118
4945 1118 986 1213 1035 773 763 1595 1239 845 202 -586 224 -32 -547 -1607 -1478 -1224 -1318 -1697 -958 -1135
4965 -1135 -463 -1391 -1025 -590 -680 -111 599 631 855 1163 954 1233 1556 1023 629 1146 724 1685 1304 599
4985 599 795 293 323 -601 -877 -1011 -794 -1734 -1758 -1171 -723 -1112 -2143 -566 -792 -332 151 -436 47 33
5005 33 214 996 562 741 767 960 1104 898 1050 822 925 1579 326 -199 310 -888 -303 -1160 -795 -701
5025 -701 -739 -1317 -1219 -857 -747 -843 -1221 -599 -115 11 -619 94 433 169 822 1004 1359 891 474 1248 1134
5046 1134 1745 748 332 714 512 -492 -479 -665 -232 -1186 -941 -1171 -1191 -450 -691 -1152 -1185 -987 -976 -281 -127
5067 -127 96 -206 489 630 1570 850 383 1454 858 1474 829 1318 1392 356 1195 -169 65 445 198
5086 198 -855 -367 -1445 -1149 -1128 -1188 -1339 -407 -822 -1298 -448 -226 -1107 -782 666 912 691 707 1074 718
5106 718 1034 1512 1395 784 1387 677 113 -125 314 -29 -581 -359 -130 -695 -1210 -353 -812 -1388 -1528 -1089
5126 -1089 -615 -390 -946 -601 -233 8 -168 79 695 1286 1318 645 1115 1321 1073 1287 1963 545 412 661
5146 661 305 208 143 -401 -1043 -687 -508 -1019 -1242 -1071 -1227 -245 -1224 -1230 -141 -334 -84 -532 156 208 821
5167 821 -360 907 729 780 266 351 1048 1658 812 391 210 84 -79 -112 -1296 -545 -320 -779 -1130 -1694
5187 -1694 -802 -442 -977 -1122 -969 -734 -1132 -799 205 -686 288 1376 903 1004 1165 1560 948 851 1085
5206 1085 500 1433 907 662 -230 195 44 -77 -801 -689 -424 -714 -1314 -873 -916 -1007 -1023 -439 -495 -509 -926
5227 -926 -4 -88 -37 557 1096 995 1865 704 888 1621 1863 571 1179 617 958 942 -382 -376 -271 -243 -1942
5248 -1942 -1378 -1334 -1340 -772 -1850 -1323 -1057 -1005 -661 -413 60 428 -272 -243 442 572 958 1046 835 935 1118
5269 1118 1432 459 626 825 807 -275 -123 374 -56 -465 -961 -1719 -1066 -685 -1553 -1646 -546 -565 -1064 -1001
5289 -1001 -404 -100 507 -313 591 -338 -73 100 573 578 864 1242 801 984 766 439 41 -122 215 564
5309 564 -193 -425 -1148 -1510 -719 -1449 -1439 -1455 -573 -1173 -1361 -790 -899 -304 -295 740 -197 359 559 382 352
5330 352 12 934 490 615 624 378 342 -87 461 -209 -960 -299 -617 -510 -657 -587 -1225 -1364 -258 -865 -850
5351 -850 -463 -926 -91 -306 -402 331 836 123 563 616 1350 1132 997 981 768 301 273 -11 939 428 87
5372 87 654 -564 -284 -380 -511 -1152 -952 -1017 -1220 -803 -1301 -223 -1389 -272 292 -611 142 619 -168 384
5392 384 1198 849 1021 122 563 1205 1279 1174 842 592 80 -141 201 134 -1067 -1290 -944 -1262 -1303 -1525 -1101
5413 -1101 -1200 -993 -867 -1074 -300 -722 -785 143 41 694 305 146 1393 1110 1159 1400 1367 932 943 1063 71
5434 71 -100 -116 -94 -162 130 -1141 -380 -802 -1464 -951 -570 -988 -1424 -1048 -949 -352 -171 -83 461 -67 384 773
5456 773 617 252 494 1169 1168 778 1719 814 -71 521 120 -32 -173 -259 -569 -459 -380 -699 -650 -1680 -822
5477 -822 -669 -662 -945 -887 -144 -488 -1005 -333 599 561 139 241 1024 478 937 981 1247 858 720 1196 -22
5498 -22 178 -441 325 -231 -65 -790 -446 -905 -1290 -641 -1076 -1100 -879 -530 -975 -832 541 283 -593 -412
5518 -412 313 419 156 -26 786 184 117 141 655 947 396 410 846 196 212 -282 -271 -379 353 92 -1266
5539 -1266 -1035 -884 -1207 -1271 -1278 -1247 -705 -838 -469 -693 951 243 291 559 794 488 672 338 805 412 498
5560 498 874 138 92 862 185 204 -823 -172 -703 -609 -1180 -620 -1605 -1602 -1386 -1405 -487 -720 -33 -388 -673 643
5582 643 177 325 592 444 1264 929 1568 1053 1222 1096 461 564 304 205 399 -333 -807 -1085 -31 -694
5602 -694 -968 -838 -937 -1086 -1059 -955 -888 -799 -1168 8 443 302 -85 -309 398 631 326 191 658 1530 1677
5623 1677 1282 297 1363 54 -322 72 -211 142 -518 -958 -742 -649 -656 -1380 -1146 -1271 -1043 -376 -477 -293
5643 -293 -390 -228 -110 -257 588 256 412 1901 915 1361 623 505 796 928 988 1037 403 -229 510 -934
5663 -934 -624 -373 -97 -833 -1558 -792 -920 -250 -764 -935 -316 -714 -463 139 -276 495 364 165 1129 698
5683 698 482 -16 571 1456 744 1132 195 838 386 -77 675 228 -392 -1229 -1024 -222 -450 -1166 -547 -389
5703 -389 -555 -1601 -826 -767 -462 -127 -391 521 512 667 630 714 313 5 843 509 1057 291 -64 828 126
5724 126 484 235 -288 -335 -64 -373 -668 -903 -501 -1117 -1053 -422 -435 -464 -1188 -126 -83 490 -260 84 753
5745 753 696 535 129 840 707 1029 627 1063 1358 420 319 148 250 -132 -698 -704 -767 -81 -851 -716 -757 -698
5767 -698 -756 -743 -199 -429 -301 -229 -78 -220 61 -67 234 368 862 703 1184 177 708 611 723 1461 957
5788 957 -221 316 -107 -100 -256 -1304 -460 -162 -1405 -1492 48 -409 -686 -559 -916 -594 -325 183 -376 -443
5808 -443 1090 432 50 1169 -28 943 623 328 284 1187 1073 -106 307 380 -170 -472 -492 -965 124
5827 124 -128 -1183 -221 -676 -954 -488 -829 -1233 -155 -428 577 405 81 962 594 1193 493 545 1267
5846 1267 982 788 659 421 451 810 261 433 -672 -376 179 -497 -1203 -1336 -477 -1180 -1504 -738 -531 -1308
5866 -1308 -655 -838 -776 489 -279 137 1 458 270 -343 180 1251 978 819 564 128 620 270 538
5885 538 -4 -48 -171 -781 -185 -405 -538 -483 -662 131 -692 -666 -1320 -235 -19 -909 -203 28 -156 -175 677
5906 677 335 1085 1074 142 1061 681 899 1718 737 -280 378 -111 -708 -345 -311 -541 -893 -538 -168 -969
5926 -969 -1478 -910 -492 -1132 -1226 -198 139 -822 389 -284 282 -108 889 876 597 366 250 312 806 763 -240
5947 -240 490 193 613 552 68 -622 -224 268 -536 -427 -375 -501 -392 -786 -1017 -221 203 -971 -318 429
5967 429 183 -237 133 785 521 778 1031 632 498 546 822 1041 284 -246 -42 -274 212 -95 -302 -189
5987 -189 -1424 -591 -435 -525 -215 -890 -501 -600 -242 -490 122 -272 -768 317 304 18 150 709 781 884 562
6008 562 433 769 877 816 972 -151 586 -1085 -521 448 -204 56 -846 -280 -1153 -713 -778 -1135 -720 -143
6028 -143 -11 326 141 -62 -480 658 598 482 1668 649 1226 1052 545 236 103 1069 609 -69 321
6047 321 101 6 -773 -382 -1114 -938 189 -382 -841 -1153 137 -924 -116 -347 -267 -641 27 56 810 -111
6067 -111 -122 1037 703 727 638 630 536 234 -220 -374 -96 157 0 -259 79 -368 -413 -623 -524 -76 -1272 -746
6089 -746 -879 -706 -703 294 -129 409 511 482 192 379 1111 522 531 696 604 805 530 637 1036 606 404 283
6111 283 137 -481 -830 -392 -6 -1058 -527 116 -544 -672 -455 -859 -664 -476 -235 -562 -9 119 879 -241
6131 -241 317 711 171 370 712 889 230 513 81 -124 -96 76 59 240 43 -453 -883 -1034 -61 -582 -1446
6152 -1446 -1206 -1053 -460 -382 -550 -917 -1012 -421 55 274 186 257 532 -9 1012 1287 1323 884 1050 253 320
6173 320 681 424 173 -191 -143 41 -339 -137 -239 -279 -698 -618 -347 -1145 -449 133 -638 652 -269 -421 1072
6194 1072 535 585 3 229 87 1048 1021 550 1833 647 179 881 -84 -111 232 92 -318 156 -363 -853
6214 -853 -149 -214 -1126 -557 -739 -847 -132 -350 -69 -130 -351 344 1002 870 -412 297 1008 1023 78 546 520
6235 520 673 712 746 143 542 396 -732 -617 331 -418 -607 -90 -1022 -1051 -983 -1015 -917 -1023 -614 -815 597
6256 597 -70 -19 -131 -262 -215 4 560 747 222 743 682 -6 650 586 873 -403 405 -330 -345 63 -362
6277 -362 -740 -602 -794 -32 -1000 -63 -828 -1065 -234 -632 189 -546 18 -327 104 1018 49 302 171 410
6297 410 545 791 894 350 -419 -42 -483 -373 -449 -890 -52 -239 -625 -975 -500 -801 -289 -174 -159 91 -391
6318 -391 -404 -156 -411 -179 -582 531 441 764 193 1212 781 621 -84 441 44 986 727 124 160 343
6338 343 -949 -200 -289 -1079 -774 -1077 -302 -660 -63 -77 -100 -789 -591 -498 -327 -224 -110 906 393 -101 1021
6359 1021 562 370 627 760 -250 312 202 503 -176 -50 -54 -768 -331 -468 -678 -713 -747 -748 -2162 -221 -213
6380 -213 -592 -103 -468 -131 268 776 -137 -147 216 485 434 1073 794 823 810 483 -340 232 648 -180 -30
6401 -30 274 -94 -549 -571 -637 176 -2 -710 -832 -886 -1041 -703 -480 -577 -24 -181 119 242 -56 1117 891
6422 891 375 967 681 207 430 355 1053 569 -564 342 -620 855 -217 -400 46 -212 -872 -589 -525 -645
6442 -645 -309 56 -437 -334 -84 117 -86 140 -74 293 896 594 882 83 607 1145 948 905 217 287 342
6463 342 -347 24 -715 -605 -82 -604 -969 -302 -871 -1110 -1177 -510 -657 -751 -1048 -86 -137 -232 246 567 339
6484 339 649 423 943 473 87 679 211 764 466 294 -285 -559 246 -212 -59 473 92 13 -820 -1146
6504 -1146 -1173 -485 63 -1359 -821 -439 -648 -438 272 75 13 747 253 779 520 887 1137 644 410 877
6524 877 611 240 735 158 -29 66 -81 5 -1188 -55 -527 -960 422 -259 -470 -329 -260 -486 14 72
6544 72 -231 -526 927 86 -353 -140 856 26 732 534 655 1123 -144 974 723 90 -149 -51 120 -290
6564 -290 -303 -214 -708 -619 -559 -897 -214 -1770 -754 -715 -759 -476 -828 -182 -431 385 1094 655 1063 989 400 68
6586 68 510 -167 160 226 161 218 -329 507 -100 364 -51 301 -216 -453 -626 -176 -418 -198 -683 -146 -572
6607 -572 -372 495 317 -35 -9 45 349 122 606 111 1278 773 802 1250 324 85 173 325 -103 91 -33
6628 -33 -250 372 32 -747 -943 -181 -912 -1387 -499 111 154 -61 -311 -354 33 10 -139 747 383 66 544
6649 544 234 819 1229 38 189 128 817 989 75 533 -403 -93 215 -98 -503 -228 85 -281 -89 -642
6669 -642 263 -274 175 -473 -885 -83 758 144 -397 520 317 50 655 1100 711 610 701 751 26 -164 229
6690 229 481 335 44 -264 -696 -734 80 -133 -922 -395 -614 328 -275 -103 128 -491 -425 -236 478 170 -641
6711 -641 548 648 46 562 714 748 120 429 204 -239 528 -131 403 -353 23 -131 -65 -344 -888 -95
6731 -95 -460 -485 -145 -1129 -15 -26 -202 282 -460 514 54 280 -120 91 425 -157 -15 403 845 969 397
6752 397 383 326 -99 -334 362 -259 202 -312 -1159 -475 -1048 -441 168 -736 -903 -214 56 -368 -52 223 422
6773 422 447 369 789 130 376 299 343 769 427 626 -335 120 125 30 -526 504 -373 256 -1261 -849 -693 -520
6795 -520 -1248 -552 -1225 -294 -892 20 587 86 1021 712 249 98 0 224 616 428 593 -84 636 1292
6815 1292 812 -118 -388 -111 -145 -267 186 -126 -165 509 -1379 -1238 -414 -1038 -194 -520 -423 -174 -208 -590 174
6836 174 324 161 431 241 291 -249 713 64 -549 11 656 75 30 569 -384 379 -435 -239 -53 348 56
6857 56 -528 -515 -10 -66 -574 -65 -331 168 -10 -487 -262 -364 604 305 -545 792 -141 405 670 1528 254
6878 254 380 59 208 -558 141 -315 436 -56 -146 -251 -625 -455 -895 -399 -391 -722 -755 84 -13 -180 -270 -537
6900 -537 -208 633 -281 360 1101 585 375 400 990 569 1016 -298 -408 163 123 -310 -510 -157 -383 -392 -361
6921 -361 -888 -224 -688 -320 -871 -682 -483 316 -125 107 78 485 -18 1254 240 -125 746 286 700 801
6941 801 775 602 313 695 376 -515 196 346 -467 192 263 -626 -232 -677 -410 -4 -540 -114 -143 -588 -254
6962 -254 -180 -791 -89 -745 532 8 473 1322 1049 591 886 519 117 438 60 390 -198 98 223 169
6982 169 190 -71 -351 -255 -990 -766 -298 -511 97 -1004 194 -255 -116 -355 -426 505 9 652 455 339
7002 339 1027 843 662 964 838 564 655 -15 233 -230 -419 269 -302 -480 656 -89 -374 -208 -446 -1176
7022 -1176 -910 -575 -565 -224 -571 -638 286 92 434 -428 534 532 704 132 564 154 1246 259 383 745 31
7043 31 3 -289 -274 -491 79 -217 31 -671 -848 -1012 -701 -7 -116 -196 -172 -1133 319 10 -700 -34 652
7064 652 -52 430 518 13 373 1071 1011 327 -46 0 71 111 192 -225 -299 -346 -207 -601 -223 -862 -847 -388 -605
7087 -605 -680 -244 -113 -252 -403 192 591 48 243 372 581 -83 575 914 1069 170 300 132 526 108
7107 108 450 167 39 -405 -819 -852 -413 -1000 -644 -159 -603 196 -520 -475 331 -474 -511 -375 131 102 766
7128 766 101 572 606 280 390 833 849 765 1363 -87 491 -249 587 180 390 -215 -1071 -347 -852 -489 -289
7149 -289 -47 -660 -20 -500 403 219 -790 -269 140 19 363 657 94 1260 163 715 559 -58 414
7168 414 40 218 329 619 -292 -628 319 -85 -218 -42 452 -192 -81 -743 -473 -452 -11 -410 -90 -32 313
7189 313 -125 -296 37 -556 493 327 136 -427 227 554 921 664 565 -694 -66 -560 -198 157 -266 -18
7209 -18 -1118 -171 195 -770 257 -402 -210 142 -340 -756 -464 -231 -16 144 548 314 152 -54 311 139
7229 139 209 644 1005 73 402 935 -300 -788 -914 787 -121 -51 -534 -753 -554 -661 -989 -655 180 -204
7249 -204 -272 234 -287 -161 204 -447 228 481 515 808 157 348 917 79 644 673 270 -2 306 -131 171
7270 171 35 -340 117 -644 -645 -489 -988 -1246 -923 -760 -657 -701 15 -336 384 381 -747 -463 372 120 323
7291 323 357 779 109 209 1144 1034 547 -90 456 -531 591 16 52 -207 207 30 -691 -963 -432 -214
7311 -214 -1142 732 -17 101 -791 60 -680 265 358 198 586 503 779 316 515 539 551 309 111 555 329
7332 329 35 354 38 326 -614 -363 -514 -37 -767 62 -598 -51 319 -495 -369 -215 76 262 175 300
7352 300 311 538 -165 937 521 -576 870 232 344 233 423 -620 366 -187 772 -326 -157 -722 -628
7371 -628 -397 -53 56 -1187 -714 -240 -205 -71 -205 -193 -181 150 504 -160 464 691 62 126 385 -47 826
7392 826 194 272 444 30 30 -209 -24 -548 -104 -363 -573 122 -1202 -826 -938 -470 -212 -85 5 -667 -445
7413 -445 217 -478 454 -102 294 581 283 1256 -12 642 347 180 505 661 -118 -722 -459 -745 469
7432 469 254 -591 -400 -875 -293 -329 -45 -648 -110 -583 -38 -707 -721 246 -147 -78 105 803 -218 -126 -604
7453 -604 221 617 -59 156 -273 -270 149 -92 319 538 -90 -398 -383 -913 -263 -329 247 -599 -902 -261 -938
7474 -938 -651 292 -18 -147 37 581 288 583 659 569 -232 413 619 480 573 825 -330 145 217 -752 -23
7495 -23 -256 -494 -708 -136 -215 -563 39 -118 137 -255 292 -717 -446 76 259 273 -167 541 -199 940
7515 940 86 780 592 682 1361 135 376 509 242 -385 68 -462 -1065 52 -313 -627 -278 -260 -663 -410
7535 -410 -964 -494 -710 -365 -1149 34 -84 -359 -254 -187 403 662 640 521 744 510 -7 1398 186 -271
7555 -271 369 330 -364 16 -239 236 100 357 -338 -172 -694 -280 -709 -830 -344 -344 669 -244 -313 270 -520
7576 -520 127 156 308 19 761 440 -95 436 686 99 611 380 331 21 -214 -573 -350 -339 -715 -236 -551
7597 -551 -462 -473 -113 -307 -439 -243 -460 -189 142 -236 71 38 39 241 35 -141 -457 407 559 898 142 516
7619 516 -131 24 13 -640 90 -273 -245 -122 -265 -520 -422 -390 -810 -254 -1123 -272 477 -499 408 211 158 418
7641 418 675 759 729 107 269 190 -97 553 60 491 505 947 603 442 218 -411 -382 -209 -482 7 -838 -812
7663 -812 -351 -479 -267 219 -446 241 -165 214 234 -98 444 49 308 -125 317 265 381 1101 1015 527 -335
7684 -335 -119 -193 90 -546 -161 381 -94 -581 -726 277 -631 -925 -399 38 -42 -409 -871 -5 332 -82
7704 -82 -397 390 409 163 -164 679 625 263 -308 45 77 298 793 -224 -251 -674 -563 -89 -890 -335 -411 -744
7726 -744 -501 -337 244 -290 -499 -207 -476 -408 -329 -334 -467 396 -288 667 30 475 673 -959 1268 874 312
7747 312 117 95 -189 301 620 452 -378 370 -633 -306 436 150 -461 -3 -19 -803 -195 117 -620 -24
7767 -24 132 -298 -372 108 -41 -206 366 -220 280 405 333 359 297 -58 -85 136 762 -661 -1005 -808 -412 227
7789 227 -267 -384 -690 136 -566 190 -247 -361 -415 -223 -232 -774 67 185 555 15 170 271 -59 408 327
7810 327 244 322 -271 850 355 -165 -32 -347 -623 -514 -294 -567 -672 169 78 -768 -1127 -918 104 192 350
7831 350 -546 -457 -312 -28 526 560 80 566 585 590 -601 926 683 -124 551 -91 -168 -262 -80 -458 -100 -225
7853 -225 -601 14 -345 -382 -707 -641 -330 274 -33 -237 -247 358 -423 1192 428 311 -148 359 168 1104 362
7874 362 468 562 -539 877 -168 255 630 -646 -454 -452 -787 70 -336 -1032 -454 -328 -402 -407 -213 -309 76
7895 76 69 -560 155 325 368 428 642 318 915 139 180 496 -461 713 87 -298 -336 -370 -235 50 -98 404
7917 404 143 -727 -96 -13 -159 265 -137 -419 -224 -185 696 -412 379 216 -547 248 626 972 1043 845 -18
7938 -18 242 -80 250 810 -21 298 653 197 472 -946 127 -339 -166 -290 -381 -401 -313 -205 -594 -405 382
7959 382 293 -105 41 121 190 175 107 -89 617 -63 566 629 409 -207 776 164 -232 711 765 -513 138 87
7981 87 -727 -282 -128 -132 -226 -345 206 -418 -332 95 -805 -736 -365 796 543 -44 -207 326 601 215 -194 196
8003 196 -244 498 403 487 116 127 57 5 365 -428 -282 -238 -595 -396 -524 -60 -283 -155 143 -192 251 -366
8025 -366 -60 275 -43 357 248 799 827 242 -67 427 798 491 414 185 -27 -105 444 540 -486 95 -323
8046 -323 -693 -66 -57 -708 -815 -347 -144 -282 -104 12 -464 -515 229 -208 578 281 304 426 -311 264 -59
8067 -59 437 -195 448 60 -567 -139 458 -98 -237 -1290 -28 -115 -356 -156 -458 239 5 -678 527 -406
8087 -406 -355 261 439 351 345 -203 -371 -810 455 50 -117 450 426 219 -169 292 188 302 -486 -159 -835
8108 -835 276 -537 0 -539 -432 -46 -918 -176 -684 -209 -234 745 -263 53 -130 473 197 577 571 132
8128 132 1003 511 -164 226 709 -65 131 -23 531 -136 -16 -639 -897 -49 -356 -165 -542 138 -110 -35
8148 -35 -246 209 -101 391 -682 314 211 -224 55 -831 559 -622 146 575 399 305 -315 -40 496 290
8168 290 568 611 64 132 -3 266 -466 185 -818 -632 -425 -700 -513 395 -282 245 19 -313 42 2 -199
8189 -199 13 252
8191B52
$$ Imaginary data points
##PAGE= N=2
##DATA TABLE= (X++(I..I)), XYDATA
0 0 0 0 0 0 0 0 0 0 0 0 0 0 0 -64 64 -64 64 -66 128 -128 130 -192 196 -256 318 -330 389 -453 524 -623
30 -623 709 -799 907 -1034 1165 -1314 1479 -1654 1852 -2067 2297 -2551 2838 -3140 3477 -3834
46 -3834 4236 -4673 5146 -5672 6251 -6881 7585 -8373 9250 -10241 11368 -12663 14160
59 14160 -15934 18058 -20664 23944 -28225 34074 -42565 56111 -81233 143778 -676281 -535650
71 -535650 749502 211800 -637155 -707673 159465 325121 -248769 -556597 145059 689132
81 689132 280331 -462370 -238204 577881 763461 13677 -420272 76111 689402 390819
91 390819 -311467 -345699 300124 510126 -71493 -556268 -201448 359606 203466 -454411
101 -454411 -580485 -13131 331917 -105339 -614120 -377070 247415 283445 -285713 -505586
111 -505586 30022 512136 217932 -331906 -197627 452275 605005 33505 -322319 121772
121 121772 642218 371916 -283784 -295798 312828 499137 -97678 -557605 -181675 365584
131 365584 149014 -511039 -559454 62935 329817 -186599 -624522 -248155 348035 226734
141 226734 -363783 -413024 192854 501829 59635 -362148 -50028 504161 421089 -135453
151 -135453 -249125 249998 536646 139665 -307639 -113367 360859 312326 -205092 -392809
161 -392809 1352 295482 -9883 -444106 -337149 113359 171928 -248383 -465082 -122639
171 -122639 245992 81652 -314693 -272932 178195 354240 14647 -258760 6674 414512
181 414512 330216 -96226 -168782 231620 451951 118100 -252961 -86538 317104 267214
191 267214 -197356 -357684 13165 274732 -31080 -432486 -292997 145608 158313 -275182
201 -275182 -437686 -51027 271094 26144 -351848 -212115 247960 308212 -91952 -261739
211 -261739 102169 423776 201058 -180949 -92404 317625 371040 -22095 -232115 52349
221 52349 334696 130563 -250045 -223914 122860 194023 -143407 -363700 -138884 145129
231 145129 27013 -296510 -301582 21457 167783 -66448 -275887 -99639 207233 187433
241 187433 -90582 -150884 127208 321506 141293 -110691 -24257 263929 286701 -6970
251 -6970 -162273 53515 267041 104015 -205452 -189488 98683 161997 -131191 -328767 -123259
262 -123259 139219 21961 -289115 -278578 48293 172089 -91193 -287734 -66349 236722
272 236722 154753 -146566 -144477 181804 318947 61394 -150206 36140 313515 224511 -88045
283 -88045 -125833 144793 255876 4707 -220079 -87499 148700 77661 -201341 -255614 -24866
294 -24866 99664 -81973 -271514 -163667 68946 66974 -138510 -193185 8301 167872 61868
305 61868 -108358 -46774 166750 213870 37659 -68008 70771 233679 156641 -44108 -62258
316 -62258 116334 184698 7291 -158865 -70828 104889 58437 -163397 -221553 -35033 81683
327 81683 -70849 -249722 -157559 64838 67738 -140265 -196147 17078 175725 46049 -132865
338 -132865 -40591 195063 205310 -7143 -79532 111864 252983 111148 -85392 -27142 168562
349 168562 159039 -58779 -148886 4632 120079 -10979 -190805 -148406 24859 33440 -136921
360 -136921 -208060 -68324 58006 -17056 -150434 -108095 55265 100772 -14497 -78166 31316
371 31316 156424 120176 -525 -2109 121416 174990 74072 -28550 18206 123785 103088
382 103088 -31603 -91341 -3006 68976 -13710 -143478 -129011 -6101 15169 -108693 -181775
393 -181775 -80625 38627 -8255 -133153 -112467 43304 102268 -10903 -85634 22908 160603
404 160603 116992 -20076 -12686 134264 180679 47820 -49049 37585 149893 82541 -69400
415 -69400 -78492 44686 70861 -61395 -154295 -74445 26429 -27310 -149436 -143171 -20463
426 -20463 20686 -70327 -127036 -43185 59406 38103 -43155 -32034 69189 116361 54950 2500
438 2500 49774 123829 110835 34655 9611 60789 93769 43747 -29841 -31560 17569 21509 -46274
451 -46274 -100346 -71683 -17767 -34517 -105409 -119991 -50905 -2188 -45333 -99120 -58991 32762
463 32762 46655 -21890 -37517 48044 115978 69376 -1156 32067 122878 122452 28192 -9644
475 -9644 63682 111501 37717 -53479 -29999 45506 26385 -75845 -108808 -37024 5170 -61928
487 -61928 -130814 -90427 -9650 -15947 -86686 -88371 -7921 38970 -2551 -38969 8630 76890
499 76890 73235 27214 26995 78996 102549 65820 30792 44477 70837 57982 15411 -7483 2868
512 2868 9633 -13610 -48278 -60788 -48241 -40328 -57879 -82917 -77994 -48472 -32351 -49564 -62937
525 -62937 -34145 11382 16668 -9232 -4803 45945 77889 50398 21538 50060 97087 85619
537 85619 31067 19438 62807 75816 19503 -29116 -6814 30018 -2653 -68706 -74702 -27274
549 -27274 -18767 -74215 -104359 -61772 -18638 -41053 -80069 -57034 2856 14503 -18171 -21045
561 -21045 29533 65560 45138 22515 46538 83814 76655 43604 39390 60487 61293 31179 7852
574 7852 11197 13500 -7287 -30506 -37873 -37614 -44992 -57420 -61369 -60098 -60458 -57780 -47159 -42002 -39291
589 -39291 -28604 -7171 6277 5620 10304 34461 55661 51317 39276 51412 75578 72289 42507
602 42507 32821 52288 55358 19224 -11010 -630 12457 -12154 -53322 -54819 -30612 -33307 -68499
615 -68499 -81625 -51136 -28428 -47125 -64885 -39429 -1188 265 -19041 -6201 35070 50409
627 50409 31845 27937 55290 75930 58530 38712 49167 64563 50809 20488 12344 22011 13248
640 13248 -16810 -32424 -26287 -27747 -48569 -62506 -54484 -46525 -55058 -61773 -48460 -31003 -29133
653 -29133 -31449 -15533 7906 14245 11583 22429 46271 53952 42103 43704 60157 65238 46100
666 46100 33323 40872 44961 23563 -2213 -3156 3174 -12400 -41536 -47969 -34513 -37151 -61122
679 -61122 -68551 -49292 -34956 -46158 -54748 -33591 -7463 -6151 -14669 388 30012 39657 27952
692 27952 31087 55086 65846 50341 38361 49585 58501 40529 17856 16169 23733 8367 -19147
705 -19147 -27629 -19023 -24301 -48236 -57757 -46315 -38781 -53243 -60757 -43758 -25585 -26967 -32934 -16985
719 -16985 8942 14764 8842 18084 42968 51807 40450 38234 54894 62429 46391 31668 36790
732 36790 42337 24732 -349 -4353 2835 -9657 -35034 -43316 -33474 -34637 -52694 -61204 -45972
745 -45972 -33440 -40975 -47382 -31357 -8867 -6581 -11766 1443 25775 34252 25495 28864 49902
758 49902 57972 45626 36366 46744 53729 36865 17691 17534 22285 7452 -16846 -22965 -15744 -23739
772 -23739 -45552 -52334 -42378 -37163 -49967 -56453 -39862 -24224 -26275 -31317 -14886 8195 13004
785 13004 6848 16852 39048 46627 36188 35604 51043 57524 42224 28325 33054 38628 22097
798 22097 -87 -2657 3909 -9173 -32818 -39416 -30475 -31648 -49975 -56375 -42797 -32580 -39865
811 -39865 -45940 -29215 -8677 -7639 -13117 739 24855 31336 23676 27129 46796 54847 42370
824 42370 33455 43698 49665 34898 16077 16040 20879 6999 -16489 -21622 -15996 -21929 -41533 -49747
838 -49747 -39167 -34862 -44898 -51347 -37451 -23334 -24663 -27255 -14884 5740 10994 6973 16024
851 16024 35498 42894 35020 34078 47039 52219 39788 29429 33621 35299 20646 2379 -361 2762
865 2762 -10266 -30537 -34398 -26485 -30926 -47647 -52043 -37462 -29642 -39169 -42289 -24754 -7791 -8815
879 -8815 -13325 1765 24160 27871 19060 24853 45322 51383 36943 29364 41921 48611 32041 13621
893 13621 15722 22280 8706 -15540 -22241 -13056 -17769 -38637 -48171 -37484 -30238 -41775 -50287 -37775
907 -37775 -20755 -21322 -26489 -16452 3762 11223 7987 13053 30543 38887 33351 31906 40965 45822
921 45822 37550 28370 29748 30225 18493 4151 565 916 -10253 -26093 -28882 -25215 -30572 -44310
935 -44310 -44916 -34227 -30299 -38384 -37476 -20988 -8567 -10393 -13095 3249 23422 24264 16290 25105
949 25105 43830 47550 31904 27687 42331 46392 27743 10850 16772 23013 7606 -16106 -19344
962 -19344 -9887 -15030 -37516 -46506 -32257 -26144 -38881 -47716 -34393 -17045 -18557 -26336 -16357 4742
976 4742 12596 6660 9653 27331 37179 32078 27742 36304 44019 36441 26542 26569 28165 19264 5817
991 5817 147 -789 -8632 -21785 -26803 -25491 -29792 -39113 -40478 -32627 -30710 -35349 -33290 -19033 -9680
1006 -9680 -11857 -10286 5396 20130 18911 14086 24404 41072 40968 27469 26945 39944 41323 23293
1020 23293 10576 17458 22174 5320 -16002 -15979 -5773 -14653 -35910 -41620 -28439 -23840 -37966
1033 -37966 -45260 -31444 -15501 -19589 -26834 -15955 5377 10571 3713 7245 26145 36651 28861
1046 28861 23737 32892 42168 34443 22601 23051 27076 19243 5000 -1460 -996 -6073 -18297 -25442
1060 -25442 -23641 -26384 -32853 -36343 -32320 -28625 -30479 -29217 -19988 -11004 -10553 -8670 3610 16116
1074 16116 16507 14354 24296 36697 35688 26286 26224 37408 36671 21568 11882 18128 19599 3693 -13926
1089 -13926 -12402 -5172 -15741 -33071 -36689 -23995 -22508 -35968 -41426 -26813 -13352 -18907 -25751
1102 -25751 -12921 6578 8895 1447 7082 25675 33042 24529 20849 32763 40075 32131 19906
1115 19906 21737 27075 19108 3084 -2344 1008 -3794 -17474 -25313 -22798 -22599 -30321 -36346 -30674
1129 -30674 -25578 -27195 -28545 -20644 -10262 -8852 -6835 1808 13181 15790 14480 22058 31059 32425
1143 32425 25236 25508 33009 31865 20196 12855 16393 16169 2450 -10865 -10570 -6355 -16911 -29615
1157 -29615 -31955 -22899 -22577 -34912 -37032 -24184 -14625 -20029 -23679 -11081 5519 6235 -41 8584
1171 8584 25277 29457 20899 20956 31968 37825 27383 17320 21706 26268 16761 2770 -1190 3080
1185 3080 -2896 -17656 -23925 -19379 -19183 -29116 -33662 -27339 -21773 -25282 -27351 -19918 -9306 -7974 -7521
1200 -7521 -62 11893 16340 14028 18120 27892 30633 25526 24526 28826 30410 20982 13566 14459 14123
1215 14123 3456 -8077 -9415 -6639 -15128 -26661 -28599 -21837 -23060 -31051 -33206 -22099 -15491 -19035
1229 -19035 -20256 -9475 3535 4923 697 8992 21955 25007 18741 20321 30440 33554 24049 17191
1243 17191 21433 24435 13918 2211 688 4459 -3508 -17547 -21887 -16517 -18505 -29148 -31847 -25036
1257 -25036 -20121 -24246 -26926 -17790 -8452 -6774 -8257 -823 11804 15495 12945 16188 26354 29226
1271 29226 23854 22071 27335 28363 20310 11970 12230 13226 4440 -7042 -8567 -6261 -12642 -22737 -26015
1286 -26015 -21667 -20603 -28232 -30137 -21879 -15102 -18142 -19579 -9028 1796 2914 1299 8974 19605
1300 19605 21969 18309 19237 28670 30217 22448 17696 21478 22924 12612 2549 1734 2670 -4630 -16180
1315 -16180 -18622 -14634 -16978 -26624 -28946 -22598 -18734 -23708 -25004 -16191 -6500 -6557 -8197 -300 10736
1330 10736 13168 10579 14754 24403 27337 22095 20224 24929 27173 18723 10744 12367 13370 4650 -6012
1345 -6012 -8624 -6331 -11710 -21510 -24732 -19725 -20033 -25922 -27400 -20275 -14150 -16730 -17050 -8370 1826
1360 1826 2441 1857 7848 18298 20816 17085 18645 26207 28077 21561 15972 19919 20889 11883 3034
1375 3034 2420 3238 -3769 -14553 -17175 -13707 -16592 -24435 -26919 -22229 -18015 -22820 -23995 -15590 -7343
1390 -7343 -7084 -7913 583 10134 12279 9582 14494 22718 25027 19628 19060 23413 24310 16992 10489 11721
1406 11721 12240 4205 -5410 -7534 -5374 -10671 -20005 -22086 -18203 -18212 -24732 -25593 -19220 -13560 -15542 -16183
1422 -16183 -7461 1253 1410 801 7953 17370 19120 14825 17052 24344 26062 19707 15215 18966 20016
1437 20016 11389 2019 1906 3034 -3003 -13695 -16330 -12421 -14452 -22837 -25659 -19389 -15617 -20311 -22355
1452 -22355 -15092 -5846 -6018 -7612 -1556 9070 11956 9848 12756 20770 23372 20127 17982 21293 22691
1467 22691 17200 11193 10765 11025 3967 -3157 -6639 -5994 -11239 -17971 -19451 -17833 -18584 -23271 -22320 -16877
1483 -16877 -13782 -16034 -13987 -5947 690 774 773 8716 16829 16305 12986 16963 24608 24631 16429 14217 19005
1500 19005 19050 8690 631 3006 5101 -3239 -15083 -14753 -10167 -12557 -23208 -25219 -17980 -13748 -19578
1515 -19578 -23388 -15184 -4836 -4511 -8065 -3859 8438 13117 9380 9281 18015 22649 19327 15379 17162
1530 17162 21425 18343 10659 8037 8085 5917 -1553 -7078 -7710 -9654 -13661 -17756 -18112 -18260 -19419 -19132
1546 -19132 -16578 -15909 -13961 -9900 -5801 -2357 -1738 1435 9618 13883 12611 12093 18187 24322 20064
1561 20064 13357 15194 21336 16783 5931 1685 5759 7219 -4955 -15373 -12732 -6173 -11892 -24150
1575 -24150 -25179 -14569 -10628 -19846 -23754 -12303 -1446 -5125 -10711 -3581 10535 14113 6609 5633
1589 5633 17585 25546 18549 11449 14896 22834 19256 8356 4253 8638 9704 47 -9698 -9244 -6595
1604 -6595 -10463 -17292 -20451 -17312 -15287 -17240 -18885 -17590 -11710 -6967 -6408 -5378 -2290 5639 11085
1619 11085 10671 8418 13294 20939 21582 14584 11034 17323 21395 13514 2071 2974 9443 5831 -8922
1634 -8922 -14934 -7464 -3110 -13131 -25715 -20884 -8858 -10397 -22467 -23664 -8225 908 -7296 -13891
1648 -13891 -2702 13614 13130 1372 2958 20453 25505 15295 6701 14670 25228 19220 3222
1661 3222 1927 11739 11682 -2210 -12839 -7842 -1142 -7690 -20224 -21499 -12914 -9855 -15700 -22545 -16496
1676 -16496 -6590 -4183 -8996 -8601 768 9276 9074 4922 6220 16649 21689 16310 9070 13213 21138
1691 21138 20063 7654 925 7468 12254 2336 -11939 -11702 -1631 -2575 -17752 -26055 -15299 -5350
1705 -5350 -12395 -25527 -21103 -2355 1590 -11561 -15571 1602 16688 9107 -3139 3168 23255
1718 23255 25296 9257 2888 17973 27679 15848 -452 1710 15817 13974 -6575 -14475 -4154
1731 -4154 3773 -8069 -23426 -20488 -6926 -5696 -20036 -25309 -13357 -765 -5118 -14131 -10718
1744 -10718 5245 11420 4392 -1154 8865 21192 19770 8889 6409 16675 23889 15184 1110
1757 1110 2807 12890 11837 -2610 -13664 -6794 2685 -5199 -21983 -22979 -7190 -2082 -16594 -27328
1771 -27328 -13896 3142 -1369 -16900 -15220 7964 17116 3316 -7681 6820 26482 21909 2219
1784 2219 1885 22423 28162 8652 -5262 5231 19977 10689 -11367 -14806 1901 6504 -11927
1797 -11927 -27164 -16390 -371 -6555 -24584 -24516 -5744 3262 -8275 -19507 -6235 11418 10895
1810 10895 -2590 -2711 12834 23647 15373 2381 7221 22330 23285 7706 -1286 7326 17284 8429
1824 8429 -9281 -12198 1170 5021 -10267 -24475 -16852 -1365 -4199 -22623 -26025 -7406 4838
1837 4838 -6929 -20651 -9737 13051 14597 -4172 -7865 12857 28560 14513 -3217 4996 26750
1850 26750 25168 2637 -7355 11219 23616 5737 -16171 -11555 8880 6402 -18196 -27043 -9413
1863 -9413 3622 -9614 -27974 -20735 985 3262 -14778 -20125 -1696 14828 6395 -8300 -2671
1876 -2671 18542 22749 7262 -1317 11838 25715 18412 192 -1465 12873 18420 2477 -12790
1889 -12790 -6820 6580 2683 -16396 -23701 -9644 1960 -8637 -25335 -20281 -315 4236 -12612
1902 -12612 -20025 -3088 15674 8033 -8890 -4439 18912 25708 6551 -6027 10497 28522 18745
1915 18745 -3417 -4704 16325 21057 -822 -17815 -4234 12585 2362 -22438 -23373 -2234 4830
1928 4830 -14932 -28908 -15454 6174 743 -19600 -18442 4939 15335 650 -11601 1461
1940 1461 21839 19315 1555 -1310 16040 26358 12452 -3654 2591 18028 16384 -4361 -13158
1953 -13158 -230 9028 -2411 -19653 -18469 -2293 923 -14382 -25232 -13088 3653 -875 -17598
1966 -17598 -17007 3529 13565 1139 -10892 1192 20893 19601 422 -3178 16086 27026 11074
1979 11074 -6245 1146 20261 17178 -6700 -15565 1239 13727 -3611 -23252 -17075 3341 2686
1992 2686 -19645 -27559 -7805 7668 -4638 -22129 -13330 9672 12537 -5666 -12059 7069 22707
2005 22707 12294 -4292 2102 20494 22595 4634 -4260 7345 20474 9801 -9221 -8854 5207
2018 5207 8751 -7844 -20355 -12021 1981 -3033 -18719 -20927 -5941 3781 -6171 -18254 -10596
2031 -10596 7772 9530 -3565 -8948 6781 20149 13158 -2495 1702 19829 22163 5761 -5727
2044 -5727 6561 20378 11190 -9263 -9485 6889 10576 -8021 -22019 -11033 4865 -2530 -22339
2057 -22339 -21764 -874 5767 -9971 -21303 -7038 11117 7120 -9716 -8071 12301 20581 6533
2070 6533 -5201 5541 21751 17013 203 -2600 11647 18511 5031 -9762 -3728 8616 4837
2083 4837 -11704 -17209 -5859 2983 -6665 -19543 -15834 -1031 1439 -10402 -15682 -5011 7837
2096 7837 4594 -6912 -4835 9675 16501 6705 -1726 6106 19112 16222 2170 -1987 11164 17042
2110 17042 4715 -10315 -4836 8607 5652 -11941 -17579 -4472 4643 -7562 -21816 -15223 1096
2123 1096 2055 -13860 -17854 -1883 10793 1657 -10658 -3241 13941 15300 1478 -3941 9955
2136 9955 20436 12030 -1979 1161 15163 14720 -629 -8528 657 9546 -30 -12512 -13496 -1568
2150 -1568 1141 -10908 -17303 -9955 264 -2905 -11715 -12164 -417 6192 -170 -6985 -659 11091
2164 11091 12066 2606 142 9920 16770 10934 295 1572 11793 12406 419 -6646 44 7287
2178 7287 1041 -12133 -12343 -1271 1160 -10315 -18263 -10100 1429 -2240 -13844 -12657 1544 7393
2192 7393 -2450 -8642 1065 13646 10358 -642 -323 12390 16753 7052 -1423 4333 14386 10037
2206 10037 -2975 -4878 3900 6578 -3655 -12317 -7936 432 -2104 -12752 -13877 -5317 -263 -6044
2220 -6044 -12308 -7749 1895 2743 -3078 -4672 2988 9846 6681 2024 2331 11171 12787 7044 1819
2235 1819 6051 11992 8470 -776 -3566 2285 4675 -2223 -10040 -8095 -808 -1920 -11296 -14012 -6688
2250 -6688 -1153 -5362 -11948 -8269 2566 3590 -4269 -5453 3423 11279 6508 -519 2562 12687
2264 12687 12713 4142 -94 7190 12502 6461 -3192 -2151 5482 4626 -5137 -9267 -4055 -15 -5159
2279 -5159 -12330 -9853 -3515 -2758 -8802 -10018 -4438 1959 -993 -4803 -1912 4819 7261 3717 1666
2294 1666 5401 10931 9458 4627 3886 6816 8913 4943 107 -1003 3047 2612 -3455 -7639 -4536
2309 -4536 -2043 -3981 -10234 -10115 -4962 -2469 -7418 -10199 -5625 1153 178 -4456 -2508 4229 8305
2324 8305 3081 409 5318 10769 8827 2469 2539 8431 9791 3739 -1754 1011 4900 983 -5754
2339 -5754 -6664 -1940 -1683 -6850 -11130 -6844 -2502 -4799 -8283 -7146 -1892 220 -2085 -3679 344
2354 344 4921 4985 2909 3121 6972 9371 5953 4468 4906 6950 6723 3019 1239 1134 2190 283 -3748
2371 -3748 -4087 -3238 -3253 -5368 -8148 -6942 -4565 -3527 -6433 -6887 -3704 -591 -836 -3593 -924 4056
2387 4056 5209 2904 1955 5933 8875 6680 3837 4572 8403 7277 2239 86 1975 3271 -277
2402 -277 -5262 -4540 -1781 -2027 -6662 -8296 -4762 -3352 -5616 -7132 -5321 -1008 -1528 -2809 -2656 1430
2418 1430 3675 2854 1488 3458 6673 6192 4443 4890 5758 6537 4247 2173 1929 2433 1169 -797 -2621
2435 -2621 -4010 -3345 -3983 -5696 -6111 -6222 -4694 -4028 -4792 -4973 -3681 -1676 -1292 -2418 102 2543 2856
2452 2856 2200 2620 5419 7277 5955 3108 4902 6752 5854 2086 713 2526 1852 -632 -4252 -3306
2468 -3306 -2081 -4002 -7227 -7785 -4582 -3894 -5762 -6935 -4778 -1512 -2546 -3829 -1255 2322 3245 832
2484 832 2707 4760 6337 5375 4196 5786 6247 4956 3169 3577 3118 2012 249 -1081 -1887 -2093 -3541
2501 -3541 -4853 -4753 -4585 -4405 -5058 -4418 -4964 -4237 -3611 -2404 -1216 -895 -225 2209 3700 3244 3241 4790
2519 4790 5159 5066 4108 4686 6019 4928 2266 1381 1607 1279 -856 -3137 -2230 -1985 -3491 -5519 -5611 -3754
2537 -3754 -4519 -5753 -5955 -3613 -1901 -2436 -3086 -708 1093 1331 1648 1515 4961 4763 4712 3609 5932
2554 5932 5888 3151 3013 3711 2722 1546 -440 -1239 -1154 -2369 -3136 -3590 -4053 -5119 -4865 -5031 -3937 -3814
2572 -3814 -4482 -3089 -2150 -827 -307 58 2386 2042 3317 3028 4066 4660 4838 4413 3703 4337 4395 2359
2590 2359 963 1575 1028 -303 -2122 -1971 -3132 -3557 -5931 -5146 -3943 -4366 -5444 -4948 -3494 -2269 -2940
2607 -2940 -2366 -742 900 977 920 2516 3840 3909 3035 4222 4834 5705 3662 3454 3121 2486 1218 -324
2625 -324 131 -20 -2226 -2766 -4237 -2877 -4361 -5526 -5275 -3655 -3190 -3469 -3542 -2257 -1400 -722 -622 1974
2643 1974 2390 2901 2364 2591 5044 4533 4115 3723 4152 4150 2926 1252 2544 1186 -277 -1814 -2255 -2045
2661 -2045 -3626 -3972 -4685 -4097 -3864 -4767 -4473 -3643 -1976 -2220 -2411 -28 1046 2046 954 2208 3253
2678 3253 4245 3904 4211 4720 4878 4125 2734 3509 2775 1291 -215 -234 -54 -1494 -3257 -2961 -3185 -3094 -4849
2697 -4849 -4363 -3805 -2731 -3850 -2960 -1363 -564 -104 345 1460 2329 2059 2711 3043 4847 3853 3449 3292
2715 3292 4379 3573 2735 2142 1929 1566 -113 -1567 -1180 -1620 -2457 -3796 -4210 -3369 -3688 -4659 -3711 -2853
2733 -2853 -2415 -2787 -1580 -176 1084 1033 823 2045 3980 3868 2784 3913 4580 4636 3059 2304 2811 1713
2751 1713 948 -427 686 -494 -1912 -2844 -3602 -2382 -3477 -4345 -3950 -3088 -3782 -3153 -3314 -1738 -941
2768 -941 -883 -811 1443 1547 1756 2323 3189 4508 3531 3956 3310 4430 3941 2693 1644 1919 1438 88 -1445
2787 -1445 -1622 -1718 -2155 -4332 -4102 -3432 -3608 -4391 -3897 -2804 -1503 -2484 -1740 -426 332 425 1468 2775
2805 2775 3103 3217 3021 3594 4436 3747 3083 2449 2954 2794 1356 382 681 -589 -1132 -3506 -3444 -2791 -2923
2824 -2923 -4039 -4204 -3276 -2620 -3389 -3447 -1605 -439 -850 -683 1461 2131 2209 2808 2737 3306 3719 3185 3689
2843 3689 3101 2988 2065 1603 1633 943 339 -1230 -1718 -1715 -2283 -3721 -3965 -2676 -3487 -4228 -3889 -2528 -1847
2862 -1847 -1049 -2071 -246 881 955 853 1937 3649 2768 2528 3010 3557 3776 2681 2368 3329 2287 1469
2880 1469 -51 97 -470 -1423 -3145 -2481 -2214 -3048 -4296 -4758 -2742 -2192 -3104 -3606 -1910 -1117 -1309 -980
2898 -980 118 2153 2361 1827 3259 3149 3520 2857 3528 3778 3228 2037 1731 1407 1149 597 -879 -1306
2916 -1306 -2397 -2453 -3438 -2776 -3341 -3780 -4079 -2763 -1730 -1729 -1800 -1106 -894 265 381 430 1575 2391 2463 1844
2936 1844 2905 3395 3302 3128 2367 2644 2096 986 -211 119 -1013 -776 -2063 -1904 -1834 -2009 -3208 -3317
2954 -3317 -2756 -2801 -2763 -3066 -1254 -501 -189 -807 330 834 1906 2215 3644 3009 3208 2491 2372 4114 2615
2973 2615 1742 1567 1976 1120 -563 -1036 -1254 -1299 -1965 -3249 -2757 -2838 -3451 -2848 -2655 -2328 -1773 -2698 -1455
2992 -1455 -1047 804 190 487 2062 1930 3196 2373 3077 3549 3641 2530 1735 2201 1735 1495 47 178
3010 178 187 -672 -2268 -2542 -2169 -2483 -4033 -3419 -2585 -2287 -2641 -3387 -1268 -444 -601 -337 487 1693 1408
3029 1408 1304 2786 2562 2794 2398 2222 3127 2464 1899 1393 1708 939 -34 -1251 -920 -1466 -1424 -2985 -2813
3048 -2813 -3006 -2759 -3468 -3236 -2618 -1909 -1882 -1975 -44 25 404 621 1592 2437 1589 2537 3011 4315 3246 2471
3068 2471 1891 2652 2130 754 -25 34 -188 -1619 -1714 -1585 -2471 -3027 -2599 -2594 -2321 -2377 -3252 -2173 -1096 -1313
3088 -1313 -279 -1425 386 1559 2358 1655 2028 2474 2886 2389 2787 2639 2390 1805 1472 1681 948 -55
3106 -55 -372 -857 -885 -1355 -2603 -2268 -2407 -2508 -3527 -2856 -2237 -2087 -2330 -1333 -581 451 -38 1066 1960
3125 1960 2048 1856 2460 2542 3514 3185 2610 2995 1420 2545 567 694 520 -223 -1552 -1466 -2089 -1264 -2190
3144 -2190 -2833 -2672 -2515 -2644 -1932 -2148 -1225 373 -989 -388 351 854 1188 802 2063 3515 2311 2155
3162 2155 1580 2547 2543 1881 2207 1380 716 416 -1427 -1596 -945 -1318 -2774 -3280 -2086 -2706 -3068 -2699 -2413
3181 -2413 -1123 -1248 -1278 -676 1255 381 530 1079 1986 2322 2015 2511 3261 2971 2295 1544 1562 1564 1000 936 58
3202 58 -338 -580 -1870 -1650 -1941 -2410 -3005 -3055 -1721 -1908 -2500 -1834 -1723 -504 -774 -351 514 1860 1292
3221 1292 1648 2380 2712 2622 2312 2393 2524 2044 1784 959 1781 1387 -934 -605 -498 -1110 -1599 -2494 -1987 -2201
3241 -2201 -2810 -2584 -2491 -1287 -1095 -1600 -749 -73 330 167 1092 1561 2281 2456 2375 1883 2547 3027 2235 2236 1956
3262 1956 2176 522 280 -139 -421 -590 -1903 -879 -1431 -2089 -2441 -3016 -1879 -1607 -2011 -1601 -1487 -280
3280 -280 -949 -768 702 1483 1711 865 1467 1974 2412 2888 2197 2980 2356 1514 1492 1658 890 161 -609 -920
3300 -920 -456 -1892 -1685 -2391 -2173 -1848 -2975 -2449 -1502 -2125 -1402 -1595 -300 629 -41 871 1323 1784 1710
3319 1710 1330 2572 2192 3090 1665 1071 1664 1685 626 -109 57 -104 -841 -1432 -493 -1842 -1350 -2215 -2778
3338 -2778 -1406 -2044 -1950 -1526 -70 -483 -1022 -85 58 619 1287 812 1945 2069 2494 1474 2109 2739 2201
3357 2201 1716 985 1414 1221 39 -465 -253 -909 -1412 -2106 -2135 -1373 -1987 -1997 -2492 -1868 -1177 -1075 -891 -493
3377 -493 -3 104 103 532 2187 2080 1720 2469 2648 2394 1928 1659 1346 1297 793 518 -384 445 -670 -1658
3397 -1658 -1950 -1595 -2144 -2367 -1891 -1818 -2862 -1349 -1357 -1614 -758 -890 -1076 437 1278 435 1179 1638 1930 1758
3417 1758 1972 2286 2744 2004 730 980 955 337 -461 -714 -776 -668 -1529 -1321 -1657 -1747 -1173 -2490 -2078 -1032
3437 -1032 -1593 -1401 -794 36 275 1187 -107 545 1093 2154 1845 1838 1056 1880 2248 709 1308 2004 1062
3456 1062 -586 748 -72 -1148 -883 -1855 -1803 -2032 -1363 -2388 -2047 -1913 -1436 -1637 -812 -585 -430 -434 490
3475 490 1439 1438 1264 1862 2639 2160 1633 2175 2530 1391 1016 1556 1946 763 -95 -966 -632 -1407 -881 -2437
3495 -2437 -1841 -1662 -1608 -2535 -1637 -1734 -1152 -1622 -1751 -281 231 -343 586 726 1715 2220 1559 1775 1828 2896
3515 2896 1354 1538 1732 1330 746 105 -273 80 -302 -286 -1174 -1721 -2314 -1572 -2321 -1751 -2863 -2119 -1513
3534 -1513 -301 -700 -1388 6 199 939 773 1492 1786 1923 2087 1501 1626 2380 1918 792 1449 896 789
3553 789 -509 -698 -227 -616 -734 -1336 -2264 -1314 -2395 -2808 -1820 -1152 -1456 -1782 -1076 29 1309 159
3571 159 733 65 1330 1816 1572 2092 2016 2350 1922 1046 1285 1084 796 605 339 -201 -565 -998 -1833 -1486
3591 -1486 -1972 -1554 -2823 -2038 -1808 -1808 -806 -1305 -636 -490 487 -236 -72 987 795 1831 1684 860 2228
3610 2228 1864 2164 2003 839 1039 825 485 -651 -307 392 -510 -2002 -2134 -1183 -1322 -1833 -2596 -2667 -1017
3629 -1017 -1672 -1627 -755 56 532 -302 658 1349 1956 1358 1328 1683 2388 2521 1725 430 1100 2191 981
3648 981 382 260 -85 -664 -1461 -1305 -1554 -796 -1049 -2179 -1373 -1139 -1345 -1814 -1045 -949 -138 -397 229 528
3668 528 1205 1811 2358 997 673 1817 1782 1259 1278 1250 1397 1425 -195 -177 -245 -24 -1221 -1440 -1336 -1463 -2365
3689 -2365 -2444 -2116 -2218 -979 -384 -1321 -1258 -397 189 -528 8 925 1527 761 520 1236 2450 1533 1327 1029
3709 1029 1032 1789 225 310 537 901 -205 -1503 -1988 -934 -886 -1469 -2799 -1603 -1097 -1414 -1691 -1565 -368
3728 -368 441 68 -798 945 862 1471 1038 1631 2238 2432 2039 1610 1088 959 1343 1199 398 -80 60 -416
3748 -416 -1962 -1184 -1125 -1149 -1717 -2259 -2050 -1286 -532 -922 -1480 -998 259 -97 -600 571 872 1740 975 676
3768 676 1407 2410 2516 334 1736 1328 2198 843 215 995 1611 -419 -1290 -1102 -1482 -677 -2326 -1723
3786 -1723 -1401 -1498 -1535 -985 -1360 -953 263 -255 32 737 997 1233 1174 1066 1936 2063 1331 1609 2229 1296
3806 1296 1448 1327 382 -502 26 76 -744 -962 -1672 -1060 -1723 -2295 -1946 -1113 -627 -1406 -1124 -1615 -289 -230
3826 -230 -635 431 887 792 1129 1140 2231 2272 2194 1674 1276 2177 1625 -836 166 174 11 -525 -1223 -1060 -795
3847 -795 -886 -1929 -1495 -1523 -555 -1393 -1302 -693 -267 -27 -741 -171 466 1619 1599 925 1061 1861 2066 2065 1535
3868 1535 1449 1084 1024 414 714 1122 -155 -65 -822 -1263 -786 -1855 -1565 -1616 -1788 -976 -1726 -779 -742 -846 143
3889 143 -425 286 513 1023 1800 1571 407 1578 2049 1749 950 1827 1682 1417 160 146 -292 -179 -587
3908 -587 -1436 -1639 -124 -1723 -2625 -2372 -821 -1776 -1472 -1564 -1651 -65 238 -651 -674 1444 1173 561 933
3927 933 1428 2432 1224 1181 839 1861 1361 878 230 926 423 -131 -1068 -625 -656 -1222 -1308 -1044 -2303 -1207
3947 -1207 -2100 -799 -1272 -1124 -667 -400 -622 31 814 1496 1255 371 771 1853 2308 1062 458 1518
3965 1518 1673 833 506 63 1077 495 -1494 -1627 -169 -709 -1452 -2018 -1664 -588 -1342 -1305 -2098 -813
3983 -813 -10 -547 -726 53 575 1501 275 339 1244 2428 1401 348 1100 1969 1261 434 951 681 441
4002 441 -755 -292 -1149 -529 -1338 -1767 -1140 -1458 -1047 -1610 -1923 -2058 -785 -548 -110 -444 902 1138 1112
4021 1112 969 682 1401 1698 1150 1766 1232 1486 1265 1224 343 292 -75 -380 -802 -1320 -835 -785 -1006 -1583 -1338
4042 -1338 -1583 -1614 -1939 -616 -583 -587 -155 -1499 -39 1601 636 585 255 937 2105 1705 868 1739 1227 1857
4062 1857 342 354 745 720 -895 -950 294 -991 -1046 -1396 -847 -1535 -1625 -1506 -1206 -1192 -351 -296 -439 -705 -427
4083 -427 990 281 186 446 1982 1701 1633 1415 1507 1234 1039 769 1073 320 895 0 -422 -1184 -1330 -1265 -1815
4104 -1815 -1350 -1298 -1305 -1031 -1979 -706 -713 -404 -482 -516 100 779 1498 993 783 1307 1645 984 1228 1332 1435 1491
4126 1491 -289 808 882 230 75 -758 -1596 -533 -1299 -1635 -1382 -1112 -2186 -1443 -1001 -2019 -973 -159
4144 -159 -886 -277 345 464 1054 700 1149 1741 1991 1197 936 1370 1841 1386 975 340 644 14 467 -1246
4164 -1246 -496 -465 -1077 -883 -1586 -1294 -893 -2280 -1680 -698 -114 -348 -405 -197 136 178 1036 630 905 2048
4184 2048 1705 1184 742 1708 1480 995 996 930 364 440 124 -139 -352 -495 -1144 -1658 -956 -1109 -995 -1035 -984 -887
4206 -887 -1020 -1781 -868 -30 228 594 -64 1272 2140 1491 1189 1055 1526 1020 1744 1164 1278 530 1017 596
4226 596 -369 -446 -1219 -639 -1215 -502 -1460 -1139 -1087 -999 -1306 -1418 -752 -657 -920 156 -401 1172 -147 587
4246 587 1891 1384 1294 530 2049 1450 1563 535 943 875 636 678 -430 -516 -1048 -662 -1535 -1293 -1447 -1050
4266 -1050 -1211 -1718 -1749 -1295 -384 -1182 -961 -228 56 904 520 684 1009 1147 1158 1347 700 1244 1359 1243
4286 1243 870 829 1176 436 1082 -405 -576 -1529 -934 -922 -1961 -1303 -1183 -1838 -1418 -1334 -1381 -861 -1142 -594
4306 -594 1040 301 650 719 1108 1043 996 1497 951 1461 1891 824 379 1285 1148 347 -216 -196 -211 -665 -1878
4327 -1878 -918 -896 -1375 -1161 -2265 -1419 -463 -1329 -1133 -301 -195 395 -7 381 1303 884 962 1067 1144 1369
4347 1369 976 954 1457 417 742 880 162 -437 75 -713 -1178 -758 -750 -1080 -1244 -826 -1840 -1953 -1460 -528
4367 -528 -145 -94 -591 -36 -92 -177 538 645 1423 1322 822 1236 1371 790 1180 377 -346 471 829 -761 346
4388 346 -205 -918 -1228 -1157 -1482 -1369 -2205 -1069 -817 -799 -1276 -957 -883 25 -291 59 718 751 1377 689 1412
4409 1412 1585 1295 1412 1706 790 413 1075 117 94 144 -286 -562 -832 -264 -929 -1785 -1485 -1600 -2208 -1093
4429 -1093 -1186 -878 -879 -926 -190 -445 398 -14 217 1231 1073 901 1860 880 1822 1477 1009 1289 1246 389 -92
4450 -92 -217 -176 -200 -977 -1184 -1373 -1425 -1655 -1252 -904 -1180 -1133 -1656 -1042 -484 66 131 979 67 1143 645 1155
4472 1155 1360 1097 1396 695 1165 1453 1025 103 147 561 335 -532 -472 -200 -1226 -1570 -1779 -2169 -1222 -1336
4492 -1336 -1929 -1379 -475 -635 -188 -91 -363 30 606 548 726 963 1021 1679 1741 1433 1636 1020 849 666 444
4513 444 465 -470 -296 -733 -887 -1494 -1160 -1712 -1684 -1922 -1491 -1482 -1064 -1585 -930 -747 -619 301 381 783 540 1512
4535 1512 1080 1781 816 1688 1220 1097 1789 1157 484 -1 513 -314 -461 -199 228 -762 -1432 -1922 -331
4554 -331 -1402 -903 -1217 -1311 -685 -34 -116 -72 32 116 751 96 744 1047 950 1276 1359 1755 1172 1048 652 423
4576 423 346 -417 477 -295 -216 -265 -740 -1135 -1476 -1902 -861 -1500 -1125 -1711 -1140 -1010 -629 -594 321 389 254
4597 254 1151 934 933 989 1041 1426 1001 874 1152 62 675 629 -213 20 -22 -80 -759 -840 -1443 -724 -1647 -1150
4619 -1150 -1290 -1918 -1346 -1022 -604 -207 -252 251 152 645 1083 1019 1389 1279 1086 1447 1750 1837 711 1220 1131
4640 1131 869 753 32 -743 -721 90 -675 -1306 -1228 -1164 -1257 -1088 -1470 -1668 -1213 -924 -127 -492 125 -38 616
4661 616 546 778 470 1465 1838 1538 1081 1272 593 787 225 693 1349 -341 -483 -819 -456 -541 -1307 -1618
4681 -1618 -1247 -142 -1480 -1279 -761 -1620 -939 -259 496 294 -288 1341 920 534 1115 1215 900 995 1389
4700 1389 1013 1392 664 945 763 -394 -67 -777 217 -1400 -1883 -1352 -1423 -1385 -1228 -1572 -381 -943 -943 -1439
4720 -1439 21 -533 138 473 -58 1109 828 1115 795 1415 1347 1461 386 716 972 254 654 -167 206
4739 206 -507 -196 80 -469 -1415 -1071 -1661 -1648 -1319 -2079 -1037 -1038 -540 -470 -539 -86 586 793 445 397 799 1226
4761 1226 798 1442 1696 1109 1271 517 1094 -108 491 386 -55 -517 -259 -1131 -1656 -1777 -832 -1174 -1500
4780 -1500 -1005 -1298 -594 -1047 -222 -88 -50 284 200 1208 354 1433 1447 1141 1311 457 792 1229 872 -5
4800 -5 84 464 -5 -222 179 -506 -379 -1993 -1344 -945 -901 -1287 -1237 -1281 -935 -609 -1013 -756 -70 242 452 31
4822 31 673 1666 1707 387 1521 1630 734 1148 549 1242 610 398 -188 -90 -84 -1102 -998 -1368 -1289 -1101 -1874
4843 -1874 -1632 -1625 -384 -1239 -1154 -597 -262 634 -91 704 681 807 697 825 1225 1648 1033 1246 1317 1009 800
4864 800 481 390 861 163 -469 -420 -294 -619 -595 -1136 -1393 -2132 -904 -1056 -606 -421 -936 -538 414 228 526
4885 526 286 969 932 1399 780 837 1197 1171 653 1035 824 510 709 244 26 414 -667 -876 -954 -774 -1486
4906 -1486 -1513 -1184 -678 -1251 -1178 -802 -625 -26 -124 -367 706 1037 794 1032 1459 967 1686 953 699 1215
4926 1215 744 885 137 28 186 91 246 -581 -797 -850 -828 -964 -1410 -1989 -1827 -982 -1346 -206 -971 40
4946 40 -653 55 289 67 983 1329 781 1117 1189 1204 1628 1030 631 1091 1308 1200 -104 584 -102 -505 -1336
4967 -1336 -1079 -457 -1462 -979 -1266 -1150 -1169 -570 -835 282 300 -586 555 672 874 526 847 842 1353 637
4987 637 1088 1347 1713 1855 503 668 418 517 -78 -43 -743 60 -873 -1007 -1133 -939 -1089 -1770 -1225 -495
5007 -495 -1139 -1535 122 -174 -158 -271 775 81 968 1484 385 1443 1528 1642 1346 1171 966 491 366
5026 366 281 -8 194 -685 -566 -1018 -892 -1061 -1019 -747 -721 -1205 -250 -176 -976 -493 454 -181 593 687 507 625
5048 625 1087 860 1270 968 1235 510 349 337 581 680 87 -81 -483 -666 -940 -153 -965 200 -882 -1349
5068 -1349 -1394 -712 -498 16 -738 -293 259 200 815 -46 988 1230 692 1472 663 1662 536 1042 1189 649
5088 649 1150 518 -246 -867 -330 -980 -983 -775 -511 -1443 -1699 -699 -1236 -1000 -555 -864 -962 -365 -488 -80 175
5109 175 1076 801 768 1319 764 1411 1205 1126 893 803 133 11 624 -39 398 362 139 -488 -1129 -1256 -1353 -805
5131 -805 -1751 -1699 -890 -663 -62 -1116 -840 24 -468 -297 92 269 808 1287 1040 1440 971 936 1711 869
5151 869 1018 1537 212 1001 162 -246 -559 -124 -675 -559 -912 -1988 -1528 -1225 -954 -843 -467 -618 -501
5170 -501 -548 122 564 628 352 737 965 961 961 764 1743 1097 587 672 811 335 60 -253 -694 308 -423 -382
5192 -382 -909 -1331 -807 -1260 -973 -849 -915 -542 -989 -942 28 -53 195 375 714 992 1069 822 841 1251 1218 644
5214 644 793 998 774 261 422 -99 266 369 -1027 -1189 -411 -798 -1293 -1360 -553 -672 -768 -902 -725 -230
5234 -230 -1025 325 593 114 736 873 522 1627 1009 530 223 652 1351 1010 710 668 827 -212 -207 -173
5254 -173 -385 -601 -650 -391 -883 -667 -651 -1467 -887 -549 -512 -804 -713 -767 -43 401 649 590 991 635 676 249
5276 249 884 1119 1690 1134 733 220 451 603 962 48 -1344 -484 -652 -1265 -1344 -988 -1399 -1401 -779 -1177 -562
5297 -562 -862 -252 -406 0 2 -549 1167 969 958 -15 1067 1438 1249 1312 816 352 1152 269 653 -280 389
5318 389 362 -381 -1326 -147 -701 -590 -900 -783 -1104 -1692 -611 -843 -169 219 691 150 398 1285 1212 953
5338 953 1016 1162 612 780 867 1193 1665 737 263 255 149 145 -505 -794 -740 -689 -711 -1087 -880 -1266 -1049 -652 -1616
5361 -1616 -717 -428 333 -282 216 735 725 866 548 1065 1026 1167 702 707 396 -26 267 202 -174 -373 -231
5382 -231 -516 -454 -1279 -309 -935 -1909 -1001 -634 -945 -1129 -416 -628 500 -30 -185 -122 1050 940 957 307
5402 307 1286 982 265 195 802 274 978 149 384 409 -468 -344 -564 -414 -595 -625 -614 -1178 -591 -559 -1083 -975
5424 -975 -999 -19 -127 -6 -3 203 -263 362 1092 1546 -148 1246 1006 546 609 948 114 314 608 470 210
5445 210 106 -576 -940 -1228 -844 -794 -697 -595 -1754 -751 -1243 -1070 -377 293 -5 -598 636 -23 919 454
5465 454 928 1437 1240 -44 768 834 976 1060 998 80 -281 -541 326 -762 -224 -210 -733 -769 -436 -532 -1334
5486 -1334 -755 -808 -436 -449 -626 -564 403 118 581 559 848 1476 935 1109 886 982 1097 636 172 143 250 -418
5508 -418 -349 -79 -212 -443 -101 44 -1506 -1164 -1386 -1345 -633 -761 -829 -1255 -1195 -516 -422 93 476 169 295
5529 295 864 1215 1889 939 1117 1216 1272 451 474 393 632 -135 -48 -620 37 -13 -747 -1172 -164 -220 -726 -864
5551 -864 -679 -364 -723 -423 -810 526 -82 107 511 561 844 527 1269 1064 810 985 353 846 56 78
5571 78 92 436 433 -534 405 -578 -865 -140 -674 -1073 -719 -952 -1503 -1143 -393 -589 -111 12 21 154 277 553
5593 553 1042 546 900 48 1468 456 878 808 -557 -112 -27 544 -299 37 343 105 -383 -634 389
5612 389 -1156 -606 -499 -563 -168 202 -738 -748 -110 88 -351 565 518 1059 860 834 957 983 463 1191 518
5633 518 1162 559 77 89 153 199 -126 -620 -39 -984 -1632 -1344 -852 -923 -866 -1023 -405 308 -972 277 307
5654 307 157 -242 -62 450 638 410 274 492 688 683 825 639 337 113 628 -222 112 380 -832 -261
5674 -261 -438 110 -766 -658 -279 -938 -390 -670 -1079 -277 -238 100 -257 475 190 54 215 405 763 873
5694 873 1391 205 571 396 -99 311 89 -994 -982 -24 -588 16 -189 -767 -484 -977 -1150 -1163 -521 -676
5714 -676 78 -505 -116 154 141 -282 41 1515 623 1470 320 538 313 606 889 980 605 500 -613 144
5734 144 -10 -373 -627 -687 -1275 -619 -877 -932 -1387 -770 -675 -1229 -418 -336 -110 351 -526 457 235 705 292
5755 292 668 392 1042 1466 370 1198 -306 967 660 -36 716 -191 -736 -443 -936 -581 -1067 -1072 -958 -533
5775 -533 -877 -821 -228 -636 -359 275 148 -724 602 -678 620 933 -162 260 1059 1102 1512 1011 273
5794 273 713 359 167 -269 134 267 -147 -152 -1161 -460 -1017 -1433 -796 67 -1706 -726 -247 -195 -340 155
5814 155 -674 409 448 565 766 527 1066 2156 788 453 1038 704 817 673 475 32 -662 105 -108
5833 -108 208 -1307 -761 -1603 -594 -1403 -655 -861 -918 -519 -134 110 125 209 862 259 -737 709 -80 1404
5853 1404 198 1275 548 737 602 685 714 566 297 65 -361 23 -629 -537 -969 -1091 -1048 -696 37 -830
5873 -830 -336 -536 -888 317 49 -489 503 620 250 476 500 621 946 874 985 370 529 336 823 87
5893 87 606 279 108 -728 73 -143 -618 -851 -1292 -565 -948 -1166 -637 -1025 -231 -188 -85 403 995 358 520
5914 520 178 330 1547 -67 913 865 1023 -125 576 -8 23 203 -230 296 -45 -508 -360 -179 -693 -743
5934 -743 -459 -887 -1065 -757 -720 -469 129 -259 238 575 449 734 705 -69 1177 539 635 989 1311 888 385
5955 385 1004 379 753 439 165 -875 63 -328 -27 -912 -811 -1324 -1625 -1091 -673 -172 -160 -1021 -446 573
5975 573 554 520 420 553 1778 87 385 676 1232 871 436 1464 672 393 -23 273 20 -842 -58 502
5995 502 -728 -31 -696 -138 -634 -906 -301 -1170 -672 320 -908 -383 362 -124 231 -161 306 603 522 677
6015 677 729 1460 447 797 167 437 216 -220 59 -725 -530 -181 -274 -102 -537 -953 -833 -1604 -147 -115
6035 -115 -753 -453 -62 250 270 813 307 869 454 -228 662 115 593 1067 294 -117 -151 -94 129 -6 -119
6056 -119 -564 -707 -549 149 -926 -733 -716 -238 -603 -81 -367 -827 -434 -898 -290 131 112 -196 1109 214
6076 214 -93 1141 65 953 564 412 412 340 418 356 191 64 -725 650 -564 -654 -639 -723 -1025 -258 130
6097 130 -351 -243 -1071 634 -32 -283 -65 115 448 1068 345 511 195 407 371 1202 316 106 586 640
6117 640 263 306 157 885 -207 -348 -234 -381 -361 239 -517 -277 -367 -449 180 -408 -533 242 -7 167 9
6138 9 1075 731 665 484 850 879 1128 1314 -44 -184 399 624 148 -595 -21 -132 -779 -299 -716 -479 -9
6159 -9 -21 651 -1191 -269 -417 -1100 0 -285 -25 -355 221 614 89 175 409 114 472 685 729 707 797 620
6181 620 374 209 -414 372 151 -137 220 -750 -483 -483 -1788 -451 -787 -407 213 -326 -445 -547 -40 909
6201 909 -69 167 248 562 535 620 1573 571 449 610 878 872 656 -85 157 -288 -438 -66 -632 -1065 -616
6222 -616 -321 -902 -415 -865 -845 -811 -498 -315 -363 55 365 9 734 792 792 121 978 433 412 -11 2 370 -24
6245 -24 371 -546 -216 -611 -601 -941 -371 -1351 198 -383 -563 -700 30 -239 -348 -339 -671 -293 -965 -727 -226
6266 -226 -96 92 858 665 1115 527 1093 207 892 509 794 1199 832 210 206 120 -95 -211 -393 -952 -479
6287 -479 -471 -1170 -908 -640 131 -464 -474 409 183 -345 -427 20 434 -121 800 211 914 716 496 996 976 914
6309 914 485 204 244 33 -261 -550 -580 -306 -1024 -790 -771 -801 -838 -424 -384 -666 -50 -633 222 229 264 236 24
6332 24 -46 1129 776 709 844 1046 863 380 772 261 0 -188 56 833 -657 -690 -1017 -18 -507 -894 -495
6353 -495 -1114 -439 -480 9 -310 -737 -312 -529 92 129 -329 517 359 956 805 331 659 679 1634 843 208
6374 208 518 385 78 109 437 -468 -276 323 -513 -454 -551 -456 -521 -968 -215 -395 -1372 -62 8 -101 -633 -122
6396 -122 390 -61 525 618 568 497 445 130 776 373 412 -811 -37 78 251 427 -662 -655 -448 -985 -660 44
6418 44 -356 -865 55 -1069 -497 -75 -458 -777 623 -167 556 991 996 598 903 593 1315 709 53 882
6438 882 744 409 666 -158 -145 107 -108 -271 -496 -1156 -101 -528 -631 -24 -474 -628 -106 900 -105
6457 -105 665 486 812 80 795 596 -12 448 501 691 138 1443 370 431 564 476 9 -390 -438 -636 248
6478 248 -517 -518 -802 -164 -1491 -935 -526 -236 -137 92 -403 -164 642 1281 255 305 832 280 -280 657 755
6499 755 349 561 1011 412 40 712 202 -218 29 -315 -567 -554 -627 -237 -1103 -171 -672 -197 -425 -646 74
6520 74 455 -840 -610 332 790 481 286 828 552 489 736 331 627 945 102 -30 5 452 -327 -666 99
6541 99 -538 -660 -185 -696 -336 -1118 -630 -348 -269 -129 -245 298 374 -107 187 550 857 595 349 1069 175
6562 175 665 638 877 698 -502 -328 138 312 -225 -551 -510 249 -964 228 -563 -1087 -819 158 -74 -1270
6582 -1270 -845 -214 -20 176 -1 247 -152 -106 231 539 537 797 220 214 494 815 190 821 -246 283 73
6603 73 -386 -324 -33 -179 -478 -424 -434 -109 -580 -661 -669 -460 -881 175 -152 -462 97 513 110 512 195 344
6625 344 848 606 692 1104 169 611 -172 -280 -821 -108 -472 -390 -202 -723 -622 -623 -651 -806 -1092 -261 -288 -112
6647 -112 174 -294 -146 631 -27 -104 400 -112 577 522 451 405 642 322 1063 -41 -182 -35 207 887 -6
6668 -6 -264 -195 -858 -575 -142 -1039 -510 -1051 -473 -551 -156 -299 -660 399 239 -129 1062 840 622 204 213
6689 213 793 228 324 251 945 480 621 281 605 120 654 0 -699 363 -490 27 -837 -235 -184 123 -1106
6710 -1106 -316 -235 -459 -359 -91 -311 -339 229 389 862 -58 62 1619 312 46 462 -125 1018 761
6729 761 48 268 -97 -555 -914 -92 -528 -737 -1486 -306 -237 -1031 -64 -208 54 -446 -190 -12 -377 250
6749 250 674 120 515 321 183 1202 625 1004 782 339 546 -411 -71 -114 -61 112 -798 -642 -736 -543 -474
6770 -474 -616 -260 461 -991 -649 -708 -412 -768 -294 188 452 530 580 1308 563 202 639 617 111 -640 459
6791 459 1281 222 668 -228 -449 64 -310 299 -521 -566 -451 249 -583 -621 -681 -736 -42 -702 -301 -353 -258 -28
6813 -28 594 548 -47 826 287 888 421 1508 -165 -169 397 161 339 362 407 146 -512 171 -133 -881 -374
6834 -374 -608 118 -583 -779 -714 -258 120 -672 -1093 267 344 720 -154 1240 -25 760 713 643 768 2
6854 2 488 415 567 89 525 -46 -410 -1229 -457 -541 -498 -324 -683 -975 209 -128 -318 -928 219 -397 75
6875 75 -495 404 1025 499 -403 418 312 170 1190 517 219 578 258 575 126 131 438 68 -538 -947 37
6896 37 -300 -437 -902 -214 30 -1541 -989 -833 -499 -396 -859 -417 202 500 -85 264 -361 364 918 233
6916 233 483 274 629 341 175 -206 705 -294 98 252 -346 -762 -992 -1184 -528 -1190 121 372 -629
6935 -629 -568 -584 28 -7 -379 1024 404 437 -204 518 314 -14 988 121 -208 32 539 599 298 127 70
6956 70 -364 -644 -1141 -689 -543 -663 -966 -840 -338 -89 -360 212 211 -398 -950 -394 -464 -17 536 451 164 151
6978 151 458 352 565 447 384 349 81 334 788 485 10 -486 -169 -986 -581 -288 -159 -153 -529 -240 657
6999 657 -678 -320 -53 492 196 533 406 -140 524 674 843 610 539 428 -17 660 1118 1021 163 525
7019 525 303 155 -436 -72 -742 -157 -495 -529 -208 -517 -469 -599 -553 40 19 320 152 235 -42 -762 682
7040 682 582 746 624 493 115 360 893 325 178 1490 -115 60 199 56 -380 -227 -858 -906 -299 -574
7060 -574 -981 203 -143 -11 154 -458 -280 -401 373 -148 455 -23 686 754 21 494 10 812 452 815
7080 815 182 290 -263 169 -283 362 -324 -545 -785 -64 -224 281 -363 -382 -827 -824 -532 -325 99 -163 324
7101 324 136 126 624 -33 -72 513 372 619 355 544 707 110 767 139 37 -331 -162 -192 -573 -295 -418
7122 -418 -278 -704 -632 746 645 -286 -283 -255 -167 -2 -621 640 22 899 391 119 513 878 180 -423 1354
7143 1354 1003 64 447 122 -162 426 -436 442 1 -316 -224 -165 -1097 -389 -139 -223 -232 -678 -767 -622 114 75
7165 75 61 419 908 435 710 899 -163 1367 809 673 -7 620 303 485 913 208 596 90 -225 -390
7185 -390 -319 -717 -1433 -693 -547 -790 -730 -1099 -143 -64 -623 241 -217 -8 388 76 -82 579 659 235 432
7206 432 -302 1293 1141 -3 -139 -168 263 -216 -349 -427 535 -346 511 -865 -888 -303 706 -557 63
7225 63 -385 -533 -750 -364 193 529 567 353 311 189 100 -114 846 521 1238 -71 -141 143 -94 278 180 -359
7247 -359 -529 -921 -240 -922 -697 -329 -345 -612 -276 64 -753 491 218 134 -72 -415 196 405 117 565
7267 565 412 752 298 963 678 652 -491 289 144 798 -528 220 -478 -522 -374 -828 -1207 -79 -155 -582
7287 -582 75 -468 -740 244 -616 375 -349 -309 -554 673 890 75 730 603 906 -330 1048 731 -112
7306 -112 -209 384 237 -36 -544 24 -26 -864 -947 -604 -1130 -555 -285 96 -688 -288 -195 -583 -190 326 -139
7327 -139 -146 334 653 509 31 650 407 1131 767 678 -382 -192 1083 517 356 -107 -236 -103 -428 -455 -821
7348 -821 -189 -338 -341 -490 -5 -34 -80 -61 -26 -896 -226 536 45 -23 540 120 601 550 550 1033 493 -742 -500
7371 -500 425 294 -25 185 -151 64 -284 -172 -305 -431 -837 27 -503 -716 -379 -286 -560 18 433 -453
7391 -453 -324 549 669 840 -215 -155 1773 411 904 486 36 -418 311 -284 170 -61 -210 -681 -537
7410 -537 -361 112 -666 -216 -158 -778 -487 66 -200 -328 -427 179 -459 530 431 7 389 525 440 82 264
7431 264 25 614 90 563 -601 135 75 678 -345 -169 -645 -705 197 329 102 449 -1243 241 -273
7450 -273 -337 -10 -593 590 -387 -64 -415 493 565 222 -24 795 14 251 -169 -203 110 -559 122 720 -248
7471 -248 -309 -101 2 -880 -1244 -456 -463 -862 -612 -791 -744 -330 181 -78 91 -560 441 465 998 790 1390
7492 1390 99 520 834 -329 -444 363 -237 135 -519 7 544 -505 154 -361 -787 -4 -385 -395 -506
7511 -506 -511 -746 -187 -972 -625 175 -528 -657 -299 636 95 536 524 730 751 521 424 21 316 111 -449 298
7533 298 501 948 205 674 -874 -677 -473 -1155 53 -1169 -436 -373 -674 -404 38 -447 2 -33 -312 489
7553 489 686 238 515 860 -123 -370 638 573 -420 636 407 577 828 432 -270 -459 -58 -396 -115 -218
7573 -218 213 -975 -648 -133 -383 103 -529 28 37 180 -261 -102 553 -477 411 1257 -58 691 604 283
7593 283 631 -36 1334 55 -508 -112 198 26 436 -124 11 -118 -577 194 -249 -83 -132 16 -1197
7612 -1197 240 124 172 -243 -495 401 224 43 -138 -80 1200 -227 -240 713 -335 -14 1038 -739 604
7631 604 -512 -891 -311 -27 -466 -552 -151 -733 -272 19 -120 -502 -357 -287 -384 578 572 813 -120 -324 396
7652 396 530 148 106 807 141 1077 -50 790 766 168 368 74 -689 -646 81 -503 -153 -478 -561 -369 -731
7673 -731 -425 -311 -405 325 499 -17 -401 705 -281 313 536 1005 274 854 -65 971 83 335 1104 396
7693 396 499 -167 -13 180 136 -228 -845 -130 147 -652 -200 -35 -303 -162 547 -76 522 -105 198 -328
7713 -328 -560 50 266 484 359 178 650 86 -284 15 -60 188 -233 89 384 -332 -51 85 -207 -859
7733 -859 -542 -595 -602 -71 -1023 -823 -783 -247 -430 -445 -119 410 252 143 -154 37 297 939 -444 326 700
7754 700 686 -190 145 125 80 289 -125 -38 290 -467 235 -547 -799 -18 392 329 -344 -134 -520 108 241 371
7776 371 -155 235 108 -62 500 -185 -102 184 385 -58 304 567 -438 -137 273 296 -322 -738 57 -49
7796 -49 -1033 -396 41 -186 453 115 197 139 219 -611 -750 463 562 633 -11 -72 425 -235 488 190 -567 40
7818 40 -275 293 140 -339 434 480 72 -724 -938 -143 270 -221 -429 -267 -1364 -263 -401 -823 -26 -235
7838 -235 503 1 243 191 963 -50 -94 288 454 364 179 311 378 14 29 952 102 216 612 38 -872
7859 -872 406 61 -489 -18 -385 -632 -650 -629 -359 -452 67 88 -827 -372 665 92 333 -360 594 396 37
7880 37 181 486 785 -138 610 26 182 1205 236 27 -118 -1007 -207 -827 -256 -510 -665 -25 183 -451
7900 -451 -334 -91 102 54 -313 545 538 164 445 264 347 -212 894 743 354 -82 373 580 436 131 356
7921 356 117 -331 -120 -319 -366 -465 -652 -411 -271 -405 -63 -321 -322 -166 373 -6 630 -264 -422 66 41 -28
7943 -28 463 475 786 548 -279 -156 -107 -101 328 -35 447 -1071 479 -339 -75 642 -361 -526 73 412 -27
7964 -27 -748 -422 123 -132 569 507 560 310 464 512 25 741 -254 530 -87 101 660 -300 354 -259 -700
7985 -700 -646 38 122 -1080 -618 175 -915 -73 388 -543 -220 -499 252 136 -42 -12 281 -27 62 332 435
8006 435 -71 573 233 -251 184 -130 253 398 774 11 276 3 265 167 -281 -587 -387 -247 -456 -178
8026 -178 -455 -320 -346 291 -23 -81 27 -414 119 -108 39 269 -185 326 -57 50 328 141 309 300 145
8047 145 -326 -162 251 273 0 500 -523 -541 -372 -719 -818 -330 267 -163 -638 -117 99 -661 280 -164 460
8068 460 -26 291 -144 336 982 563 684 -275 50 -539 -79 378 7 -66 -709 -590 -206 255 -563 -494 -321
8089 -321 -269 -555 277 -104 -678 -159 -195 -159 -200 256 223 -931 786 -124 503 784 -149 423 393 -308 513
8110 513 58 289 -121 -44 -249 166 201 193 -170 -450 600 -659 -443 -193 -282 -393 -185 -145 79 -203 -71
8131 -71 778 -866 422 412 457 243 -86 552 1289 676 -47 -46 -184 372 -56 -285 -587 -262 -117 -429 -585
8152 -585 -106 -143 -856 -392 -58 665 306 -122 492 -448 -308 614 35 943 946 140 -202 520 445 -339 82
8173 82 192 -272 -273 37 46 -283 46 -279 424 150 -158 -459 -502 72 -69 -1287 -636 -90
8191i0
##END NTUPLES=NMR FID
##END=
