##TITLE=1H_IAMT155
 CDCl3, 8 sc, 
 26.07.2021
##JCAMPDX= 6.0         $$ Bruker NMR JCAMP-DX V2.0
##DATA TYPE= NMR FID
##DATA CLASS= NTUPLES
##ORIGIN= UXNMR, Bruker Analytische Messtechnik GmbH
##OWNER= root
$$ XWIN-NMR		Version 3.5
$$ Mon Jul 26 13:25:23 2021 Russian Standard Time (UT+4h)  she@DPX200
##.OBSERVE FREQUENCY= 200.131506
##.OBSERVE NUCLEUS= ^1H
##.DELAY= (6, 6)
##.ACQUISITION MODE= SIMULTANEOUS
##.ACQUISITION SCHEME= undefined
##.AVERAGES= 8
##.DIGITISER RES= 18
##SPECTROMETER/DATA SYSTEM= spect
##.PULSE SEQUENCE= zg30
##.SOLVENT NAME= CDCl3
##.SHIFT REFERENCE= (INTERNAL, CDCl3, 0, 15.7039)
##AUDIT TRAIL= $$ (NUMBER, WHEN, WHO, WHERE, WHAT)
$$ ##TITLE= Audit trail, XWIN-NMR		Version 3.5
$$ ##JCAMPDX= 5.01
$$ ##ORIGIN= Bruker BioSpin GmbH
$$ ##OWNER= she
$$ F:/spectra/data/she/nmr/H-F/1/audita.txt
$$ ##AUDIT TRAIL=  $$ (NUMBER, WHEN, WHO, WHERE, WHAT)
(   1,<2021-07-26 13:23:46.04 +0400>,<she>,<DPX200>,
      <created by zg, POWCHK disabled, PULCHK disabled
       configuration hash MD5:
       00 E9 B6 7A A2 85 ED C7 34 08 36 98 17 FE 4E 26
       data hash MD5: 16K
       63 ED EC 60 18 54 2B 06 75 6A 2D 7F A1 2C 90 AB>)
$$ ##END=
$$ 
$$ hash MD5
$$ 84 52 AC A4 B0 18 C6 C6 FD 6C FB D4 8C 30 95 7C
##$RELAX= 
##$RELAX= 
##$RELAX= 
##$RELAX= 
##$RELAX= 
##$RELAX= 
$$ Bruker specific parameters
$$ --------------------------
##$DU= <F:/spectra>
##$EXPNO= 1
##$NAME= <H-F>
##$PROCNO= 1
##$TYPE= <nmr>
##$USER= <she>
##$AMP= (0..31)
100 100 100 100 100 100 100 100 100 100 100 100 100 100 100 100 100 100 
100 100 100 100 100 100 100 100 100 100 100 100 100 100 
##$AQSEQ= 0
##$AQ_mod= 1
##$AUNM= <au_zg>
##$AUTOPOS= <>
##$BF1= 200.13
##$BF2= 200.13
##$BF3= 200.13
##$BF4= 200.13
##$BF5= 200.13
##$BF6= 200.13
##$BF7= 200.13
##$BF8= 200.13
##$BYTORDA= 1
##$CFDGTYP= 0
##$CFRGTYP= 5
##$CHEMSTR= <none>
##$CNST= (0..31)
1 1 145 1 1 1 1 1 1 1 1 1 1 1 1 1 1 1 1 1 1 1 1 1 1 1 1 1 1 1 1 1 
##$CPDPRG= <>
##$CPDPRG1= <>
##$CPDPRG2= <>
##$CPDPRG3= <>
##$CPDPRG4= <mlev>
##$CPDPRG5= <mlev>
##$CPDPRG6= <mlev>
##$CPDPRG7= <mlev>
##$CPDPRG8= <mlev>
##$CPDPRGB= <>
##$CPDPRGT= <>
##$D= (0..31)
0 1.2 0 0 0 0 0 0 0 0.06 0 0.03 0 0 0 0 0.0002 0 0 0 0 0 0 0 0 0 0 0 0 
0 0 0 
##$DATE= 1627291425
##$DBL= (0..7)
120 120 120 120 120 120 120 120 
##$DBP= (0..7)
150 150 150 150 150 150 150 150 
##$DBP07= 0
##$DBPNAM0= <>
##$DBPNAM1= <>
##$DBPNAM2= <>
##$DBPNAM3= <>
##$DBPNAM4= <>
##$DBPNAM5= <>
##$DBPNAM6= <>
##$DBPNAM7= <>
##$DBPOAL= (0..7)
0.5 0.5 0.5 0.5 0.5 0.5 0.5 0.5 
##$DBPOFFS= (0..7)
0 0 0 0 0 0 0 0 
##$DE= 6
##$DECBNUC= <off>
##$DECIM= 24
##$DECNUC= <off>
##$DECSTAT= 4
##$DIGMOD= 1
##$DIGTYP= 9
##$DL= (0..7)
0 120 120 120 120 120 120 120 
##$DP= (0..7)
150 150 150 150 150 150 150 150 
##$DP07= 0
##$DPNAME0= <>
##$DPNAME1= <>
##$DPNAME2= <>
##$DPNAME3= <>
##$DPNAME4= <>
##$DPNAME5= <>
##$DPNAME6= <>
##$DPNAME7= <>
##$DPOAL= (0..7)
0.5 0.5 0.5 0.5 0.5 0.5 0.5 0.5 
##$DPOFFS= (0..7)
0 0 0 0 0 0 0 0 
##$DQDMODE= 0
##$DR= 18
##$DS= 0
##$DSLIST= <SSSSSSSSSSSSSSS>
$$ [...]
##$SUBNAM2= <"">
##$SUBNAM3= <"">
##$SUBNAM4= <"">
##$SUBNAM5= <"">
##$SUBNAM6= <"">
##$SUBNAM7= <"">
##$SUBNAM8= <"">
##$SUBNAM9= <"">
##$SW= 24.9337051412577
##$SWIBOX= (0..15)
0 0 2 0 0 0 0 0 0 0 0 0 0 0 0 0 
##$SW_h= 4990.01996007984
##$TD= 16384
##$TD0= 1
##$TE= 0
##$TE2= 300
##$TE3= 300
##$TEG= 300
##$TL= (0..7)
0 120 120 120 120 120 120 120 
##$TP= (0..7)
150 150 150 150 150 150 150 150 
##$TP07= 0
##$TPNAME0= <>
##$TPNAME1= <>
##$TPNAME2= <>
##$TPNAME3= <>
##$TPNAME4= <>
##$TPNAME5= <>
##$TPNAME6= <>
##$TPNAME7= <>
##$TPOAL= (0..7)
0.5 0.5 0.5 0.5 0.5 0.5 0.5 0.5 
##$TPOFFS= (0..7)
0 0 0 0 0 0 0 0 
##$TUNHIN= 0
##$TUNHOUT= 0
##$TUNXOUT= 0
##$USERA1= <user>
##$USERA2= <user>
##$USERA3= <user>
##$USERA4= <user>
##$USERA5= <user>
##$V9= 5
##$VALIST= <valist>
##$VCLIST= <CCCCCCCCCCCCCCC>
##$VD= 0
##$VDLIST= <DDDDDDDDDDDDDDD>
##$VPLIST= <PPPPPPPPPPPPPPP>
##$VTLIST= <TTTTTTTTTTTTTTT>
##$WBST= 1024
##$WBSW= 4
##$XGAIN= (0..3)
0 0 0 0 
##$XL= 0
##$YL= 0
##$YMAX_a= 656477
##$YMIN_a= -761008
##$ZGOPTNS= <>
##$ZL1= 120
##$ZL2= 120
##$ZL3= 120
##$ZL4= 120
##$ABSF1= 10
##$ABSF2= 0
##$ABSG= 5
##$ABSL= 3
##$ALPHA= 0
##$AQORDER= 0
##$ASSFAC= 0
##$ASSFACI= 0
##$ASSFACX= 0
##$ASSWID= 0
##$AUNMP= <proc_1d>
##$AZFE= 0.1
##$AZFW= 0.1
##$BCFW= 1
##$BC_mod= 2
##$BYTORDP= 1
##$COROFFS= 0
##$CY= 11.3945322036743
##$DATMOD= 1
##$DC= 2
##$DFILT= <>
##$DTYPP= 0
##$F1P= 17.5019972093344
##$F2P= -2.517084195857
##$FCOR= 0.5
##$FTSIZE= 0
##$FT_mod= 4
##$GAMMA= 1
##$GB= 0.15
##$INTBC= 1
##$INTSCL= 1
##$ISEN= 128
##$LB= 0.24
##$LEV0= 0
##$LPBIN= 0
##$MAXI= 10000
##$MC2= 0
##$MEAN= 0
##$ME_mod= 0
##$MI= 1.114404
##$NCOEF= 0
##$NC_proc= 0
##$NLEV= 6
##$NOISF1= 3.799351
##$NOISF2= 2.8
##$NSP= 1
##$NTH_PI= 0
##$NZP= 0
##$OFFSET= 15.70392
##$PC= 1
##$PHC0= -12457.35
##$PHC1= 13.60099
##$PH_mod= 1
##$PKNL= yes
##$PPARMOD= 0
##$PSCAL= 0
##$PSIGN= 0
##$REVERSE= no
##$SF= 200.130013532006
##$SI= 16384
##$SIGF1= 3
##$SIGF2= 2
##$SINO= 400
##$SIOLD= 16384
##$SREGLST= <1H.CDCl3>
##$SSB= 0
##$STSI= 0
##$STSR= 0
##$SW_p= 3612.71676300578
##$SYMM= 0
##$S_DEV= 0
##$TDeff= 0
##$TDoff= 0
##$TI= <>
##$TILT= no
##$TM1= 0
##$TM2= 0
##$TOPLEV= 0
##$USERP1= <user>
##$USERP2= <user>
##$USERP3= <user>
##$USERP4= <user>
##$USERP5= <user>
##$WDW= 1
##$XDIM= 8192
##$YMAX_p= 0
##$YMIN_p= 0
$$ End of Bruker specific parameters
$$ ---------------------------------
##NTUPLES= NMR FID
##VAR_NAME=  TIME,          FID/REAL,        FID/IMAG
##SYMBOL=    X,             R,               I
##VAR_TYPE=  INDEPENDENT,   DEPENDENT,       DEPENDENT
##VAR_FORM=  AFFN,          ASDF,            ASDF
##VAR_DIM=   8192,          8192,            8192
##UNITS=     SECONDS,       ARBITRARY UNITS, ARBITRARY UNITS
##FACTOR=    0.0002004,     1,               1
##FIRST=     0,             0,               0
##LAST=      1.6414764,     0,               0
##MIN=       0,             -761008,         0
##MAX=       1.6414764,     656477,          0
$$ Real data points
##PAGE= N=1
##DATA TABLE= (X++(R..R)), XYDATA
0@%%%qJ6j6J6k4M0n0N8q0J05j26J51j87K27k68L22l79M41n19O06o97Q02r25J059
27E64j201J363j549J750j967K207k473K763l081L432l814M233m698N207n763O381
43C354p068P825q669R623j0707J1939j3357J5020j6994J9379k2337K6117l1138
56a7013L8187m8866O7120j06510L28277l74551o47652Q22089N12035m57408n70937
67d55229L08640M41563j19537l38183K4178J04834J49472Q1780j98361l02842
77c03685J39862M63984L1564n78831j44116N38409K21735m19410k65528K82566
87c3450L04216j80923k68725K8434J70877J59317l1757k94594j17754K92088K80384
98C08113k11175l97220J36858M16421q4240l57268N506K89647Q4033k12844j23495
$$ plain form
0 0 0 0 0 -8 8 -8 8 -16 24 -26 32 -48 57 -69 82 -105 122 -146 176 -203 238 -281 325 -372 430 -495 564
27 564 -637 726 -823 927 -1040 1167 -1306 1457 -1624 1808 -2006 2227 -2471 2736 -3027 3354
43 3354 -3714 4111 -4558 5065 -5642 6297 -7060 7960 -9034 10345 -11992 14125 -17013
56 -17013 21174 -27692 39428 -67082 261195 -113356 -761008 61081 573116 115708 -455229
67 -455229 -146589 294974 175437 -162746 -138568 -33734 115738 197518 -843 -303685
77 -303685 -163823 300161 331725 -247106 -391222 147187 368922 -50488 -316016 -33450
87 -33450 270766 89843 -178882 -150448 20429 179746 147989 -146605 -264359 27729 308113
98 308113 96938 -300282 -163424 252997 168757 -188511 -183005 106642 190675 -22169 -145664
109a45664O9037R3556J41485j7997l15824r5984L76909K43051l65586l79008L50434
120d5591M52439l15928m68567K14896M70388o7528m42568n7013L17969J24703
130A83200j01792j43615j05378J12516K36731k1504l22853r8021M08288J98097
140C45669m60641k80192M20178L69483k99663m31678J68056L99012n7341k69745
150i6862l6440J25029R8345k0383j03739p8150O7233K04129j9195l07471m2291
161b09795L25461J33166k67951k19196J88445K31654j09221j65020K2520Q5359
171A5422N9723k8736j04103m4468J09772J58443r8942k64442O1931K99355K0404
182A84359k69340j13167K20038J54716j61417j37500P3691J08702K7636q8338
$$ plain form
109 -145664 -76627 16929 158414 140417 -175407 -271391 105518 348569 -17017 -396025 -45591
120 -45591 406848 90920 -377647 -162751 307637 240109 -202459 -259472 58497 183200
130 183200 81408 -62207 -167585 -55069 181662 160158 -162695 -260716 147572 345669
140 345669 -114972 -395164 25014 394497 94834 -336844 -168788 230224 172883 -96862
150 -96862 -133302 -8273 90072 69689 -34050 -112200 -44967 159162 139967 -167504 -209795
161 -209795 115666 248832 -19119 -238315 -49870 181784 72563 -92457 -69937 15422
171 15422 75145 46409 -57694 -102162 7610 166053 67111 -197331 -135400 163955 184359
182 184359 -84981 -198148 21890 176606 15189 -122311 -48620 60082 87718 -620
192f20j08034L3784J60957P9307j95053j99216J95133K64821j40233k83221N3243
203a39132K87948J0634k74379m1315K18029P6891j27219j19944L5702J18346M4547
214I0108n0018j20103m1309J72229J04827j70050j45552J28902J90336r0523k24954
225a56107N8619K13222l704j60392o8982R7412J07963l0354q5188m5954L6431
236c7034J12659k103j39384l1613J30716Q7004j17212j40579J00892J56310n1857
247F7799j33529k4013R7152P6300n1950p9626j3735O5133Q3280n7260j23261L8800
259e4910J34751J3915j43789p6369J43494J11497j06793j17273L7896J15179K0483
270G8081r9145m5032N3222N9151Q523q2123n6082Q8676Q5579n4500j15235K715
$$ plain form
192 -620 -108654 -74870 86087 165394 -29659 -228875 -33742 231079 90846 -192375 -139132
203 -139132 148816 159450 -114929 -156244 61785 138676 11457 -108487 -72785 45561 90108
214 90108 40090 -80013 -121322 50907 155734 -14316 -159868 -30966 159370 68847 -156107
225 -156107 -97488 115734 112030 -48362 -117344 -19932 88031 57677 -27511 -73465 -37034
236 -37034 75625 73522 -65862 -97475 33241 120245 3033 -137546 -36654 119656 67799
247 67799 -65730 -89743 7409 83709 31759 -47867 -61602 3531 86811 29551 -93710 -54910
259 -54910 79841 93756 -50033 -126402 17092 128589 21796 -95477 -57581 57598 78081
270 78081 -21064 -66096 -12874 46277 54800 -27323 -83405 5271 90850 36350 -78885 -76170
282g6170J38676L3610j26370n5235P7833P7846l2641r2905Q600P7332J7881l8733
294I724n7236M551Q2681K2378p1121o0147L9133R8443j6525j05942j893Q0474
306B4520L3428n1855o4159L4222O7601r137m9062l4197L1467O7079j4462o6127
318c0682j8296M9120N9616l9391p9813K7160P1102K905n9491l7536N4709N1196
330E0599l4350m6205p798M3325M3651l9964n2104J5042M6811K4331m6632m7967
342e1261M1470M9402j3130m9603k1811N3407L7080m0840l7184N085M1337K9042
354D2994m3418m0345K4812M3681R372n2735l3210N2054L9616k6429m6958q360
366c8926N9327K9172n3823l6457K2325M8628R875n8233k6384M3309L8474q952
$$ plain form
282 -76170 62506 96116 -30254 -85489 -7656 70190 37549 -55356 -46756 30576 48457 9724
294 9724 -47512 -42961 39720 62098 -9023 -69170 -30037 68406 51881 -54061 -55954 24520
306 24520 57948 6093 -58066 -23844 43757 34620 -14442 -48639 -17172 49907 35445 -30682
318 -30682 -48978 142 59758 20367 -59446 -32286 38816 41721 -17770 -55306 -597 50599
330 50599 16249 -29956 -37754 5571 49222 9258 -42846 -27804 19007 43338 -3294 -51261
342 -51261 -9791 39611 26481 -23122 -44933 8474 45554 4714 -32470 -27385 13952 42994
354 42994 -424 -40769 -15957 27724 37096 -15639 -48849 3205 42821 16392 -30566 -38926
366 -38926 20401 49573 -4250 -40707 -18382 30246 40121 -18112 -44496 -1187 37287 28335
378B8335n6143j6952O3808K8552m3172m3314R617O1288J2263o1468k7019L6692
390g513M9229p349o7854r889O0567K8128l2649n5296N887P2701J1752o1791l6178
403e0255L6617O5898j5508p7228n102O0729L7120l7302o9307J8834P6607N719
415D6822n9936m1656M0844O9924k2744p2131r375N7907N0250m5130p5561K6686
427c4100P5005J0621o4282n2842N2887P5286k8663p6956j5588P3624N6175o3738
439G429p4115L3042P7350J5247p8071n4274O5989P2659l0899q2478j6122Q8349
451B4106N0682p2943o9847L2017Q6010J4355r4066m5892P5325O7474l4022q7460
463e4261o730R3809L8237p1383o7575L0331R5578P317j01933l9263P6361P3026
$$ plain form
378 28335 -27808 -44760 19048 47600 4428 -38886 -29269 32019 44282 -17186 -44205 -7513
390 -7513 41716 34367 -33487 -43376 17191 45319 12670 -42626 -36739 35962 47714 -14077 -50255
403 -50255 -13638 52260 36752 -40476 -45578 15151 52271 14969 -54338 -35504 41103 46822
415 46822 -13114 -54770 -13926 55998 33254 -38877 -48252 9655 59905 14775 -60786 -34100
427 -34100 40905 51526 -12756 -65598 -12711 62575 33912 -43044 -58632 14992 71167 7429
439 7429 -66686 -33644 43706 58953 -19118 -73392 -7403 65256 34357 -48121 -64243 24106
451 24106 74788 1845 -68002 -35985 50025 64380 -29686 -75578 -253 67221 33199 -54261
463 -54261 -60991 32818 71055 -328 -67903 -37572 58006 65323 -36610 -75873 488 73514
475G3514l6964r9390K853J00327L0752p4432p0242M2841R7789j1762r6749k8591
487g0054P2656P4773m2634j01903R121R8968L4508p9778p7288N6838R7551k3875
499D8883r4320k4138Q1213P0944n9570r4140J9111R4249L5662q4249p9630O1078
511b4907R8497j7908j03293l2944J02619P1497q4090r3141L8536J05449J6061
522G6376j04526n8412P5744Q5297k3726j02127k6385J03411O1290p8660r0614
533h2332L4909J16008R018j21941m7386R4879Q4486m8201j09440L701J03976L5688
545G3365p1967p3892L2016J01622L951j03566m4294Q2587Q9614n0124j17752R834
557f8606J11330L8394q1281q1519M5468R8982n364q9108m2565O8610Q8724m2584
$$ plain form
475 73514 36550 -62840 -59987 40340 71092 -3340 -73582 -30741 67048 55286 -41463 -70054
487 -70054 2602 77375 34741 -67162 -58041 40927 75435 -4343 -81631 -24793 72758 48883
499 48883 -45437 -69575 11638 82582 23012 -71128 -52017 42232 77894 -6355 -85985 -24907
511 -24907 73590 55682 -47611 -80555 22064 93561 9471 -83670 -45134 60315 76376
522 76376 -28150 -86562 -10818 74479 50753 -51374 -77759 25652 86942 8282 -82332
533 -82332 -47423 68585 77603 -44338 -91724 3155 87641 39440 -70000 -66299 37677 73365
545 73365 1398 -72494 -40478 61144 65095 -38471 -82765 -178 89436 39312 -78440 -68606
557 -68606 42724 81118 -163 -81682 -36214 62768 57404 -31704 -74269 -5659 83065 40481
569D0481j15191j003J18573N9275j05798j06649P6151J24932k7521j18902k6010
580h1662J03067O4249p5542q4673K7961R6869K9969r6791p9090O9548J12412j4845
592G1472j29759m1857J26471P8420r8541j00077N5981J16400j4670j18014k2500
603g6674R3235O2300m6821r5264m232R8586M9936p0086q7818L1569J11790M73
615F6994j12506l1235R4655O7899o9601r6759L4546R8493J3699p2373o2614L5373
627c3429Q7546N870q3476m9611O7677Q5992n1860j06356K5435J10766J8659j02201
639b4988o3341P5142Q6655k5461q4829l2929O6527P4826l6833r4948m643J07115
651D2293N1798j14822r3294J02062J24828o1353j43194P753J38246L3418j02908
$$ plain form
569 40481 -74710 -75713 42860 102135 -3663 -110312 -34161 90771 63250 -55652 -81662
580 -81662 21405 85654 10112 -74561 -46600 50269 80238 -16553 -95643 -26095 86317 71472
592 71472 -58287 -100144 26327 104747 6206 -93871 -37890 78510 63840 -54174 -76674
603 -76674 16561 78861 32040 -63224 -67456 31130 81066 10980 -76838 -45269 66521 66994
615 66994 -45512 -76747 17908 85807 16206 -80553 -46007 52486 66185 -6188 -68802 -33429
627 -33429 54117 59987 -23489 -73100 -5423 80569 28709 -77647 -52212 58554 77213 -24988
639 -24988 -88329 -13187 73468 48007 -36822 -69751 -3224 71602 34769 -60179 -64822 42293
651 42293 94091 -20731 -114025 -11963 112865 51512 -91682 -83929 54317 87735 -15173
662a5173n6557N2308O8206o625o8984k9875N2351O7606j9792j06068k0982J23622
674D0037O4971j07327j04376P2734J25393l9766j20453J2221R8127J5637p3353
685a6155m1779M7037N4639o750m8911m1634K8686P4219N97p6237l4869O0720O0440
698F0003m4564o7206K7475O2946pn6345l4196M0835O1268m907p2098m6478O8005
711e269Q8003m9372j04695K1547J06553O203j06554k6743R8526M2418p1374n6700
723e7457K9221O0027J2196l5728m2704r824N9430N2615o2533q0995N2608J02873
735G9729l4566j26064J3881J39925J2878j28917m6213R4377P0718n3172o9557
746d6981J5546M6056J6591j9695m0134j138N2985K6278n7531o0644N1763R0380
$$ plain form
662 -15173 -71730 -19422 48784 42159 -26825 -56700 -4349 63257 43465 -62603 -83585 40037
674 40037 105008 -2319 -106695 -33961 91432 51666 -68787 -56566 41561 57198 -16155
685 -16155 -57934 -10897 43742 36992 -11919 -53553 -24867 49352 49949 -26288 -61157 -437 60003
698 60003 15439 -51767 -24292 38654 38647 -17698 -51894 -11059 50209 45302 -26796 -73274 -5269
711 -5269 82734 33362 -71333 -49786 56767 62970 -43584 -70327 28199 70617 -757 -57457
723 -57457 -28236 31791 43987 8259 -34445 -44269 15161 67776 5243 -75752 -23144 79729
735 79729 45163 -80901 -67020 72905 85783 -43134 -89347 5030 75748 22576 -46981
746 -46981 -31435 14621 31212 11517 -28617 -29755 23230 49508 -8023 -68667 -16904 73476
758G3476l3684r6756L636Q0470K4400n4899l3316K7907K5721j55j8008k6945J2273
771a5880M9329L261o3098l4721O7944O5303n7213p8192L1637P1947m953n8157
783b2793r427M1412J4035j7290k0600j2823K8275M3215k2187o9767l212Q6585
795C5423L3662q7645n1741P2810N7643n1189o0572L4147O0389j9356m9971k131
807b8531K6641K6276M273l5716l6235K4397O4101m891q0192q768Q1328J8281p4534
820b3570l1637O7445M5492n3460n0231K7434M0348M575k0612k4523n169K5668
832A760L1930j8981n2818J5757O4101j1019o8876l255P0981K1275o4200l1998
844d5343M1074L1565j0345k1564j2261N734K1062J3461k4853l1961K9956M6043
$$ plain form
758 73476 39792 -56964 -53328 27142 51542 -3357 -36673 -8766 16955 16800 -1208 -28153 -15880
771 -15880 33449 36710 -26388 -61109 6835 72138 14925 -63267 -31630 40317 35364 -22793
783 -22793 -32220 9192 23227 5937 -14663 -27486 789 44004 21817 -47950 -51162 35423
795 35423 69085 -18560 -70301 2509 60152 8963 -51609 -17462 42927 23571 -26400 -28531
807 -28531 -1890 24386 28659 -7057 -43292 -18895 45206 40315 -39877 -48645 32683 50964 -23570
820 -23570 -55207 12238 57730 4270 -45961 -18527 21821 26396 5784 -18739 -23908 1760
832 1760 33690 14709 -38109 -22352 41749 30730 -38146 -41401 29580 50855 -13345 -45343
844 -45343 -4269 27296 16951 -4613 -16874 -11140 9922 23383 -1470 -33431 -3475 42568
856D2568l0935n7404J9913O6917j577o7205j2394N1383J7305k6070j6465N194
868h770J0579O700j22j7310j2024L1196K3384l9175l5663L3333M7629j8936n3417
881c2596O553M5762O83k8830n428J4227Q162m580o139q878J48K7120P736m0701
895a6761j8008M1222L1035l2100l9664K2684L7218j5376k7292O579J8557J944
907A0038j1569n584q47N432J9413j595l4930n929L8513J7662l5332k7099L1561
920b66K8592k6445k3769J7586J9712o539j6037j822N728N041J1401m883k5304
933a7005P14K9897R101k8637j8275K6702K0824k3300j8830J4755J6549l097j3263
946c865n243L372R821J2664j1134k6948Q210L2161P02l2521j1513L2523J8505
$$ plain form
856 42568 11633 -45771 -25858 41059 39482 -27723 -40117 11266 28571 2501 -13964 -8770
868 -8770 1809 8509 8387 -8923 -20947 10249 33633 -5542 -41205 -7872 39757 20821 -32596
881 -32596 -26043 19719 20402 -8428 -13856 371 8533 3953 -2186 -11064 -10916 16204 23940 -16761
895 -16761 -34769 6453 37488 5388 -34276 -11592 25626 10250 -17042 -10463 8094 10038
907 10038 -1531 -7115 -7962 -2530 16883 15288 -19642 -25571 12942 30604 -4728 -31827 -266
920 -266 28326 1881 -21888 -4302 15410 8871 -7166 -8988 -3260 1781 13182 8299 -17005
933 -17005 -16291 13606 22707 -5930 -24205 2497 23321 21 -18809 -4054 12495 9398 -3865
946 -3865 -9108 -5736 4085 16749 5615 -21333 -13123 19038 19740 -12781 -24294 8229 26734
959B6734k9108k1579J8746K4589m565k5307q222J7432J6960j170k3052j4691K4706
972A473K4670j8630l1493Q141L7334Q03l8176r553L0763J8834j7117k6117L576
985a5492K5141Q344j5281j9638K503K7080Q305k6990j9088K0725L0841j2296l8162
998b4008K879L5688R437k6367k2062J4330K7250p81k3139j4406J5784K7428p106
1011A4927l2610n836L1225K1260k6206l4225J7327L9308k942l6676j3584L0178
1023B146K5662j9075k9803J606K9620J6763k6337k9441J6305L6411M99l8871j7534
1036c2049L5363K9573k3470l6921N972M0100J0131l6078k1864K4013L0720o184
1048A9306l6568j0138L3688K3996k2290l5574O898M2221P733l8853k1097K6663
$$ plain form
959 26734 -2374 -23953 -5207 19382 14817 -10490 -18712 -1280 15680 14510 -8542 -23233 1473
972 1473 26143 7513 -23980 -15839 21495 22298 -15878 -25431 5332 24166 7049 -19068 -15492
985 -15492 9649 17993 2712 -16926 -14423 12657 20962 -6028 -25116 -4391 26450 14154 -24008
998 -24008 -21129 14559 23996 -2371 -24433 -10103 17147 16366 -6773 -21179 -5395 22033 14927
1011 14927 -17683 -23519 7706 28966 2760 -31465 -14138 25170 22228 -14448 -28032 2146
1023 2146 27808 8733 -21070 -19464 10156 26919 582 -28859 -12554 23857 24356 -14515 -32049
1036 -32049 3314 32887 9417 -27504 -21532 18568 28699 -7379 -29243 -5230 25490 19306
1048 19306 -17262 -27400 6288 30284 7994 -27580 -20682 21539 29272 -9581 -30678 -4015
1060d015L3474j1763m0027l272L6515J8678k5765l1948J1678L8762L706l5357
1072i334k0999K5748L5390j3541m1714j732L8673J9077k9761l3113J7586L8368
1084B4648j03l6850j8832K9817L3436j8155l9802P76L8886J8569l3002l2579K0975
1097a2216L9108l191m0114j5243L5419K7894k2481l5370L949L7848J4733l3429
1109c093k8865K0845L7793l279m1845j3567L7451K6970k3872l7012O399M1445
1121A9370J0534l7244k4518K3474L6327o702m1338j0147L7177K6202k4930l9782
1133c1577J0046M5895N918m2227k2578L0858L6268j5685m2279j364L8904K0084
1145C2263k9172l5201J5902M1529J682l9743k1394L2445L6656j9344m3614J561
$$ plain form
1060 -4015 29459 17696 -22331 -25603 10912 29590 3825 -28123 -16445 22317 26023 -9334
1072 -9334 -30333 -4585 30805 17264 -24450 -26182 12491 31568 1807 -31306 -13720 24648
1084 24648 24545 -12305 -31137 -1320 32116 13961 -25841 -25065 13821 32390 -612 -33191 -12216
1097 -12216 26892 23701 -16413 -31656 3763 31657 9176 -26194 -22245 15603 30336 -3093
1109 -3093 -31958 -11113 26680 23401 -18444 -32011 5440 32410 8538 -28474 -22075 19370
1121 19370 29904 -7340 -31858 -8384 27943 21241 -20097 -30244 6933 33135 8205 -31577
1133 -31577 -21531 24364 30282 -11945 -34523 -3665 32603 16918 -25361 -26725 12179 32263
1145 32263 3091 -32110 -16208 25321 27003 -12740 -34134 -1689 34967 15623 -27991 -26430
1157b6430M2991J6892l6039l0488K2786L7026m367l7808j5120L2832L0538k0217
1169A2596l9578K126M2077J6872l8108l1142K5570L9834p771m3456r382M0041
1181I679K3460k7570l4121R304L9209R410l6058k5767K3817L8669p346m4913q734
1194c0961M2396K3351l2042l6277J7473M3302j397m1378j6259L1573L1721j6851
1206A4651l9154q46L7450J9486k9522l5393J7659M4377k806m5101j4776L9817
1218E842L0290k8224l8624J0251L9049R343l3086k5256K1570L3712m802l6432
1230a6367j2935L4085K8477k5502l9098R551M4459Q560m2335k3072L0676L2527
1242B9026j3183l5500n222L2937J9914k3121l1641P269M0408R029m0088k5165
$$ plain form
1157 -26430 16561 33453 -2586 -33074 -10288 26738 22371 -15437 -30557 2275 32813 12596
1169 12596 -26982 -24856 17221 34093 -4015 -35157 -9587 30247 22476 -20980 -30362 9679
1181 9679 33139 5569 -28552 -19248 19961 29371 -6687 -32454 -8637 30032 22686 -22227 -30961
1194 -30961 11435 34786 2744 -33533 -16060 27242 25845 -15533 -31792 -219 31502 14651
1206 14651 -24503 -25349 12101 31587 2065 -33328 -15669 28708 25902 -19199 -33975 5842
1218 5842 36132 7908 -30716 -20465 18584 27927 -5159 -30415 -8845 24867 20065 -16367
1230 -16367 -29302 4783 33260 7758 -31340 -21789 22670 31230 -11105 -34177 -3501 29026
1242 29026 15843 -19657 -24879 8058 27972 4851 -26790 -19521 20887 29916 -10172 -35337
1254c5337L0951L8439j5454m5434n41M2786J4880l2960k6450J9049L4625m387
1266B0167l4742j2634K8064K9981j7010m0761J867M2302J4423l5961k7895K5917
1278f282L4970j3090l5796j031L1659J5168k4042k5308J0379K8883Q013k6549
1290c026k3423J7952L2555n609l5230p740L4280J8067k8939k5431J7588L0523
1302B1567k838l0234j1815K2540K2106q085k7082p802K6162J9291j9030k7652
1314b2872Q662L3935K589l5482j4264K9440K5211j6578l2529J170L1146J4124
1326B4552k2606k5820J1017L2905M51l4935j2088L1470K4472k4057l3704J2156
1338a6187L6156K400l0346j5449J9372K2182o882k1424o753J8145J8448j2996
$$ plain form
1254 -35337 -4386 34053 18599 -26835 -27376 15410 30290 -2670 -29120 -10071 24554 20167
1266 20167 -14575 -27209 855 30836 13826 -26935 -25068 17234 31657 -4304 -32199 -6282
1278 -6282 28688 15598 -20198 -21229 10430 25598 1556 -23752 -13373 15510 23523 -3026
1290 -3026 -26449 -8497 24058 18449 -16781 -24521 9759 27826 -1113 -26544 -8956 21567
1302 21567 18729 -11505 -23320 -780 21326 13241 -13841 -21643 4519 23810 4780 -22872
1314 -22872 -14210 19725 22314 -13168 -27432 2008 27219 10641 -21888 -20718 10428 24552
1326 24552 1946 -23874 -12857 20048 20499 -14436 -26524 4946 29418 5361 -28343 -16187
1338 -16187 19969 22369 -7977 -23426 -4054 18128 11246 -10178 -16931 1214 19662 6666
1350F666k7331M547L2632P738l2569k0398K6917K7494j5803k8118L219K4597N916
1363A5507j8604j0635J0158J4109l6j5889j0120J2654J9117l966k4328o743K3311
1376D535J4777j6223j8304P248J8236K063j7551r012J3274J6272n227k3111n171
1389a8194K5095J6219j9705k4672J0015K8251j709k6540m688K1609J0410j5286
1401H05j5249P512J6953L533j4145j5355O891K2972K699k4231j1782K0813J8102
1414A9518j6359k1371J1922K2025n139k1216l771J7419J0367q525j2390l306J0410
1427d16J2324m846j6739j389J7676O698j8240j0611J7303J3742j2538j5862M389
1440h509J5340L065r303p614K18Q321P194o263j1496L232J3966O13j6707m267
$$ plain form
1350 6666 -20665 -16118 16514 24252 -8317 -28715 -1798 25696 9893 -18225 -15006 9591 15507
1363 15507 -3097 -13732 -3574 10535 10499 -5390 -15510 -2856 16261 12295 -12033 -18776 4535
1376 4535 19312 3089 -15215 -7967 10269 12332 -5219 -14231 -957 15315 10088 -13023 -18194
1389 -18194 6901 23120 3415 -21257 -11242 17009 15300 -11240 -15928 5681 16091 805
1401 805 -14444 -6932 10021 13554 -591 -15946 -9055 13917 16616 -7615 -19397 1416 19518
1414 19518 3159 -18212 -6290 15735 10596 -10620 -14391 3028 13395 4870 -7520 -10826 -416
1427 -416 11908 7062 -9677 -11066 6610 13308 -4932 -15543 1760 15502 2964 -12898 -8509
1440 -8509 6831 9896 593 -7021 -6803 1518 8712 2449 -9047 -5815 8151 8764 -7943 -12210
1454a2210J8069Q342j4895j2014P236J3172k5q952n416J939Q278M300r547p943
1468i666R254J1584p935j6166N024J9412k07j8305m586J2807P905o540p365K207
1482b577K845K167P9n579k145Q780N502j0385j0808J0180J4598o818j4764K050
1496f875J1250J156o366k018L365M43M1O56m309j077Q190L460j1286q077J1596
1511A49J3150r826j4045O112J1334k174q201L54N390j43j579j044l242J694Q543
1526F472J21j2152n203J3040J0470j1388j2515P700J1563m075r706J332P765Q24
1540D248m037l753j604N839P708m775j2651L56J5107M574j4295p741J1578Q990
1554I544p927r914M174R761P1p368m723K240Q998M257r955j0628P309J4835l358
$$ plain form
1454 -12210 5859 14201 -694 -12708 -5472 7700 7675 -1277 -6693 -4754 3524 7824 -1723 -9666
1468 -9666 -412 11172 3237 -12929 -7905 11507 11300 -7005 -11591 1216 9121 2581 -4784 -2577
1482 -2577 268 2435 2514 -3065 -5210 3570 9072 -1313 -12121 -1941 12657 5839 -8925 -6875
1496 -6875 4375 5531 -835 -2853 512 955 996 1652 -2657 -3734 4456 7916 -3370 -11447 149
1511 149 13299 3473 -10572 -4460 6874 4700 -3501 -3147 2243 2100 521 -523 -3765 -2071 6472
1526 6472 6593 -5559 -10762 2278 12748 1360 -11155 -3455 8108 4033 -5673 -4341 3424 4248
1540 4248 211 -3542 -5146 693 8401 3626 -9025 -8669 6438 11012 -3283 -11024 554 9544
1554 9544 1617 -8297 -4123 5638 5709 -1659 -6382 -4142 4856 9113 -842 -11470 -4161 10674 7316
1569G316j6710L16J6164K286j3812n625J0794Q470o195r053m0O342O210j649r613
1584d799l815R740Q929p995j2979O543J4963l792j5770o38J4781N268j0933q153
1598h650M850Q124K533o430p440K677J0041K312j1431p073J1607J1481r740j5004
1612a2143N374J6519O53j5138o036J0750Q871m117r688k440Q709Q072n732j2792
1626i138J373J5510M653j6516j0021J2876J4760p163j6694J116J5423M242j1583
1639a162q327N668J1243K58j1443o789R318J2967n030j7066m69J7388O135j4247
1653a556j1274R679J3440l958j3240j820J0904P438o772j1183R89J1721O318j0411
1667B75j2599O932J5909j237j6607m588J4659R725j1189j2377M989J3490J942
$$ plain form
1569 7316 -9394 -9078 7086 9372 -4440 -10065 729 9199 3004 -6049 -6089 253 6463 4814 -4799
1584 -4799 -8614 1126 10055 2060 -10919 -4376 10587 6795 -8975 -9613 5168 10436 -497 -8650
1598 -8650 -3800 4324 6857 427 -7013 -4336 5705 8017 -3414 -10487 1120 12601 2861 -12143
1612 -12143 -6769 9750 10403 -4735 -10771 -21 8850 4733 -4955 -7395 1314 9386 3654 -9138
1626 -9138 -7765 7745 12398 -4118 -14139 -1263 13497 6334 -10360 -9244 6179 10421 -1162
1639 -1162 -9489 -3821 7422 7680 -3763 -10552 -1234 11733 6703 -10363 -10832 6556 12691 -1556
1653 -1556 -12830 -3151 10289 6331 -6909 -8729 2175 9613 2841 -8342 -7353 4368 10686 275
1667 275 -12324 -5392 10517 9280 -7327 -11915 2744 12469 1280 -11097 -6108 7382 9324
1680I324j2377q271Q410J2616j783j4397n231J3474J1151r776j5629M186J7667
1693I364K448j7405p999J3633J2668p105j5467k35J5015P255j1147j3111N190
1706f896J6411J901j6765q186J3434J4110q052j7925J758J8068M896j4644j1027
1719a2917R037J5055k480j4854n137J2097J1915p198j6528J091J7298O040j5554
1732b135j2246J0931J6639m424j7484l342J5668J0029j1337j4223M382J5824L487
1745A1769j4748j0290J0605J5492m308j8142l120J7651R904j4094j4729P430J7359
1758A0779J42j7151o974J3252J3145p347j6639k36J7020P750j4122j3919Q278
1771f022J8190j042j9095o296J6235J2584j0479j6988L436J7667M179j4657j1711
$$ plain form
1680 9324 -3053 -11324 -2914 9702 7919 -6478 -11709 1765 12916 3140 -12489 -8303 9364
1693 9364 11812 -5593 -13592 41 12709 5604 -9863 -10098 4917 12172 1025 -12086 -6896
1706 -6896 9515 11416 -5349 -13535 -101 14009 5957 -11968 -10210 7858 12754 -1890 -12917
1719 -12917 -3880 11175 8695 -6159 -11296 801 12716 5518 -11010 -9919 7379 13419 -2135
1732 -2135 -14381 -3450 13189 8765 -8719 -12061 3607 13636 2299 -11924 -7542 8282 11769
1745 11769 -2979 -13269 -2664 12828 8520 -9622 -12742 4909 14813 719 -14010 -6580 10779
1758 10779 10921 -6230 -13204 48 13193 5846 -10793 -11029 5991 13741 -381 -14300 -6022
1771 -6022 12168 11126 -7969 -14265 1970 14554 4075 -12913 -9477 8190 12369 -2288 -13999
1784a3999J0023J6641l489j8093m336J6189J1678j1981j6315N434J8158K243j6871
1797d718r343J2845J4146o204j6481j452J5496Q953j1522j4672N541J7347J955
1810A1891j7177r046J4252J3877q100j6703Q02J6958O139j4031j1527Q048J4813
1823A0196p15j5762o026J3226J2009p973j6395J688J7689M931j5519j0672J0890
1836b433J4518m586j5654k320J3673Q593r250j3256L462J5178L029j3678r738
1849a2462J0104J4602m684j6635j712J5762P539j2140j2281O983J4138n27j3549
1862d862o150J0711J1312n690j4231m80J4642P027j2661j1581P937J4084j968
1875H090j4970l178J2683P641q578j0403L015J1009L057r472q286N598J1702k93
$$ plain form
1784 -13999 -3976 12665 9176 -8917 -13253 2936 14614 2633 -13682 -8248 9910 12153 -4718
1797 -4718 -14061 -1216 12930 6726 -9755 -11207 4289 13242 1720 -12952 -7411 9936 11891
1810 11891 -5286 -14332 -80 13797 5697 -11006 -10204 6754 12893 -1138 -12665 -4617 10196
1823 10196 9481 -6281 -12307 919 12928 4955 -11440 -9752 7937 12868 -2651 -13323 -2433
1836 -2433 12085 7499 -8155 -10475 3198 11791 2541 -10715 -7253 7925 10954 -2724 -12462
1849 -12462 -2358 12244 7560 -9075 -10787 4975 12514 374 -11907 -4924 9214 8687 -4862
1862 -4862 -11012 -301 11011 5321 -8910 -9390 5252 12279 -382 -11963 -4026 10058 8090
1875 8090 -6880 -10058 2625 10266 1688 -8715 -5700 5309 8366 -1106 -9392 -3794 7908 7615
1889G615j3056m648J1756Q615q351j1381L893J2500Q36j0933n617P439Q679k426
1903D921r767l069Q667P631m895j1454P55J3047L648j2634p684R750J1475n841
1917D550j2751R01J1315M412q058q448L787R954J283r473o371P779J0380m558
1931D702j2425j19J3100N004j1979q292Q088J0048l226r701j662Q110N273m800
1945B121p690N34Q931L739q551p485O318J0040k786j0791r04R712L474p088m524
1960d950L175N270m32l822l085J710N540J939p123n369O843Q046m413j0079J479
1975e271J0213R48q486l358O105N261l246n924m59N262M008k573p628m67Q999
1990C384M100q141p629O706R272m274j0314J849R313K200q293n065N413O778q31
$$ plain form
1889 7615 -5441 -10089 1667 10282 1931 -9450 -5557 6943 7779 -3154 -8771 -1332 7347 4921
1903 4921 -4846 -7915 752 8383 3488 -7966 -7211 5836 9484 -3150 -10834 -1084 10391 4550
1917 4550 -8201 -7300 4015 8427 369 -8079 -4292 5662 6945 -2528 -8899 -1120 9260 4702
1931 4702 -7723 -7842 5258 10262 -1717 -10009 -1921 8127 4901 -4800 -6462 1648 6921 2121
1945 2121 -5569 -5035 3896 7635 -916 -8401 -2083 7957 5171 -5620 -6524 3188 6662 -426 -4950
1960 -4950 -1775 3495 3063 -759 -3844 -2134 3406 5345 -1778 -7147 -304 7742 3329 -6750 -5271
1975 -5271 4942 5890 -2596 -5954 151 5412 2166 -3758 -4217 1045 5053 2480 -5148 -5615 3384
1990 3384 7484 -657 -8286 -1580 7692 3418 -6896 -5047 4266 6466 -1827 -6892 -1479 5299 4468
2005D468p294l469O067O335l817q019J007R078J429q962l748P909N259n327n651
2020d735K179M604M87k079k182o35K300L335j976n266J276O675L7p566j783P184
2036A855L633n658m460L166M058p32k035q87n56J924K798k343m578J828O229m80
2052C762q010j005Q407L060o654n177M406N421j832m689m04L213K575j901l725
2067b553k55M844K829n120n385M233O674k252o588R6N693J138l981j963K519J992
2083A921n41k094j657J557L441O3m240k619M599M038l674m144J763L961j003l010
2099a639O22J465M7K77n85k315K15M336J181n449l366N287N248m133n951K627
2115b133N962j038n754k76M525J889k136l537q47M055L673k699o072M91P278J693
$$ plain form
2005 4468 -2826 -6295 -228 6107 2290 -5729 -4722 4356 5785 -3177 -6925 984 6243 916 -4735
2020 -4735 -2556 2048 2535 456 -1726 -2361 -61 3274 1298 -3968 -2692 3983 4020 -3546 -5329 1855
2036 1855 5488 -170 -4630 -1464 2594 1862 -173 -1060 -1616 308 3106 763 -3815 -1987 4242 3762
2052 3762 -4248 -5253 3154 6214 -440 -5617 -1211 4210 2378 -2311 -2715 498 3073 1172 -2553
2067 -2553 -2808 2036 4865 -255 -5640 -1407 5267 3015 -3573 -3477 2216 3354 -627 -2590 -71 1921
2083 1921 1380 -714 -2371 -814 2627 2690 -1550 -4169 430 4468 794 -3350 -1587 2374 1371 -1639
2099 -1639 -1017 448 495 772 187 -2128 -1913 2423 3604 -1845 -5211 76 5324 1191 -4760 -2133
2115 -2133 3829 2791 -2963 -3239 1286 3175 1039 -2498 -3345 710 4383 1684 -4388 -3897 3381 5074
2131E074p350l161O163M522m586n629K651N811J56m899k522K244M381N87m423
2146i81l465L390N511j525o964K04O988J638o354l594M446N149j719n385j231
2161c892L748M136j334n270j145N060L710m513o006L514P266j379p796j420P067
2176A746M093m634n497J290N416K104m214m918K270O467N15p562k985P403N768
2191G262o021p877K891Q919J46p804l140N412M831j948n799j118N589M127m191
2206A279p230J837Q874J699r389m343O947P246l963q162P26P513K102n430n108
2221e402L067O833N0o926m058N742P497k924r595m68R408L914p862o426N215P592
2237E657j746p603k422O915N903m253q499K77R521L718q151p363N606R688k218
$$ plain form
2131 5074 -2276 -5437 726 5248 662 -4967 -2316 3495 3651 -1248 -3770 -1526 2855 3442 -981
2146 -981 -4446 -1056 4455 2930 -4034 -3830 3158 4796 -1558 -5152 -706 4443 2724 -2661 -3892
2161 -3892 -144 3992 2658 -2612 -3757 1303 5013 500 -5506 -1992 5274 3895 -3901 -5321 1746
2176 1746 5839 1205 -4292 -3002 2414 4518 304 -4614 -2344 4123 4638 -2924 -5909 1494 7262
2191 7262 1241 -6636 -3745 5174 5320 -2484 -5624 -212 4619 2671 -3128 -4246 1343 5470 1279
2206 1279 -5951 -4114 4760 6459 -2930 -7273 -326 6920 2957 -5205 -4479 3034 5136 -294 -5402
2221 -5402 -2335 4498 4548 -2378 -6436 -694 6803 3879 -5716 -6184 3224 7138 -724 -7150 -1935 5657
2237 5657 3911 -3692 -6114 801 6704 2451 -6048 -5771 3750 7468 -683 -8046 -2440 7248 5030
2252E030j0211j554R437M454o924p014L365Q200J233p652n520N346Q411j548r572
2267d519k240Q799N617o931q104L670R783k86r318l369P091O678l338q507r48
2282e922P901N197n817q294K330J0561Q98j0420m660Q750Q117n943j0030J821
2296e511R946K993p918p176M940Q971m67r403l890Q117Q018n748j0651J919J1450
2311E590K704j0899o454P732R282l315r894j675Q856N839o157q875K390J0542
2325E666K065j0237o697Q262R665m314j1523k21J1312M124q701p292M950Q951
2339F010m08q806m227P080P876l544j0583m83J0990M894r269q618N823J1088j993
2354E830j0901k658R259O299o083q888K067R632K779q544p128N879J0152j994
$$ plain form
2252 5030 -5181 -6735 2702 7156 232 -6782 -3417 4783 6016 -1636 -7156 -1810 6601 5053 -4519
2267 -4519 -6759 2040 7657 726 -7378 -3708 6075 5789 -3529 -6898 193 6871 3533 -4974 -5922
2282 -5922 1979 7176 1359 -6935 -4605 5956 6854 -3566 -8226 524 8641 2698 -7332 -5511
2296 -5511 4435 7428 -490 -7666 -2726 6245 5778 -3625 -7515 602 8620 2872 -7779 -5860 5590
2311 5590 8294 -2605 -9059 -1327 7955 4640 -5254 -6929 1927 7766 1609 -7266 -4876 5666
2325 5666 7731 -2506 -9203 -941 8724 4410 -7113 -7334 3978 8102 -599 -7891 -2941 6010
2339 6010 5602 -3204 -7431 -351 7525 3981 -6602 -7085 3905 8799 -470 -9088 -3265 7823 5830
2354 5830 -5071 -7729 1530 7829 1746 -7142 -5075 4557 7336 -1208 -8336 -2457 7695 5701
2368E701j1508k277J0707O196p967q981M254J0035K91r554m490P142P927l551
2382C925r684r79R811N348p907q775M349J0922k95j1228l573R570O645o116q771
2397f758J727R476K471p915o294M604R192o58j0298l367R042P098o231r549K692
2412d768J0521J339r657n035O844P645l210q701j026P985N067n398q378K240R753
2427E221J545r378n485P712Q158m633r268M74R366L345p719o124M445P768o39
2442D788p805l282O316O853m166q396O05R037K690q013n741N522P645j809q331
2457d087j712P058M876m579p100J203P990K283p253n544N168P970k264q753j331
2472f075Q462M246o307o425L379P087M21o765l980M968O672k069q045j231P940
$$ plain form
2368 5701 -5807 -8084 2623 8819 852 -8129 -3875 6160 6451 -3103 -7593 -451 7476 3925
2382 3925 -5759 -6738 3073 8421 514 -8261 -3912 7010 6715 -4513 -8086 1484 8129 2013 -6758
2397 -6758 -5031 4445 6916 -999 -7293 -2689 6503 5845 -4453 -7820 1222 8320 2089 -7460 -4768
2412 -4768 5753 7092 -2565 -7600 -756 6889 3679 -5022 -6048 1937 7004 1606 -6772 -4532 5221
2427 5221 6766 -2612 -8097 -385 7773 3140 -6128 -5654 3712 7057 -662 -6786 -2341 5427 4788
2442 4788 -3017 -6299 17 6870 2704 -5692 -5087 3950 6640 -1373 -7114 -1592 6053 4244 -4087
2457 -4087 -5799 1259 6135 1556 -5544 -4341 3649 5932 -1321 -6865 -1697 6273 4009 -4744 -6075
2472 -6075 2387 6633 326 -6099 -2720 4367 4788 -1977 -5957 -989 5683 3614 -4431 -5662 2278
2487B278M382o376o807L491Q267m10p816k766O248N198l747o331M74O163K989
2502E237m776n943K607P401N11p737l430O520O261m661p123J422P207J766o326
2517a064m346M165N725p90o476k041N523M892l506p034J060P489K016p200m283
2532e870N450N749k620o585k60N780L250m097n332J551O343J322o300l752M655
2547g16O255k947p150K00O864K230n388m090L300N029n11m913k141L798M191j551
2563B460n802p98N880L226m946n073L433N811r00o106j427N092L041l034m229
2578c372O17M274J983l245m182J585N465J208o304l407N714N038m211n866J775
2593b928O174N21n297k559L597M074j343m547j227M048L466k718n016R71N748
$$ plain form
2487 2278 6660 284 -6523 -3032 5235 4825 -2991 -5757 491 5689 1942 -4389 -3915 2248 5237
2502 5237 461 -5482 -2875 4526 5037 -2700 -6130 390 6651 1990 -5133 -3711 3496 5262 -1064
2517 -1064 -5410 -1245 4480 3690 -2786 -4827 696 5588 2082 -4952 -3892 3597 5613 -1587 -5870
2532 -5870 -420 5329 2709 -3876 -4136 1644 4894 797 -4535 -2984 3359 4681 -1619 -5371 -716
2547 -716 5539 2592 -4558 -4358 2506 4736 -652 -4742 -1442 3587 3076 -1837 -3978 -180 4011 2460
2563 2460 -3342 -4140 1740 4966 20 -5053 -1620 4191 3291 -2815 -4242 850 3891 857 -3372
2578 -3372 -2755 1519 3502 257 -3925 -2340 3125 4333 -1971 -5378 336 5374 1163 -4703 -2928
2593 -2928 3246 3767 -1530 -4089 -492 3582 2239 -2308 -3535 513 3979 1261 -3755 -2784 2964
2608B964J046n568k934M466M177k919m358R44L691J124k444k661O78L704J055
2623B965l372k776K613L841j374m542J83M300J207l835j856K354K072p25j059
2638dq81m54J906J592k017l100K063M302j380m913J22N048R78m206k174K880K597
2655B359j053k550l28J455J804l88k619j353L006L033k938m131K078M830p12m897
2671b404n09L892J931k657k446J176J947P32j453k065L95K991Q48l288k273L008
2687a75L172j980l853J122L521j06k483m47P84J066Q11j012k368J90L464R75m057
2704a376k432M204L873l239m594J629M547m5m055q53J970K367k62k423k408K578
2720e19M219j349o047l01O557K664o324m457N238N241k938n722R48N091J141l842
$$ plain form
2608 2964 4010 -1558 -4492 -26 4151 1232 -3126 -2182 1509 2633 189 -2472 -1794 1910 2965
2623 2965 -407 -3183 -570 3271 1897 -2645 -2462 1838 3045 -790 -2646 -292 1780 1055 -4
2638 -4 -885 -1339 567 2159 142 -2958 -895 3407 2027 -2886 -2764 2284 3262 -944 -3118 -238 2359
2655 2359 1306 -1244 -1572 -117 1687 1299 -1320 -2673 333 3366 428 -3703 -1625 3205 2493 -2404
2671 -2404 -2913 979 2910 253 -2193 -1017 930 1662 209 -1856 -1461 1530 2378 -910 -3183 -175
2687 -175 2997 1017 -2836 -1714 1807 1701 -782 -1229 -445 621 1432 420 -1948 -1758 1706 2681 -1376
2704 -1376 -3808 396 4269 1030 -3564 -1935 2612 2567 -1488 -2341 -371 1996 1734 -689 -3097 -519
2720 -519 3700 2351 -3696 -3997 2560 5224 -1100 -5557 -319 4922 1984 -3738 -2790 2301 3442 -400
2736d00k628J404L815J059l493l968K615O109j004o754j330O670K935n623m368
2751d961M022M907j242m995j043L510L178j298m377j413M491L789l495n949K255
2766b621O906k2p225k036O213L729m267m635J180M715J650l410m052J394N457
2781B976J165n846l601N179N739l535p510J524P946J012o928l367M715M886j962
2796B393n019j137M180L966k427o408J45P645K917p547n561N671P485k964q369
2811e030K40P543K725n686m589K730N552M42n095l877L477O701q65q461j731Q223
2827B299M762o939o938M594P822j406p716j721O189M200l588n573N6O093L342
2842E476n028o200K293Q402M75q680l283P667N532n420p059K410P400O84o198
$$ plain form
2736 -400 -3028 -1624 2191 3250 -243 -4211 -1596 4513 3509 -3245 -4575 2095 5030 -593 -4961
2751 -4961 -939 3968 2726 -2269 -3312 198 3376 2078 -2299 -3712 779 4568 1073 -4876 -2621
2766 -2621 4285 4263 -2962 -4998 1215 4944 677 -3958 -2778 1937 3587 177 -3875 -2481 2976
2781 2976 4141 -1705 -5306 -127 5612 2077 -5433 -3909 4037 5049 -1879 -5246 -531 4355 2393
2796 2393 -2626 -3763 417 4383 1956 -4452 -4307 3338 6255 -1292 -6853 -1182 6303 3339 -5030
2811 -5030 -4790 2753 5478 -208 -4797 -2067 3485 3927 -1168 -5045 -1568 5133 4268 -4193 -5924 2299
2827 2299 7061 122 -6816 -2222 5600 4194 -3522 -5243 946 5146 1558 -4015 -3959 2134 5476
2842 5476 448 -5752 -3459 4943 5418 -3262 -6545 1122 6654 1234 -5825 -3415 3985 4669 -1529
2857a529l727L918O126q33o884k380N788N584l993p506J561Q262J492p769m502
2872f392N729O406k745p037n18N772M348l828o680Q09P822K380p355n892N796
2887a385Q657l389r506m80R356L987p767o153M118P715n88p081l320N327O306
2902E797k545q340r33R247M384q103p505N467R375j989r520j887Q295N056o013
2917G86o766K363P685J352o912m757M590P494j227q827k511Q567N693o476p840
2932f786L253Q461L01p776l514N546O703l007p666q88P300M838n973p418K608
2947d018R180Q09q802m424P539O837m560q229O94Q509K868o800o300L807Q286
2962E396L56q962l926P589O949m554r446J219J0007K415q946n733O441Q304l171
$$ plain form
2857 -1529 -5256 -1338 4788 3955 -2929 -5309 479 6063 2070 -5436 -3875 4387 5879 -1890 -6392
2872 -6392 -663 5743 2998 -4039 -4557 1215 5563 1735 -4945 -4136 3686 6066 -1289 -7181 -1385
2887 -1385 7272 3883 -5623 -6103 3253 7240 -527 -6680 -2562 5153 4565 -2516 -5836 -509 5797
2902 5797 3252 -5088 -6021 3226 7610 -493 -7998 -2531 6844 4855 -4665 -6552 1743 6799 786
2917 786 -5980 -3617 4068 5420 -1492 -6249 -1659 5835 4608 -4219 -6730 1837 7530 1054 -6786
2932 -6786 -3533 4928 5229 -2547 -6061 -515 6188 3181 -4485 -5373 1927 6765 792 -6626 -4018
2947 -4018 5162 5971 -2831 -7255 284 7121 2561 -5668 -4974 3535 6403 -397 -6697 -2890 5396
2962 5396 5752 -3210 -7136 453 7402 2848 -6598 -5379 4628 7043 -1903 -7636 -1195 7109 3938
2977C938q877r63Q109M613n386p563J908Q725J679q111n071O328P673l476r061
2992e535RQ474L581o684o477M146P494l12p497l152N832N916l054p785j19P902
3008B739L942p119o369M328P897p54q166k529O790N204l843p219P37P543K571
3023E752o483n528M220P609p87q636k581P831N325n247p308K003Q137J105p248
3038a836m147N036O620k290p503j258P344M307n498o862K741P958N64p467l671
3053e962O056N671l568o913O80O577K616n349m995K946O437J53o464l327N355
3068h7N474l019o678K08O685K625n633m743L455O101m62o667k263N485M484l365
3084A600n721J74O542K480n736m573M058N939j479o642j255N876L615l669n644
$$ plain form
2977 3938 -4939 -5902 2207 6820 1434 -6129 -4221 4504 6183 -1928 -6999 -671 7002 3526 -5535
2992 -5535 -5526 2948 6529 -155 -6632 -2486 5008 4696 -2801 -5953 -121 5795 2741 -5044 -5163 2739
3008 2739 6681 -438 -6807 -2479 5418 4664 -3502 -6031 759 5963 2120 -5099 -4362 3181 5752
3023 5752 -731 -6259 -2039 5570 4783 -3853 -6434 1397 6722 1475 -5833 -3830 4307 5412 -1836
3038 -1836 -5983 -947 5673 3383 -4120 -5378 1966 6273 775 -6087 -3346 4612 5176 -2291 -5962
3053 -5962 94 5765 2197 -4716 -4036 2541 5157 -192 -5187 -2241 4196 4349 -2115 -5442 -87
3068 -87 5387 2368 -4310 -4102 2583 5208 -425 -5168 -1713 4388 3926 -2741 -5004 481 4965 1600
3084 1600 -4121 -3947 2595 5075 -661 -5234 -1176 4763 3284 -3358 -4613 1263 4878 1209 -4435
3099d435J294O123J351n386m078M026N579j486o119j277N780L810m549n406K311
3114b462O043M05n874k554M068M445j953n188l88N055K608l827m580K025N345
3129C168J64n227k528M104M565k551n017J01M889K080l886l611K153M500R8m767
3145a765k055L823L856k111m730J03M648J731l604l721K245M536j67m564j604
3160c379L615L148k077m356M94M437J795m100l524K870M066o08m436q78L727K406
3176C200k422l299N63L613J061k987k424J653L497l18l413j564K879K954j954
3191A039l543M60L828P27l062j996J955L108p39l128j057K726K305j642l118M72
3207a665L036P77k408k074J499K732k14k885j004K724J502j585k042L12K236J006
$$ plain form
3099 -4435 -3141 2982 4333 -1053 -5131 -1105 4474 2988 -3131 -4408 1372 5182 633 -4773 -2462
3114 -2462 3581 3986 -1888 -4442 -374 4071 2118 -3070 -3458 1597 4205 378 -4202 -2177 3168
3129 3168 3332 -1895 -4423 -319 4246 1695 -3322 -3221 1668 3748 -138 -3749 -1596 2904 3002 -1765
3145 -1765 -3820 3 3859 1748 -2982 -2879 1769 3500 -104 -3825 -1580 2956 2789 -1775 -3379
3160 -3379 236 3384 1307 -3049 -2555 1882 3677 -423 -3947 -1077 2989 2381 -2055 -2933 794 3200
3176 3200 778 -2521 -1958 1655 2716 -271 -2695 -1042 2455 2137 -1276 -2840 39 2993 1039
3191 1039 -2504 -2044 1784 2511 -551 -2547 -592 2516 1777 -1351 -2408 318 2623 981 -2137 -1665
3207 -1665 1371 2148 -260 -2334 -835 1897 1683 -1202 -2206 518 2020 435 -1607 -1295 941 1947
3223A947j778k150Q00K620L47k567j310J941K062j086k243l18K432J279j482k525
3239b031J017K311K58j878j696J121K531j39k666q85K353J933j612k454K13K610
3255I86J269k296k552J608L137k5l752q05K803K411k164l044N77L471R12l289
3271g53k004K285K823r13l197n00K481K219j500k852Q9L233J291l189k303K177
3287f13L269r79l360r44L269K172j993l493R57L580Q59l240k140J941L106m37
3303A954l586j180L191K319j812l412K60L949J281l038l153K071M203m07m810
3318b170j482M227L374k815m823J280N105J015n059k663L935L957k047m930p7
3333c173M546K473l547m091J655N185K77n137k337M356L976k527n146M31N211
$$ plain form
3223 1947 169 -1981 -1181 1439 1786 -781 -2091 -150 1912 826 -1417 -1735 697 1976 494 -2031
3239 -2031 -1014 1297 1555 -323 -2019 -898 1633 1494 -1172 -2057 296 2229 617 -1837 -1624 986
3255 986 2255 -41 -2593 -985 2152 2127 -1625 -2430 373 2784 620 -2424 -1847 1624 2536 -753
3271 -753 -2757 -472 2351 1438 -1759 -2259 222 2441 941 -1911 -1822 1411 2702 -487 -2790 -613
3287 -613 2656 1677 -1683 -2627 642 2814 821 -2672 -1715 1865 2724 -516 -2656 -715 2391 1954
3303 1954 -1632 -2812 379 2698 886 -2526 -2266 1683 2964 -74 -3227 -1156 3047 2640 -2170
3318 -2170 -3652 575 3949 1134 -3689 -2409 2696 3711 -1348 -4011 -76 3881 1834 -3096 -3173
3333 -3173 1373 3846 299 -3792 -2137 3048 3325 -1812 -4149 207 4183 1656 -3490 -3059 2152
3348B152J596m400l304K910M448o91m906j495M009L531k373m741Q0N303J801m560
3364f40l484K960M704q88n205r58M025L447k762m570O31M920J530m132l626K644
3380a404N098p10n736j301M988L410l524m746J340N213J017m457l175K817M858
3395C688n99n561j886N474L776l983n805K284O328N35o289k954N043M734k879
3410A906n612L88N546J863m043m348K096N749K53n864k783N104M890l074o262
3425d191O46O305J839n322l901L400N387r50n725j451M511L979k809n566L00N997
3441B449K264n365m456L855N912j685o221p86N428L147l698m865J179N547J526
3456D231n086l768L319N676r84o472j945O429M090n119n699K937O370j11n967
$$ plain form
3348 2152 3748 -652 -3956 -1046 3402 2711 -2195 -3690 319 3850 1477 -3264 -3184 2119 3920 -640
3364 -640 -4124 -1164 3540 2652 -2553 -3511 514 3961 1199 -3371 -2740 2180 3710 -422 -4048 -1404
3380 -1404 3694 2984 -2752 -4053 935 4345 821 -3925 -2585 2628 3645 -812 -3987 -1170 3688
3395 3688 3089 -2472 -4358 1116 4892 909 -4896 -2612 3716 4251 -2038 -4992 51 4785 1906
3410 1906 -3706 -3318 2228 4091 48 -4300 -2204 3545 3798 -2066 -4849 255 5145 2071 -4191
3425 -4191 -3545 2760 4599 -723 -4624 -1224 4163 3213 -2512 -3963 548 4527 1718 -3848 -3548 2449
3441 2449 4713 -652 -5108 -1253 4659 2974 -3247 -4033 1395 4542 844 -4021 -2842 2705 4231
3456 4231 -855 -4623 -1304 4372 3388 -3084 -5029 1400 5490 371 -5328 -2391 3979 3868 -2099
3471b099k461M366M606j918n935j005O006L603m709n972K859P090J23p315k796
3486e557O123N084m157o494J382O712J682n634m003L101N916k16o572k692N964
3501F39N360m362p393K002Q153P85p314l668N229N990k939o431r5N651L258m175
3517F90n395J905O425J377o638m362N445O570l450p422M95P309K149n687m313
3532d902L564N555p26n694k371M448N067k416o423l42O715L231o037n594M298
3547a627O804j666p078q56N851L486l912n242J097N830K140n583m510L778O293
3562D805j167p333j492P135M073n980n569L319O586n50o265k137M873M126k413
3577B011n481n67N648L655n099n638L141O928n85p224k059O481L857m402n268
$$ plain form
3471 -2099 -4560 -194 4412 2494 -3441 -4446 1560 5163 454 -5518 -2659 4431 4554 -2761 -5557
3486 -5557 566 5650 1493 -5001 -3619 3093 4775 -859 -4862 -1761 4155 3939 -2633 -5325 639
3501 639 5999 1637 -5756 -3754 4399 5184 -2130 -5798 -569 5421 2482 -3949 -4044 1607 4865 690
3517 690 -4705 -2800 3625 5002 -1636 -5998 -553 6017 2567 -4855 -4360 2949 5098 -589 -4902
3532 -4902 -1338 4217 3491 -2203 -4574 -126 4941 2525 -3898 -4240 2475 5706 -331 -5925 -1627
3547 -1627 5177 3511 -3567 -4423 1428 4914 1002 -4240 -3143 2687 4827 -756 -5266 -1488 4805
3562 4805 3638 -3695 -5187 1948 6021 41 -5528 -2209 4377 3827 -2438 -4575 298 4424 2011
3577 2011 -3470 -4037 1611 5266 167 -5471 -2330 4598 4013 -3211 -5270 1211 5068 666 -4602
3592d602K051N649M69m541l074K974M477m28n233j768M623M126l295o000J671
3607b901O292N94n750k366L778M113j740m628m55M045K672k643m207N71N146J331
3623C852m784l625L887M992k155n612J77N224J790m199l143K170M183Q3m197k140
3639c497L135M120j752n012m02N276K463m768l828L073M746j196m842m48M164
3654A232K101k555l452O59L487J570l397k874J932M167l84m749j042M377K423
3669C495l141l566J524L882K63l433j729K406K536m47l295j035K612L098k103
3684A067l946Q47M205N47l881j804K758L041j655l343J18L008J460j985k465K50
3700a778L262R64l197k248K482L355j313m081J92L912J237l499j860J895K514
$$ plain form
3592 -4602 -2551 3098 3567 -974 -4048 -1074 3403 2975 -2258 -4026 597 4723 1428 -4572 -2901
3607 -2901 3391 3985 -1765 -4131 -353 3760 2020 -2608 -3063 982 3654 1011 -3196 -2625 2521 3852
3623 3852 -932 -4557 -670 4322 2167 -3445 -3268 1956 3746 -453 -3596 -1426 2757 2840 -1357 -3497
3639 -3497 -362 3758 2006 -3006 -3408 1868 4331 -437 -4265 -1192 3554 2358 -2484 -2932 1232
3654 1232 3333 778 -2674 -2015 1472 3042 -355 -3229 -1297 2870 2486 -2263 -3305 1072 3495
3669 3495 354 -3212 -1688 2194 2457 -976 -2705 -299 2237 1790 -1505 -2540 72 3170 1067
3684 1067 -2879 -2032 2173 2720 -1161 -2965 -207 2834 1179 -2164 -2046 962 2422 437 -2028 -1778
3700 -1778 1484 2448 -749 -2997 -515 2840 1527 -2554 -2362 1550 2787 -712 -2572 -677 1837
3715A837l26k403j021J668K086o74k772n52L165J692k721k494J518L436p39l222
3731a522l81K411J641j914j747L69K059P69j752j729J001K403j90k306r55K121
3747B78J752j472k204N50K300M62k016j156J334J568l32j822p88J555J629q07
3763H31k553J51K783O76k395j295J571J777q19j976K05J641O16j023j369N89J352
3780G62M40j191j386Q97J750l84j946j71K001N53j652p89P39J142j62q34m89L99
3798c21J061P4j159n12N45J269k77j449l26J332R22j400r20Q96J141k15j156k13
3816g08O03O08J43j230k13Q03P78n55r23j22J326M19j001j045Q96J021j02j140
3834d42n16Q67R61k35j451n7J173J016j214j472R15J539j50j633n22J524R17p07
$$ plain form
3715 1837 1511 -892 -1913 -245 1841 1167 -1605 -2157 1008 2700 -21 -2515 -997 2439 1700 -1522
3731 -1522 -1903 508 2149 235 -1512 -1143 916 1685 -67 -1796 -795 1608 1418 -888 -1843 278
3747 278 2030 558 -1646 -1096 1204 1666 -350 -1506 -172 1396 1064 -758 -1546 9 1638 831
3763 831 -1722 -1571 1212 1888 -507 -1802 -231 1546 727 -1249 -1044 597 1213 190 -1179 -590 762
3780 762 1202 11 -1375 -478 1272 888 -1058 -1229 772 1325 -327 -1116 -377 765 603 -231 -720 -321
3798 -321 740 814 -345 -857 -312 957 680 -769 -1095 237 1159 -241 -1161 -265 876 661 -495 -708
3816 -708 -105 503 646 -584 -797 6 784 229 -694 -816 510 929 -72 -1117 -221 800 698 -442
3834 -442 -958 -91 870 635 -816 -873 300 1316 102 -1370 -455 1084 934 -699 -1221 303 1220 513
3852E13j442J60J156O65r60j235N45J456K34j579r27J328J777j021j851j55J964
3869F28Q69j612j308Q89J610j57j562p79J461J436n99k270j74K297J175k007j898
3886b001J274K512l78k629m75K091J462j340j904J87J919R88j757j840J139K463
3902A711q9k367j685K544K324j601k907K96L282N44k736j597K103K187q60k471
3918a322o68K295J977j682k831N54L286N23k710j955K189K632q13l282o09K980
3934E64K071k356l019J454L048L53k934j776K370K969j498l294K28L250Q47k729
3950d52k128J877K617j64k822j148K181K318j120k956l49K923J947k411l188J521
3966a354L808j27m021j058L334K341k368l097R16L106Q47k967k019J848K844q1
$$ plain form
3852 513 -929 -769 387 1052 92 -1143 -598 858 1092 -487 -1414 -86 1691 670 -1181 -1336 628
3869 628 1497 -115 -1423 -534 1076 919 -643 -1422 39 1475 876 -1394 -1568 729 1904 -103 -2001
3886 -2001 -727 1785 1407 -1222 -1697 394 1856 516 -1388 -1201 718 1706 -51 -1891 -752 1711
3902 1711 1622 -745 -2430 114 2438 837 -2070 -1774 1508 2052 -684 -2281 -178 2009 1149 -1322
3918 -1322 -1990 305 2282 600 -2231 -1677 1609 2132 -578 -2533 -344 2288 1475 -1807 -2416 564
3934 564 2635 279 -2740 -1286 1762 2115 -819 -2595 -225 2744 1246 -2048 -1820 1430 2277 -452
3950 -452 -2580 -703 1914 1750 -1072 -2220 -39 2279 1159 -1797 -2146 777 2724 313 -2875 -1354
3966 -1354 2454 2327 -1694 -2752 582 2923 555 -2542 -1626 1480 2327 -640 -2659 -811 2033 1952
3982A952l471j176K949K823k085l876R63L930P24l656k170K711L248j417l551
3997b102m80L630K009k690l291J227M018N6l461j858L035K970j658l693q9L517
4013A140J755k838k928J438L530L04l704j728L123L061j735m060K41M015J468
4028C082l511k771K261L497n20l876q62L026K673k135l220K08L686J316l130k905
4044c181K233L709k49m512j261M082K622k901l983J374M383N63l907k170K902
4059b96L362j552l937r6L939J643l011l124J601L833J56l788j888L405L102j994
4075A355l800j37M156J603l235l188J940M137l76m119j352L554K961k479l798
4090b778O46L871J067l457k486K314L667q46l863p83L280K607k468l654Q84M088
$$ plain form
3982 1952 -1519 -2695 254 3077 992 -2884 -1921 2009 2733 -923 -3093 -382 2866 1449 -2102
3997 -2102 -2582 1048 3057 367 -2924 -1697 2321 2377 -1084 -2942 93 3063 1405 -2288 -2377 1140
4013 1140 2895 57 -2871 -1433 2097 2401 -1303 -3031 92 3153 1418 -2642 -2401 1614 3082
4028 3082 -429 -3200 -939 2558 2038 -1838 -2700 326 2999 864 -2356 -2148 1538 2854 -276 -3181
4044 -3181 -948 2761 2512 -2000 -3261 821 3443 542 -3441 -2067 2316 2879 -1028 -3198 -296
4059 -296 3066 1514 -2423 -2519 1420 3063 52 -3072 -1471 2362 2518 -1270 -3158 247 3349 1355
4075 1355 -2445 -2582 1574 3177 -58 -3246 -1306 2831 2455 -1664 -3016 538 3499 1020 -2778
4090 -2778 -2132 1739 2806 -651 -3137 -823 2844 1998 -1865 -2648 632 3239 771 -2883 -1999 2089
4106B089Q11l978k333L053L543j571m035k30L777K208l149l377J684M092Jm263
4122a678j339L303K883k064l592J1M142J187l346k548K040L613n23l557j473L340
4138C99K815k560l396Q82L683O36l259k190K678K789j036l238l50K749J865k074
4154C93k744R21L074N16k765k180K417K950j085l406m29L605J471k699k778J425
4170a314L414J64l113j535K292K660j345l301J76L167J123k605k387J843K895
4185B134l55l063r73K698K053j774k729M76K905Q77k730j831J592K931o61l463
4201a913k12L089J278k278k002J031K478P6k553p25J852J533r35j834l90J869
4217C64J367j420k135P37K495K48k297j323J821J945j031k186Q6K036R27j395
$$ plain form
4106 2089 2900 -1078 -3411 -358 3185 1614 -2421 -2651 1126 3334 185 -3192 -1508 2584 2585 -1678
4122 -1678 -3017 286 3169 1105 -2487 -2476 1666 2853 -493 -3041 -1001 2612 2089 -1468 -2941 399
4138 399 3214 654 -2742 -1860 1823 2459 -800 -2990 -312 2477 1441 -1797 -2147 602 2467 393
4154 393 -2351 -1430 1644 2160 -605 -2785 -368 2582 1497 -1909 -2338 1267 2738 39 -2739 -1314
4170 -1314 2100 2264 -849 -2384 -92 2568 1223 -2078 -1902 1265 2388 -217 -2604 -761 2134
4185 2134 1779 -1284 -2257 441 2494 720 -2009 -1533 1372 2249 -481 -2312 -720 2211 1550 -1913
4201 -1913 -2125 964 2242 -36 -2038 -1007 1471 1547 -1006 -1731 121 1654 719 -1115 -1505 364
4217 364 1731 311 -1824 -1087 1408 1656 -641 -1964 -143 1802 771 -1415 -1329 707 1634 239
4233B39j705N00K191K53k145j110J505K265j265k391K58K345P78j957j615J363
4249d91J772k95j677q77J707J455r85k108J90K191O76j977j497J367K146o69k093
4266a165l92K165J025j649j178M64J570L61j463j214J130J759o03k182J9K150
4282G97P66j472j503R30J656k21j506n91J182R18m38j309j74J376P47r12j433
4299a187O46J694J08j993n20J371J060q52j318K84J050N80j023q52N00J053J12
4316G13j071p64J116J042n44j633K03J735L11j508p71J054J138n30j040j55R56
4333B52N10m66j099J42J187K59j016p33P64J144n25j141J92R94L71q33q29O55
4351a72N32J63o36n84N08O12J32q95m86Q10P00p45o17L99P83q3o49k91K26O69
$$ plain form
4233 239 -1466 -966 1225 1478 -667 -1777 -272 1993 728 -1663 -1405 940 1718 -239 -1854 -491
4249 -491 1281 986 -691 -1568 139 1594 609 -1499 -1309 882 1558 -419 -1916 -549 1597 928 -1165
4266 -1165 -1557 608 1633 -16 -1194 -730 840 1201 -262 -1476 -346 1413 810 -1372 -1353 797
4282 797 1563 91 -1412 -482 1174 953 -553 -1144 38 956 518 -791 -965 411 1158 246 -1187
4299 -1187 -541 1153 1261 -732 -1252 119 1179 327 -991 -707 343 923 -100 -952 -452 601 713
4316 713 -358 -1122 -6 1036 492 -1141 -938 797 1108 -400 -1171 -117 1021 491 -549 -704 252
4333 252 762 296 -803 -661 526 785 -231 -964 -200 944 419 -722 -530 464 835 2 -827 -172
4351 -172 360 523 -113 -697 -189 423 555 -340 -826 -16 684 -61 -678 -279 504 421 -228 -519 -293 376
4371C76j80m71j61L88M22j91n23k45O25L12m27n22M73N13j84m87j74N23K22k2
4391B67n69J32L6M63p7m88m04O56O30n08p88N14O79j86o22j38P43O5l30l14j26
4412c65N88J79l13n93Q9O07M29n08p46K81J148k85j007j37O56P67o01p91J32O18
4432A48P08o83j031O50P19K11j027n27J121N25o20j084J42J292J60o98r14O25
4450b83J207l69j004m54J102O84n21j275kJ423M24j143p89Q64J145m32j342q0
4468h45J193O51j005q81J47J429K74j029j055P11J497j78j608o73J700R66j383
4485h9j373R33J617lj676p58J424J166p31j560K61J354N83j112j389R14J446R7
4503A104j767o45J635Q15j025j249K11J680J54j101r38P65J360k06j604m49J557
$$ plain form
4371 376 196 -275 -436 -48 374 183 -340 -585 40 352 -75 -597 -124 389 205 -282 -456 67 289 267
4391 267 -302 -170 -134 329 252 -236 -640 16 646 138 -650 -136 543 357 -265 -403 340 405 75 -239 -365
4412 -365 223 402 89 -504 -415 192 621 113 -633 -352 796 511 -496 -633 23 790 189 -602 -470 148
4432 148 856 173 -858 -208 511 722 -305 -832 289 814 194 -890 -748 544 704 6 -908 -283
4450 -283 924 555 -449 -903 199 883 362 -913 -915 508 932 -211 -1000 -136 1009 577 -765 -845
4468 -845 348 999 -6 -887 -740 689 963 -66 -1121 -410 1087 909 -699 -1372 328 1294 -89
4485 -89 -1462 -529 1088 1085 -591 -1349 75 1241 510 -1050 -789 565 1148 36 -1353 -439 1007 1104
4503 1104 -663 -1308 327 1142 117 -1132 -921 759 913 -188 -1126 -361 999 793 -811 -1260 297
4520B97J174j012j776L96K068N9j516j277J757J439r32j676l1J481Q23j063j386
4537a175N25J517K85j579j166J640J492j046j514R0J635O58j522j192P71J900
4553A319l14j731o24J320J442q97j724J75J894O09j920j095J197J965p71j726
4569h81m8J253R89r45j565M22J434O93j324j590J098J806j77k228l28K074J131
4586A814j905j733J208J819j43j815n23J222J334o69j683j36J636R28j198j504
4602a348N63J753K02j914q04J390J619r24j936M41J711O07j412j463R65J685j4
4619A121j802r28J872J319j238j733L75K042K72j620j012J148J495n31j640m38
4635a298J503J360j043j623k11K123O41j934j357J774J735j023k061K07J837Q48
$$ plain form
4520 297 1471 459 -1317 -921 1147 1206 -310 -1587 170 1609 677 -999 -1030 451 1274 211 -1175
4537 -1175 -650 867 1152 -427 -1593 47 1539 493 -1021 -931 704 1362 -160 -1352 -581 1319
4553 1319 1005 -726 -1350 -30 1412 515 -1209 -1034 860 1469 -451 -1546 -349 1616 845 -881
4569 -881 -929 324 1313 368 -1197 -775 659 1352 28 -1562 -464 1342 1165 -1063 -1391 683 1814
4586 1814 -91 -1824 -616 1203 1060 -755 -1278 -56 1278 609 -1074 -1210 426 1354 156 -1348
4602 -1348 -785 968 1170 -744 -1548 -158 1461 537 -1399 -958 753 1360 -52 -1515 -550 1135 1121
4619 1121 -681 -1609 263 1582 344 -1389 -1014 1028 1300 -320 -1332 -184 1311 780 -860 -1298
4635 -1298 205 1565 522 -1101 -1312 811 1452 -482 -1839 -65 1670 647 -1414 -1207 630 1478
4651A478j552j402R82J566J32j936p02J240J811p57k014P7J838Q69j925j499J349
4668d45K101o80k041j82J838O17r27j397L61J636L96j737q18J097J564m97j812
4685i26k42J720J032j410j533P33J558K8j401r55J362J216n83j648j80J899N57
4702A227j417j302J065J698k26k001l86J663Q31r47j440M97J198M90j127j252
4718a429J014J546k64j776p19K206J086j605j575Q37J747L3j650o20J007J289
4734A127n86j419J9J425N47j180j117O94J651k09j705m75J507J033r84j350L19
4751g03J486J77r82j159J036J213l94j324l45J343P93q92j235K41J604J50j482
4768d73o24Q68J089m14j095k10J068O79q02r87L38J332J71j261q67J122R91m98
$$ plain form
4651 1478 -74 -1476 -494 1072 1204 -732 -1434 -194 1617 860 -1154 -1077 761 1630 -295 -1794 -445
4668 -445 1656 976 -1065 -1247 591 1208 281 -1116 -755 881 1277 -460 -1278 -181 1383 886 -926
4685 -926 -1168 552 1584 174 -1359 -626 932 960 -441 -1396 -34 1182 599 -1049 -1229 670 1227
4702 1227 -190 -1492 -427 1271 1045 -956 -1342 321 1152 205 -1235 -738 460 950 -177 -1429
4718 -1429 -415 1131 867 -909 -1628 578 1664 59 -1516 -679 1068 1101 -549 -1169 -162 1127
4734 1127 541 -878 -859 566 1113 -67 -1184 -490 1161 952 -753 -1228 279 1312 328 -1022 -703
4751 -703 783 960 -22 -1181 -145 1068 674 -650 -995 348 1141 249 -986 -745 859 1009 -473
4768 -473 -1097 -229 860 446 -649 -859 209 888 86 -901 -563 769 940 -321 -1188 -66 925 427
4786D27j148j01J345J95q81q53P96R97q1j135l69Q33Q83n71j079J9J221L66j077
4805b13q52R43J193p48r12%R03N28q42p89K90J062J77r58o95Q42J003p42q49n7
4825g16J058K90p74n51M07Q51m1q80j76M65N93j13r69J6P81M64p40m76M42P46
4845F77j31j072j58P15N70k64r06O0R34P5o92l76O15M73r0q52j82P00M45l74m97
4866c30R5O87k29l03m46M50O71k36p44O5O12R6l39n19J25O78j84m68j63O36K13
4887C67l72j98j3N00n1j77m83J65O70j48m25l35M17L52k58m90L93J88K8k98k7
4908a95J45J32Oj38j92L45K19k61k29Q8K08J86l18m51N85J36l81M8R1J39rM4k93
4931i5j15M24j31j47n9J45J83r3p5l07K13N2j88J94Q3m4J27k77R1K1j37J07J55
$$ plain form
4786 427 -721 -822 523 718 -163 -1016 -220 777 696 -439 -808 25 908 337 -742 -723 498 864 -213
4805 -213 -1065 -122 1071 323 -589 -589 314 842 0 -789 -499 563 740 -218 -913 -71 932 190 -659 -716
4825 -716 342 632 -142 -693 -286 565 524 -356 -532 -67 526 413 -556 -540 241 705 -35 -511 -69 677
4845 677 546 -526 -684 31 601 337 -569 -509 425 500 -192 -568 47 520 430 -422 -604 96 541 167 -330
4866 -330 -235 452 223 -80 -526 -76 595 359 -385 -320 292 388 49 -470 -345 333 149 -319 -482 154 367
4887 367 -5 -203 -216 284 233 56 -427 -262 408 260 -165 -500 -83 269 11 -479 -86 102 130 -168 -195
4908 -195 -50 82 88 -50 -242 103 322 61 -168 -80 128 314 -4 -455 130 266 -115 -67 24 163 154 198 -95
4931 -95 -210 214 83 -64 -123 22 205 112 37 -270 -57 -5 -193 1 84 40 167 -110 -19 2 -135 -28 127
4954A27k36J08J58K8k46k2j4J85J31j99q8r3M84j66j85k6n1L06%m58J52J57R8
4977A50j66j08M7J14m5P1j56J0K03J65j94j81j50N95k30l11k63N59J81k84l40
4998c33K98J25J84l40j82J77L66k70m37N9Q07j87m29m33L80K97J56m76j83N99
5018A78K22n04j81J36M43r4l85r9K31M36k50o76P1P26O3l67l93L69N22k58m82
5039b92j91M24M65k64m21j46Q63J09n71m79N11K97rq18J45O36J18l48m63KN60
5060A28J94l95l46L83L78j25m39k30R10J59o89n07N79N50j06p30j46M39O52n74
5080H5n67J98P81J07n34q17O93N99k85o86J51N23L97p98l04K63O59j67m08m68
5100e78O22N76m02q40K67O09K63p39l33N09N31p6o55k92M57M87l89l54n7N13K87
$$ plain form
4954 127 -109 -1 157 185 -61 -83 -97 88 219 20 -68 -161 323 157 -28 -54 -105 201 201 -257 -105 52 150
4977 150 -16 -124 -77 37 -8 63 -93 -83 120 285 91 -90 -240 355 125 -186 -449 110 291 7 -333
4998 -333 -35 90 274 -66 -248 -71 295 25 -412 -353 454 267 -162 -595 -215 82 238 -238 -421 178
5018 178 400 -104 -285 -149 294 200 -185 -284 -53 383 133 -543 -472 254 317 -50 -443 -74 448 190 -292
5039 -292 -483 -59 406 142 -279 -425 438 547 -24 -503 8 305 296 -522 -377 259 377 29 -434 -432 128
5060 128 322 -73 -419 -36 342 217 -222 -452 458 617 -72 -579 0 550 444 -286 -432 7 659 85
5080 85 -482 -284 497 604 70 -747 -54 545 260 -426 -275 248 645 -153 -457 -194 465 298 -110 -578
5100 -578 44 620 218 -622 -355 254 517 -222 -555 -46 485 409 -246 -538 -81 406 17 -337 -394 119 406
5121D06m27o13K26R16k12p23j22P38K56k63o09J05O33J39o75m22M76Q20k31q65
5141d47n8N12O88n55p13M93L96J19p32p3L39O24l75o59J28N53N01p31n38K21P65
5162D58q6q13l04N73Q19n45n82K5P85K92q14l77N32O04j43p25k26O42N95p10o68
5183f68L66P61P8o26l92L27P79k24j014K72M03M56m39m59j48J120O5j087m61R64
5203G3O48l65r23L02O42J15o53m15M15R02n06n92k83O85N32m89p85J77Q87J45
5223E12o13p54P14P76m37p58P2Q40K51n86o79M12O66J98q45o44P67Q32o44p30
5243f50m1J116K04q98o31J007M33j46p14l35P50N42m95o36n7R22N19j080o63O60
5263a93J225p64q44p2J017L38q43n57M83N89J76r64k37N39N15j48q16j7J216J67
$$ plain form
5121 406 -21 -634 -408 508 296 -427 -549 189 445 182 -427 -322 311 450 -225 -647 -171 649 418 -447
5141 -447 -505 7 695 140 -573 -80 316 435 -297 -370 -31 593 218 -441 -313 240 741 10 -528 -307 458
5162 458 372 -441 -745 -172 647 102 -480 -455 330 622 -192 -569 -37 567 424 -301 -527 115 710 0 -668
5183 -668 -302 459 537 -89 -481 -154 625 401 -613 -341 62 518 79 -380 -528 592 657 -430 -891 73
5203 73 721 356 -567 -265 377 492 -161 -576 -161 741 235 -357 -640 45 577 88 -697 -520 367 512
5223 512 -101 -855 -141 635 198 -560 -488 352 603 17 -662 -250 416 614 -231 -875 -108 724 80 -650
5243 -650 -691 425 629 -269 -900 107 540 394 -320 -655 95 637 142 -494 -551 371 890 -190 -853 -193
5263 -193 1032 268 -576 -648 369 707 -136 -693 -210 379 555 -409 -646 -107 408 260 -556 -573 643 810
5283H10j065o07P20R10o95q23M37P62J08m95n54K36O67K58r38l58N54P80l34p13
5303c40j23P35K73o28n12L42O96j84n19l08P98K45j80p96R4O80L66p15m77N13
5323d0N81k30n87l80Q10M23n32m32J24M65L63q29l44M44Q60n60n05j17O71N33
5343G18q61m29K56Q94l79r19K36O52M24m39l98j08O25J31p59j24M63L77j5o97
5363c52L1M94J79m18l67L28K84j08k8l24K06K84o6m58J48M19Rm98j9J88M16k18
5385A30j83k41L92K75k64m84K13L86p1q5k73O1L54N2m10k53N09K79k37n07K25
5406a32M66q3l46j89R7N02k3m23J77K7J55k16l54J81N62n9k50m54O82M2k41l00
5428a79K23J93j36k40L0p7K28Q8l41jM86J27m22l32K66M26q3m77Q1J08K90k76
$$ plain form
5283 810 -255 -862 -142 768 73 -750 -313 449 557 62 -492 -256 411 669 -269 -627 -73 707 373 -340
5303 -340 -463 272 545 -83 -595 -253 443 259 -260 -568 230 475 295 -501 -407 273 639 -76 -553 -40
5323 -40 541 311 -276 -656 154 577 45 -387 -263 202 565 -264 -608 -164 696 136 -369 -486 185 718
5343 718 -143 -572 -316 578 199 -720 -484 168 592 153 -245 -353 272 403 -356 -480 -17 360 345 -352
5363 -352 -321 173 352 -66 -433 -105 179 71 43 -281 -75 209 143 -315 -167 252 261 -237 -256 -68 348 130
5385 130 -53 -294 98 373 109 -375 -162 224 153 68 -205 -144 210 262 -148 -401 108 387 150 -357 -132
5406 -132 334 251 -95 -284 -187 315 292 -131 46 73 228 12 -342 -161 401 342 92 -362 320 362 121 -179
5428 -179 44 237 101 -139 -109 -186 42 130 -211 -212 274 401 -21 -353 -87 339 256 -221 -140 -32 258 -18
5450a8j9p7J92J26K0m51K14J34J45k82k81M62j34Q3l29N3L60J74m60n1J24K98
5472B83l33j02j80R3Q7K71l37L8L10o1k61j68L34K94k51j79P5J78r4k36j4L9K82
5495F8Q3l61K46K11j09Nl02J76K52k70l22L45J44j10k38j1J88K5J55p3j38J64
5517A28jPj79k3J68j43kl59O55p5k72k77L91L12k11k21J59N2j2j3j93k4P1K04
5541A42o2k36J27K70k04o1j56R9K72J8m56L03K20k02j40r9R1K79o3k28j80M47
5563A81K04m99n9j68N70Pk10l18L14K53j78l05J22L02M7m11j52L42K0n6j67j33
5585b94N12m3k51j83K37K56j69j11m9L36J5m26j58K78K14J38n72l8K88M13l85
5606Hl17M0N15J76m35j32K90M9j53j69n7L89J4j17m85P9M40j2l02L5M08j95J92
$$ plain form
5450 -18 -37 -114 78 204 224 -227 -13 121 266 -16 -297 165 31 114 -215 -162 198 372 -88 -139 -15 283
5472 283 -50 -152 -332 -239 -152 119 -218 -180 130 69 -192 -360 -26 268 17 -162 -87 91 -3 -239 -253 -214 68
5495 68 151 -210 36 247 138 143 -159 17 269 -1 -323 22 166 56 -182 -193 -5 20 175 102 -36 128
5517 128 127 134 -45 -68 100 -43 -45 -404 251 176 -96 -373 18 330 119 -102 57 109 97 84 -109 -133 -62 142
5541 142 80 -156 -29 241 37 -24 -180 -81 191 209 -247 56 276 74 -66 -165 -74 205 142 -86 -266 181
5563 181 385 -114 -173 -341 229 236 26 -292 22 275 97 -208 -86 216 263 -148 -300 42 62 6 -161 -294
5585 -294 218 175 -76 -259 -22 234 65 -46 -95 241 256 -170 -328 -50 164 302 -270 -308 -20 393 8
5606 8 -309 -269 246 422 -13 -145 145 194 41 -128 -185 204 218 101 -384 -305 135 123 -179 -144 264 69 261
5629B61n96J36L27R2l35l21L87L60j55n09L21K54q9q4l71L16K94j04k01m92N53
5650D4K43j38l30j81M91O5j86k64L12K14q4l52k43O04j00K01n97J50K66M4l62
5671b03q8L27K89j84k71l02N13K51n27j16k9O95j07m53l9J97L70k72l05J70J74
5692I0K10m46k95M14J80J75n82k0L22L50n68j29QN20J03m23l17L84K30M2o06n3
5714d11N60K94m23m72M69L09j71k74j56K73K10N6o58K66J82L62m40l75L44M33
5734C78p1n56k33N42L76o36r4R3M94o4k29m56N67L77m10j36j73M84j06j02m16
5755c71K04L18K76o50o2N29L42n66o46M92N46q9m54r5K41J95L6m53k29M73M28
5776D65m82m84L72M86l1l84k88M48L42k63n93J69M78O4j71m38J37N99j13m67k75
$$ plain form
5629 261 -335 -199 128 220 -115 -436 -49 311 156 -353 -32 222 133 49 -322 -6 288 184 -17 -509 44
5650 44 287 149 -181 -362 129 194 8 -256 56 270 186 -166 -409 195 95 296 -301 -151 115 159 -203
5671 -203 -291 36 325 141 -130 -432 81 332 -195 -311 -340 355 248 -205 -244 -47 323 51 -254 -84 90
5692 90 300 -146 -441 -27 153 328 -254 -274 48 398 -170 -299 -291 229 332 -91 -408 -24 206 248 -358 -411
5714 -411 149 443 20 -452 17 326 155 -119 -275 -2 208 264 -394 -128 54 416 -24 -399 -55 378
5734 378 307 -249 -482 60 436 -200 -294 -201 293 229 0 -456 111 488 78 -58 -231 253 147 45 -371
5755 -371 -167 151 427 -223 -285 244 586 20 -626 -134 412 323 -131 -226 15 210 246 -207 -436 37 465
5776 465 -17 -501 -129 357 326 -58 -346 102 444 181 -412 -243 235 299 128 -310 -173 426 313 -154 -429
5797d29M77M85m29o06K51N87l2m65k34N73L85l89l62L6L09J88k87n68O2Q40n9
5818C33l94n28Q11K05k56p96K53M83L01o15o2M9O02j92l04r6K48K49k00l18j02
5839c29P22P7q39j38N16N52n54j65l15O72J60l83m07J98P43j47m06m62M69M26
5859C90l23m13K49L34P0o51m9M55K25k00l79J43J58M94n49k04J22M30J12n67l13
5880d66N05N01k57q05L23N87j4n29k94L63N32k58m73R7M69N1l14m31R5O22J7l43
5902b2m75M24L18j05m53j5N81N1m74l27L26L81r6l46k14L85L75k43l13p1N02R0
5924B79l60k53J61N81j89m64l2L94J06l09j58J93K49O0l03j43K56L07n7o94Q6
5945b90M99K49n84l01M51L16j31m52Q1K48L8M7m57J61M17R8n62k41N25M71k77
$$ plain form
5797 -429 48 533 104 -502 -251 336 304 -161 -395 178 563 174 -188 -152 157 345 58 -510 -448 392 333
5818 333 -61 -589 222 427 171 -625 -372 111 412 -203 -265 -216 386 194 -110 -206 42 291 91 -227 -329
5839 -329 393 470 -369 -507 9 561 7 -158 -473 199 359 -24 -431 -233 510 363 -43 -505 -36 390
5859 390 67 -346 -97 237 307 -344 -393 62 287 87 -292 -149 9 503 -46 -250 -128 302 414 -153 -466
5880 -466 39 540 283 -522 -199 388 374 -155 -449 -86 446 188 -285 -188 281 332 18 -413 -318 304 321 -22
5902 -22 -497 -73 245 140 -313 -328 253 304 -170 -497 -171 210 114 -232 -446 -61 314 71 -242 -313 189 279
5924 279 -81 -334 -173 408 219 -245 -277 117 223 -86 -244 -51 198 258 -45 -188 68 375 318 -376 -290
5945 -290 209 458 -126 -427 24 340 209 -243 -162 86 124 171 -286 -125 292 390 -172 -413 112 583 306
5966C06p21J79K72K28m93p2M58J77k11k70j71L11K56j65k01r8J36K35j90q9J56
5987C3K67k32l53P3K49L91k79l52K04K85N2l17l37L33L88j53p58K97M66O7l60
6008c6l77L79M12l82P3k76L19J46k18k81K10J58N6k15j62J87J72N7l29j42N11
6029B62j5m40l3K11J19K57k58l51L33J71j46l51k7N97j56l57j24L3N03k37j28
6050a37r6L31J09k99k19K66K09r3j68p8J83J81j92l92J31O12o4m02J36R9K54%
6072C71n98J28K11K90k65l16m0M93j52l59q5K75N35n16j94j12L74K34l78j08m1
6093b53N14o7l75q0L23L70k61n23O7N92o6k61j25J73K87n6p05K37L42J79l38k35
6115b61K60j00K79k62k21K91L62m20k51R2P15j97m64k93O15K18j67j93l25M33
$$ plain form
5966 306 -415 -236 36 264 -229 -301 157 334 123 -147 -318 -7 249 84 -117 -215 -79 156 -34 -123 33
5987 33 300 68 -285 -212 37 428 149 -203 1 286 338 21 -316 17 405 252 -506 -209 257 324 -36
6008 -36 -413 -34 378 -4 69 -207 112 258 40 -241 -31 127 183 -32 -194 -7 165 222 -107 -249 262
6029 262 247 -193 -226 -15 104 361 103 -248 85 256 110 -241 -268 329 173 -184 -308 -275 228 -9 -137
6050 -137 -233 98 207 -92 -311 -45 164 71 -97 -175 8 189 -3 -395 -264 348 284 -118 18 117 371 371
6072 371 -227 -99 112 402 137 -179 -219 274 122 -237 -322 -47 488 -28 -222 -334 40 274 -104 -212 -253
6093 -253 261 194 -181 -261 62 432 171 -352 -285 307 241 -20 -145 28 315 259 -446 -209 133 312 -26 -261
6115 -261 -1 -101 178 -84 -305 -14 348 -72 -323 -231 484 287 -177 -470 145 363 196 3 -322 111
6135A11J83k21l37J59K54J59m77l39P12J02l21k93J23M38r6l21k7K67P0p4o7l27
6157c22L08L62k14m77J26L80O7n42j08K77P18n84k49J29L59L9m38j1J50L90j2
6178C48n94j52M94J52j54m64K72M40j85n41K60M12j92l7j76J71J58O9m14j45L14
6199C6R8N9l88j04M46J53l76m21L62N60j24n17j06J70N16j45m63L9K46L50j72
6220B19o43L63J60J21l55k86M71L15k25n55M68J71j12l85J18K71l7p6l18K24R2
6241AM10m12m94L03O17l30j61k91N23J9j93k38M2N58k14k05j42K08J42J3l31k73
6263d48N79K12j67o09R6P02k9l65r6LL85k61j82j64M91K0k20j12J81K34j7k59
6285b6k86L47K47k48l21J86K89j32j64k02K37N11k96j72j01K08J62q2m09J00K18
$$ plain form
6135 111 294 73 -264 -105 149 308 -169 -508 204 306 -15 -308 -185 253 157 -164 -191 76 146 72 5 -322
6157 -322 -14 348 134 -343 -217 163 230 -312 -420 -143 575 -9 -258 -129 230 269 -169 -180 -30 360 348
6178 348 -246 -398 96 248 94 -370 -98 342 157 -384 -124 288 96 59 -117 54 212 281 -133 -278 36
6199 36 134 193 -195 -299 147 300 -76 -497 -135 425 301 -216 -322 -152 364 219 -244 -205 41 391 219
6220 219 -424 -61 99 220 -135 -421 50 365 140 -415 53 224 112 -273 -155 116 79 3 -315 -91 1
6241 1 411 -1 -495 -192 425 95 -66 -357 166 185 -8 -246 -204 354 140 -65 -207 1 143 156 -175 -448
6263 -448 131 343 176 -433 -337 365 336 -29 -125 -122 263 2 -180 -344 147 167 -53 -165 16 250 233 -26
6285 -26 -312 35 282 34 -287 -101 188 56 -108 -310 -73 438 142 -30 -131 77 239 157 -252 -152 66
6306F6kk10j38M51J06k16k97RK03N6n0r8j05L10K08n27o7J15M86k98j99L08k5
6329H6rj86k26L17M25j44n45K13J70K05j69k79K86j65K43k48j71L02J06Kl03j48
6351b38L46L2m25J52R0K98j32k82J84n5L1l6k1l14M02K33k50m12L97K59j55n73
6373d69R9O20j46k5m87L01J96J57l94j52L53K11K8n24L3L72L7k39l57M41K19k40
6395C4k86M7L74J02k39l89K99L84k67l04K07K59J37m00k67J62K61q2jk27J10L19
6417B33Rl28j21K96J89j86k49J5L71n1j78k22L71mj30j75N3K49J47m55n0K72K44
6440C00j78n12K95K78j14k35R1M2m6K20j43l14M20j21M1l8o9P2J19k98n6J89M14
6463C57o8n85J30M84j07l53j50J55K06K07n75RN47m6k2l56O1K24P0m36J20K87
$$ plain form
6306 66 64 -146 -284 167 273 57 -240 -231 -28 28 -22 -120 -225 85 293 -234 -301 -186 300 2 -197 111 86
6329 86 77 -109 -335 -18 407 263 -282 -69 101 306 137 -142 144 -21 222 -26 -197 105 211 213 -90 -238
6351 -238 108 140 -285 -133 -43 255 123 -159 25 -30 1 -35 -56 -370 32 265 15 -397 0 259 104 -469
6373 -469 -370 250 104 79 -408 -107 89 246 -148 -300 53 264 292 -232 -199 173 210 -29 -386 55 274 34
6395 34 -252 -205 169 271 32 -357 -58 326 59 -245 -38 221 358 -42 -309 -147 114 32 31 -196 -86 233
6417 233 242 -86 -207 89 278 92 -157 -142 229 178 0 -222 149 145 15 -160 -107 142 289 -166 -216 56 300
6440 300 122 -390 -95 183 69 -166 -75 -33 -79 141 -2 -316 104 -17 24 -14 -83 -11 108 -190 -246 -57 357
6463 357 289 -296 -166 318 211 -142 -292 -137 69 276 -299 -290 257 211 189 -167 -106 118 188 -248 -128 159
6485A59J16k30l14K59J71m4q6j52n3L21O8l96q7K36M20k89m75L4N26J54n19J0
6507a71K28L66l13k74J87L30k2m39o9K55J99j64l24J5K58K17j83m01J23L82J00
6528C00l37p3k3L76J82o67J19J85J67k56p7k19M56L20n29m19O72J20l53l55Q4
6549c27N02k5p9k96J54L72J40l93m05L79L17k68j42j92M73J84m73k81K98L80l19
6570ak93j45O01k6j94r0K7K85Rn04Q2K49K80j49n02K77L62J42n44p0K43J86m7
6593A78m08j17L65J20J9n02K52L60R4l91l79K24M37M1n48R2K50L17m06k21M26
6614B03q4K25k09l85j31O74q6l87p2M49K81l33m04J62O09k32m31J66OL45l61k54
6636b49N8J60K97l85j05K17K80o7l87k85O46K66n25k83J09M36J12m72m0J16M72
$$ plain form
6485 159 275 45 -269 -10 161 117 31 -121 -174 147 215 -181 -268 -32 388 99 -376 -342 184 338 -181 -171
6507 -171 57 423 110 -164 23 353 331 -108 -177 78 277 113 -211 -196 62 279 96 -305 -182 200 300
6528 300 -37 -110 -133 243 425 -242 -123 62 229 -27 -104 -323 133 453 -76 -495 177 297 -56 -411 -327
6549 -327 175 150 71 -225 -71 301 441 48 -357 22 339 71 -71 -263 210 394 -79 -360 -62 318 -1
6570 -1 -294 -439 162 136 -58 -148 -121 164 173 -331 -249 0 280 131 -371 -94 268 410 -134 -204 39 225 178
6593 178 -230 -347 18 138 157 -345 -93 267 361 -30 -409 -185 252 293 -255 -163 87 404 -2 -223 203
6614 203 119 344 135 -250 -381 293 207 -180 -252 197 478 145 -259 -97 512 280 -151 15 21 366 5 -249
6636 -249 -191 -31 266 -119 -224 -7 273 206 -181 -466 180 446 -79 -362 -253 183 295 -177 -217 -101 371
6657C71l79k47j42O32j14k96j31K23M58j92l83o9K06L66k59l08P9L23J32l46k31
6678c07K18N26k69m50j86N34K77k41m26L78K47J57l66o42L67N36k18m93J36M57
6698B35J7l83j48J64N95j82n73n6M98K33l35m44R0N58J13m33m20M21M63r1n06
6719a84O5L65J74n43k45L2O29K1n54l04N72K41j66n44J75M71M5k61l60M38K16
6740B83J7o99R0M24L50l88l60J36N72n7m34l36L44N67l12o24P2M85K42k69m71
6761c68K23M69m8l31j52J54K98l2m06p7L96M4l46j55K51M22j93o02O7M56L80l96
6783E4m31K71O04j51l68m38L94L14j05m36M5L40L44l81l63J30L44K24o84j43N72
6804A36K10l21l88L00K97Kk55j77o8L98l6j56j55M22J1j95j31p6M08k77K3j92
$$ plain form
6657 371 -8 -255 -397 235 121 -175 -306 -83 375 183 -200 -269 -63 303 44 -264 -185 138 270 -76 -307
6678 -307 -89 437 168 -282 -468 66 343 102 -324 54 301 458 92 -550 -183 353 135 -358 -222 235
6698 235 252 -131 -279 -115 480 298 -275 -331 167 400 65 -379 -289 269 382 -51 -471 -50 413 322 -184
6719 -184 -119 246 420 -123 -368 -336 293 314 -240 -544 28 269 103 -441 -266 205 250 -11 -371 67 283
6740 283 300 -399 -309 115 465 77 -283 -147 425 368 -66 -402 -58 509 197 -427 -355 130 372 103 -368
6761 -368 -145 324 276 -55 -207 -53 245 213 -193 -270 126 170 -176 -331 -80 342 149 -453 -386 70 450 54
6783 54 -377 -106 498 347 -21 -459 -65 249 144 -292 -247 93 437 56 -307 -177 167 391 -293 -436 136
6804 136 346 25 -363 -63 234 236 -19 -196 -264 134 98 -58 -213 209 220 25 -106 -182 226 -51 -28 -220
6826b20L54j59K64l59J0J71J88j00k73L9K65km13kJ73L11j57k05j2J85L9j38j95
6849b36K39J42p9K3l54N11J9K2o11R1N13L5k80k9j62L58j2k36k17M09Q1k95j0
6872g8N9K15j70j02k25K03K27O5l44jM19j12l42j57J82J54J03O8k06r9K40l8j28
6895f7Jj16L72k29q1q4M39k12k13j3K88Rk84K15j08J81o6nj00qJ60n7k00J00j3
6920i1K95k92q6M9L23k59p6O7K1J35j11K2o9K6J28J48k44P9K57k93j73J02Q6J36
6944A80k02j16J30K18j55j56K2K46j32k07K79l66J69k7J89l2o0Q7J21l09J46o7
6966d2J98j5j51Q4K8j90J22J08j12K15k35j09R8p5J67k22J29r9J43N9j11k81L67
6989G6O1k72P4K14k08j38K20l5j24K12j68N0j03J28K16j77oj73K09J33l92K25
$$ plain form
6826 -220 134 -25 239 -120 -110 61 249 149 -124 -85 180 178 -235 -237 -64 247 90 -115 -127 58 97 -41 -236
6849 -236 3 145 66 89 -265 246 265 287 -324 -233 280 315 35 6 -156 202 190 -46 -263 146 227 -68 -78
6872 -78 -19 196 26 -76 -301 -98 129 194 -150 -151 268 156 -186 -343 -161 -7 96 164 -42 -141 99 61 -67
6895 -67 -66 -182 190 -39 -120 -204 235 23 -190 -203 85 94 -190 25 -83 98 32 27 -73 -81 79 22 -178 -78 -91
6920 -91 204 -88 -174 -125 198 -61 -137 -70 -49 86 -25 -3 -72 -46 82 230 -14 65 322 29 -144 -42 44 180
6944 180 -22 -138 -8 210 55 -101 -79 167 35 -172 107 -259 -90 -117 72 40 -20 67 188 -121 25 -42
6966 -42 156 141 -10 74 102 -88 34 142 30 245 10 -99 -1 -76 91 -131 -2 -101 42 101 -10 -291 76
6989 76 137 -135 -61 153 -55 -193 27 -8 -132 80 -88 -38 -141 -13 203 26 20 -153 56 189 -203 22
7011B2Q0K0l41K25K50o5l74R9M5K51q8k77J25K05p1j73p5Q3K62p5k24q6K56K85
7035C59l11r3o9N54k39l77K9L08N4l38L0k4L70R1k10m50P9M37j13j73j06L34K14
7058C56m65p7J75J58j32j40m6K18J03N6l81nM18p4Qm62K46K73j31j58l64M77L62
7081D15j94n56K63K58k4j32l40L96J49l66j4m7L82J76l39j72RN53k3n22k35L40
7103b3L16j29m98J27L50M7l07j97L43J73O9l29j97M95L29n80l03jN03R6n05r0
7125c11L65M44m23m81K49M55M3l07l27J57M87o0l54k32K81L99j76m63r0P20q1
7146B95l04k47K58K13n0m70J88nN35j45m52j04M85L34n45l25M41L83m39l17N7
7167b14K67J44k19j89J50L31j15k28j88M15K64k94l98m3L35M28m00m36M06L05
$$ plain form
7011 22 102 122 -219 6 256 191 -183 -84 -39 212 124 -153 -28 177 106 -67 -142 -59 203 128 -96 -182 74 359
7035 359 48 -45 -114 440 201 -176 -147 161 215 -123 -93 -117 253 344 134 -316 -237 200 87 -86 -192 142 356
7058 356 -109 -186 -11 147 15 -125 -171 47 150 206 -175 -180 238 164 172 -290 -44 229 98 -60 -424 53 415
7081 415 221 -335 -72 186 162 30 -310 86 235 -131 -145 -192 190 366 27 -145 -136 417 394 -128 -363 -23
7103 -23 293 164 -334 -207 143 190 -117 -314 29 202 271 -58 -255 240 569 -11 -314 -315 188 284 -221 -311
7125 -311 54 498 75 -406 -157 298 341 34 -293 -136 351 291 -63 -295 -14 385 209 -254 -344 376 295
7146 295 -9 -256 2 215 165 -305 -117 -122 413 268 -184 -288 197 531 -14 -339 102 485 46 -271 -214
7167 -214 53 197 -22 -211 -61 270 155 -73 -261 154 418 124 -274 -317 18 446 46 -390 16 321
7187C21j4m69k21O14N1q8m15o3M04J86k67k39J3N95j25o37L1K41O42o18l96L28
7209a26N06L4o61R2K35J47qn34j01M63M18k46o32Q4P27k49l31k61N39L57k37n11
7231b95K2J86L30j68n69K61M06K97o68k13J20Q60l07o90J18N50J47n80k35M73
7251D5J68k28k02j64L12O06n18l26J53K71J78k28o13N07L12N9q63J47M34K80l76
7272d6l07R6N17Q1l97j81M28K51l08m07j46M82M00n21l81M26K88j36m21p3L07
7293d8M53l67l68k9N01K17k69n76M72L87p7o95j11N31L74l74m29J42O10j08l49
7314a13k03J37P77m51m32L9K73K47j93m70K88L62j76l95J32K74K67j37l92k2L11
7335A23J9l80k43M21K59J07o33J31J30O29m61n31J95M88J75m73k24k3O66k89m14
$$ plain form
7187 321 307 -162 -383 231 282 194 -221 -284 120 306 39 -200 -187 408 283 -354 -323 -82 560 -58 -454 -126
7209 -126 380 414 -247 -155 80 227 219 -315 -416 47 465 219 -413 -329 398 149 -182 -443 96 453 216 -295
7231 -295 -273 -87 243 75 -494 -233 173 470 -198 -411 -291 569 262 -428 -310 240 387 -193 -428 45
7251 45 213 -15 -217 -381 -69 537 19 -307 -154 117 295 67 -546 -39 273 332 -531 -384 50 330 -46
7272 -46 -353 -257 260 341 -56 -237 191 442 134 -273 -419 63 463 -58 -439 -13 275 139 -282 -355 -48
7293 -48 405 38 -330 -359 142 359 90 -486 -14 373 296 -399 -510 21 395 21 -408 -266 344 236 -113
7314 -113 -316 -179 598 147 -285 -246 27 274 81 -389 -101 261 85 -310 -178 96 363 226 -166 -188 123
7335 123 142 -238 -481 -60 199 306 -327 -196 -66 563 102 -429 -234 254 429 -44 -268 -291 375 86 -328
7356c28j55O40L45n57j67J9N22J00o63l15O89L33l89l73l5P20j12j96l40J12O45
7377D95k53m07j01K49K70j01k73m6K55P7p9j84L5M69j39m09k25M22L02k29m68
7398c40J85L20J09l41j44J13M16o0k82k78M60j7j28k25L9J58N6%k96J92L80l20
7420ck85K11M4K36j73k39OL75O5k34l7m4K70k38k21N3K32J83j8l84K72J42m3j83
7444a3j56J50K12n5l69M06j8Q4n15J87J00K8L8l62J22J56K16j43j71j04K90Nj81
7467i3m4K36m9J72k61r0K02R8j96o0m2K41n8m1k26L9L28j37K3j07K94%q5k38O2
7492c2K16kj66n9N2J09qk50j08j0M10n9p9l2R8N7j53j43K59k3K51m58n4L19R5
7517B30k79j89J92N9m0k2L8J31k11K01o1k22K79k17J49o1k3Q4J1j10m3J08J28
$$ plain form
7356 -328 -483 157 502 -55 -222 -203 319 419 -244 -559 130 463 74 -299 -334 386 274 78 -262 -150 495
7377 495 242 -165 -266 -17 253 152 -121 -167 88 165 86 -98 -63 406 267 -142 -367 55 357 128 -340
7398 -340 -155 165 274 -67 -211 -98 318 258 -24 -302 158 141 13 -212 -173 -15 41 41 -255 -63 317 -3
7420 -3 -288 -77 -33 203 30 -209 -203 172 237 3 -34 -78 192 -46 -267 -214 18 201 183 -201 71 213 170 -13
7444 -13 -169 -19 193 138 -231 175 157 241 -274 -87 13 41 79 -283 -161 -5 211 68 -103 -207 83 88 -93
7467 -93 -137 99 50 222 -39 -129 73 171 -25 -85 -127 114 56 15 -211 -172 156 19 42 -65 229 229 144 -94 -32
7492 -32 184 182 16 -43 9 118 110 -140 -248 -258 152 93 14 -18 80 137 -16 -159 100 77 328 -130 -184 135 230
7517 230 -49 -238 -46 13 -27 -49 -11 120 -91 110 49 -173 106 -111 38 -23 -46 38 49 -61 -104 4 132
7540A32l8j71K2M0j72J97Q7j86LJ36j17m3J67L1J33j23R5k01L1Q1k20K47j19N0
7564F2P7j84j22J17L8J85m34J56L06j56pl14K74M0M6j64L4R1j6k38K38n1J39K5
7588A42k77j91L96K17k80j71o0L65n5j27k2R1P3L1j53k55K13K63m1j58j93K15
7610B3J70k60k73K70L91k75n9l68K65N62l49k72m5O8L34k41k45K73K38J15m99
7631a77j12J35M52j89l10o0L81p5J32l54j09M97q9k17j93J22N30l4o41J50K85
7652A24K19n55p6M54J07k84k07K47m1K37j88l48J03N64o4o40J63M5L03L5n12K46
7674f8J25N1j06l50L54K81r5l31j81K47K62J65n14j91M74O6j57k44lN02j51k89
7696a53k99L93L43k49j59M3M35r1k50k34J35L64j18m05l7K82M53l86m17J68L85
$$ plain form
7540 132 94 -77 -55 -15 -187 10 97 -89 -86 50 -67 -110 57 88 221 98 193 -8 23 104 -116 131 12 62
7564 62 139 -45 -167 -50 -12 173 -261 -105 201 45 38 -276 -2 38 84 -80 -46 45 29 -209 29 -22 117 142
7588 142 -135 -326 70 287 7 -164 -224 141 86 -41 -63 28 101 132 -21 -276 -63 200 159 1 -192 23
7610 23 193 -67 -340 -70 321 46 -13 -381 -116 446 97 -175 -220 -152 182 -59 -304 -31 207 322 -177
7631 -177 -289 -154 298 109 -201 -261 120 45 177 -177 -286 211 122 -95 -288 -166 364 330 -311 -161 124
7652 124 343 -212 -288 166 273 -11 -218 29 -12 225 37 -311 -208 356 292 -348 -185 -140 163 198 -314 -68
7674 -68 57 108 2 -348 6 287 192 -139 -320 -73 189 354 -160 -351 123 189 32 -212 -215 287 136 -153
7696 -153 -452 -59 284 35 -124 -81 354 263 13 -221 -86 278 160 -245 -282 0 453 67 -350 -182 203
7717B03J05l58n0K49K89m41j75k80N24L52m11k99N4O30o8n91p0M99J99k18l24
7738a81J33K73J51m75m22M26L47J3n07j42M67L25k27m42O1M24j8l39k91L95M38
7759D09j20o51M8L63L92l34m07k9M14K76l19m29L70J94N6n25O3K98L04k26m93
7780c46rQ25k52l92J0J94K27J73p69J9M90J88l05l09K52M32K36q13l15L25O57
7801E18m67l45q0P11K1m78m64L73N55r1j82n02L90O23m16o10P8P77l1n74j60Q5
7823b69N91l0n66o0L42K15q4k31j51L53L77n19l92K29O02p1n62oM28R9k17m83
7845d05K19M21J01m29n15M83O61k29n68j91N44J31n33k25K56P65j80n08l55O71
7865A14J95k10o88L99N33J8m30l68L26M02l9n63j71N91L45m99l34K0M78K37l80
$$ plain form
7717 203 308 -50 -100 149 438 -3 -178 -458 66 418 7 -292 -238 392 324 -267 -337 162 361 143 -181
7738 -181 -48 225 376 -99 -521 -95 252 265 -242 -384 83 408 181 -261 -200 224 206 -133 -424 -29 409
7759 409 289 -362 -314 49 441 107 -300 -329 85 361 42 -387 -17 177 233 -292 -229 69 373 147 -346
7780 -346 -355 470 218 -174 -164 30 257 430 -339 -320 170 358 53 -256 -4 428 664 -149 -464 -139 518
7801 518 51 -294 -374 337 358 -120 -584 -211 344 253 71 -431 -41 582 166 -444 -366 411 380 -194 -354 -269
7823 -269 322 292 -274 -334 8 223 139 -92 -243 110 487 -32 -424 -195 407 336 -226 -232 196 295 78 -405
7845 -405 -186 235 336 -93 -608 -125 536 307 -261 -452 92 223 -310 -535 -279 486 306 -202 -557 114
7865 114 309 99 -589 -190 343 361 -69 -437 -111 291 252 -311 -482 109 454 -45 -379 -359 119 356 -24
7886b4m16M71M92n59k62p9P41N7m23k01J91M34m1n98k6K40M77j65l37l67N77L14
7908D96n38l65J85L67Q7n94r3M07L60qo62O9O17q3m22k02L52M22k20l00l37P67
7930C05J04l89j91j57N02O8l08k85M81K48l31l67K11L42J69l98m09M26K32J81
7950D34o78q0L80J95p5l88o8L51J78j72l22L06J85k22k14q0M62L03m07m06M24
7971A06K2J47l67k19K64L78o2m19k50K42N07k97k27R1M18j27l33k39L94L06m9
7992B86m86j37N14o3j02j40j28M39J97m02q7J00K34q2N7j73j08K89k30j32R4K82
8014B22k1l38J4o2L42o1m00j26M56J57k91k35K01L23m3k38j42J58N35m22j77j54
8036c02L61M7O1l57n6M98J25k09m86K23M90m70o3J09J14K45m18p9J50N3N2k06
$$ plain form
7886 -24 -440 31 523 -36 -298 -377 364 421 -2 -203 -12 422 381 -217 -243 -3 474 309 -28 -395 182 496
7908 496 -42 -407 -222 145 232 -362 -455 -48 312 304 -358 -289 328 245 -177 -379 -27 395 175 -125 -462 305
7930 305 409 20 -171 -328 174 242 -66 -351 130 378 47 -320 -109 233 402 4 -405 21 253 434
7950 434 -244 -324 56 251 176 -212 -280 71 249 77 -245 61 246 24 -190 -270 192 495 88 -318 106
7971 106 128 275 -92 -311 -47 331 269 -150 -400 -158 349 52 -175 -84 334 207 -126 -365 29 335 286
7992 286 -200 -337 177 114 12 -128 -256 183 380 -22 -109 -9 225 143 200 27 -81 208 -22 -154 -60 222
8014 222 201 -137 -123 -185 157 96 -304 -430 26 183 -108 -343 -142 181 138 -100 -242 -84 451 29 -148 -302
8036 -302 59 106 167 -190 -246 252 377 168 -318 -95 395 -75 -138 -29 85 330 -88 -167 -17 36 88 -118
8058a18n3M9L51k81L9j82M08O5m17n9K25L3L5k98q7K30M53k09l63J05R6K68k50
8081D0k49J65J53j97M9j77L28J02j38k77j9K18J59k39Q5j20K16K04m80j67M36
8102I2k5j14r7K9R7J92l13l2jJ75K08k27j08J56J42j82k46nM09O1j79k93K00K11
8126A50j16n1k92K87J56j5k31J06K9J23j94j05J00J26J38m17PJ28K72j08j15r0
8148a12K52J52j41k16j23K30J05l36J81k9L12k78M1l9P0K04j81j82n3L09j77l0
8170d1K1J08j61J60j74j27K76Q6o0l84K34L11l5l02R8j5K44n3k62j19Q5
$$ plain form
8058 -118 -171 -122 229 -52 -13 -195 213 278 -139 -198 27 60 95 -203 -290 -60 393 184 -179 -74 22 290 40
8081 40 -209 -44 109 -88 -39 -216 112 214 76 -201 -220 -2 157 -82 3 -117 99 303 -177 -344 92
8102 92 67 -47 -144 -115 -18 174 -139 -171 -172 3 211 -16 -124 32 174 -8 -254 -259 150 211 32 -261 -61 150
8126 150 34 -17 -309 -22 134 119 -112 -6 23 146 -48 -153 -53 73 211 -206 -199 -71 201 93 -22 -112
8148 -112 140 292 151 -65 -188 42 147 -189 -8 -37 275 -3 38 -1 69 273 92 -90 -143 166 -11 -41
8170 -41 -20 88 -73 87 -87 -214 62 148 88 -296 -62 249 214 -88 10 -5 239 186 -76 -195 -110
8191a10
$$ Imaginary data points
##PAGE= N=2
##DATA TABLE= (X++(I..I)), XYDATA
0@%%%Qj6QqK2k3K1k8M0n1N9p5R4j11J33j58J84k16K54k91L31l85M42m99N68o46
29c43P28q17R19j032J152j283J430j591J766j960K173k403K659k946L260l610
45a898M009m460M968n552O239p051Q026r229J0755j2759J5519j9580K6143l8478
59b3348O9302k76489m96268Q25524N57756n90609o16054M34025M85536k19062
69A50313l64173M5060K26260R8315o2785j49354k01038J57435M32548q3361n44636
80b95416n4386N26603K13612m73005k84503L87422K75251k53553k52289P3484
90a36780K37836Q8690j46411k07449m3544K78700K44561k85278l52425K04284
100a17816L77295q7549l80585J1184L62844K4626k72615p3205J15122J26831N5180
$$ plain form
0 0 0 0 0 8 -8 0 -8 14 -9 12 -16 24 -27 32 -43 51 -60 73 -85 99 -117 137 -154 177 -208 234 -265 303 -343
29 -343 385 -432 487 -545 607 -676 754 -837 929 -1031 1142 -1261 1398 -1548 1712 -1898
45 -1898 2111 -2349 2619 -2933 3306 -3745 4281 -4948 5807 -6952 8567 -11013 15130 -23348
59 -23348 45954 -230535 -726803 98721 656477 65868 -550186 -116161 369375 150313
69 150313 -213860 -168800 57460 155775 92990 -56364 -257402 -99967 332581 249220 -295416
80 -295416 -349802 176801 390413 -82592 -367095 20327 295578 42025 -210264 -136780
90 -136780 101056 189746 43335 -164114 -207658 71042 315603 30325 -322100 -117816
100 -117816 259479 171930 -208655 -197471 165373 189999 -82616 -155821 -40699 86132 141312
111A41312j01045k07411l8429L34028K07906m03121l18213L88371L84965l15975
121G2388m56243K40362N07958j60455m78265L5434L59459J09766j97026j76965
131a43587K2283J29701J56477l6103l08605l8766L93222J14939m20286k33232
141c63957M22728L59894l83415m20238K64787L96565r8330l25793k6328K24057
151D9970O6726q9209p3204n2709Q9653J63546p8241k41417m266L00699J17661
162B49209l20164j90709K58286K06166j36602j90878L5284J51425J3636p3828
172A825n5617k8281J12866J19490j37981j95542Q7728K67565N273l07177p6895
183b06746K72322J13189j80492j39292R2530J49129l0875j15031m2162M4034J40945
$$ plain form
111 141312 40267 -167144 -205573 128455 336361 -66760 -384973 3398 388363 72388
121 72388 -383855 -143493 364465 204010 -274255 -238821 120638 230404 33378 -143587
131 -143587 -121304 8397 164874 128771 -179834 -218600 174622 289561 -130725 -363957
141 -363957 58771 418665 35250 -384988 -120201 276364 178034 -147759 -174087 49970
151 49970 116696 27487 -45717 -98426 -8773 154773 76532 -164885 -169151 131548 249209
162 249209 -70955 -261664 -3378 202788 66186 -124692 -89408 62017 75653 1825
172 1825 -53792 -82073 30793 150283 12302 -183240 -95512 172053 177326 -129851 -206746
183 -206746 65576 178765 -1727 -141019 -48489 100640 69765 -45266 -87428 -43394 97551
194I7551L6670k10620j22339K02172K17652j45148k94800R1598L11114m4089k71564
205a31803j8416K25678Q3118j84249j13670J07603J04040J0201p4073j10814K3624
216g8761J51272N7623j50718j43173J48032J89393j34494j97729Q3440K01456
226A26341j0029j99457m4561J54386P3356n9930q7657l2971Q0200Q1735l5526
237D5887j05562k9879J34933P7408j48024j03610J17987J31670n7445j58215M291
248i0559J39415L4140o9893o9871k510R1554M8054p7044q3406L4674J29146K513
260H6213j63084l2889J51802P8381j08200j26895O5433J38687k5931j03672k4317
271f4472N7094O9949k5173q4929j2235P3474P1201n9050j22424M1361J33496o02
$$ plain form
194 97551 134221 -76399 -198738 3434 221086 75938 -218862 -127264 183850 139761 -131803
205 -131803 -150219 75459 158577 -25672 -139342 -31739 72301 82502 8429 -102385 -78761
216 -78761 72511 130134 -20584 -163757 -15725 173668 39174 -158555 -75115 126341
226 126341 116312 -83145 -127706 26680 100036 40106 -47551 -80522 -322 81413 45887
237 45887 -59675 -89554 45379 122787 -25237 -128847 -10860 120810 63365 -94850 -90559
248 -90559 48856 82996 13103 -56768 -59278 32276 80330 3286 -80120 -45446 83700 86213
260 86213 -76871 -109760 42042 120423 12223 -114672 -49239 89448 63517 -40155 -64472
271 -64472 -7378 62571 37398 -47531 -59766 13708 84909 25859 -96565 -55204 78292 77690
283G7690j16727n5231R6983Q6518p2940q1033K9607O8354K1043o3104n0298M1649
295a7489N7729Q506o5474o1113O8772Q4529m3875q6376j889Q8874L5109q4134
307a6831m3805N1936M9772o328o3452k3469N9753L8880k3389n5968j9708P0668
319A8059M2251n9548n4428K4802P2299L453q2579j3944O5635K9066l0435n4383
331c9752L560O3512J3278m1781l7788J1242O2810O411o1333k0323L5764M5726
343D1326j3165o6663K113N9394J4899l3830m2735J5207N6559o54m1446k5466J8760
356a5701N4514p330o1681n857M4466L3970k6495n9251J6264O0043M690m3856l8758
369d4982L1169N9031j9382n2553q859L6920M4695k7069n9709J1240N1904K0840
$$ plain form
283 77690 -39037 -94268 2715 89233 16293 -64740 -35133 33221 54264 -8840 -59138 -17489
295 -17489 40240 48746 -16728 -77841 -9069 75460 31585 -54791 -56680 32194 67303 -16831
307 -16831 -60636 -8700 41072 34744 -28708 -52177 7576 46456 23067 -32901 -52609 18059
319 18059 60310 762 -53666 -28864 43435 46888 -35691 -49635 16000 45066 14631 -39752
331 -39752 -36192 27320 40598 -1183 -38971 -27729 35081 41492 -19841 -40164 -4400 41326
343 41326 28161 -38502 -36389 23005 37904 4074 -38661 -23454 33105 32451 -8995 -34461 -15701
356 -15701 38813 31483 -30198 -36055 8411 42381 15886 -43365 -27101 32942 37632 -6224 -44982
369 -44982 -13813 45218 25836 -26717 -35576 1344 46039 18970 -40739 -29499 22405 43245
381D3245m2454n1812L4623N8240j2207m9074k5457M4031N3027l5340n7212P270
393c3120N1230L0672m9008n2790L4600N6121J226n7316l8479N8015N5916l9677
405A7390o0044n0O4834L4823o2496n1310L6665O1343M436p1436l3655O5553M7644
418E3697l3881o1921o752P4493L3830o5032n1084L1215P2209M069q3534k8614
430f1305O6801N2376l0820p9558j643R0421K7329p0680n6654L6740Q5224p068
442E1163r0327k3287O7645O1004l8125r1046J2216R3655K1742p2195o3681M6256
454b4980R2321j8714r2111k1393P3875O6361n4204q9165K5845Q6697J9273p3758
466i953o5302N6456Q8847k3648r0843k6322Q4743O9425o7016q7665K8516R0255
$$ plain form
381 43245 791 -51021 -16398 41842 29635 -19439 -44896 -865 52162 16822 -40390 -33120
393 -33120 18110 48782 -226 -53016 -18416 37705 38931 -18385 -56864 1151 57067 17390
405 17390 -42654 -42704 22130 56953 -5543 -56853 -20188 41155 45591 -25845 -59500 6053 53697
418 53697 19816 -42105 -48857 25636 59466 -5566 -56650 -25435 46774 50843 -32691 -61305
430 -61305 5496 57872 27052 -52506 -54149 36272 63601 -7079 -63733 -26993 58231 51163
442 51163 -39164 -62451 5194 66198 28073 -62973 -50757 42898 64640 -7555 -71236 -24980
454 -24980 67341 48627 -43484 -64877 8998 75359 21155 -68010 -42165 44532 63805 -9953
466 -9953 -75255 -18799 70048 46400 -44443 -70765 13978 83403 16387 -71278 -42762 47493
478D7493K2299q8456o1107P1624P9505l0948q9318j9716R2009N7323p0175q0067
490f9534K3061R6776K4423j00671n6317P7249P8171l3181r7589q508J01051M1945
502G6876p4737p5620L0142J01943J1913j02078m8773P0957Q5984k9711j12109
513f5213n730J11489M2369q7754q4009N5010J12560j8634j09260k9430Q2553P9155
525H3106m7692j05756P967J01296M0182q3037q6032O0264J11212k3681j13560
536e5731k9008J03790P8058q0076j01086L4085R9771K2319q7222o5086O2260Q5843
548F7917j8395r5332l2701R7682P3589p8158r9079L0123J11732K4812j05622o2796
560h6228P2299Q3561j9987r4342k7280Q9644O2142o0637r4931J3785J22577L5117
$$ plain form
478 47493 69792 -18664 -79771 -8147 71358 40410 -48908 -68624 23385 80708 10533 -69534
490 -69534 -46473 50303 74726 -25945 -82262 -5013 73158 39977 -57612 -66120 34931 76876
502 76876 2139 -73481 -43339 58604 70517 -31561 -80334 -9377 76607 46896 -65213
513 -65213 -70943 40546 82915 -4839 -88848 -33838 78722 60088 -49172 -78602 3951 83106
525 83106 35414 -70342 -62375 38921 79103 -3934 -89966 -29702 81510 57829 -55731
536 -55731 -84739 19051 97109 17033 -84053 -49968 49803 72122 -15100 -80186 -17926 67917
548 67917 49522 -45810 -78511 19171 92760 14602 -84477 -54354 57378 82190 -23432 -86228
560 -86228 -13929 69632 49645 -44697 -71977 17667 79809 19172 -75759 -61974 60603 95720
572I5720j24422p7316R1902J13062m3243j31349o1J19362L7377q5212p4137M5388
584c2929J01557l749j02365m7399P7697J01523l9937j33091o697J29398N7117
595A01125j05540r7903P8416J16214m4771j13724k763J01449N1573p6781q3977
606g6682K9701R2188L1738q3124p9340N8954J00273k0115j05921k2823J06006
617C0855N5917r2865p8400N4853R4286k659r3387m1784O2785P0008j1250q4556
629c6197l6769Q4103O6645o4790q9421L3627J11392O43j16825l6497R1499P2044
641G9454m4092r3798n788Q4353M8638m9057q3623R174J09328K5390j16629o5357
653a02007J05102J11642p9810j44271M0670J44464R277j15761n2052P6780P0384
$$ plain form
572 95720 -28702 -106018 -14116 98946 55703 -75646 -75707 43655 81032 -4180 -78317 -32929
584 -32929 68628 64879 -37486 -84885 -7188 94335 54398 -78693 -85390 44008 101125
595 101125 -4415 -102318 -23902 92312 47541 -66183 -68946 32503 84076 7295 -76682
606 -76682 -46981 45207 76945 -6179 -85519 -26565 73708 53593 -52328 -75151 30855
617 30855 86772 -6093 -84493 -29640 64646 61987 -31400 -73184 -10399 59609 48359 -36197
629 -36197 -72966 11137 77782 12992 -76429 -42802 68590 69233 -47592 -84089 7410 79454
641 79454 35362 -58436 -64224 20129 68767 19710 -63913 -54739 54589 79979 -36650 -102007
653 -102007 3095 114737 34927 -109344 -68674 75790 85067 -30694 -82746 -5966 64418
664F4418l6022o6018j0269N5809N5874m0328r1673P883J11843M4731j14576r4072
676a12400R7495J17216o0889j18330K0645J09755P635r2969k5186O2971M3323
687D9266k1303n7308k0922M8146N4181j3038p4331k5777P5801M8736n7555n8192
699e2296L1525O5474r628o7544j2638N2180M2732j8291p2001k2971P8784O3311
711G8637n8350r5499K8927J12407q214j11246j0148R9209L4504q2243n6946N5597
723a3365O2156j3580m4592l2762J2109N9105K6385o0554o5177N2326R7877m5416
735C4512j18782L1581J29907j348j33150l6131J18122O1820p9526o6971L0365
746b9601N7643P126l8319k7364J1623M1892J7870n7814m6354O2556P2524m4154
$$ plain form
664 64418 28396 -37622 -47891 7918 63792 23464 -68209 -60326 51517 96248 -18328 -112400
676 -112400 -14905 102311 41422 -76908 -56263 53492 61127 -31842 -57028 5943 49266
687 49266 27963 -29345 -50267 -2121 52060 39022 -35309 -61086 14715 63451 5896 -52296
699 -52296 -20771 44703 35075 -32469 -45107 7073 49805 31514 -40487 -63458 15326 78637
711 78637 20287 -75212 -46285 66122 57908 -53338 -63486 35723 70227 -12016 -68962 -13365
723 -13365 48791 35211 -9381 -42143 -30034 29071 55456 -5098 -70275 -17949 79928 34512
735 34512 -84270 -52689 77218 75870 -57280 -93411 24711 86531 7005 -59966 -29601
746 -29601 28042 35168 -3151 -30515 -18892 23000 40870 -16944 -63298 -742 71782 27628
758B7628r2459J2770R5382J2581p3390k5203L8039K9056q828k7026j1233J8286
770d397L2948j175n8817k0663P3237M6177o4515p0178L9764Q1168j7183p0090
782c3724K100M6826J1012k5220k2373N273K6974K3046k2340n9326Q550Q5740J4153
795F0691q8494m0652P6019N9588o1722o3422M7645N7624k8233n1651L885M2389
807A3667J6851j6833k8570k2038K9222N6235j8821p3190K17P6952J7944p8581
819b6945k8333P6704L5406o2249m5081L6397M9537r405l6380j1724O068K4924
831H919K3696k6822m2270J9869N4163r816o7450J034P6005Q837o9649k4244M9651
844A923L6303k4573l1678J714J1675J6104Q785k7394k2233K9975L4940k7769n2266
$$ plain form
758 27628 -64831 -52061 43321 55902 -17488 -42691 -4652 24404 15576 -11450 -22683 -4397
770 -4397 28551 27376 -31441 -52104 21133 67310 2795 -67383 -27619 53549 36366 -33724
782 -33724 -31624 15202 26214 994 -21379 -16106 10868 33914 11574 -47752 -39202 46538 60691
795 60691 -27803 -68455 7564 67152 5430 -57992 -10347 47277 19044 -32607 -28722 13667
807 13667 30518 13685 -14885 -36923 -7701 48534 29713 -43477 -43260 33692 51636 -26945
819 -26945 -55278 21426 56832 -5417 -50498 -14101 35436 26031 -10349 -22073 -16005 8919
831 8919 32615 5793 -36477 -16608 37555 27739 -39711 -38677 37328 46165 -23484 -47728 1923
844 1923 38226 13653 -18025 -16311 -4636 11468 20253 -7141 -29374 601 35541 7772 -44494
857d4494K3596O7729j4289o9080k843N6196J8671l8057k1443J9099J1849j07j335
870E492j5900m442K6320J3300l2499l0314L5039M6658k9953n2249J5890M6765
882B4107K79l6857p142K5090N278j0791l637n453M872K0249q47l1491j3203L9969
896A0423K9112m0646l6457L0328L5376j6275l1921P728K6872m467j6317l77K412
909d209P324J1791q028k4750k660L5829J6190m0719k3075L6546K4572k6612k6046
922b3847J9445K5245j4285j9103N114Q284N675L942r225j5753K495K6610P446
935B2043l2784j3361K9796J6406k2647j9841J6782K1374j0853j6525J886N442
947b282R712N724j4592j7392R437K8395o85l5424n713L5241J1586k8961j9944
$$ plain form
857 -44494 -20898 46831 32542 -36538 -39381 16815 35486 -2571 -24014 -4915 6934 6827 5492
870 5492 -10408 -14850 11470 24770 -7729 -38043 -3004 43654 13701 -38548 -22658 24107
882 24107 24386 -12471 -19613 5477 10755 -36 -3673 -9126 -4254 15995 15148 -16343 -29546 10423
896 10423 39535 -1111 -37568 -7240 28136 11861 -20060 -12332 14540 10073 -6244 -6621 -4209
909 -4209 3115 14906 6878 -17872 -20532 15297 31487 -9232 -32307 4239 28811 2199 -23847
922 -23847 -4402 20843 6558 -12545 -7431 853 6528 10470 1245 -14508 -12013 14597 22043
935 22043 -10741 -24102 5694 22100 -547 -20388 -3606 17768 6915 -9610 -7724 -2282
947 -2282 7430 13154 -1438 -18830 -9393 19002 18317 -17107 -22820 12421 24007 -4954 -24898
960b4898K1417K6881j3517k6725R42J9070J4711q674k3632m326K3882J8526j9122
973D535l1456J4253L6769o691l5919n488L3082J7550k6546k3248J2906K3579L826
986A7152k0080j7038J2064K2893J623k4764j6426K5111K7239k0100l3081P994
998a7413L5598O361l3630j6592K2990K2699o028k5253r626K2854K0417j3141k8076
1011a8840j699L3356J5374l2322k5868K2000L5757p238m1146n653L6499J7006
1023B7226k3223k7739P880L3020O815k9727k1014J9725L4241o831m1383o959L7647
1036I678K2652k7558l6186J5260M1429l34l7534j6165K8349K9938j6734l5475
1048b2680M89L3333J8376k7316l3352J7320L9819j300l9092j6666L3224K9887
$$ plain form
960 -24898 -3481 23400 9883 -16842 -15900 3170 17881 9207 -14425 -18751 5131 23657 4535
973 4535 -26921 -12668 24101 17410 -18509 -23997 9085 26635 89 -23159 -10253 13326 17152
986 17152 -2928 -19966 -7902 14991 16614 -8150 -24576 535 27774 7674 -25407 -17413
998 -17413 18185 24546 -9084 -25676 -2686 20013 13985 -11268 -20894 1960 22377 9236 -18840
1011 -18840 -20539 12817 28191 -4131 -29999 -7999 27758 20520 -20626 -26279 10220 27226
1023 27226 4003 -23736 -15856 17164 23979 -5748 -26762 -7037 27204 20373 -21010 -27969 9678
1036 9678 32330 4772 -31414 -16154 25275 24941 -12593 -28758 -409 29529 12795 -22680
1048 -22680 -22191 11142 29518 2202 -31150 -13830 25989 24689 -14403 -31069 2155 32042
1060C2042k2089l6300M775L7055J3530l2930k6564K1546L3873l689l6408j5080
1072c0239L2969K8534k1391l7115M143M1149J2859l7688k5433K4724L5077p410
1084B0179l9736j0193L6429K4581k3837l6406P483M2474Q460l8234k3874K5886
1096f788L6875j0953m2749m718L9164K0370k7406l3872J3094L9540L427l5832
$$ plain form
1060 32042 9953 -26347 -21572 15483 29013 -3917 -30481 -8935 24938 21249 -15159 -30239
1072 -30239 2730 31264 9873 -27242 -23099 18050 30909 -6779 -32212 -7488 27589 20179
1084 20179 -19557 -29750 6679 31260 7423 -28983 -21500 20974 29434 -8800 -32674 -6788
1096 -6788 30087 19134 -23615 -28333 10831 31201 3795 -30077 -16983 22557 25984 -9848
$$ [...]
8191C3
##END NTUPLES=NMR FID
##END=
