##TITLE=1H_IAMT-S27
 CDCl3, 8 sc, 
 28.5.2019
##JCAMPDX= 6.0         $$ Bruker NMR JCAMP-DX V2.0
##DATA TYPE= NMR FID
##DATA CLASS= NTUPLES
##ORIGIN= UXNMR, Bruker Analytische Messtechnik GmbH
##OWNER= root
$$ XWIN-NMR		Version 3.5
$$ Tue May 28 16:15:41 2019 Russian Standard Time (UT+4h)  she@DPX200
##.OBSERVE FREQUENCY= 200.13155
##.OBSERVE NUCLEUS= ^1H
##.DELAY= (6, 6)
##.ACQUISITION MODE= SIMULTANEOUS
##.ACQUISITION SCHEME= undefined
##.AVERAGES= 8
##.DIGITISER RES= 18
##SPECTROMETER/DATA SYSTEM= spect
##.PULSE SEQUENCE= zg30
##.SOLVENT NAME= CDCl3
##.SHIFT REFERENCE= (INTERNAL, CDCl3, 0, 15.7039)
##AUDIT TRAIL= $$ (NUMBER, WHEN, WHO, WHERE, WHAT)
$$ ##TITLE= Audit trail, XWIN-NMR		Version 3.5
$$ ##JCAMPDX= 5.01
$$ ##ORIGIN= Bruker BioSpin GmbH
$$ ##OWNER= she
$$ F:/spectra/data/she/nmr/H-F/1/audita.txt
$$ ##AUDIT TRAIL=  $$ (NUMBER, WHEN, WHO, WHERE, WHAT)
(   1,<2019-05-28 16:14:42.60 +0400>,<she>,<DPX200>,
      <created by zg, POWCHK disabled, PULCHK disabled
       configuration hash MD5:
       00 E9 B6 7A A2 85 ED C7 34 08 36 98 17 FE 4E 26
       data hash MD5: 16K
       06 65 93 00 9E B1 EC D0 DB 54 6B 7D 3A CD D6 91>)
$$ ##END=
$$ 
$$ hash MD5
$$ 47 21 13 89 0A D1 1A 0C AB CC 8E 44 60 AC D0 CA
##$RELAX= 
##$RELAX= 
##$RELAX= 
##$RELAX= 
##$RELAX= 
##$RELAX= 
$$ Bruker specific parameters
$$ --------------------------
##$DU= <F:/spectra>
##$EXPNO= 1
##$NAME= <H-F>
##$PROCNO= 1
##$TYPE= <nmr>
##$USER= <she>
##$AMP= (0..31)
100 100 100 100 100 100 100 100 100 100 100 100 100 100 100 100 100 100 
100 100 100 100 100 100 100 100 100 100 100 100 100 100 
##$AQSEQ= 0
##$AQ_mod= 1
##$AUNM= <au_zg>
##$AUTOPOS= <>
##$BF1= 200.13
##$BF2= 200.13
##$BF3= 200.13
##$BF4= 200.13
##$BF5= 200.13
##$BF6= 200.13
##$BF7= 200.13
##$BF8= 200.13
##$BYTORDA= 1
##$CFDGTYP= 0
##$CFRGTYP= 5
##$CHEMSTR= <none>
##$CNST= (0..31)
1 1 145 1 1 1 1 1 1 1 1 1 1 1 1 1 1 1 1 1 1 1 1 1 1 1 1 1 1 1 1 1 
##$CPDPRG= <>
##$CPDPRG1= <>
##$CPDPRG2= <>
##$CPDPRG3= <>
##$CPDPRG4= <mlev>
##$CPDPRG5= <mlev>
##$CPDPRG6= <mlev>
##$CPDPRG7= <mlev>
##$CPDPRG8= <mlev>
##$CPDPRGB= <>
##$CPDPRGT= <>
##$D= (0..31)
0 1.2 0 0 0 0 0 0 0 0 0 0.03 0 0 0 0 0 0 0 0 0 0 0 0 0 0 0 0 0 0 0 0 
##$DATE= 1559045681
##$DBL= (0..7)
120 120 120 120 120 120 120 120 
##$DBP= (0..7)
150 150 150 150 150 150 150 150 
##$DBP07= 0
##$DBPNAM0= <>
##$DBPNAM1= <>
##$DBPNAM2= <>
##$DBPNAM3= <>
##$DBPNAM4= <>
##$DBPNAM5= <>
##$DBPNAM6= <>
##$DBPNAM7= <>
##$DBPOAL= (0..7)
0.5 0.5 0.5 0.5 0.5 0.5 0.5 0.5 
##$DBPOFFS= (0..7)
0 0 0 0 0 0 0 0 
##$DE= 6
##$DECBNUC= <off>
##$DECIM= 24
##$DECNUC= <off>
##$DECSTAT= 4
##$DIGMOD= 1
##$DIGTYP= 9
##$DL= (0..7)
0 120 120 120 120 120 120 120 
##$DP= (0..7)
150 150 150 150 150 150 150 150 
##$DP07= 0
##$DPNAME0= <>
##$DPNAME1= <>
##$DPNAME2= <>
##$DPNAME3= <>
##$DPNAME4= <>
##$DPNAME5= <>
##$DPNAME6= <>
##$DPNAME7= <>
##$DPOAL= (0..7)
0.5 0.5 0.5 0.5 0.5 0.5 0.5 0.5 
##$DPOFFS= (0..7)
0 0 0 0 0 0 0 0 
##$DQDMODE= 0
##$DR= 18
##$DS= 0
##$DSLIST= <SSSSSSSSSSSSSSS>
##$DSPFIRM= 0
$$ [...]
##$SUBNAM2= <"">
##$SUBNAM3= <"">
##$SUBNAM4= <"">
##$SUBNAM5= <"">
##$SUBNAM6= <"">
##$SUBNAM7= <"">
##$SUBNAM8= <"">
##$SUBNAM9= <"">
##$SW= 24.9336996594482
##$SWIBOX= (0..15)
0 0 2 0 0 0 0 0 0 0 0 0 0 0 0 0 
##$SW_h= 4990.01996007984
##$TD= 16384
##$TD0= 1
##$TE= 0
##$TE2= 300
##$TE3= 300
##$TEG= 300
##$TL= (0..7)
0 120 120 120 120 120 120 120 
##$TP= (0..7)
150 150 150 150 150 150 150 150 
##$TP07= 0
##$TPNAME0= <>
##$TPNAME1= <>
##$TPNAME2= <>
##$TPNAME3= <>
##$TPNAME4= <>
##$TPNAME5= <>
##$TPNAME6= <>
##$TPNAME7= <>
##$TPOAL= (0..7)
0.5 0.5 0.5 0.5 0.5 0.5 0.5 0.5 
##$TPOFFS= (0..7)
0 0 0 0 0 0 0 0 
##$TUNHIN= 0
##$TUNHOUT= 0
##$TUNXOUT= 0
##$USERA1= <user>
##$USERA2= <user>
##$USERA3= <user>
##$USERA4= <user>
##$USERA5= <user>
##$V9= 5
##$VALIST= <valist>
##$VCLIST= <CCCCCCCCCCCCCCC>
##$VD= 0
##$VDLIST= <DDDDDDDDDDDDDDD>
##$VPLIST= <PPPPPPPPPPPPPPP>
##$VTLIST= <TTTTTTTTTTTTTTT>
##$WBST= 1024
##$WBSW= 4
##$XGAIN= (0..3)
0 0 0 0 
##$XL= 0
##$YL= 0
##$YMAX_a= 66876
##$YMIN_a= -122134
##$ZGOPTNS= <>
##$ZL1= 120
##$ZL2= 120
##$ZL3= 120
##$ZL4= 120
##$ABSF1= 10
##$ABSF2= 0
##$ABSG= 5
##$ABSL= 3
##$ALPHA= 0
##$AQORDER= 0
##$ASSFAC= 0
##$ASSFACI= 0
##$ASSFACX= 0
##$ASSWID= 0
##$AUNMP= <proc_1d>
##$AZFE= 0.1
##$AZFW= 0.1
##$BCFW= 1
##$BC_mod= 2
##$BYTORDP= 1
##$COROFFS= 0
##$CY= 11.3945322036743
##$DATMOD= 1
##$DC= 2
##$DFILT= <>
##$DTYPP= 0
##$F1P= 18.9103706918063
##$F2P= -1.10871071338519
##$FCOR= 0.5
##$FTSIZE= 0
##$FT_mod= 4
##$GAMMA= 1
##$GB= 0.15
##$INTBC= 1
##$INTSCL= 1
##$ISEN= 128
##$LB= 0.24
##$LEV0= 0
##$LPBIN= 0
##$MAXI= 10000
##$MC2= 0
##$MEAN= 0
##$ME_mod= 0
##$MI= 1.114404
##$NCOEF= 0
##$NC_proc= 0
##$NLEV= 6
##$NOISF1= 3.799351
##$NOISF2= 2.8
##$NSP= 1
##$NTH_PI= 0
##$NZP= 0
##$OFFSET= 15.70392
##$PC= 1
##$PHC0= -8861.009
##$PHC1= 23.20025
##$PH_mod= 1
##$PKNL= yes
##$PPARMOD= 0
##$PSCAL= 0
##$PSIGN= 0
##$REVERSE= no
##$SF= 200.130013532006
##$SI= 16384
##$SIGF1= 3
##$SIGF2= 2
##$SINO= 400
##$SIOLD= 16384
##$SREGLST= <1H.CDCl3>
##$SSB= 0
##$STSI= 0
##$STSR= 0
##$SW_p= 3612.71676300578
##$SYMM= 0
##$S_DEV= 0
##$TDeff= 0
##$TDoff= 0
##$TI= <>
##$TILT= no
##$TM1= 0
##$TM2= 0
##$TOPLEV= 0
##$USERP1= <user>
##$USERP2= <user>
##$USERP3= <user>
##$USERP4= <user>
##$USERP5= <user>
##$WDW= 1
##$XDIM= 8192
##$YMAX_p= 0
##$YMIN_p= 0
$$ End of Bruker specific parameters
$$ ---------------------------------
##NTUPLES= NMR FID
##VAR_NAME=  TIME,          FID/REAL,        FID/IMAG
##SYMBOL=    X,             R,               I
##VAR_TYPE=  INDEPENDENT,   DEPENDENT,       DEPENDENT
##VAR_FORM=  AFFN,          ASDF,            ASDF
##VAR_DIM=   8192,          8192,            8192
##UNITS=     SECONDS,       ARBITRARY UNITS, ARBITRARY UNITS
##FACTOR=    0.0002004,     1,               1
##FIRST=     0,             0,               0
##LAST=      1.6414764,     0,               0
##MIN=       0,             -122134,         0
##MAX=       1.6414764,     66876,           0
$$ Real data points
##PAGE= N=1
##DATA TABLE= (X++(R..R)), XYDATA
0 0 0 0 0 0 0 0 0 0 8 -8 8 -8 8 -16 16 -17 24 -28 32 -40 47 -54 63 -71 81 -94 107 -121 137 -154 174 -196
32 -196 220 -247 274 -305 341 -379 422 -466 517 -573 634 -702 776 -862 956 -1065 1189 -1334
50 -1334 1505 -1710 1958 -2272 2681 -3239 4046 -5330 7696 -13559 61589 51275 -39327 26830
64 26830 40262 -8638 -13552 66876 60900 -21669 -49267 -1418 -7983 -40149 -7013 49375 18034
77 18034 -37218 -21750 18424 -2270 -21752 16576 48569 14307 -17401 2019 22483 4897
89 4897 -5876 11920 16636 -4514 -8181 7947 7828 -13456 -18961 -6943 -9673 -24699 -18371 2294
103 2294 -3130 -35062 -46951 -29562 -19403 -23462 -12521 7207 -3386 -36627 -41831 -18481 -7692
116 -7692 -4196 21049 38600 6160 -34696 -25250 3196 -643 -5397 25007 37209 -8466 -49490
129 -49490 -31029 -3546 -12279 -13970 13865 13678 -29623 -47007 -17514 -2662 -17337 -7888 22319
142 22319 12249 -28640 -29038 7191 14196 -7512 166 29639 22690 -8698 -5131 25746 25770 3524
156 3524 9402 31938 23102 140 8547 27091 10847 -13567 428 23761 9938 -10422 4236
169 4236 17314 -9420 -30580 -4294 24645 14280 3398 20388 21341 -9855 -17342 16295 33353
182 33353 19375 20343 35072 15840 -19642 -13247 18733 19933 3288 11204 17591 -11591 -37000
195 -37000 -18186 5535 -1786 -8005 5765 1928 -27096 -34083 -7899 2865 -8041 -3201 13290
208 13290 3509 -21000 -17087 5052 7385 -2887 4180 15545 3902 -12653 -6844 4595 -978
221 -978 -7951 1437 8451 -3077 -16111 -11121 -4758 -13592 -19071 -5603 6349 -1989 -13719 -10100
235 -10100 -5924 -14314 -17081 -906 13161 7175 -1583 1022 394 -9829 -7850 10914 19529 9792
249 9792 3189 5325 -1156 -13164 -7380 10812 13970 2590 -2624 -1616 -10517 -18948 -9406 6827
263 6827 7644 1948 2277 1402 -7080 -9152 3682 14974 13892 12116 13536 10069 1192 470 9118 14990
279 14990 13244 12248 11598 6064 -3023 -3415 2447 6701 6906 8701 10504 5405 -3056 -4850 431 3855
295 3855 4651 7906 10882 5609 -3667 -6635 -2845 -896 -25 5971 8978 2503 -5752 -6213 -2669 -2021
311 -2021 1239 9838 11956 2940 -5072 -4847 -3562 -4918 -866 8295 9237 150 -6554 -7010 -7620 -8051
327 -8051 -1301 7085 6957 1094 -2233 -4255 -7102 -5399 2679 8633 7264 2769 -181 -3912 -7728
342 -7728 -5791 2428 8420 8443 5739 2519 -1676 -5095 -3629 2280 7945 9456 7497 2509 -3503 -7448
358 -7448 -7360 -3800 831 3206 2613 -1474 -7134 -10126 -8042 -2828 2793 7335 8405 5842 621 -3393
374 -3393 -3381 1259 6283 9387 9663 5887 -581 -6181 -7846 -5251 516 5082 6771 4832 176 -3425
390 -3425 -4260 -909 4828 10607 12723 10691 5744 31 -2438 -1548 2476 7089 9342 6835 911 -5347
406 -5347 -8418 -7104 -2601 3302 7619 7799 4024 -1215 -3908 -3168 665 5684 9205 9327 5571 -277
422 -277 -4996 -5776 -3017 1398 5169 5733 1991 -2591 -6623 -8443 -5386 456 5569 6858 4287 405
438 405 -4147 -6260 -4677 973 5858 7973 6843 3133 -1342 -3521 -1465 3080 7043 9494 9305 5320
454 5320 -823 -4066 -2691 309 2898 5383 5651 842 -6290 -9603 -8923 -6040 -2186 2437 4336 1489
470 1489 -3157 -5436 -5386 -3208 1016 6645 7795 4516 334 -2518 -4278 -4819 -1234 3782 5053 856
486 856 -3900 -6420 -8063 -7979 -4063 1740 4251 1655 -2358 -5061 -6328 -6476 -2184 3916 5595 3000
502 3000 383 -1045 -4068 -4947 -235 5977 6624 4002 3358 2058 -1816 -3623 1118 6932 6506 3946
518 3946 3575 1284 -4508 -6990 -2952 1171 1021 517 1424 -1342 -7393 -8935 -5019 -2095 -1025 1816
534 1816 4348 1133 -4355 -5476 -1908 700 1641 4887 7281 3315 -3227 -5383 -1774 420 1370 4511
550 4511 6635 1638 -5797 -7270 -3968 -2699 -1737 4047 6068 -1211 -8496 -5534 -1614 -3385 -2093
565 -2093 6436 7364 -2461 -6928 -745 360 -3946 -170 9338 6239 -5152 -4255 2522 -1703 -7981
580 -7981 -63 9068 1926 -6511 -605 3875 -5594 -10670 -70 4580 -3854 -6151 3265 1957 -10090
595 -10090 -10504 263 994 -5947 -1558 7566 2203 -8503 -4980 4646 4563 1417 7285 12120 4234
610 4234 -4459 -1344 4514 4729 4684 9166 8249 -1271 -6928 -2562 2704 2776 3588 8163 6897 -2001 -6674
627 -6674 511 8013 7358 6597 10587 9465 -25 -3519 3366 7929 5365 5550 9286 5157 -3169 -1949
643 -1949 5575 3973 -1955 2134 7810 1757 -5267 952 7428 840 -5573 544 5556 -674 -3365
658 -3365 4739 6762 -3089 -5957 3919 6979 405 1411 8658 5497 -6767 -6450 4783 7088 229
673 229 882 5137 -2079 -12484 -9078 2985 4767 -1447 -598 2612 -5176 -13422 -5264 8713 8128
688 8128 -352 1132 4189 -5743 -14738 -3885 10032 4634 -5536 -2501 296 -11151 -15353 -1949
702 -1949 6791 -2800 -8058 739 1189 -10422 -8489 7256 7741 -6504 -6433 5038 1259 -9705 -3403
717 -3403 8612 750 -11206 -4096 5942 -1111 -7019 2988 7341 -4599 -7782 5694 11297 1962
731 1962 673 9486 5920 -6772 -4007 10850 11491 1167 783 5472 -1988 -10803 -1878 11363 9024
746 9024 -66 360 2432 -5557 -9900 2158 14278 9261 -418 473 1957 -5964 -8946 3897 13197
761 13197 4888 -4194 -42 2194 -5681 -6355 7078 12135 -806 -6882 1619 3066 -5567 -4165 7878
776 7878 6956 -6599 -7521 2802 2104 -6417 -2225 6435 1159 -8004 -2125 7269 2712 -4140 530
791 530 4736 -3427 -7305 2264 8329 662 -5795 -2866 -2022 -7545 -6579 3339 6184 -1519 -7151 -5153
807 -5153 -4746 -6988 -2341 6947 7271 -2223 -6789 -4859 -4531 -6693 -1799 7319 5080 -5594 -8792 -3489
823 -3489 -3324 -6391 -439 8107 2710 -7861 -6257 2044 -252 -4215 3666 10055 258 -8466 -854
838 -854 6340 -795 -3833 6475 8562 -3436 -6086 5759 7525 -3055 -2622 7392 4802 -5740
852 -5740 -891 10286 5416 -5380 -1684 6033 335 -5239 3052 9611 1008 -7161 -1675 3071 -1909
867 -1909 -1859 6927 7990 -1806 -6617 -885 677 -2184 1181 8016 5690 -3760 -5829 -1034 145 -2002
883 -2002 1271 5881 2072 -5610 -6092 -497 214 -1588 1726 4737 219 -5708 -3336 1742 1055 -440
899 -440 3169 5229 -428 -4214 -10 3453 -543 -2099 2360 3532 -2235 -4288 1314 2355 -3529
914 -3529 -4383 1058 1328 -3175 -2348 2532 907 -4448 -2633 1946 835 -1378 1213 3008 -1708 -5661
930 -5661 -2972 428 -662 -1314 1394 1695 -3253 -5951 -2573 756 320 390 2723 2170 -1249 -2804 298
947 298 2831 2205 2253 3090 2087 -1564 -2286 915 2469 1395 855 2863 1313 -1685 -1765 1908 3078
964 3078 767 680 3513 2076 -1458 -408 2920 1451 -1130 1117 2901 769 -1852 629 2294 -209
980 -209 -1393 1939 2858 7 -1288 646 204 -2483 -2358 1435 1321 -1642 -693 467 -1271 -3357 -1331
997 -1331 2104 1440 -177 1073 2314 465 -414 1692 3102 2476 1033 1673 794 -618 -921 833 1403
1014 1403 304 560 1062 30 -1185 -170 1992 2700 1504 1975 2518 2049 451 572 1744 2076 698
1031 698 251 -10 -754 -1381 -1223 -766 -590 -666 -324 -128 -787 -885 -163 793 867 910 1799 1490 360 -571 -95
1052 -95 168 -677 -951 -295 -722 -1583 -2095 -1744 -1281 -1295 -578 -268 -203 -333 -417 -195 -253 1100 982 1020 699 174
1074 174 -158 -589 -653 -162 39 428 124 -752 -1305 -1099 -1115 -929 -1146 -1151 -1522 -2323 -2786 -3260 -2953 -2905 -2592 -2253
1096 -2253 -2210 -2829 -2733 -2513 -2158 -1539 -115 249 -25 132 -244 -112 -889 -579 368 348 -765 -595 -835 -1382
1116 -1382 -1805 -1358 -499 -558 -793 -763 -698 -948 -893 273 877 1037 1725 1839 904 304 506 1485 1373 1187 2022
1137 2022 2158 1717 680 705 1086 1357 1403 1126 1252 774 141 -275 -151 166 182 53 -572 -1322 -1519 -1800
1157 -1800 -1665 -1642 -868 31 70 -474 -416 158 109 -103 545 1704 1899 1070 807 1157 710 278 860 1163 564
1178 564 -430 -395 -679 -1392 -879 128 471 -717 -906 -156 -1091 -1796 -1255 44 214 -110 -374 -45 -175
1197 -175 -1072 -657 524 818 -190 -346 -132 -454 -996 -908 216 -63 -1057 -964 -631 -1394 -2316 -1753 -633
1216 -633 -1233 -2086 -1641 -313 -1193 -2402 -1749 -121 -871 -2018 302 1643 169 -941 1535 2292 457
1233 457 336 3258 3296 1190 900 2684 2422 213 882 3684 1746 -1049 -572 896 -958 -2446 231
1250 231 2486 -194 -2045 -81 1075 -776 -726 3151 3251 176 236 2496 2277 690 1861 3543 1824
1267 1824 -1019 -517 1441 -109 -2022 -353 1147 -983 -3880 -1838 666 -592 -2554 -846 145
1282 145 -1631 -3179 -79 2494 863 -628 701 1335 -812 -1282 2218 3565 1068 126 2180 2104
1298 2104 -1079 -638 3071 2582 -1733 -2169 646 -236 -3423 -1277 2132 -188 -4095 -3046 -72 -1443
1314 -1443 -2638 730 2634 -914 -3271 -657 1370 -265 -690 2049 1952 -2127 -3155 -272 977 -494
1330 -494 -707 884 -96 -3062 -2947 469 1980 149 -608 587 -387 -3102 -1977 2305 3125 -544 -1502
1347 -1502 11 -1192 -3373 -790 3615 2770 -1228 -480 2334 234 -1915 2545 6611 2395 -1942
1362 -1942 1294 3803 -293 -1784 3747 4478 -2656 -4996 168 1096 -3916 -2813 2632 470 -6328
1377 -6328 -4198 1972 569 -3708 196 4058 -1289 -6018 -634 4492 911 -2284 1675 2849 -3116
1392 -3116 -5003 1519 4225 -293 -2252 1324 399 -4434 -3145 3337 4157 -780 -2127 -112 -1703
1407 -1703 -4501 -1091 4198 3019 -1614 -2325 225 -1593 -3016 1378 5325 2502 -2085 -1348 1513
1422 1513 -350 -2118 2385 4687 -62 -4575 -1397 918 -1751 -2612 1513 1887 -3677 -5124 -196
1437 -196 1453 -2348 -1384 2487 300 -4856 -2690 3300 2166 -2110 -757 2150 -1371 -5087 -779
1452 -779 4280 1526 -2585 -799 919 -2299 -2969 2309 4922 810 -2652 -456 406 -1973 -1288 4013
1468 4013 4970 -102 -3512 -947 163 -2107 -803 4124 4215 -1797 -4309 -322 915 -1865 -455 4183
1484 4183 2316 -3716 -4038 1061 1128 -2047 -309 3566 -258 -5338 -2289 2317 415 -3101 510 3119
1500 3119 -1902 -4674 1101 4077 -737 -2916 1257 2028 -3497 -3130 3292 3053 -2598 -2804 1671 405
1516 405 -3709 -123 5114 2056 -3456 -1448 2204 -299 -1516 3660 5674 526 -3285 -391 1670
1531 1670 -325 -185 3977 4434 -1785 -4112 -603 729 -1216 -802 3014 1486 -3490 -4404 -540 634
1547 634 -1387 -273 2705 481 -3934 -2732 1776 1317 -1421 623 2936 294 -3399 -507 2662
1562 2662 421 -2323 70 1864 -889 -2914 905 3019 -727 -2412 657 1638 -1207 -947 2153
1577 2153 2247 -2060 -1943 1153 1653 -660 343 3127 797 -2735 -1737 1632 1526 312 1631 3016
1593 3016 503 -2166 -912 2144 1280 507 1647 1781 -1312 -3106 -1052 887 110 -733 149 26 -2731
1610 -2731 -3551 -653 1134 -430 -720 815 1117 -1847 -1709 1399 2392 376 131 2161 1763 -897 -25
1627 -25 2750 2100 -535 437 2441 631 -1523 -96 2045 -225 -2007 -249 1406 -1111 -2455 -457
1643 -457 319 -2608 -2951 334 1604 -670 -1112 937 444 -1506 -919 1969 1946 -304 -51 787 -938
1660 -938 -2534 -1038 168 -343 -2098 -2160 -1922 -3252 -4080 -1930 -445 -1344 -1829 -978 -873 -1948 -2019 -201
1678 -201 1312 196 -174 440 320 -617 -777 540 1346 349 340 445 300 -553 -688 478 813 -32 311
1697 311 1137 -165 -1479 -707 401 55 -304 426 923 -506 -1364 -450 311 164 198 1401 1626 220
1715 220 -199 587 783 468 1367 1754 1285 247 -244 -226 -669 -336 353 963 329 -780 -986 -821 -879 -768
1735 -768 79 1081 1179 61 -357 25 -188 199 812 1396 1725 903 107 -186 243 685 1122 1551 1471 351
1755 351 -443 -566 -1230 -1045 96 277 -439 -1163 -1348 -1814 -2648 -2465 -1490 -986 -941 -924 -1423 -1721 -2042 -1526
1775 -1526 -510 -102 405 394 -308 -1054 -1789 -1091 -557 -68 -6 -89 -738 -1926 -2266 -1813 -1469 -1094 -461 -273
1795 -273 -552 -1902 -1523 -1579 -1057 -218 782 1237 232 -206 -414 -405 125 1035 2270 2238 1309 500 352 15
1815 15 49 779 1664 2082 1466 281 -511 -816 -910 -685 613 862 476 -258 -610 -1368 -1321 -229 793 1147
1835 1147 1245 902 147 -499 -370 783 1928 2245 2157 1666 790 -368 -351 490 1266 1472 1470 741 -52 -682
1855 -682 -1050 -636 -146 705 1399 503 -382 -818 -518 -17 433 1289 1639 1107 574 -243 -776 -465 340 870
1875 870 897 1239 411 -1226 -2019 -1104 -1024 -394 14 286 -689 -1587 -2008 -1429 -1213 -1067 365 609 -678 -1668
1895 -1668 -1525 -1198 -1711 -951 672 542 -777 -1220 -693 -999 -1720 -271 1702 1319 195 201 236 -445 -789
1914 -789 482 1712 982 89 924 258 -1177 -1060 465 1172 532 131 841 -2 -1286 -917 859 1211
1932 1211 467 594 1297 71 -1229 -1062 162 728 263 600 1370 239 -1467 -876 -161 -361 -356 895
1950 895 1326 -498 -2134 -1249 -122 -412 -373 1265 1456 -543 -2048 -709 111 -407 128 2264 1669 -466
1968 -466 -820 324 455 -323 960 2596 1061 -877 -624 122 -640 -1059 181 1417 78 -1559 -969
1985 -969 -123 -899 -1237 434 1737 260 -816 150 434 -858 -1738 27 751 -177 -874 -325 -332 -2080
2003 -2080 -2534 -378 485 -1009 -781 716 263 -2254 -1967 1177 1471 -601 194 1803 279 -2620 -1583
2020 -1583 1284 773 -761 624 1999 -784 -2973 -321 1918 -39 -382 1566 2201 -1881 -2299 790
2036 790 1818 -138 -140 2456 1319 -2480 -1873 1202 1169 -1028 73 2125 -12 -2320 -1166 1209 78
2053 78 -1765 65 1949 -522 -2517 -594 708 -1286 -2245 -127 1084 -914 -2178 -178 566 -1483
2069 -1483 -1980 834 1957 -390 -901 1110 761 -1950 -1545 1428 2199 -564 -242 1355 -267 -3277
2085 -3277 -1224 2447 1753 -644 226 1607 -1401 -3258 294 3294 917 -775 798 1439 -2303 -2874
2101 -2874 932 2757 -19 -966 924 365 -2598 -2149 1412 1975 -455 -490 1278 244 -2423 -1105
2117 -1105 1532 842 -1089 -616 1504 -257 -2255 -702 1467 279 -1450 287 2122 371 -1437
2132 -1437 82 1800 64 -1368 1148 2851 609 -1191 528 1160 -1247 -1584 2116 3037 -71 -1392
2148 -1392 768 738 -2114 -694 3198 2948 -1125 -1168 677 -458 -2860 -272 3776 1721 -1801 -1110
2164 -1110 544 -2203 -3287 549 2999 -242 -2412 -498 319 -2864 -2454 1655 2350 -1527 -2079 767
2180 767 397 -2494 -1558 2088 1597 -1628 -1371 1129 47 -2610 -892 1725 632 -1186 -155 1931
2196 1931 209 -1987 -631 1231 20 -1219 1206 2496 246 -1835 -223 1224 -659 -822 2012
2211 2012 2527 -1141 -2471 -362 328 -1519 -358 2631 1721 -1683 -2360 -96 34 -1586 786 3266
2227 3266 1555 -1564 -1204 536 -551 -1399 1318 2569 445 -2265 -285 554 -1402 -1333 1457 1986
2243 1986 -502 -1718 191 332 -1124 -785 1777 1943 73 -191 1066 1155 -1115 -539 1802 1434 -15
2260 -15 503 1458 546 -1509 -520 1132 1021 -273 559 1613 -33 -1975 -1149 797 263 -443 764 1507
2278 1507 -1067 -2557 -847 874 10 -210 1590 1517 -1464 -2309 -302 574 -741 -122 1598 236 -2329
2295 -2329 -2374 -329 -102 -929 494 1772 195 -1583 -855 721 28 -384 1357 2249 330 -1187 50
2312 50 575 -470 -366 1393 1372 -98 -834 235 -27 -1062 -593 1208 1043 -344 -414 697 -128 -1414
2330 -1414 -818 901 602 -385 -119 16 -1102 -1942 -1084 533 253 -513 28 175 -1405 -2094 -829 528
2348 528 234 -166 581 119 -1485 -1556 -164 483 89 -422 573 151 -1782 -1577 2 541 249 562 1123
2367 1123 54 -1044 -375 615 290 126 720 1339 -20 -1176 -220 142 -183 207 427 747 -249 -850
2385 -850 -265 -330 -538 -231 302 639 -351 -966 -844 -858 -723 -420 586 513 -179 -728 -717 -703 -549 197 907
2406 907 1051 372 149 267 -125 -459 8 1031 1031 404 167 -22 -145 -492 152 1065 584 229 399 -158
2426 -158 -279 -523 754 1145 616 735 500 144 -638 -233 765 691 394 712 546 -3 -430 -245 456 442
2446 442 232 300 -43 -315 -1111 -804 -549 -108 -94 -52 -390 -1218 -1041 -816 -582 -227 28 104 -155 -598 -509 -537
2468 -537 -241 -114 585 740 359 -266 -522 -415 -76 78 419 452 608 -440 -607 -322 -317 83 615 382 -29
2489 -29 30 -302 -610 -611 7 699 694 565 101 -315 -499 -1037 -246 350 441 150 120 -591 -827 -957 -561 191 647
2512 647 439 -86 -506 -726 -832 -246 133 565 515 466 -156 -491 -567 -533 323 717 782 382 -86 -240 -371 -43
2534 -43 289 999 957 636 -83 -281 -473 -134 181 827 1104 690 320 -511 -474 -143 -24 589 412 424 176
2555 176 -784 -951 22 -275 -75 403 529 -248 -887 -790 -732 -636 -71 503 413 30 -607 -947 -760 -933 -374
2576 -374 486 -6 3 -634 -205 -654 -612 2 709 441 25 45 -347 -688 -563 273 770 918 412 24 164
2597 164 -293 -157 313 621 782 447 377 -290 -878 -863 42 654 217 306 480 -403 -1057 -903 -9 99 118
2618 118 356 267 -254 -1028 -496 -185 241 -4 474 179 -486 -999 -833 -346 -552 -392 533 352 -465 -950
2638 -950 -300 -400 -262 305 1330 812 163 -393 -141 -211 -119 545 992 678 -162 -375 -244 -344 -711 519
2658 519 1146 478 -275 -238 -111 -482 -761 720 1198 573 -263 14 -31 -780 -918 291 616 -7 -402 188
2678 188 -401 -1148 -1029 330 400 -100 97 366 -328 -1380 -585 282 367 -471 143 851 -103 -1208 -198
2697 -198 895 57 -23 930 1172 31 -786 435 707 -57 415 1586 1018 -197 -658 48 204 -74 613
2716 613 1298 648 -692 -900 205 -75 -756 296 1093 384 -693 -749 -46 4 -632 283 1047 147 -1108
2735 -1108 -326 -70 -504 -641 362 718 -371 -783 -157 264 -1083 -618 374 631 -711 -840 185 -205
2753 -205 -1096 -566 643 259 -806 1 883 -215 -893 -76 805 291 -211 954 729 -583 -586 60 665
2772 665 -62 -280 542 -21 -1260 -1222 -124 43 -583 -293 643 131 -1129 -1319 -11 425 -406 -124 642
2791 642 -38 -1136 -783 309 459 -218 316 1164 139 -1220 -412 602 181 -477 255 1301 -441 -1156
2809 -1156 328 917 -167 -548 764 907 -261 -1042 408 785 -493 -358 1379 784 -418 373 1393
2826 1393 543 -295 395 1688 772 10 772 1202 -224 -890 327 1513 -112 -453 291 509 -1019 -1380
2844 -1380 101 406 -420 -696 -72 -254 -1464 -1046 498 799 -210 -32 964 89 -1017 -270 859 657
2862 657 -351 60 821 -227 -1154 -441 884 -36 -896 166 399 -1027 -1306 -302 619 -496 -890 391
2880 391 662 -716 -1155 657 653 -669 -529 1230 567 -559 -300 290 328 -638 -44 804 185 -892 -313
2899 -313 -32 -834 -1119 -457 531 -230 -1166 -590 -306 -1173 -1045 124 600 176 -861 -108 -186 -825 -597 926
2919 926 825 19 -192 349 311 -521 128 920 1049 89 125 479 422 -143 -23 1167 613 -98 437 690 -379
2940 -379 -804 175 705 35 -622 3 645 -343 -813 447 793 126 -79 1027 975 -538 -720 522 609
2959 609 -366 -98 775 441 -1115 -912 -62 -538 -835 -382 357 -290 -1046 -461 -269 -270 -584 480 743 -44
2979 -44 -687 86 290 -338 64 910 847 -22 -361 394 82 -167 -45 686 910 5 -335 -53 -184 -315 -380
3000 -380 511 506 -345 -447 -303 -709 -774 -189 622 366 -614 131 29 -63 -619 59 562 108 -58 451 196
3021 196 -561 -492 165 270 -244 -25 194 -313 -637 -685 125 50 -488 333 676 -165 -765 -81 285 501 269
3042 269 757 949 56 26 159 388 335 352 524 423 421 37 31 243 -36 52 744 364 -28 -404 -63 -484 -413
3065 -413 -195 282 454 -566 -527 -177 -400 -320 -299 198 103 -56 -114 -89 -190 -169 29 329 -149 -240 148 -55
3087 -55 -450 -401 71 595 -194 37 -140 -133 -486 5 118 591 399 604 509 224 47 -59 287 75 191 463
3109 463 176 61 -147 197 119 294 220 395 132 43 -509 -57 -355 17 -95 71 -34 -553 -203 -350 -501
3130 -501 -152 -174 -38 -189 -614 -190 -39 -188 -267 190 396 46 -332 -114 162 1 -60 308 259 223 203 4
3152 4 -5 -60 -24 85 278 329 202 -65 28 -28 -84 275 -6 255 -32 266 -84 -66 211 257 264 186 40 45 132 -235
3178 -235 192 -279 40 -52 -305 -202 -212 33 -415 -76 -28 104 -224 30 -157 -165 9 -273 87 101 70 23 45
3201 45 -250 -128 85 151 55 71 -84 -249 -265 -39 290 250 174 306 117 -62 102 -163 77 257 266 423 47
3224 47 212 -115 -70 -317 38 -106 246 -5 -98 -268 -295 -109 -215 1 -31 -24 -449 -291 -310 -354 -412 -152 -190 -23
3248 -23 -126 -401 178 -390 -236 7 -51 -339 -93 -94 4 -213 200 220 1 -185 -14 -154 -244 -369 241 250 350
3271 350 479 -190 152 25 132 268 323 489 261 -98 -169 76 -156 71 17 148 140 -326 -127 -355 -149 45
3293 45 -110 -159 -237 -107 -375 -346 -123 -20 -160 -60 -68 -45 -43 -82 -83 -544 -64 -15 -5 334 -97 9 257 107 188
3318 188 171 441 519 50 315 31 -124 164 5 245 254 18 -15 -209 27 -372 376 401 71 54 131 3 -152
3341 -152 153 92 56 -56 -222 211 25 -259 -22 446 -318 -349 -237 100 -223 -600 -116 -98 1 -231 205 -41
3363 -41 -538 -360 -318 -22 -364 -143 167 323 -114 -225 218 227 26 173 575 479 -103 -203 451 143 173 200
3385 200 379 48 -296 61 194 99 94 333 467 -83 -173 195 -51 -30 -272 180 679 -310 -202 201 263 -324
3407 -324 -76 187 363 -380 -341 370 -2 -249 371 397 5 4 155 118 -204 -611 -3 374 -290 -378 37 439
3429 439 -177 -290 344 435 -46 -127 426 500 -56 27 160 409 122 -240 200 104 -225 -339 165 166 -63 127
3451 127 486 -140 -426 -315 -104 32 -261 26 157 17 -727 -211 -14 -386 -704 156 177 -518 -806 42
3471 42 205 -414 -505 -168 92 -461 -593 58 -69 -422 -389 446 309 -535 -108 802 466 -173 162 275 404
3492 404 -251 112 680 48 -522 257 371 282 -330 677 331 -374 -339 339 794 -84 34 537 813 -321
3512 -321 -313 666 165 -405 -124 477 169 -470 -384 344 214 -453 -215 144 -21 -432 59 231 -20 -261 92
3533 92 492 -78 -439 458 665 -338 -607 533 116 -461 -244 557 461 -343 -204 418 615 -66 -222 680
3553 680 167 -35 451 539 405 -583 110 786 27 -480 237 587 35 -43 273 459 -392 -614 -68 -28 -414
3574 -414 -300 210 155 -357 -274 62 407 -118 -488 -5 -129 -381 -246 329 -1 -602 -355 507 428 -284 99
3595 99 672 75 -506 -170 735 -276 -319 169 648 -231 -366 58 559 -260 -25 554 270 -168 -207 300 258
3616 258 -90 -295 484 111 -427 -25 315 225 -337 -84 653 93 -232 -113 246 89 -571 129 149 -273 -481
3637 -481 -156 348 0 -406 -180 35 -43 -368 217 249 -457 -6 197 346 -205 -104 476 237 -95 -224 196
3658 196 268 -489 83 286 110 -305 -265 493 338 -219 366 283 -138 -424 282 316 31 56 192 478 -431 -386
3680 -386 72 125 -266 -42 384 -19 -363 -185 72 258 -472 -22 338 -75 -391 -95 116 -122 -264 -228 289
3701 289 -209 -273 -15 143 -18 -129 -185 138 20 35 123 183 -28 122 78 297 -71 -173 235 312 -205 260
3723 260 626 403 51 134 335 140 -92 -248 320 141 -21 -195 324 -149 -92 201 311 -21 -236 -255 65
3744 65 -280 -497 -319 443 -371 -81 -260 -177 -405 -141 -23 -174 173 -132 135 -192 -193 -320 209 -61 -467
3765 -467 -198 107 -50 -192 145 80 -166 -129 78 7 6 14 242 44 259 93 258 408 -308 159 -98 46
3787 46 -284 80 136 -17 -105 294 105 175 152 -38 -48 144 -263 -151 159 0 -13 94 7 231 -396 -26 -318
3810 -318 -52 -235 -255 -73 -95 -174 -115 174 -178 12 -73 -34 125 -33 133 264 107 -255 97 192 -48 221
3832 221 104 218 130 449 94 -59 27 153 -11 88 390 -70 207 51 -150 488 16 -327 196 109 63 110
3854 110 -9 -129 74 -289 -685 293 112 -268 52 -278 -210 68 -206 27 -99 -143 95 91 53 -22 -11 -68 -64
3877 -64 15 151 471 -87 54 -89 -86 254 -209 -176 213 4 37 73 -48 20 137 412 127 27 112 203 -47
3900 -47 -187 159 -38 278 201 92 -349 -126 112 -104 1 -180 -119 -185 -35 199 -290 84 53 -125 -268 -103
3922 -103 -67 -311 -194 259 87 10 -40 -128 -9 -370 -174 85 19 0 -126 -3 9 109 -90 241 358 -79
3944 -79 196 285 -178 29 -15 491 224 -85 -85 -34 154 -166 208 -19 -49 56 32 402 -106 -204 -156 -87 106 -10
3968 -10 -64 -65 195 -305 -233 -162 282 -134 -15 57 -4 -478 -229 -20 19 136 -190 -114 -219 -172 -184 -127 -54 213 334
3993 334 124 3 64 301 87 156 284 482 358 -269 153 374 -62 98 295 93 290 312 85 -150 -93
4014 -93 -51 -67 -37 215 353 149 35 -227 10 189 -46 -287 -29 -138 -156 -347 20 98 170 113 104 -270 -322 -249
4038 -249 -315 127 141 141 238 -45 -237 -197 -58 -199 -356 183 335 79 -163 171 26 100 72 169 360 56 -280
4061 -280 305 -64 134 131 279 279 -102 -459 464 81 138 67 324 -231 31 74 36 -120 -255 -99 125 241 -278
4084 -278 -112 374 -377 -77 338 92 -9 8 41 44 -362 -446 -37 38 6 -183 98 -175 -70 -418 61 83 110
4107 110 -355 -21 -1 -364 -93 10 132 285 42 487 392 58 -43 60 302 7 -51 286 195 77 80 39
4129 39 6 96 2 147 -223 82 441 122 -202 -222 -68 225 -346 21 -225 -76 23 -403 176 186 -357 -319 111
4152 111 -368 -288 -162 260 223 9 -155 117 -79 -408 73 277 220 -182 103 17 155 -233 16 504 81
4173 81 -92 85 304 39 -293 431 -33 -60 -233 60 -173 -44 -366 303 2 -24 -360 -97 -59 -271 -71
4194 -71 107 318 -359 -236 -102 -43 -514 114 -275 33 -156 121 -118 78 -519 118 -188 -455 -12 70 130
4215 130 17 -289 -146 252 -117 185 525 477 -180 -82 174 -105 -226 142 734 120 -231 -341 -119 47 -52
4236 -52 230 484 53 -327 -46 249 164 194 302 200 34 -529 132 201 2 -81 364 124 -324 -198 -304 77
4258 77 -283 21 13 -23 -114 99 224 -106 -245 -90 257 -92 -45 282 489 110 -89 121 354 -72 -81 352 329
4281 329 72 -204 -154 298 -24 42 255 252 -93 0 201 522 -161 373 220 -95 -169 -112 552 77 -194 -104 77
4304 77 -46 -442 -185 194 -168 -265 -159 237 -563 -206 -383 -36 -209 -331 -287 172 -80 -426 236 203 -39
4325 -39 143 531 -107 -341 -94 164 -62 7 -207 284 57 -221 -101 419 122 -346 -339 67 372 -166 200
4346 200 115 8 -204 103 138 -177 179 159 -155 -201 -343 123 101 28 194 -18 -85 -466 -150 -4 -126 -30 63
4369 63 151 -267 -700 -299 96 -39 55 -103 -406 34 -321 16 -45 32 -81 -179 -125 20 -81 -44 256 -53 -213
4392 -213 89 488 -239 83 303 135 -312 72 210 271 -48 155 -20 -115 114 60 61 -32 -242 -11 101 8
4414 8 -396 133 -201 166 -204 -49 6 -337 -102 381 274 -113 -55 -57 -240 -421 -40 -70 -125 251 68 -230 -78
4437 -78 -410 83 -117 17 -173 413 311 -88 126 73 203 461 113 252 305 184 -50 -29 232 -82 80
4458 80 81 404 -255 -49 -47 -16 197 -195 -59 -125 -22 -487 110 -399 -17 298 -164 23 -170 -178 -156 -124 -74 -92
4482 -92 -223 -108 -129 -208 -91 -256 48 -130 173 95 -234 108 -87 -191 143 61 121 90 193 5 -87 -21 50
4505 50 -70 288 248 -5 -12 -93 7 -218 87 94 42 -43 61 114 49 142 -145 119 394 135 100 159 -170 19 22
4530 22 135 -161 -356 177 -107 -534 -35 -347 -434 -214 88 115 -458 -373 -146 -585 51 198 160 4 31 -60
4552 -60 -136 262 281 -3 -242 148 375 171 -273 58 23 112 265 125 -189 202 115 210 -190 -54 203 -6
4574 -6 -77 -109 128 129 -49 132 11 -24 37 -71 -369 58 -125 55 313 -119 -198 -244 -276 -71 28 -71 260 53
4598 53 -182 -198 -99 -110 -167 199 250 77 -38 -281 -17 -138 221 150 328 -28 270 97 -165 120 206 249 33
4621 33 68 -211 172 -207 -87 218 -70 478 -96 67 317 76 -204 125 233 73 -6 64 129 112 -185 -41
4643 -41 -30 218 71 161 58 136 -140 -299 -359 -24 -71 -208 7 -423 -254 -220 -229 5 277 -60 -262 -22 131
4666 131 -202 138 340 357 -47 176 -76 -204 -103 14 45 67 95 -36 145 345 -195 178 45 232 134 -5
4688 -5 145 -139 149 204 201 207 283 316 7 -109 146 -50 50 -79 335 -183 173 92 -159 77 -147 -122 -12 132
4712 132 -30 3 95 -67 -19 -223 -20 235 420 58 50 -80 -11 42 305 203 -175 99 432 23 -24 104 66
4735 66 106 220 139 -43 333 85 -58 272 -296 217 110 429 -48 -57 26 197 73 -79 131 -244 -61 38
4757 38 -122 140 216 106 -319 -155 157 -131 171 -270 -147 -54 -145 -339 -17 -26 -371 -232 -220 79 -61 142
4779 142 -349 -232 -124 182 -28 146 6 157 -178 77 182 259 306 349 174 -25 -217 22 -180 413 37
4800 37 296 281 104 -183 -308 114 59 200 -66 -69 -231 -54 -245 -96 -316 -52 56 -313 -221 -130 153 -147
4822 -147 36 111 172 153 -268 65 49 103 127 -131 -276 -55 181 -101 -18 114 -163 -199 38 -150 85 273 217
4845 217 -11 233 157 -232 138 88 351 -46 149 10 123 353 520 -52 -138 -230 -47 43 -196 65 39 -309
4867 -309 -13 80 41 76 289 230 51 -244 -325 -83 22 -126 289 -64 -196 2 -91 59 81 11 25 104 -123
4890 -123 177 -149 -3 -56 115 -140 88 68 15 442 -31 69 113 -198 -149 25 -144 12 208 -160 93 -56
4912 -56 91 38 -114 -67 366 -231 -253 -51 11 216 -151 177 -209 -152 -126 -52 2 -59 -77 -199 -159 -83 -398 -213
4936 -213 -237 -62 -214 28 26 -36 -192 -206 117 -19 -211 123 214 214 167 -70 -99 50 -21 37 33 -59 -263 38 69
4961 69 317 -364 180 167 121 -18 -1 68 73 -18 -187 314 248 59 21 -71 -184 -89 -112 -3 31 -355 -137 -39 -238
4986 -238 -101 -122 -25 -114 -61 -179 -129 -8 -12 207 300 -114 124 -27 -1 160 171 48 -45 -40 151 -66 125 50 75
5011 75 -75 185 286 -121 195 15 297 141 -139 -59 90 -42 -8 -72 127 -103 -71 -131 -18 63 -208 41
5033 41 -218 -176 170 14 108 -172 -160 -59 -357 21 -46 -81 -10 69 -174 -243 19 -263 100 128 149 -130 88 -93
5057 -93 -279 60 139 103 11 150 -164 44 59 181 52 186 -167 -48 119 218 42 14 248 205 54 -291 -134
5080 -134 -19 19 76 97 -64 -247 377 173 -130 -201 -134 276 90 112 -63 -289 -13 -20 24 -497 -5 -134 -181
5103 -181 -20 -216 -43 -48 51 -199 -100 -104 235 13 -234 8 -343 296 182 -205 113 193 -92 -52 -126 45 311
5126 311 -116 217 179 174 -116 9 140 -36 19 -281 234 141 -23 60 -219 109 -151 67 57 23 -124 59 -57
5149 -57 103 -194 96 -79 -51 118 -281 -259 -163 -26 181 120 -93 -31 -132 162 -85 98 -169 105 -3 -253
5171 -253 142 -41 -95 198 -6 252 64 92 -181 -35 251 -147 -179 -152 240 75 23 -228 160 188 298 136
5193 136 -126 -145 52 -202 6 44 112 -210 -89 -4 0 83 -63 17 -54 104 -377 -242 27 -134 145 -100 -79
5216 -79 -32 -46 -216 104 -56 -115 265 -55 54 -183 77 -71 138 -200 127 -113 -26 307 -271 222 -366 92
5238 92 -144 123 -190 122 332 81 194 211 288 215 153 21 -61 295 -93 -159 105 -49 -287 -132 110 84 -268
5261 -268 230 65 -326 -82 -12 25 -98 -251 -106 -203 -4 211 -133 26 -15 -384 49 -153 -133 -19 154 28
5283 28 -86 31 -302 245 41 -9 -41 44 23 134 69 -134 152 266 132 330 -75 -217 135 20 50 -214
5305 -214 162 -116 184 -77 -166 7 175 147 26 -73 -255 325 -27 -15 -78 9 44 -53 56 177 -213 -191 -28
5328 -28 -160 -96 -442 122 -221 -308 -112 -98 -75 97 -23 -82 -51 137 131 -348 -139 16 104 1 -53 -70 110 40
5352 40 75 -137 270 261 73 -38 187 -175 -10 76 133 86 97 19 17 134 -86 261 -32 141 -221 -28 4 212
5376 212 -9 -34 -189 -79 93 -109 -111 15 -517 -145 -291 -95 -45 239 -62 -133 -236 -131 241 -252 -165 -364
5398 -364 -184 -9 -64 158 -13 -184 31 -119 97 290 -165 156 246 406 263 120 31 5 265 -50 73
5419 73 -13 60 -94 170 141 141 198 -92 -90 -13 -72 31 -104 95 286 -26 -15 99 98 -169 17 136 -159 -148 155
5444 155 -25 47 -80 -265 -65 -38 -102 -116 -44 231 -289 -45 38 23 -268 302 123 54 391 -52 -86 61 25
5467 25 66 68 248 437 146 -141 -82 -12 6 199 -23 144 -56 58 37 3 161 53 -238 88 -439 -292 -13
5490 -13 -283 -202 197 17 129 -59 -43 -63 -67 220 -69 192 -41 58 -510 134 -101 -21 -36 -95 -34 -137 163 -51
5514 -51 -14 334 155 -233 -62 -323 -257 336 193 148 -8 -75 -134 227 352 -19 44 261 79 -309 129 60 38
5537 38 70 -88 -125 20 77 -237 -241 59 -249 19 -277 -89 131 163 110 -194 118 -34 182 -34 144 -60 -230
5560 -230 114 60 126 -106 331 -61 -397 249 -321 1 -60 187 -111 25 -58 -1 60 110 198 142 -157 21 315
5583 315 -173 -158 437 57 183 -116 -151 210 -76 14 110 116 -145 -120 -13 -162 24 160 197 -134 -192 -30 -54
5606 -54 170 -172 25 246 78 -77 -383 36 70 -101 198 -118 -167 89 41 169 -3 101 43 -148 -149 -52 134
5629 134 163 349 199 -140 57 -26 20 231 232 -146 29 62 -125 -4 359 151 121 -232 -129 -65 -136 86 222
5652 222 48 -183 58 -149 -36 -2 -347 -67 -70 -224 -454 -19 140 90 40 1 -175 -208 -106 -168 170 65 50
5675 50 53 -164 -176 78 147 91 -87 131 111 -374 163 105 187 -193 82 116 -28 -59 -69 187 135 -6 192 -164
5699 -164 -205 57 405 315 69 -31 -127 -189 -312 -125 -8 271 -135 204 -27 30 17 -379 373 -342 -404 -430 -23
5722 -23 80 53 107 -249 32 -115 13 184 248 -99 145 -263 -160 154 123 86 -11 75 52 -99 -93 -437 213 463
5746 463 -221 -116 -294 13 -42 -69 342 146 163 177 182 -4 2 1 -80 -340 4 161 -197 -115 -109 -77 -124 -18 -64 355
5772 355 -164 -9 -160 -12 -153 -145 -70 22 35 -166 43 71 -57 56 -4 -86 130 5 39 266 2 -27 -321
5795 -321 73 74 365 -117 64 124 -69 234 25 -166 93 165 -2 35 187 201 159 346 18 45 181 -213 -14
5818 -14 268 -28 -78 -347 -239 339 179 98 -117 19 34 -92 -124 153 -107 18 175 -312 -99 -242 49 163
5840 163 -221 -219 0 -208 -198 123 -139 -101 -186 -37 -174 -88 -113 -79 194 -177 25 -40 251 96 148 37 -182
5863 -182 -147 117 156 46 -56 -116 169 154 -59 -65 -297 132 -33 263 140 -190 -4 -403 -2 -135 -66 -168
5885 -168 71 -34 -70 -253 168 -43 -108 -125 90 -250 -104 -38 90 29 -147 -298 18 77 -89 73 -20 250
5907 250 -6 -192 -94 -37 224 105 -70 201 249 101 36 117 19 195 -12 141 109 101 40 -206 287 142 -267
5930 -267 182 307 -30 -211 223 -5 -272 -15 -299 -180 -200 152 -106 46 64 -123 44 -159 44 -98 -226
5951 -226 -122 -138 0 145 78 -231 344 32 -431 -148 345 104 -254 -183 -179 -15 116 12 265 -103 86 -20
5973 -20 -85 -68 -45 -207 24 59 -102 221 -18 68 -72 239 -20 -39 -5 39 94 41 330 -76 504 415 -282 -129
5997 -129 -258 -384 -339 89 163 59 -209 -174 179 194 27 93 197 161 -4 154 189 242 129 -373 131 244 121
6020 121 17 -10 25 26 -28 -130 103 15 68 -327 181 85 56 58 -107 80 96 17 343 -25 -96 -84 33 -141 -143 161
6046 161 190 83 237 -119 387 303 -234 -331 -160 36 255 34 42 219 -212 149 -236 76 -282 18 72 100
6068 100 -155 458 225 287 -99 -33 65 71 -50 -162 25 65 28 -151 223 228 -37 78 -8 86 -47 74 127 -116
6092 -116 3 60 -44 47 -284 140 -82 -1 346 -76 476 -105 60 49 117 -137 262 57 79 5 5 -93 -7 33
6116 33 -93 26 42 -243 -144 309 -201 235 -115 7 47 -17 -283 -146 -60 -212 -4 -230 198 -203 43 77
6138 77 -316 255 -8 327 140 -16 50 227 229 408 151 59 256 -172 100 -135 -37 -40 -134 -17 46 248 -127
6161 -127 -329 -92 -47 89 -45 96 -271 165 96 -10 184 -148 -20 -26 -121 -172 -214 182 -188 -6 10 -236 -26
6184 -26 -37 137 -185 -258 107 -110 -127 -10 -145 224 153 333 -46 231 -62 199 4 57 163 95 83 -64 104
6207 104 42 -171 -304 248 256 -4 23 1 132 162 -54 -258 -245 -109 172 111 -271 1 -131 -287 -308 93 -101
6230 -101 20 116 -252 28 -27 230 -58 -123 -193 -227 92 78 130 -21 99 -56 -134 -145 -74 79 -11 211 279 228
6254 228 -97 107 37 7 321 -134 -289 59 74 76 -189 69 270 -3 -80 -68 20 143 -90 277 23 -95 -11
6277 -11 -109 -406 23 122 -144 -7 -275 -30 -13 -223 91 -229 -51 -260 20 -6 35 -181 55 83 -22 -123
6299 -123 209 225 -8 -165 -127 -195 283 8 -19 363 -118 67 78 108 -184 -155 234 188 42 130 344 -127 -394
6322 -394 294 -163 115 -235 -156 -69 246 417 186 126 195 -119 92 -72 57 -220 -115 212 -17 -135 -113 -28
6344 -28 53 -71 22 253 -347 -142 198 155 -246 231 102 66 -165 -34 232 171 -153 -248 -94 -69 -28 16 218
6367 218 108 30 -152 22 110 77 107 -72 -5 -192 -270 -13 -54 -182 -20 86 -224 -21 -92 323 -31 -75 -70 34
6391 34 -30 -144 -52 72 56 16 35 -126 -136 -378 136 46 14 -23 -298 -144 -223 -131 36 438 -7 -18 301 -245
6415 -245 358 -167 29 110 -117 -65 61 271 -19 343 150 -20 24 188 -105 111 252 336 -53 -141 -84 237
6437 237 33 162 282 -47 -2 233 -4 114 -320 -39 4 65 -58 -241 -135 78 456 -60 -65 28 -253 -33
6459 -33 27 41 -220 -103 -53 38 63 128 -87 -11 -121 -34 -90 180 239 100 -97 -25 -392 79 113 -268 -151 121
6483 121 132 -167 84 -208 136 -120 -27 408 518 -79 58 398 476 134 -143 -84 -76 34 -126 302 177 27
6505 27 -67 25 -241 101 -100 -290 53 88 -168 176 193 -123 225 -34 -182 -38 -187 -130 -152 -238 115 76 132
6528 132 -245 32 -150 19 35 -392 -15 -148 -171 -135 183 176 130 -236 -87 -273 -128 252 32 -142 49 -214
6550 -214 -97 167 -213 -177 -91 -153 99 121 -178 101 102 272 -192 -355 -62 -113 -231 148 98 287 9 0 109
6573 109 -137 -47 -373 -160 16 48 265 206 -56 -168 97 251 165 -46 -37 -172 123 -314 -16 234 -59 -131
6595 -131 269 -13 -155 -209 -62 204 -141 315 -78 110 282 186 -10 -87 -29 121 -55 223 2 -197 59
6616 59 77 -147 -153 70 -18 -189 -91 -58 -80 -10 16 -171 94 -409 -103 -28 -3 -211 61 -120 62 -191 241 -26
6640 -26 -305 177 -165 191 124 250 97 -38 1 -169 -178 302 -50 243 156 -61 95 -144 170 -168 -1 118
6662 118 18 -157 -156 -179 -85 -42 6 63 199 -210 -107 209 -190 135 -272 -128 -41 -264 18 -219 -96 44 -50
6685 -50 -389 -63 82 -107 -189 -252 -353 -75 174 -327 -84 223 167 -15 117 -160 68 96 -152 -19 -31 -1
6707 -1 342 -210 -195 -158 -5 285 22 -21 175 -110 209 29 -28 42 -13 205 27 -152 29 59 60 -66 -57 -84 137
6732 137 -65 -110 -194 -104 -113 -123 3 220 -147 29 16 30 3 94 12 -193 -24 51 -11 -22 -66 22 117 132 -158 -199
6758 -199 54 -53 -147 -8 279 -96 125 208 -162 -294 -180 -120 107 -21 -133 -242 269 -125 -94 71 -65
6779 -65 102 -122 139 45 -116 -151 -280 218 100 -158 -142 181 152 -158 -41 93 50 -267 283 166 -88 -59
6801 -59 202 45 -32 95 -235 120 -62 -188 155 83 146 159 127 -196 150 33 -57 -23 -65 -5 132 358 480
6824 480 152 -124 96 133 -37 -199 -28 242 44 283 70 -183 70 32 87 140 100 -245 103 191 -26 119
6846 119 -84 119 -138 42 -140 -68 88 13 -391 -342 -222 260 -104 -177 -100 -177 316 36 -49 40 -157 138 -131
6869 -131 -15 -83 -12 24 85 57 88 15 74 -114 -158 90 152 -100 225 113 196 -196 55 -126 -113 -123 114 222
6893 222 -210 -223 -52 -155 20 -57 6 -113 326 -137 -111 -131 -29 222 -326 -132 -34 76 -119 -201 -174 280 14
6916 14 130 -195 -7 158 -183 133 389 -248 -193 129 341 259 -44 27 197 182 -225 128 213 391 143 119
6938 119 33 -61 -133 -36 206 -61 343 87 154 -174 157 -211 -1 213 49 280 88 -143 -151 22 160 84 29
6961 29 -105 53 36 -361 -68 79 -104 53 65 -90 -14 104 193 -82 -23 -184 277 -112 -178 39 -219 -106
6983 -106 -318 -97 92 -60 77 396 -246 -101 -203 -225 310 222 -143 -441 -66 233 101 61 -339 148 -202
7004 -202 -191 221 -186 -37 -63 140 -178 -32 -197 -102 26 -171 241 -186 -287 308 -137 -220 -69 -167 117 -83
7026 -83 22 92 26 237 -77 11 192 -104 -45 273 0 -55 44 251 -278 -144 -35 -166 30 -162 85 264
7048 264 -171 198 238 -74 279 108 -10 -4 44 13 184 -30 -191 195 111 304 -94 -71 148 -196 -322 -259 -45
7071 -45 -241 -472 109 269 -134 -170 156 -43 204 235 135 208 -370 -308 -266 4 215 15 167 112 -152 -24
7093 -24 304 -129 161 169 132 238 -19 59 42 271 8 46 4 -213 -104 163 121 102 -421 -79 147 53 -46 -169
7117 -169 3 -26 62 46 254 -61 -106 -165 150 -207 -168 -83 5 -264 -135 351 -106 23 32 -248 182 1 -159
7140 -159 54 149 -220 -57 -41 -88 162 206 -64 67 99 -11 -241 120 43 112 33 -203 118 109 24 171 88 69
7164 69 -131 -23 -230 -231 -208 293 -156 82 284 -26 242 28 143 36 -10 107 157 -181 -184 98 -232 -244 -83
7187 -83 139 -84 -105 -112 139 -38 -154 -20 49 128 70 300 326 -230 -113 -136 97 259 150 403 -37 -16 209
7210 209 39 -54 -205 -96 -117 -324 -39 -63 85 48 -140 -59 60 -149 75 410 207 -112 81 198 -84 -55
7232 -55 -60 -164 144 -112 245 163 96 -83 -173 -8 3 -16 -51 89 -126 -16 -253 -84 -87 -74 -233 55 355 -125
7256 -125 -13 53 -132 -138 8 -57 -486 -6 -157 -246 285 -32 -51 -77 86 72 -172 -84 218 65 275 -6 174
7279 174 202 101 151 17 2 155 98 -61 63 -329 139 131 -116 -218 -225 119 187 -172 37 -7 -76 -72 105 -46
7303 -46 -53 -172 -243 -273 -48 227 -8 -347 -42 314 114 35 -302 115 147 -48 14 -110 74 285 144 212 -198
7326 -198 371 6 110 266 -122 129 -79 35 105 -155 -253 -69 -41 -87 -191 -95 -11 109 -195 -112 -163 109 -107
7349 -107 -76 89 -281 -133 -74 18 160 43 58 -163 -237 -146 -75 87 -109 53 -98 -53 -263 -220 -212 -39 140 -249
7373 -249 256 90 80 64 69 -193 -110 -94 75 20 -76 76 -54 -3 66 -140 176 268 75 -181 159 -41 161 -163
7397 -163 361 -390 47 -229 87 77 -176 -38 5 -215 -137 60 -68 -143 181 -154 116 -70 -133 -154 -7 -182
7419 -182 87 -146 101 87 -365 -129 64 -246 292 -210 167 139 22 -90 -71 -324 -118 -125 -196 62 97 -57
7441 -57 177 -73 11 46 -174 -149 343 230 -12 104 -185 22 154 -214 48 216 120 23 85 -78 70 13 -160
7464 -160 12 91 -16 167 -185 -195 -99 205 69 89 183 108 -252 -50 91 132 209 -191 270 -65 67 144 -45
7487 -45 -151 -102 -157 -119 -233 59 79 19 85 -323 -129 296 -236 -51 -183 -120 140 148 -8 150 11 -230 -257 -76
7511 -76 75 -136 -107 -184 177 -120 -137 -390 -245 -103 -113 76 -291 -254 194 -212 -90 -44 -59 105 -185 -37 -103
7534 -103 -110 -78 -2 188 217 34 22 138 253 312 -30 75 -296 34 125 30 -285 -110 -196 199 99 231 -113
7557 -113 255 158 -74 372 12 104 -127 100 -242 45 -360 62 40 102 -254 -137 215 273 16 170 -111 -30
7579 -30 103 185 -124 164 -98 320 10 -1 34 -45 -164 -128 49 345 -41 -36 36 -12 -161 -32 85 79 71 -11 184
7604 184 92 -117 -102 161 -32 57 211 381 -71 -369 -355 -101 -26 -192 174 -101 115 -125 86 429 -15 64
7626 64 393 -9 -259 -39 3 148 23 61 98 -180 -140 -107 -6 124 -180 20 12 -20 -394 -25 281 -36 30
7649 30 -98 164 -166 212 93 165 43 334 15 -256 -60 293 -128 55 -108 445 270 -52 177 -190 -57
7670 -57 -197 171 -6 171 -20 89 124 147 367 23 64 152 -189 -84 -189 0 -9 -110 -131 -41 -517 92 -185
7693 -185 -201 -122 -45 -11 61 5 -111 49 11 -30 230 -146 -20 -138 18 358 -12 102 178 110 12 -400 -8 17
7717 17 16 -24 -207 116 -297 -191 -197 26 -197 283 99 227 -301 259 130 193 110 -247 -133 -168 171 94 80 152
7741 152 -199 -166 70 -266 -125 -85 46 77 -11 -273 412 25 348 0 -183 -49 161 306 376 -163 -39 -53
7763 -53 -256 22 324 228 -82 -101 -99 311 -65 -25 90 80 72 -117 58 -32 265 -206 14 162 -310 71 312
7786 312 121 -141 -26 -12 28 -76 264 44 -133 -4 -65 416 -16 -46 -110 -46 56 65 -240 -179 14 162 -25
7809 -25 501 117 24 206 -31 71 41 15 -83 287 -14 -157 72 -276 -31 21 169 0 -2 33 33 33 -174 226
7833 226 -33 -23 -169 65 51 384 36 -11 21 349 -185 -64 -10 147 165 125 -70 -248 118 -111 -324 -63
7855 -63 -10 211 -101 -180 -218 147 56 -119 272 88 111 -44 96 -234 -106 -200 147 -51 -51 -1 -240 110 49 -100
7879 -100 81 -189 62 21 243 159 -9 -107 154 287 17 138 37 -87 -15 -144 -17 128 -47 -157 -191 237
7901 237 -149 -81 43 45 -119 150 115 -73 160 149 102 -177 -52 35 -68 123 229 447 -120 -291 355 -157
7923 -157 51 225 63 410 108 -48 -279 -28 -192 151 134 -262 -176 105 11 -174 -166 34 -287 8 -134 -341
7945 -341 58 -57 33 1 222 -99 203 -208 154 236 103 -141 -6 13 -20 -109 184 36 229 16 -130 -218
7967 -218 -32 -65 -29 -237 289 -2 131 228 -225 -146 180 -116 -96 68 -91 -153 -304 305 -14 -216 -19 -125
7989 -125 -220 -56 -191 -24 119 -55 -50 122 -45 81 193 -11 -32 421 113 -23 -46 264 -289 140 -226 -46
8011 -46 67 -41 -69 96 17 -175 56 -141 44 26 -151 81 228 20 98 -166 38 -195 11 -158 118 -14
8033 -14 87 -386 -371 196 201 9 -283 149 285 0 206 -19 -19 95 53 21 -228 76 -56 -51 -149 132 90 27
8057 27 -118 199 69 -164 47 -82 -51 66 -21 40 -31 -190 283 -47 -301 -6 -11 -69 124 234 105 146 -232
8080 -232 -162 110 110 -48 -147 103 140 15 83 44 134 -95 30 172 76 -320 149 -35 -238 -14 -43 -70 29 -12
8104 -12 39 1 -20 -237 2 -128 139 200 -93 91 -132 87 -25 155 68 213 -78 -44 62 9 -192 5 -166
8127 -166 79 -152 -198 -103 -18 31 -376 -141 -5 115 156 68 -107 122 -32 -119 -301 341 82 -240 80 16 -225
8150 -225 -297 129 283 -101 105 164 189 -305 -139 48 20 192 -175 100 239 -114 -217 1 -52 245 -14 149
8172 149 158 -126 -31 -185 64 139 7 74 261 64 -186 -95 -26 74 153 -174 -111 233 16
8191A6
$$ Imaginary data points
##PAGE= N=2
##DATA TABLE= (X++(I..I)), XYDATA
0 0 0 0 0 0 0 0 0 0 0 0 0 8 -8 8 -8 8 -8 16 -16 16 -24 24 -28 32 -40 42 -48 56 -64 72 -80 89 -99 113 -123
35 -123 139 -155 172 -191 212 -235 259 -287 318 -352 391 -436 485 -543 609 -690 789 -909 1063
54 1063 -1266 1555 -1983 2695 -4100 7902 -37929 -122134 -38740 4151 -41958 -52737 14629
67 14629 5764 -78866 -93557 -22493 -5697 -35463 -10112 36861 2020 -55360 -32678 17510
79 17510 2231 -23794 5743 29996 -9970 -44400 -19198 6882 -11795 -27525 -11457 -5552
91 -5552 -26903 -32139 -14006 -12267 -31746 -33461 -15274 -12419 -24324 -18460 -1002 -7904 -34213 -35049
105 -35049 -5540 11892 6267 9493 20505 7636 -20250 -15455 17135 30281 23291 29201 31381
118 31381 -4064 -37504 -16246 22341 19098 3385 17207 19233 -25112 -53232 -17796 22215
130 22215 14186 2508 19765 16864 -20880 -29093 10875 32294 14279 13293 34904 22834 -13872
143 -13872 -8507 33425 39530 10795 10385 33611 23844 -7981 -3248 28257 25823 -930 -235 19271
157 19271 8959 -15993 -10434 8846 -4366 -25601 -9479 15477 1755 -20487 -7744 8333
169 8333 -11779 -26777 3564 31601 14372 -6771 4418 7575 -17017 -19597 14150 27051 1917
182 1917 -10747 -2344 -17324 -43503 -28782 7999 6480 -19165 -19076 -11132 -32444 -47128 -19085
195 -19085 9730 -165 -14051 -4352 -4700 -26147 -25123 6462 17679 1174 -2260 9718 1138
208 1138 -19756 -11766 13975 14672 -1456 -694 7386 -4831 -19834 -11283 3384 -515 -9167 -2176
222 -2176 4322 -7473 -18492 -9717 626 -4335 -7848 4897 14798 4190 -8027 -1883 6766 2731
236 2731 1856 15773 24440 12274 -1304 658 4917 -131 3462 18998 21596 5100 -6089 -2988
250 -2988 -3667 -10108 -1931 15038 14186 -1859 -7914 -3250 -4677 -6887 5280 19731 15840 4469
264 4469 2823 4639 1616 3071 15521 22805 15509 6820 4337 1119 -4823 -2835 6897 10435 4725
279 4725 -699 -2178 -6721 -11611 -8402 68 4057 1297 -103 -591 -4806 -10414 -8539 -435 3129
294 3129 963 131 -203 -5873 -12900 -11465 -2982 1451 1469 3005 3276 -4513 -11634 -8372 -882 1119
310 1119 2370 6719 4709 -5604 -12595 -8395 -2854 -2507 325 5503 2814 -7482 -11828 -6954 -2324
325 -2324 -179 5175 9388 5072 -3855 -6740 -5084 -3470 441 7178 10029 4153 -3093 -5466 -5837
340 -5837 -5505 -1244 6705 9700 4642 -774 -3962 -5245 -5198 -1481 4212 6133 3229 -2565 -7647 -10448
356 -10448 -9706 -5054 990 4146 3424 417 -4013 -7107 -5585 255 6736 10955 10425 7045 1648 -2805
372 -2805 -4626 -1280 3772 6674 5692 1489 -3641 -8006 -8483 -5509 692 6060 7735 4955 500 -3392
388 -3392 -4318 -1819 3704 8382 10064 6671 255 -5952 -9033 -8089 -4183 586 2759 1406 -3137 -8576
404 -8576 -10522 -8339 -3360 2226 5454 5867 1856 -3476 -6787 -6624 -2258 3041 5328 4766 292 -5673
420 -5673 -10001 -10661 -7710 -2016 2209 3154 497 -4293 -8128 -8402 -5999 -933 4508 6471 3073 -1302
436 -1302 -4971 -6275 -4682 -313 4756 6480 4414 -351 -4410 -6779 -6016 -1367 3367 4881 2959
451 2959 -933 -6255 -11168 -10960 -6635 -2285 -628 -1163 -3208 -7954 -12146 -10968 -5994 -932 2145 3776
467 3776 2231 -2187 -5578 -5001 -2080 1514 4830 6547 3573 -2730 -7391 -8061 -6122 -3535 214 3170
483 3170 1686 -3939 -7850 -7522 -5668 -2401 1995 5943 5354 435 -3277 -3416 -1934 641 4297 8014
499 8014 6131 1138 -2447 -2422 -2085 -605 4743 8844 6501 887 -1873 -2193 -4234 -4187 1321 5574 3062
516 3062 -2511 -3910 -4353 -7337 -7389 -1273 2651 703 -1844 -2001 -3297 -6211 -4816 1729 5360 4504
532 4504 3914 3930 -178 -4472 -2951 3011 5368 4565 4682 4447 -723 -6566 -6285 -352 2809 1992 2615
549 2615 2491 -3118 -8564 -6461 83 2154 1709 3870 3690 -3582 -8792 -2916 3657 3101 2776 7154
565 7154 5833 -4394 -8239 -118 4017 -147 1223 8239 4075 -7372 -6743 2176 389 -5777 1076
580 1076 8376 613 -8485 -2758 3587 -3677 -7806 2689 8104 -1720 -5585 3169 3243 -6594 -5113
595 -5113 7503 9151 877 2827 10570 4578 -5496 -658 10686 9626 2879 5480 8374 -241
609 -241 -7430 -2080 5606 4400 1009 2589 679 -7241 -9505 -1171 6155 4662 2489 4314 1761
624 1761 -6102 -7505 1811 9220 5658 1528 2386 355 -6993 -8820 -49 4248 -338 -3268 -870
639 -870 -3842 -10416 -7209 1616 375 -5893 -3879 1420 -3583 -9983 -3510 3451 -2970 -8903 -1720
654 -1720 4445 -2009 -6228 1326 2801 -6290 -8069 2386 5647 -2240 -3829 2435 -1188 -11278 -9071
669 -9071 2850 3836 -5095 -6814 -2523 -6079 -12818 -6694 6191 6406 -2828 -4321 -1233 -5568 -10190
684 -10190 -274 12211 8356 -4524 -5187 -1046 -6940 -12207 -743 11022 3430 -9945 -6652 -275
698 -275 -6612 -8825 4973 12982 1299 -6697 1827 5006 -4288 -2965 11510 10863 -4570 -5745 6952
713 6952 5022 -6488 -1064 10725 3335 -8457 -520 10993 4548 -2832 5123 9971 -984 -4790
727 -4790 8596 13075 1082 -3429 4775 3302 -7598 -3846 10020 8235 -5179 -7441 -848 -4489
741 -4489 -9619 -123 11912 6490 -6356 -6561 -1675 -5354 -7518 3979 12631 2939 -9241 -7336
755 -7336 -2247 -5916 -6928 4375 10383 -803 -11347 -6423 10 -5247 -5613 5712 8137 -5683
769 -5683 -12367 -2629 1797 -6633 -6254 4938 3164 -9710 -10138 2337 3019 -6109 -3606 4849 85
784 85 -9015 -3360 6738 1071 -7443 -2754 2258 -4126 -8227 821 5368 -3637 -11138 -5772 -1460
799 -1460 -4294 -3522 5258 5928 -4074 -8844 -4009 -711 -1516 2396 8253 5244 -4992 -8710 -3227
814 -3227 744 -148 3013 7589 3143 -7441 -8214 769 3723 908 4563 9998 3421 -7082 -3841
829 -3841 6658 5644 -46 4941 9768 211 -7753 830 9369 2042 -3031 4889 7224 -4104 -6300
844 -6300 5520 8015 -2935 -4054 5991 4263 -6374 -3248 7793 2710 -8624 -3682 5020 1223
858 1223 -5465 1289 7121 -1829 -9955 -2765 3941 -13 -1633 5239 4833 -5642 -8619 -598 3320
873 3320 -747 475 4870 1104 -8033 -7856 128 2468 -354 974 3465 -834 -7991 -5842 1741
888 1741 3125 477 1613 3524 -723 -5703 -2525 3753 2695 -654 1039 2598 -2011 -5285 -332
903 -332 3186 -709 -3349 229 738 -4175 -5311 470 1755 -3207 -3731 1978 2612 -2360 -1497 2331
919 2331 622 -4251 -2104 3132 2056 -1084 226 1864 -2148 -5498 -1426 2624 1269 -858 1213
934 1213 1365 -2357 -3413 1237 5191 3530 1799 2460 2085 -1773 -1986 1884 4435 2478 863 1073
950 1073 -44 -2602 -2860 1127 2779 478 -795 399 189 -2432 -1368 2518 2839 -427 -1188 1110
966 1110 -435 -2917 -1678 1807 1233 -1792 -653 1238 -816 -3490 -1291 863 -1190 -2582 278
981 278 1740 -1615 -3142 -665 -552 -2488 -2057 1121 885 -2197 -1635 776 -35 -1792 833 3589 2055
998 2055 -253 120 1501 -108 -1199 1070 1992 467 -1490 -1067 -1137 -2777 -2014 -59 183 -780 -1315
1015 -1315 133 -552 -1554 -319 1467 1315 -450 -926 -798 -1230 -2447 -2095 -482 -1295 -2752 -2909 -2849
1032 -2849 -3068 -3345 -2751 -1590 -1092 -1334 -468 -603 -727 -1323 -273 73 -188 -830 -490 -1203 -2164 -2849 -1808
1051 -1808 -1471 -1808 -1771 -1994 -1805 -2354 -2375 -1312 -324 160 342 295 180 -378 -496 -113 -45 162 4 -357 -1146
1072 -1146 -1712 -1398 -1196 -1234 -1061 -1044 -1391 -1814 -2373 -2337 -1837 -1457 -1165 -1382 -1315 -1440 -2123 -2310 -1956 -830 -385
1093 -385 12 1077 713 468 576 1151 1243 1710 2271 2185 1699 1252 993 795 759 1146 1060 1172 -397 -280 -159
1114 -159 -241 -20 875 1997 1798 1280 1364 1374 1456 1546 2170 2270 1987 1974 1835 945 847 1049 1489 1289 629 613
1136 613 408 -162 -885 -373 480 349 -308 -495 -690 -1589 -2000 -2112 -1425 -924 -899 -1032 -1244 -1312 -1061 -1060 -565
1157 -565 166 473 1095 887 411 382 1071 863 322 838 1240 277 -803 -1048 -845 -878 -1192 -997 -415 -1069
1177 -1069 -1827 -1651 -1335 -2194 -1615 -520 -240 -1086 -1328 -290 -645 -1002 -498 684 701 -487 -937 -284 -452
1196 -452 -1009 -314 767 492 -787 -1246 -766 -905 -1582 -919 -620 -557 -1211 -988 -428 -726 -999 -913 245 401
1216 401 -989 36 1609 1057 -273 786 2555 1483 489 1892 3201 1465 37 1998 2898 1083
1232 1083 598 2353 2799 -529 -1203 525 480 -1904 -894 1154 -716 -3423 -2010 194 -1198 -2165
1248 -2165 110 1867 -693 -2417 510 2191 503 192 2941 2359 -900 -2189 888 659 -1632 -894
1264 -894 721 -587 -3595 -2584 -648 -1510 -2942 -1587 -90 -1833 -3423 -1108 1659 666 -1183 375
1280 375 1668 -88 -1685 1244 3161 1183 -994 1131 1630 -485 -978 2255 2817 -894 -2294 -233
1296 -233 245 -2692 -2158 1449 726 -3709 -3903 -686 -667 -3396 -1686 1800 -365 -3625 -1920 1773 1246
1313 1246 -737 1445 2819 -304 -2658 -66 2098 904 -402 1162 1209 -1920 -2996 425 1897
1328 1897 -358 -1226 223 -513 -2331 -1413 2131 3092 148 -1210 -42 -54 -1949 -850 2879 2733 -763
1345 -763 -2568 -335 116 -1276 760 4223 2360 -1918 -1373 1820 653 -1331 2105 4699 -554 -5061
1361 -5061 -2222 1356 -2775 -4296 377 1357 -5101 -7224 -663 1031 -3317 -3267 2125 356 -5450 -3148
1377 -3148 4337 2830 -2309 93 4059 -625 -5255 552 5382 897 -3478 -64 2079 -3056 -4188
1392 -4188 2562 4741 -1195 -3591 -454 54 -3580 -1719 4333 3569 -2381 -3825 -397 -227 -2093 582
1408 582 4897 2411 -3018 -2880 334 386 -679 2467 4780 564 -4213 -2521 1114 4 -1799 1241
1424 1241 2826 -1965 -5892 -1940 1662 -460 -2130 1135 1782 -3337 -4136 1878 3709 -607 -815 2600
1440 2600 1032 -3803 -1322 4595 3119 -2176 -1086 2664 -323 -3081 1074 5460 1421 -3162 -1193
1455 -1193 1668 -201 -1485 3555 5091 -125 -3874 -1080 858 -730 -385 3646 3399 -2508 -4922
1470 -4922 -1128 1468 -349 224 3549 2064 -4168 -5168 45 2431 -330 176 3052 1023 -4963
1485 -4963 -4224 1872 2328 -1749 -523 2581 -204 -4784 -1216 4343 1887 -2517 267 3059 -1500
1500 -1500 -3824 1779 4922 -251 -3283 1266 2495 -2206 -2197 4339 3354 -2864 -2922 2433 1761 -1608 706
1517 706 5065 1410 -4017 -1657 2822 1455 -1172 2386 3839 -1479 -4970 -957 2481 -106 -1036
1532 -1036 2224 1615 -4338 -5704 -535 1862 -541 -563 1872 552 -4054 -3628 1798 2496 -130 336
1548 336 2402 851 -3027 -1346 3441 2357 -979 -69 2628 -445 -3237 -97 3479 814 -2488
1563 -2488 -622 2044 -499 -2490 972 3011 -345 -2157 1032 2580 -207 -924 1937 1498 -2423
1578 -2423 -2094 1681 1869 -901 -17 2149 107 -3302 -1428 2560 1927 -327 -298 911 -1394 -3684
1594 -3684 -1121 1811 779 -1103 -807 -760 -3103 -3814 -1088 1371 -170 -1530 -556 -459 -2315 -1943 1431
1611 1431 2274 532 -546 1166 945 -1107 -810 2111 2737 -45 -1128 1088 530 -2012 -1343 957
1627 957 416 -1892 -1588 469 -1042 -3258 -2215 324 -1657 -3234 -986 499 -1712 -3196 -688 558
1643 558 -1914 -1594 1348 2082 -777 -1465 783 611 -1436 -902 1819 759 -1730 -2158 -1265 -1942 -3341
1660 -3341 -1342 581 -520 -2269 -1681 -1008 -1447 -1344 789 2186 1366 -39 781 1668 883 725 2680
1677 2680 3133 1362 413 840 990 67 212 1486 2347 634 389 584 389 -663 278 1251 1117 251
1695 251 186 651 -406 -1119 -49 1161 712 -230 339 743 -495 -894 577 1789 1153 907 1497 1460 141
1714 141 -357 419 923 593 689 699 -60 -1244 -1314 -860 -735 -740 177 601 -288 -1125 -1227 -147 182 538 1309
1735 1309 1241 513 -669 -1041 -249 93 383 642 798 280 -678 -1112 -1411 -608 -424 -130 -285 -953 -1787 -2490
1755 -2490 -2301 -2042 -1872 -1124 -572 -1623 -2565 -2531 -1861 -1508 -1275 160 480 254 -439 -560 -537 -672 109 1059
1775 1059 1558 919 96 -503 -926 -1301 -197 361 605 185 153 -578 -1311 -946 162 913 1277 1429 741
1794 741 -29 -435 204 892 1748 2253 2347 1755 1011 95 554 739 1025 2531 1768 1586 489 -552 -702
1813 -702 -127 46 672 1190 359 -828 -1726 -1272 -972 -546 284 714 463 -219 -815 -927 -539 351 1303 2060
1833 2060 1876 1346 490 -152 -50 703 1158 1786 1330 496 -412 -805 -1336 -963 58 504 557 -283 -1251 -1361
1853 -1361 -1657 -833 78 562 780 253 -2 -1197 -1241 -791 205 876 1040 444 -26 -952 -1628 -1588 -601 2
1873 2 12 -237 -684 -1296 -2131 -1806 -840 99 -89 377 -10 -1009 -1626 -1183 -158 197 458 1324 1141 -172
1893 -172 -1321 -324 45 216 916 1953 1675 -324 -830 419 389 205 1226 2505 1261 -268 -368 465
1911 465 144 129 1284 2145 659 -839 -489 -618 -998 -782 1181 1398 267 -148 106 -327 -1206 -606 1415
1930 1415 1303 292 56 -125 -332 -1433 -768 857 841 520 -115 210 -966 -1703 -926 552 664 218
1948 218 473 335 -1510 -2241 -834 468 140 154 1029 947 -993 -1731 83 1157 713 498 1762 1153
1966 1153 -1043 -1660 41 446 -254 499 985 -444 -2776 -2013 -598 -641 -1021 333 1376 -502 -1914
1983 -1914 -895 340 -700 -547 752 1221 -303 -1647 -759 179 -1002 -1525 132 1027 -910 -1673 -429
2000 -429 -147 -1089 -1500 1103 1862 288 -410 1253 737 -1606 -710 2216 2281 -72 -159 1476 343 -2297
2018 -2297 -919 2478 1544 -943 74 1514 -713 -2388 226 3114 822 -684 806 1137 -1872
2033 -1872 -2411 1273 2741 -306 -838 1244 -81 -3185 -2178 1401 1443 -1206 -699 1391 -425 -2948
2049 -2948 -1030 1354 29 -1264 -148 996 -806 -2692 -363 1553 -538 -1498 794 1722 -621
2064 -621 -1064 430 1269 -267 -1113 2052 2591 -343 -957 1263 1030 -1756 -830 2771 2002 -1144 -1264
2081 -1264 1166 260 -2387 -1 3395 1990 -1592 -723 797 -846 -1918 948 3653 1132 -1456
2096 -1456 -27 327 -1775 -2181 1548 3175 -51 -1548 46 283 -1993 -1096 2450 2710 -542 -1476
2112 -1476 860 57 -2144 -301 2336 1557 -842 -291 1495 268 -1664 -299 2306 1040 -949 406
2128 406 2513 476 -1254 -82 1965 183 -1007 1330 2435 -177 -2114 -79 1352 -708 -956
2143 -956 1995 2445 -1429 -2620 180 586 -1445 -300 2920 1937 -2509 -2915 215 -324 -2458 -227
2159 -227 3039 506 -3695 -2531 498 -968 -2288 1136 3183 -544 -3414 -1016 788 -1381 -1289 2490
2175 2490 2761 -1159 -2090 513 925 -1522 -659 2752 1800 -1458 -1050 1496 367 -1439 -578 2324 1020
2192 1020 -1349 -166 1995 99 -2223 -333 1839 541 -936 795 1767 -836 -2370 -509 1185
2207 1185 -203 -554 1437 1188 -1838 -3211 -193 992 -540 -187 2418 1306 -2615 -2157 288 1088
2223 1088 -468 1044 2734 399 -2837 -1553 1102 349 -809 1485 2313 -467 -2924 -785 1056
2238 1056 -237 -265 1834 2062 -420 -1983 449 1161 -145 -101 2220 1991 -401 -1247 630 827 -905
2255 -905 -515 1365 1302 -1012 -742 484 -327 -1782 -780 1195 527 -1063 -713 681 -983 -2464 -642
2272 -642 1565 624 -705 71 730 -1048 -2535 -128 1983 746 -187 912 771 -1919 -2396 573 1478
2289 1478 466 -89 1426 14 -2125 -1354 1163 1508 -21 1320 2062 93 -1553 -372 1824 1106
2305 1106 137 1084 1764 -429 -1771 -623 748 -237 -448 983 1040 -1185 -1394 -230 325 -807 -577
2322 -577 1114 917 -1092 -1280 -79 -221 -1274 -293 1115 734 -794 -1295 -340 -717 -1578 -372 1257
2339 1257 700 -484 -103 -151 -1086 -844 491 1640 854 -177 232 133 -1073 -1049 549 1556 457 -175
2357 -175 520 -164 -1189 -542 1100 1156 394 593 813 28 -715 -272 1240 808 -27 103 -1 -804 -1334
2376 -1334 -491 92 125 -115 297 308 -869 -1138 -598 49 -23 142 187 144 -655 -1035 -420 -458 -261 427 640
2397 640 490 57 -294 -84 354 419 1094 1499 940 -83 -88 144 -137 -75 481 1216 357 -280 -594 -605 -108
2418 -108 -149 447 836 472 -499 -433 -98 -538 -144 853 720 396 -282 -220 -404 -891 -202 838 685 -112 -232
2439 -232 -411 -873 -1188 -340 265 482 -157 -218 -760 -777 -947 -288 83 138 427 -38 -328 -759 -748 254 625
2460 625 619 819 674 97 -180 -330 480 942 759 870 699 208 -382 -758 -78 241 456 867 174 -281 -65
2481 -65 -777 -195 38 675 744 623 -194 -139 -523 -176 44 705 736 292 -223 -522 -729 -642 -284 287 256 460
2503 460 95 -535 -594 -721 -276 308 446 362 157 -140 -441 -573 13 711 658 373 611 41 -384 -353 -31
2524 -31 458 1006 956 313 75 -189 -462 -292 21 897 1027 280 -5 -8 -242 -581 -87 214 325 460 -420
2545 -420 -468 -1077 -969 -377 141 -113 153 -353 -796 -1159 -596 -493 95 318 735 137 -417 -1173 -861 -8
2565 -8 112 353 848 243 -430 -502 -664 10 106 428 1055 298 -340 -645 -339 -321 367 940 1201 676 -79 -350
2587 -350 -518 41 -135 802 985 399 17 -142 -917 -571 -56 508 723 247 -483 -567 -616 -1042 -880 163
2607 163 713 -124 -309 -210 -777 -1025 -499 602 880 559 60 -135 -456 -827 -45 438 276 -41 670 128
2627 128 -626 -829 -75 755 385 522 873 636 -466 -657 408 857 543 633 811 413 -473 -737 -251 -241
2647 -241 -15 786 633 116 -657 -906 -354 -317 -124 344 728 -17 -753 -580 -226 -360 -312 703 1095 -68
2667 -68 -913 -695 -238 -605 -700 436 898 -118 -768 -410 -74 -564 -252 824 1005 271 -168 320 -26 -862
2687 -862 -263 1282 795 140 578 1010 126 -717 505 1407 803 216 1017 1021 -620 -709 280 898 128 499
2707 499 985 19 -1125 -1262 -69 341 -421 3 842 108 -1339 -1118 497 32 -216 198 797 -238
2725 -238 -1443 -634 61 -77 -643 468 857 -776 -1595 -326 272 -207 -369 723 778 -532 -858 -62
2743 -62 156 -864 -389 639 573 -701 -481 819 272 -583 -80 1190 611 -474 163 946 271 -699 34
2762 34 1292 169 -647 130 398 -472 -999 34 397 -267 -500 362 -46 -1306 -1090 139 578 -94 -193
2781 -193 282 231 -1141 -890 572 961 -94 394 650 88 -1026 -628 867 758 133 299 956 52 -830
2800 -830 -150 1205 446 -15 525 742 -362 -974 204 1295 -86 -636 593 922 -687 -872 783
2817 783 720 -136 -160 1265 1032 -687 -480 892 296 -710 80 1022 184 -1357 -549 305 -966 -1626 -371
2836 -371 364 -584 -1435 -574 -449 -1372 -1515 389 806 -117 -780 89 108 -972 -437 948 1042 -82 -340
2855 -340 806 56 -1042 173 1368 1068 -397 -267 498 -582 -1253 -212 1092 182 -587 229 275 -305
2873 -305 -974 442 1012 52 -290 567 555 -506 -187 745 824 -297 -226 1105 266 -1069 -472 843 415
2892 415 -805 -428 539 -42 -1267 -591 449 -226 -518 117 772 -28 -710 -153 292 -384 3 765 1186
2911 1186 713 -96 353 666 21 458 1092 1194 122 -348 520 525 -150 -188 888 999 -566 -387 379 -21
2931 -21 -627 -156 848 355 -668 -1056 96 -519 -750 -44 730 -47 -664 -166 387 -607 -941 356 860
2950 860 -286 -653 324 411 -708 -690 223 275 -625 -535 183 -261 -1128 -740 -60 -159 -695 -55 478 -105 -784
2971 -784 -81 330 -4 -184 801 1124 -64 -673 167 781 -27 265 551 652 -344 -863 -298 -66 -178 36
2991 36 426 164 -806 -479 -115 -122 -338 -87 730 -133 -655 -244 61 -51 -273 200 733 487 -607 -333 280
3012 280 -182 -369 432 692 147 -233 151 103 -532 -108 323 290 -4 -196 238 129 -477 83 642 316 218
3033 218 480 744 396 -5 329 683 578 365 213 585 -30 -361 57 267 -1 106 351 116 -620 -610
3053 -610 -494 -272 52 -50 236 38 -501 -760 -581 -264 -241 -53 137 394 -404 -384 143 159 -231 111 383
3074 383 360 -93 -379 -140 -57 56 -81 455 291 -39 -95 -37 -134 -102 145 366 170 22 81 138 -47 -148 406
3097 406 537 -333 48 36 -110 -237 71 459 154 22 -5 -174 -610 -361 -279 -61 -8 121 105 -308 -658 -726
3119 -726 -306 101 -460 -107 8 -472 -521 -361 -252 -34 78 181 219 -85 -59 -254 62 116 261 409 266
3140 266 261 47 -89 269 210 285 16 222 -82 -283 -68 -25 69 -75 82 316 -32 -437 4 -92 -189 105 5
3163 5 16 -30 -8 59 94 3 75 -144 -180 -113 224 -529 -434 -397 -229 -133 23 -216 -73 -244 -367 36 64 450 -77
3188 -77 118 68 59 -236 104 192 250 407 45 -15 129 -123 -90 138 -45 88 329 73 -7 284 330 342 464 76
3212 76 70 -76 68 -50 -20 166 129 96 -95 -423 -379 -383 -108 -417 -83 -200 39 -39 -548 -304 -164 -31 -34 -303
3236 -303 33 364 -245 -105 33 -171 -92 76 285 280 -145 91 58 -118 252 201 279 96 -134 147 -82 -13
3258 -13 35 269 392 39 74 -134 75 121 57 433 552 175 121 378 -119 -91 209 150 18 -127 125 -79 -552
3281 -552 -292 -87 -222 -137 -291 -140 -192 -422 -50 -1 -93 -424 -190 59 -140 -368 -119 -65 40 95 72 87 -31
3304 -31 -191 336 519 518 101 149 304 -71 165 55 278 235 99 181 160 114 -415 -233 15 76 -68 -47 -73 -51
3328 -51 -91 -164 463 -79 -29 -51 184 -23 -233 -234 -193 -188 13 226 290 -324 -255 -156 -288 -255 -213 322 144 -422 -241
3353 -241 24 91 -208 6 105 87 -596 344 144 -162 -159 317 676 -27 319 426 316 -371 229 546 713 78
3375 78 206 705 60 -219 45 64 226 -468 51 49 78 -364 -520 121 -222 -163 305 252 -43 -731 -181 187
3397 187 296 -400 86 367 -553 -504 139 92 -359 -265 463 127 -430 -560 39 325 -390 -200 111 -236 -369
3418 -369 -139 61 116 -386 252 367 -214 -235 405 332 -100 -228 322 814 41 41 637 314 -560 -371 -104 322
3440 322 18 -101 71 270 -348 -467 121 5 -275 -133 187 -238 -617 -339 248 179 -87 -157 348 -454 -526
3461 -526 -198 374 -233 -680 85 327 -182 -434 260 365 -115 -164 335 283 -197 -376 566 680 -66 224 529
3482 529 487 -185 -238 819 130 -376 -172 679 301 -513 200 239 -48 -448 4 349 16 -315 351 193 -381
3503 -381 -711 178 175 -411 -219 88 49 -706 -691 225 346 -416 -504 -220 -121 -766 -533 184 6 -565 -186 421
3525 421 -231 -421 -87 689 228 -353 148 440 -335 -301 282 730 -51 -116 -72 253 -105 -194 311 149 -580
3546 -580 -292 215 648 -340 -169 491 402 -570 -259 544 22 -273 -234 320 -19 -865 -141 196 -127 -627 -147
3567 -147 140 -389 -660 44 553 -293 -470 -161 234 -522 -308 209 412 -147 -271 240 452 -149 -120 580
3587 580 379 -353 -123 224 109 -118 -14 457 -184 -123 -183 675 111 -362 179 514 213 -222 205 657 77
3608 77 -108 43 455 -224 -88 153 386 -42 -149 72 -7 -413 -324 287 208 -396 -348 361 -304 -329 -191 217
3630 217 160 -243 -52 227 -289 -624 77 163 -198 -247 139 525 -59 -77 306 376 -288 -345 165 311 -99 -193
3652 -193 308 467 -97 -149 822 244 -408 105 333 -6 -536 73 611 235 -218 -12 139 -93 -451 -63
3672 -63 287 35 -353 -264 64 -462 -585 -58 177 -467 -52 -122 -81 -518 -196 177 131 -337 -355 342 283 -546
3694 -546 -178 65 28 -178 -203 280 155 -431 -26 407 158 38 101 510 191 160 496 392 263 -24 226
3715 226 228 11 -227 129 -109 -50 -241 215 215 276 -482 23 -211 -120 -37 52 -54 -538 -295 -295 -63 -385 38 31
3739 31 486 -53 -132 423 214 -286 24 161 -251 -167 47 142 -121 135 -32 248 45 -219 140 83 241 106
3761 106 347 227 160 69 66 370 -137 367 201 110 -144 241 -9 43 -319 60 164 -310 -197 21 239 -33
3783 -33 -361 -132 54 -179 -332 -35 81 -6 117 -99 -39 -235 -193 228 -48 -204 3 -493 -247 -211 41 -135
3805 -135 187 -222 -62 88 -138 -90 -201 -39 46 109 33 575 -70 395 567 163 100 354 12 81 33 182
3827 182 77 156 -25 -218 413 121 -259 -416 83 48 -301 -224 31 1 43 -308 -349 -54 -130 -136 -30 -227 -105
3850 -105 -127 43 -218 183 -6 23 -281 -223 -229 85 51 -85 -254 -4 226 -208 153 132 86 57 174 71 -117
3873 -117 172 253 193 71 333 269 67 256 334 193 467 299 164 -123 -198 -126 -67 -59 -27 18 175 147 119 111 151
3898 151 5 87 -192 -130 198 -263 -229 -139 -206 -136 2 303 -135 -69 -276 -69 -119 -113 7 17 -91 -217 -86 218
3922 218 -81 129 16 228 238 -69 19 122 48 -24 272 305 73 182 201 160 -218 -223 175 -254 118 12 16 -137
3946 -137 -102 -235 22 -378 -143 -95 72 -173 -198 -69 65 -373 -44 -16 -100 59 -186 -58 285 -49 216 6
3968 6 -67 -367 -330 59 137 -64 -187 183 170 165 -230 298 4 224 204 410 17 -147 122 -12 -82 -19 0 322
3992 322 32 -52 159 55 326 93 16 159 -51 -182 137 68 -148 -53 374 199 -31 -194 -68 22 -274 -327
4014 -327 161 -122 40 21 -16 -193 -173 -201 353 68 -60 -98 -46 100 48 76 264 319 126 -46 -254 61 118
4037 118 206 330 -18 183 55 -217 -29 -152 332 -165 -10 29 -21 133 -91 -88 285 161 31 110 308 19
4059 19 6 21 359 -247 -495 -62 -59 -47 -151 172 -310 63 175 109 -144 -114 -174 69 -179 -410 -31 198 -90
4082 -90 -226 -87 -52 128 -130 89 58 131 107 105 311 -219 -36 162 311 24 46 44 318 78 -343 289 252 286
4106 286 77 -95 296 81 37 254 134 61 -124 -15 -224 -126 10 90 -140 -170 1 -259 -24 -179 -95 145
4128 145 10 -119 -50 239 19 -530 193 429 -364 -246 420 -78 -157 -599 -172 242 35 -98 195 282 -451
4149 -451 -227 -40 -49 -268 191 452 39 -45 -170 -245 -44 -67 414 350 160 111 -228 45 18 -15 329 421 -72
4172 -72 -205 -359 161 -99 -270 78 126 -332 -157 69 -59 -337 236 -112 -218 -393 -267 183 150 -111 53
4193 53 163 -279 -96 -157 325 -209 -346 -27 274 -72 -214 227 578 -79 -336 269 124 150 259 471 367
4214 367 -23 -84 178 28 147 156 335 -25 -268 -280 136 29 111 403 -13 452 -359 -334 321 -109 -199 321
4236 321 -192 -45 -66 121 200 -125 -168 -86 153 -412 -843 65 242 106 32 137 340 -50 14 241 481 12
4258 12 -259 123 224 -151 59 291 84 -387 -48 -90 -34 -473 -147 163 290 -309 198 167 122 -159 26 237
4280 237 -19 -170 124 153 0 133 287 -86 -327 -390 83 158 -210 -274 -182 183 -348 -280 308 -34 -2 449
4302 449 -146 -296 -341 -377 -11 -289 -145 -177 124 -331 -328 24 61 63 -118 525 47 103 -129 266 -52 12 405
4325 405 61 161 -449 16 208 200 -154 14 256 79 -153 207 173 -133 -185 101 133 36 9 -18 -79 -463 -329
4348 -329 -90 173 -188 -121 -3 -98 -399 96 27 358 -130 -231 -167 -455 -678 -324 -163 -3 32 -174 155 -109
4370 -109 -234 -297 440 169 88 -238 -208 -220 -38 -40 242 40 135 19 -29 42 -227 191 161 113 30 170 -58 -15
4394 -15 -107 104 -46 -311 -392 -171 -216 -213 -334 -130 -252 -49 -271 -112 14 -331 -80 -248 -159 -177 91 126 136
4417 136 -201 -237 287 -79 -109 -95 15 23 -125 -126 -161 -51 -214 44 13 101 -229 203 -155 -264 -235 395 426 234
4441 234 -182 450 -48 -224 456 235 256 73 176 190 115 -36 -110 193 80 -170 210 -16 -350 -42 -9 39
4463 39 -327 -240 128 -137 -26 -122 -131 -118 -93 -172 291 -330 -251 88 195 256 17 255 81 -60 -153 -318 -68 203
4487 203 -299 125 282 180 -169 -44 258 -51 -94 242 174 -506 322 -177 221 51 -1 488 53 -201 -274
4508 -274 51 120 184 16 220 -114 -9 -164 -54 -112 -147 -240 -1 -365 123 -254 -147 -153 -3 75 -282 -202 -183
4531 -183 -74 -211 -386 30 13 -95 -7 -136 -31 -84 49 -88 -62 -58 113 217 188 -71 85 -521 95 111 124
4554 124 -207 130 37 43 -190 -9 295 196 175 180 -90 -170 -37 85 -211 -131 -170 271 242 -192 107 -145 169 -140
4578 -140 -71 64 -107 76 -121 -11 117 -29 164 -141 -17 -590 -73 263 -109 -242 311 -96 -22 62 -172
4599 -172 -199 -242 -175 104 300 -25 117 -225 -89 146 -17 -262 40 -65 112 -5 -86 9 315 -97 233 -81
4621 -81 -297 -211 -100 -135 110 250 -87 -76 -33 0 -12 235 -21 -40 -88 -10 -48 85 -176 -332 -92 -270 -104 1
4645 1 -113 -141 -247 205 113 -241 94 -67 376 -298 151 -6 398 71 241 49 405 -109 56 52 -120 9
4667 9 -125 -6 -110 11 -39 109 -209 394 87 17 -136 26 -1 0 240 -152 220 37 203 -53 -8 -47 88
4690 88 -68 -46 349 -163 -221 -178 -281 -53 -21 -157 53 -109 -2 -104 -209 26 116 -217 -28 221 160 -280
4712 -280 201 217 112 -16 196 272 297 -61 -104 247 -76 -130 176 -55 2 -182 -65 53 127 -144 144 156 -49
4735 -49 122 -73 62 11 41 -129 77 -318 -271 -409 -136 -107 47 -200 -51 345 48 -421 -153 78 -322 -114
4757 -114 -84 -104 288 226 -235 15 157 363 161 -26 -132 89 -59 -10 144 -94 145 -48 -146 43 279 142
4779 142 -49 201 51 282 194 125 76 -1 -112 173 273 197 58 -60 -63 -262 -110 -171 44 178 -111 -67 -272
4802 -272 -401 64 151 -230 -285 -74 -217 86 27 -141 197 98 -44 185 -43 -200 28 -50 -8 -19 92 -279
4824 -279 389 -102 68 -41 34 369 431 111 257 -200 125 -20 -128 99 2 173 278 81 16 -51 61 25
4846 25 -62 321 -77 140 -127 -193 -225 -263 -102 153 92 206 -100 -260 -162 189 -172 -112 -187 -4 46 -290 -319 -84
4870 -84 490 -113 -188 -112 230 96 50 268 61 -38 30 -236 206 -151 -57 190 262 -256 -57 -19 -71 118 221
4893 221 -42 -109 -36 33 -37 124 -208 -82 -187 15 -41 -14 228 51 29 -248 -205 18 -168 -28 -270 -159 -300
4916 -300 -121 -288 -159 68 -307 189 -100 -192 -59 -235 -168 -145 83 -160 132 -5 -59 -198 -149 20 -67 -244
4938 -244 259 -77 -477 31 92 86 296 76 20 110 -206 48 177 3 -155 -25 21 292 -62 59 -107 -66
4960 -66 -223 160 -215 -36 -164 84 -259 -60 60 86 90 -104 30 18 -152 -264 -128 304 228 -234 -337 -331 -216
4983 -216 71 -105 129 -9 32 71 -194 -4 -63 258 -144 156 228 192 -24 -128 128 -11 243 442 36 131
5005 131 128 -145 -331 -72 309 -6 -199 236 168 235 167 -108 -117 -108 211 -103 199 -99 -103 20 -226 -7 -123 258
5029 258 -222 106 -357 -204 -321 -119 -41 -94 -121 -100 214 -184 -7 131 -25 139 -84 -10 263 -105 170 116
5051 116 372 29 -47 -37 120 261 72 109 243 299 79 -90 -42 -38 158 149 -103 147 65 15 85 -294 -192 -110
5075 -110 -1 -20 -82 13 -234 68 72 -253 -152 264 -305 -66 -66 -6 -51 204 -144 26 49 36 116 199 -189 -4
5099 -4 28 192 16 206 -3 -195 107 95 269 106 134 278 -267 106 -253 -222 -132 221 90 79 241 -186 139
5122 139 232 -161 -155 -23 286 405 153 189 35 143 -131 -78 -73 -204 -174 -97 -11 -135 -243 -176 81 -89 -131 170
5146 170 33 64 416 -16 -118 -95 144 -27 -181 -299 -76 76 -26 109 30 -339 -272 -4 5 180 37 283
5168 283 86 -386 28 3 62 -24 131 335 177 164 -44 -92 155 -300 115 -83 162 -161 -117 151 73 -17 128
5191 128 -165 -53 -208 -145 -64 200 -46 -164 -60 -154 25 -33 250 -156 -216 -61 -205 22 -29 -328 -33 -117
5213 -117 57 191 134 -100 -114 109 217 162 -26 116 246 221 107 -163 94 210 72 108 173 104 123 80 136
5236 136 -190 82 173 444 50 -120 -75 183 -132 -149 263 55 -8 -33 -146 160 -63 -127 -247 -6 42 -66
5258 -66 76 -94 52 270 -136 -76 7 -274 -69 121 -94 0 73 170 -103 -284 118 -126 -54 255 149 178 150
5281 150 52 15 -113 107 -21 262 -25 80 -50 37 -378 55 -197 -57 107 -53 78 43 6 125 -58 61
5303 61 -74 -16 341 3 9 1 -121 -67 -165 -144 -484 91 -345 -109 -239 -359 -48 -330 62 -200 -196 -59 -275 -71
5327 -71 35 -166 -42 190 85 -106 -67 67 126 -28 -47 -266 -97 -41 -194 144 24 -29 59 49 -49 163 204
5350 204 60 -169 27 50 -27 172 -134 -27 59 14 -169 -39 30 -322 -137 -135 83 -146 156 -96 -89 -142 -374
5373 -374 67 -190 168 252 -192 -101 -152 120 109 87 -39 93 17 68 -3 27 105 316 14 -124 160 1 23 310
5397 310 219 136 -191 156 4 -7 -42 -383 -254 50 92 -28 -4 187 -81 -355 191 -9 165 85 -72 -49 187
5420 187 127 -123 -13 -189 -69 -157 -22 315 -64 -220 -170 -119 270 -191 -219 109 134 -32 297 -265 203 -134
5442 -134 -215 297 156 105 -289 -183 221 44 -30 -51 -75 -79 -18 -50 45 -210 -30 1 97 -19 -109 106 -4 -51 45
5467 45 -22 251 178 25 -215 -65 -215 -237 -177 66 -2 -87 95 -104 -179 -2 200 53 92 -154 -58 -285 78
5490 78 -2 -55 180 47 -18 45 204 1 49 15 -16 188 99 -126 50 242 9 103 -75 283 -88 -25 -13 148
5514 148 -49 -106 -53 27 98 95 -125 -279 -91 205 -1 148 193 138 -216 -56 186 -91 101 280 41 -358 -72
5537 -72 135 50 -319 -7 -52 -117 -22 -12 140 5 -246 155 273 54 -178 331 265 480 369 -24 9 -157 176
5560 176 -111 182 293 202 201 64 -173 133 -220 -243 425 101 93 -199 -156 -75 -13 133 -28 191 107 -184 -106 224
5584 224 14 27 -218 -26 -19 18 59 4 153 -302 -183 -6 -165 38 119 51 -188 -296 -38 111 -121 -188 154
5607 154 -23 85 74 -189 279 379 82 -150 71 -164 222 -102 -118 -44 313 26 -212 85 213 228 277 31
5629 31 79 48 79 73 -22 35 335 310 -52 -209 -248 -153 -75 78 -27 -39 -28 -76 -55 106 181 127 121 -160 34 38 -130
5656 -130 -84 118 231 -42 -321 -68 65 16 -7 -285 -151 -209 214 97 393 228 -166 -517 -167 101 -498
5677 -498 477 7 89 100 -15 61 -230 100 -114 -160 -151 -148 56 -39 6 186 260 -219 -276 -50 131 -95 -144 107
5701 107 133 -140 -252 7 145 -375 -114 31 137 -208 -58 40 -189 -270 42 168 1 -187 35 144 -159
5722 -159 50 57 -268 -188 211 -78 43 90 -134 -21 94 109 -179 -159 -27 -64 -77 -404 62 -155 175 35 60
5745 60 32 -41 -23 -74 -57 197 82 -284 -188 -136 -239 34 -95 -172 -48 50 -372 -36 128 74 29 -136 -258 -171
5769 -171 -178 -119 115 -156 -157 95 -256 295 -197 -185 -127 291 150 -42 -147 94 113 -77 81 47 -191 -120 115
5792 115 -164 148 -58 265 -68 186 105 -4 36 -66 167 81 -214 -140 32 -264 186 266 25 -55 -187 -193 40
5815 40 -182 2 48 -203 -189 -151 -249 -247 -102 -303 37 -190 73 -48 79 54 47 -163 137 -166 -37 -30 83 -103
5839 -103 5 160 -233 -9 28 423 -454 -322 138 193 -180 71 356 204 -123 -30 -3 23 -47 -224 40 284
5861 284 47 -184 46 -35 113 -79 81 28 -448 -139 -59 7 -63 -2 -60 383 290 117 118 -177 -82 223 -99 -86
5885 -86 -14 59 226 -87 -104 -78 -52 -87 209 35 181 -117 146 -6 355 12 -193 183 209 241 22 273 190
5908 190 -203 151 17 -116 -62 70 15 179 -191 223 -119 -223 -106 241 -41 39 -4 -265 -333 -230 124 -35
5930 -35 252 -412 94 269 29 -199 -4 -209 86 -36 -172 20 -17 251 -336 95 -43 -116 -166 -287 -77
5951 -77 -231 1 -44 113 151 72 128 57 127 44 48 40 -86 194 22 1 148 -152 -151 77 208 -45 -295 31 -93
5976 -93 85 -68 -207 -147 -213 -193 -381 -139 -206 52 74 -156 -265 -33 300 -34 -65 -352 -37 76 10 14 148
5999 148 -38 -91 -146 49 164 -186 87 82 -294 -77 -272 -11 256 282 163 364 -56 -22 40 51 -29 -86 161
6022 161 83 -15 198 181 -215 358 226 -197 77 -82 171 -54 116 -143 115 33 -9 -264 -89 -65 58 133
6044 133 -33 3 159 -169 42 -59 -125 253 209 -227 354 -43 106 94 -94 -38 -278 -15 286 -68 -367 -104
6066 -104 159 382 16 2 -3 101 156 -207 -13 -68 44 238 -66 85 153 56 36 -2 -32 -102 7 207 43 92
6090 92 103 -135 134 -26 -66 8 -71 86 -228 88 -6 144 165 158 -9 -138 -135 -43 333 -354 -103 -18 -241 -187 -34
6115 -34 101 35 234 41 206 113 -12 -365 -165 166 -135 40 -30 386 -38 82 108 -92 -213 159 87 288
6137 288 74 -83 11 -86 65 97 -177 206 35 74 -208 -58 157 28 35 -25 -33 -137 -103 89 -37 -187 -131 -209
6161 -209 -244 -482 16 130 -118 -165 -46 -109 -3 105 -275 -313 -211 196 158 202 -360 98 -227 107 257 -193
6183 -193 -53 267 -44 27 -99 181 193 -67 23 114 -73 89 292 -146 223 -48 338 -69 -237 71 230
6204 230 -150 250 -11 -223 22 108 -303 79 57 40 -194 -293 132 108 89 -261 -35 94 -174 -367 32 185
6226 185 -391 76 29 -81 -133 24 -299 188 76 -50 41 -344 122 246 97 84 100 -220 428 -147 -199 147
6248 147 18 423 32 -89 202 -267 107 408 40 17 247 20 -49 -67 -32 -67 -65 -206 -253 -61 -48 -136 -194 -76
6272 -76 -55 -180 -362 -128 171 -60 -84 156 39 -3 -120 106 35 360 218 215 -115 -350 135 171 -169 302 20
6295 20 -126 -164 37 163 263 192 132 -22 89 -2 -301 244 25 50 185 -24 304 12 -278 -207 9 -74 52
6318 52 -178 -108 178 260 -199 -94 -65 -39 -222 -164 81 -177 176 -52 59 167 -76 23 188 -88 -122 80 161
6341 161 -25 -7 -5 -96 22 349 -106 107 177 224 252 -51 -185 -114 90 4 375 -145 160 63 328 297 136 250
6365 250 65 -164 -296 -159 367 117 282 -163 -58 76 -88 171 -125 -18 194 66 500 6 -187 38
6385 38 -227 414 -83 128 44 -368 -175 -53 -193 -55 -216 -2 -209 8 -100 -98 58 -104 72 -124 -79 -28
6407 -28 283 97 -266 -142 195 336 -108 11 121 97 -75 -82 36 14 158 35 54 76 213 -99 169 148 106
6430 106 -4 -123 228 -31 -160 25 83 -171 21 -35 -192 -382 -176 -87 -58 -4 -63 -341 111 -232 353 265
6452 265 -28 -42 -81 52 -94 -123 118 190 -188 -276 -146 166 -85 -250 -78 21 107 -45 281 12 -186 201
6474 201 -109 -171 60 -21 170 165 -24 100 -123 -79 29 74 -72 -77 -113 -58 3 -152 -56 -282 -181 -206 -58 -39 146
6499 146 -182 -77 -234 159 -2 -123 -59 70 -115 -146 40 -266 236 -101 74 -93 108 128 102 -65 -3 71
6521 71 -1 -78 -43 -272 180 67 -147 147 67 -185 -178 -47 -79 143 46 -36 150 59 -137 130 24 -57 35 43 -126
6546 -126 52 -97 251 -75 70 -155 -154 86 27 -246 37 -360 31 -87 -38 84 -170 -67 50 46 24 68 205
6569 205 31 14 36 -75 -48 211 -207 -37 -2 -43 -114 -6 74 276 558 -38 70 -300 207 223 78 40 138
6592 138 -610 -254 108 1 18 -155 50 -76 165 44 -188 1 -200 -130 -80 -312 -3 -183 294 24 -64
6613 -64 -259 -89 -145 -39 167 93 43 -93 127 57 -121 -93 -103 -277 -14 -35 -133 -26 161 223 30 -205 43
6636 43 -101 -105 -58 139 169 -95 122 -19 -201 83 60 -33 -13 -171 12 -106 170 4 29 -247 -43 -63 -117 289
6660 289 50 95 126 -41 51 -408 -165 67 -16 -166 42 202 0 82 116 255 89 10 23 153 -172 155 -82
6683 -82 -82 -83 11 129 -4 7 250 -271 -177 -245 -295 68 9 157 -232 401 -100 -127 160 -53 44 40 243 -211 155
6708 155 3 159 45 116 -244 -40 106 -247 -94 87 112 -155 -198 15 60 50 -106 -423 47 -180 108 74
6730 74 12 82 67 66 146 150 -6 51 -79 -111 -349 124 133 139 74 73 -94 -189 -78 236 -94 -179 98 18 -24 -161 295
6757 295 135 125 19 -333 14 -187 -104 120 78 130 -361 212 273 -106 -68 -9 6 21 -224 104 -157 -186 -53
6780 -53 -106 105 85 131 -231 78 -109 151 59 -80 79 184 -68 -144 -100 -431 104 -26 -140 9 -169 155
6802 155 333 126 3 121 174 -110 246 16 116 121 -127 -30 27 -171 36 132 -39 92 16 -43 10 -35 -148
6825 -148 59 -264 -306 -163 -102 161 -50 -234 -46 4 -194 -46 -165 -165 113 -334 33 -186 -126 -73 -130 20 -3
6848 -3 17 -257 36 188 -91 80 -110 -276 -154 -91 116 128 -41 -229 115 332 -68 111 56 28 125 -28 -1
6871 -1 104 -219 -16 -35 -36 -253 -413 -21 210 -9 -249 184 131 193 -44 -36 -23 -65 112 -53 -159 291 -123 -123
6895 -123 -129 179 -120 286 -42 71 -15 165 -356 -319 -122 -12 197 -397 -220 -153 77 -183 -252 163 45 -38
6917 -38 50 236 250 7 275 97 -24 74 -25 19 123 -6 133 64 124 -21 162 -227 -57 -47 204 98 192
6940 192 -49 -21 -125 -179 -126 -230 -338 113 -14 84 215 -227 -94 -75 123 247 67 136 -39 -221 -71 154
6962 154 -283 158 51 -21 -11 -228 -115 -166 -368 325 159 -93 -149 87 74 17 -127 -104 -72 -88 137 15 15 240
6986 240 -29 -173 17 126 160 168 -217 -13 94 11 -4 -219 234 -115 -217 140 -78 163 -342 128 42 -150
7008 -150 -21 -95 99 219 -164 -274 -125 40 -100 -229 312 169 -292 -186 -10 304 66 -134 467 371 424
7029 424 121 19 -64 -160 27 81 138 -177 189 20 62 -92 -13 121 14 -130 -47 201 -93 17 262 38
7051 38 -123 -248 131 -186 121 -43 159 381 -211 -60 59 -122 -43 62 65 -224 -195 77 100 209 158 56
7073 56 29 166 -144 -107 222 -109 -65 1 0 177 -241 114 21 -302 -129 -47 -208 -214 17 29 189 -38 -390 206
7097 206 -135 38 -21 33 38 -224 -18 47 130 -68 137 310 59 -361 -212 162 -221 64 -168 25 -231 60
7119 60 -58 -6 165 -72 -55 109 0 -41 115 -71 -15 -127 40 -56 -48 -68 50 369 62 158 115 61 -215 162
7143 162 137 -118 84 365 -137 -28 206 22 33 -191 162 -124 128 82 -56 -181 -81 -14 26 332 88 -133
7165 -133 -119 -76 184 -34 -268 351 -337 176 -62 231 306 -110 261 51 -53 -324 -85 24 171 -190 266
7186 266 -215 -200 320 107 156 107 -84 -22 211 89 -4 -36 26 -5 189 -51 -110 3 89 7 389 102 22 170
7210 170 265 -157 142 -39 98 37 -322 -127 -5 -135 66 -150 -48 -317 15 160 -210 -4 69 -24 -257
7231 -257 245 -150 189 -363 -180 154 38 181 -30 -3 -410 31 -12 151 86 15 -288 174 -183 -127 149 -137
7253 -137 -32 137 66 129 112 -91 237 -20 -165 18 -274 223 -126 -21 -105 -24 51 -48 104 -485 -170 -80 101
7276 101 -372 234 65 277 54 -154 45 -66 -47 -98 -80 -219 5 24 346 213 1 18 -5 37 -283 88
7298 88 192 -68 -36 188 -21 147 -162 248 319 163 124 -216 82 -449 -107 147 -12 389 51 -64 -255
7319 -255 -100 -19 8 -21 76 12 -243 117 -146 -71 224 12 -184 -30 -90 85 -276 -80 106 60 -51 -43 -84 -172
7343 -172 -109 -202 107 7 -206 63 161 -59 114 -140 -151 3 13 53 223 7 -300 -3 141 -327 -232 53
7365 53 234 -9 5 -218 -160 76 -259 139 4 126 136 305 -161 -152 59 471 187 158 -197 -30 -38 -92 -320
7388 -320 -208 115 -167 56 242 -77 -83 -238 68 -116 -460 -145 -160 -361 -90 62 -44 -102 -12 75 -136 -261
7410 -261 -167 -415 -113 -11 42 -33 -447 -78 207 88 53 -206 -118 110 142 -294 -154 40 -216 228 -48 120
7432 120 -222 -232 -9 200 112 -123 220 107 8 109 -161 -11 128 33 -289 120 -43 -48 127 -163 -258 90
7454 90 -522 55 -51 -21 -28 -71 -30 1 205 182 -72 118 -101 7 -533 195 -195 7 284 104 271 146 58
7477 58 86 157 -32 -227 2 -110 61 -134 261 -15 313 36 -162 -205 -30 -76 3 111 -211 -85 294 204
7499 204 25 297 211 -274 -299 385 -5 104 132 339 -83 -218 4 -138 79 -12 37 101 61 -106 -8 169 -173
7522 -173 -247 -150 32 284 69 105 -6 47 -123 -145 116 -121 -301 156 117 72 261 107 16 -65 36 101 304
7545 304 -106 -462 129 -246 -12 277 -162 145 92 -101 -13 3 37 71 68 265 -177 217 -6 25 59 87 5 -88
7569 -88 90 -105 -98 -100 -226 113 132 -290 -9 33 -26 286 -5 -196 -179 99 13 20 -125 114 -39 -209 195 49
7593 49 48 -70 -28 -120 -17 36 62 286 340 -14 -91 -21 98 194 -130 121 258 -157 -269 169 247 -48 -12 -98 -6
7618 -6 166 -424 -158 51 196 -128 120 -2 121 204 -289 58 0 35 -26 -11 50 71 173 194 -223 264 -43
7641 -43 159 -30 -55 -209 123 9 -300 258 449 -24 -142 -161 -13 -190 -192 -21 196 53 -154 -30 22 14 -98
7664 -98 240 298 -83 -165 -72 -181 137 88 -143 -178 -264 -156 27 -261 -34 -24 319 7 -304 122 -5 91 -266
7687 -266 -120 23 -29 111 -5 616 -56 114 74 173 -111 -64 146 -233 127 -101 -21 23 -51 54 61 194 292
7710 292 -224 391 70 -126 350 178 -175 -201 -19 74 -246 -76 365 126 -93 304 -14 92 224 -381 -83
7731 -83 -122 44 -205 -225 192 237 -55 -19 249 -91 118 -323 -339 166 112 -207 202 -11 306 -28 -160 -14
7753 -14 24 -47 -163 -146 375 409 -113 -255 150 187 -79 85 23 117 -85 134 157 -150 141 72 244 66 271
7776 271 41 365 -103 198 -28 -55 80 -54 233 -114 19 -60 109 -250 -37 -33 -53 -127 -99 -98 32 42 47 -577
7800 -577 15 106 -48 -67 58 -42 171 344 91 47 -180 -9 -29 22 -260 28 -132 128 43 126 -23 -142
7822 -142 -35 -28 153 -76 -181 -104 362 264 -244 281 -87 73 -198 -41 -39 -70 83 -238 98 108 -174 4 -476
7845 -476 -54 -19 307 30 491 -213 -190 65 -162 -34 94 -273 59 -35 8 -241 -328 -89 114 13 -89 -28
7867 -28 67 201 156 163 17 61 91 547 26 -114 -123 -137 85 101 -128 157 261 -8 -8 288 -52 -215 13 201
7891 201 93 -67 24 88 -199 -34 112 173 30 65 259 -117 -294 -46 141 11 -70 158 -365 -121 31 -233
7913 -233 -33 264 92 -131 54 25 -167 130 108 -200 -245 64 335 223 114 47 241 96 -178 219 78
7934 78 166 38 -21 84 -18 -352 197 133 -213 -149 -46 -228 -150 -76 96 -123 -60 3 117 172 -133 44 -56
7957 -56 68 43 -16 132 -237 -127 -218 148 26 69 -130 40 34 236 -190 53 -65 15 10 -326 -88 243 180 24
7981 24 259 9 -362 -391 -93 -134 -168 265 112 76 -60 54 -141 155 83 73 274 -42 87 98 122 218 259 169
8005 169 -51 -84 127 0 -125 161 -280 -187 106 -40 41 -144 25 -235 79 -162 -212 -15 -43 -24 165 314
8027 314 -80 199 170 241 -309 30 111 78 -214 383 -37 44 269 -230 57 199 92 -49 85 -21 168 -57
8049 -57 -39 142 -47 147 116 -2 170 -348 -75 -175 -37 30 115 123 96 -139 85 249 315 89 22 152 -155
8072 -155 -70 -81 -67 -223 92 -189 209 0 35 50 -153 -29 76 163 155 275 142 -100 -156 -31 -140 195 -22
8095 -22 -93 34 96 208 272 -26 -171 94 -231 122 -94 14 168 111 192 -299 -129 -33 -9 -36 62 -338 9
8118 9 -205 116 -291 160 62 235 43 134 86 41 -145 -181 -18 135 46 -423 -239 -113 -47 106 359 -99 -113
8141 -113 62 -43 -52 -93 -114 69 -50 -24 173 -3 253 252 114 -222 9 -168 -87 -15 145 222 -58 -105 -32 177
8165 177 -79 73 -124 538 82 -102 208 -236 43 -37 47 18 124 -160 -86 338 93 227 -203 9 8 45
8187 45 -93 56 96 382
8191C82
##END NTUPLES=NMR FID
##END=
