##TITLE=1H_IAMT-S26
 CDCl3, 8 sc, 
 28.5.2019
##JCAMPDX= 6.0         $$ Bruker NMR JCAMP-DX V2.0
##DATA TYPE= NMR FID
##DATA CLASS= NTUPLES
##ORIGIN= UXNMR, Bruker Analytische Messtechnik GmbH
##OWNER= root
$$ XWIN-NMR		Version 3.5
$$ Tue May 28 16:09:57 2019 Russian Standard Time (UT+4h)  she@DPX200
##.OBSERVE FREQUENCY= 200.13155
##.OBSERVE NUCLEUS= ^1H
##.DELAY= (6, 6)
##.ACQUISITION MODE= SIMULTANEOUS
##.ACQUISITION SCHEME= undefined
##.AVERAGES= 8
##.DIGITISER RES= 18
##SPECTROMETER/DATA SYSTEM= spect
##.PULSE SEQUENCE= zg30
##.SOLVENT NAME= CDCl3
##.SHIFT REFERENCE= (INTERNAL, CDCl3, 0, 15.7039)
##AUDIT TRAIL= $$ (NUMBER, WHEN, WHO, WHERE, WHAT)
$$ ##TITLE= Audit trail, XWIN-NMR		Version 3.5
$$ ##JCAMPDX= 5.01
$$ ##ORIGIN= Bruker BioSpin GmbH
$$ ##OWNER= she
$$ F:/spectra/data/she/nmr/H-F/1/audita.txt
$$ ##AUDIT TRAIL=  $$ (NUMBER, WHEN, WHO, WHERE, WHAT)
(   1,<2019-05-28 16:08:59.10 +0400>,<she>,<DPX200>,
      <created by zg, POWCHK disabled, PULCHK disabled
       configuration hash MD5:
       00 E9 B6 7A A2 85 ED C7 34 08 36 98 17 FE 4E 26
       data hash MD5: 16K
       83 73 4C AE 72 FE C4 6B 61 B7 A1 02 B7 75 30 D7>)
$$ ##END=
$$ 
$$ hash MD5
$$ BC 54 49 A5 7F C3 07 80 16 CF 7A 74 F3 10 24 1E
##$RELAX= 
##$RELAX= 
##$RELAX= 
##$RELAX= 
##$RELAX= 
##$RELAX= 
$$ Bruker specific parameters
$$ --------------------------
##$DU= <F:/spectra>
##$EXPNO= 1
##$NAME= <H-F>
##$PROCNO= 1
##$TYPE= <nmr>
##$USER= <she>
##$AMP= (0..31)
100 100 100 100 100 100 100 100 100 100 100 100 100 100 100 100 100 100 
100 100 100 100 100 100 100 100 100 100 100 100 100 100 
##$AQSEQ= 0
##$AQ_mod= 1
##$AUNM= <au_zg>
##$AUTOPOS= <>
##$BF1= 200.13
##$BF2= 200.13
##$BF3= 200.13
##$BF4= 200.13
##$BF5= 200.13
##$BF6= 200.13
##$BF7= 200.13
##$BF8= 200.13
##$BYTORDA= 1
##$CFDGTYP= 0
##$CFRGTYP= 5
##$CHEMSTR= <none>
##$CNST= (0..31)
1 1 145 1 1 1 1 1 1 1 1 1 1 1 1 1 1 1 1 1 1 1 1 1 1 1 1 1 1 1 1 1 
##$CPDPRG= <>
##$CPDPRG1= <>
##$CPDPRG2= <>
##$CPDPRG3= <>
##$CPDPRG4= <mlev>
##$CPDPRG5= <mlev>
##$CPDPRG6= <mlev>
##$CPDPRG7= <mlev>
##$CPDPRG8= <mlev>
##$CPDPRGB= <>
##$CPDPRGT= <>
##$D= (0..31)
0 1.2 0 0 0 0 0 0 0 0 0 0.03 0 0 0 0 0 0 0 0 0 0 0 0 0 0 0 0 0 0 0 0 
##$DATE= 1559045338
##$DBL= (0..7)
120 120 120 120 120 120 120 120 
##$DBP= (0..7)
150 150 150 150 150 150 150 150 
##$DBP07= 0
##$DBPNAM0= <>
##$DBPNAM1= <>
##$DBPNAM2= <>
##$DBPNAM3= <>
##$DBPNAM4= <>
##$DBPNAM5= <>
##$DBPNAM6= <>
##$DBPNAM7= <>
##$DBPOAL= (0..7)
0.5 0.5 0.5 0.5 0.5 0.5 0.5 0.5 
##$DBPOFFS= (0..7)
0 0 0 0 0 0 0 0 
##$DE= 6
##$DECBNUC= <off>
##$DECIM= 24
##$DECNUC= <off>
##$DECSTAT= 4
##$DIGMOD= 1
##$DIGTYP= 9
##$DL= (0..7)
0 120 120 120 120 120 120 120 
##$DP= (0..7)
150 150 150 150 150 150 150 150 
##$DP07= 0
##$DPNAME0= <>
##$DPNAME1= <>
##$DPNAME2= <>
##$DPNAME3= <>
##$DPNAME4= <>
##$DPNAME5= <>
##$DPNAME6= <>
##$DPNAME7= <>
##$DPOAL= (0..7)
0.5 0.5 0.5 0.5 0.5 0.5 0.5 0.5 
##$DPOFFS= (0..7)
0 0 0 0 0 0 0 0 
##$DQDMODE= 0
##$DR= 18
##$DS= 0
##$DSLIST= <SSSSSSSSSSSSSSS>
##$DSPFIRM= 0
$$ [...]
##$SUBNAM2= <"">
##$SUBNAM3= <"">
##$SUBNAM4= <"">
##$SUBNAM5= <"">
##$SUBNAM6= <"">
##$SUBNAM7= <"">
##$SUBNAM8= <"">
##$SUBNAM9= <"">
##$SW= 24.9336996594482
##$SWIBOX= (0..15)
0 0 2 0 0 0 0 0 0 0 0 0 0 0 0 0 
##$SW_h= 4990.01996007984
##$TD= 16384
##$TD0= 1
##$TE= 0
##$TE2= 300
##$TE3= 300
##$TEG= 300
##$TL= (0..7)
0 120 120 120 120 120 120 120 
##$TP= (0..7)
150 150 150 150 150 150 150 150 
##$TP07= 0
##$TPNAME0= <>
##$TPNAME1= <>
##$TPNAME2= <>
##$TPNAME3= <>
##$TPNAME4= <>
##$TPNAME5= <>
##$TPNAME6= <>
##$TPNAME7= <>
##$TPOAL= (0..7)
0.5 0.5 0.5 0.5 0.5 0.5 0.5 0.5 
##$TPOFFS= (0..7)
0 0 0 0 0 0 0 0 
##$TUNHIN= 0
##$TUNHOUT= 0
##$TUNXOUT= 0
##$USERA1= <user>
##$USERA2= <user>
##$USERA3= <user>
##$USERA4= <user>
##$USERA5= <user>
##$V9= 5
##$VALIST= <valist>
##$VCLIST= <CCCCCCCCCCCCCCC>
##$VD= 0
##$VDLIST= <DDDDDDDDDDDDDDD>
##$VPLIST= <PPPPPPPPPPPPPPP>
##$VTLIST= <TTTTTTTTTTTTTTT>
##$WBST= 1024
##$WBSW= 4
##$XGAIN= (0..3)
0 0 0 0 
##$XL= 0
##$YL= 0
##$YMAX_a= 302152
##$YMIN_a= -458558
##$ZGOPTNS= <>
##$ZL1= 120
##$ZL2= 120
##$ZL3= 120
##$ZL4= 120
##$ABSF1= 10
##$ABSF2= 0
##$ABSG= 5
##$ABSL= 3
##$ALPHA= 0
##$AQORDER= 0
##$ASSFAC= 0
##$ASSFACI= 0
##$ASSFACX= 0
##$ASSWID= 0
##$AUNMP= <proc_1d>
##$AZFE= 0.1
##$AZFW= 0.1
##$BCFW= 1
##$BC_mod= 2
##$BYTORDP= 1
##$COROFFS= 0
##$CY= 11.3945322036743
##$DATMOD= 1
##$DC= 2
##$DFILT= <>
##$DTYPP= 0
##$F1P= 18.9103706918063
##$F2P= -1.10871071338519
##$FCOR= 0.5
##$FTSIZE= 0
##$FT_mod= 4
##$GAMMA= 1
##$GB= 0.15
##$INTBC= 1
##$INTSCL= 1
##$ISEN= 128
##$LB= 0.24
##$LEV0= 0
##$LPBIN= 0
##$MAXI= 10000
##$MC2= 0
##$MEAN= 0
##$ME_mod= 0
##$MI= 1.114404
##$NCOEF= 0
##$NC_proc= 0
##$NLEV= 6
##$NOISF1= 3.799351
##$NOISF2= 2.8
##$NSP= 1
##$NTH_PI= 0
##$NZP= 0
##$OFFSET= 15.70392
##$PC= 1
##$PHC0= -8865.479
##$PHC1= 28.20025
##$PH_mod= 1
##$PKNL= yes
##$PPARMOD= 0
##$PSCAL= 0
##$PSIGN= 0
##$REVERSE= no
##$SF= 200.130013532006
##$SI= 16384
##$SIGF1= 3
##$SIGF2= 2
##$SINO= 400
##$SIOLD= 16384
##$SREGLST= <1H.CDCl3>
##$SSB= 0
##$STSI= 0
##$STSR= 0
##$SW_p= 3612.71676300578
##$SYMM= 0
##$S_DEV= 0
##$TDeff= 0
##$TDoff= 0
##$TI= <>
##$TILT= no
##$TM1= 0
##$TM2= 0
##$TOPLEV= 0
##$USERP1= <user>
##$USERP2= <user>
##$USERP3= <user>
##$USERP4= <user>
##$USERP5= <user>
##$WDW= 1
##$XDIM= 8192
##$YMAX_p= 0
##$YMIN_p= 0
$$ End of Bruker specific parameters
$$ ---------------------------------
##NTUPLES= NMR FID
##VAR_NAME=  TIME,          FID/REAL,        FID/IMAG
##SYMBOL=    X,             R,               I
##VAR_TYPE=  INDEPENDENT,   DEPENDENT,       DEPENDENT
##VAR_FORM=  AFFN,          ASDF,            ASDF
##VAR_DIM=   8192,          8192,            8192
##UNITS=     SECONDS,       ARBITRARY UNITS, ARBITRARY UNITS
##FACTOR=    0.0002004,     1,               1
##FIRST=     0,             0,               0
##LAST=      1.6414764,     0,               0
##MIN=       0,             -458558,         0
##MAX=       1.6414764,     302152,          0
$$ Real data points
##PAGE= N=1
##DATA TABLE= (X++(R..R)), XYDATA
0 0 0 0 0 -8 8 -8 8 -8 16 -24 24 -32 40 -49 64 -72 89 -108 128 -151 175 -205 237 -273 315 -360 413 -469
28 -469 531 -599 676 -757 853 -952 1064 -1185 1317 -1465 1623 -1799 1994 -2207 2443 -2706
44 -2706 2999 -3326 3692 -4114 4595 -5157 5815 -6608 7576 -8796 10384 -12550 15701 -20726
58 -20726 30041 -53270 236341 302152 897 241693 253202 45413 -12594 207360 162287
69 162287 -34794 -42464 74303 -55724 -210319 -154838 -57672 -132581 -140093 -3504 54168
80 54168 -55981 -98297 -43246 -31071 -67211 -30442 28371 47677 61062 83196 45294 -12912
92 -12912 -25674 -26037 -58712 -55529 -7919 644 -38310 -50105 -58382 -113070 -153442 -131539 -117753
105 -117753 -132824 -97337 -24244 -22020 -69268 -66944 -41680 -58186 -58237 3169 47863 45768 70940
118 70940 111109 79583 20956 28577 50856 13399 -3939 56501 88723 34439 -4889 10989
130 10989 -7492 -64228 -67409 -26606 -23213 -34248 625 30556 -1410 -40912 -32915 -20472 -34411
143 -34411 -31931 5384 33712 28667 12313 2955 -2351 -14467 -35189 -42746 -17430 12566 11156
156 11156 -853 6190 2548 -34537 -52584 -25032 -10350 -26330 -11555 32584 31126 -8188 -8861
169 -8861 12547 -10401 -37585 -1725 42789 31593 14110 35817 39657 1293 -12734 11036
181 11036 10703 -8077 13212 49044 38761 11714 18089 23468 -3014 -12026 18850 36494 26217
194 26217 32778 51730 41171 16274 15993 19171 2307 -1250 23363 34665 15580 3468 5146
207 5146 -9880 -34841 -36321 -24914 -26803 -28964 -15240 -7710 -18683 -28549 -28601 -32245 -35990 -24854
221 -24854 -6362 3617 6107 6684 4114 -1136 -5865 -10806 -15012 -7795 3954 5096 -118 224 -4009
236 -4009 -21502 -34246 -28314 -21293 -23338 -18256 -5146 -2538 -9835 -9233 -5155 -11912 -15561 -273
250 -273 17667 20128 22241 31137 29797 16715 11553 17278 16409 12092 17880 26220 22073 13921 10337
265 10337 3390 -8750 -12263 -5152 -976 -1248 2237 5450 1122 -5225 -5961 -6334 -8700 -5570 3933
280 3933 9838 10079 9768 7838 1352 -3646 -3350 -1544 -110 3054 5945 4767 2273 -252 -5690 -12452
296 -12452 -13802 -9267 -5861 -3826 198 1527 -3247 -7084 -7323 -7461 -8596 -4436 3716 7312 7445 9914
312 9914 10530 4380 -1831 1031 5559 5679 6354 10985 11934 6850 2799 1806 -1326 -4833 -3419 2154
328 2154 5535 5604 6443 5633 1662 -1435 -1017 963 1892 4233 7823 9048 6719 3866 1227 -1822 -5050
345 -5050 -4675 -2110 635 970 -85 -1434 -3257 -6057 -8721 -8611 -7170 -5464 -2790 -405 227 -2228
361 -2228 -4954 -6642 -6885 -6611 -4295 -1053 488 578 486 594 -1770 -4178 -4542 -2542 -975 151 2435
378 2435 2327 152 -2424 -3761 -4543 -5732 -4437 -2479 -680 214 913 957 -616 -2226 -2366 -139 1133
395 1133 3317 5456 6261 4976 3399 2159 656 -1397 -1306 -407 850 1629 1013 -537 -2211 -4575 -5480
412 -5480 -5063 -3533 -2132 -501 872 755 225 -709 -1848 -2774 -2559 -1517 597 1505 1500 728 -39 -1660
430 -1660 -3133 -3859 -2950 -2236 -1470 -35 698 537 -1349 -2215 -2622 -2455 -1687 131 1260 1380 1201 970
448 970 356 -898 -1557 -1206 -567 362 1876 2607 1708 429 -296 -1015 -1693 -1450 -420 870 1448 811 959
467 959 -79 -1060 -2120 -1646 -1079 506 1373 1945 1618 896 -38 -500 -1046 -1177 -813 232 776 954 336
486 336 -792 -1165 -2470 -2845 -1990 -1364 -822 -30 354 253 -465 -1079 -907 -962 -645 799 1629 2039 1606 1337
506 1337 1012 -167 -427 -114 240 615 978 1649 985 478 -584 -557 -782 -628 154 755 1101 906 972 667
526 667 -77 -533 -378 -30 154 976 1391 1739 730 451 469 -300 -387 195 581 945 972 987 310 246 -477 -402
548 -402 -1076 -76 600 584 606 304 371 -933 -1305 -870 -398 -260 55 344 732 251 -314 -439 -788 -736 -235
569 -235 393 80 547 388 -113 -353 -727 -659 -722 -786 -307 217 14 -100 -413 -747 -1089 -927 -661 -322 -598
590 -598 27 273 -101 -447 -494 -387 -729 -652 -232 26 37 -41 -534 -622 -638 -709 -723 -389 26 145 6 404 77
613 77 -346 -347 -181 -241 -61 200 500 576 156 -145 255 133 -317 -455 386 76 93 703 251 -85 -81 194 -156
636 -156 217 52 723 416 397 487 104 157 -117 323 -44 90 374 611 424 221 -121 287 125 -436 2
657 2 508 480 90 148 -101 -307 -99 -262 -24 -309 84 -51 -48 75 -251 -179 -65 -381 -119 -61 -219 93 6
680 6 -271 -248 -189 -378 -275 -42 226 220 -128 -128 -167 140 -334 -254 -333 -414 -106 -125 -140 83 10 -352 -311 114 -20 22
706 22 -34 94 155 171 152 -279 -290 -238 -336 56 -209 -131 -215 86 -67 -38 -204 142 -68 -193 113 -207 209 312
730 312 -77 29 48 -69 74 -35 231 -102 12 -123 -354 -110 -505 -442 -207 -26 -63 -70 -207 3 -253 -95
752 -95 -111 -341 -238 -57 -81 -305 80 -158 89 -205 147 -16 -91 -332 -18 299 283 -204 -123 -10 -340 -185
774 -185 -213 -67 -274 175 70 -98 -151 -218 105 77 -82 -194 434 408 -265 332 2 -125 -86 -176 203 50 140
797 140 42 66 158 104 157 107 -139 44 283 427 313 -100 18 182 -21 -81 130 -43 -60 148 201 -135 -5
820 -5 32 -41 -145 -299 -151 -10 -249 -88 -74 23 24 45 -231 164 167 -131 -43 196 -9 15 -35 151 -161 -13 85
845 85 236 53 -47 46 -12 99 -201 -316 51 -253 -29 56 3 44 -2 134 72 -21 -224 84 -109 306 163
868 163 292 274 -317 -27 -117 140 233 -195 558 44 -136 -194 -148 -79 -140 -140 2 201 -128 58 266 71 -127
891 -127 -175 -86 238 144 123 -7 80 24 -151 205 -88 -220 200 35 79 28 -177 -163 -178 74 -215 139 16 4
915 4 148 -59 109 -30 -44 -1 -247 -22 98 308 100 -236 97 169 -191 67 -119 150 57 -4 -19 -212 -162
938 -162 24 -160 -105 236 23 -281 368 315 -47 143 -31 5 335 -1 92 -96 -211 -5 -352 220 -102 -249
960 -249 35 31 -110 143 -23 -223 -183 -213 -192 -59 297 -7 -78 70 -123 292 -209 -12 -43 -5 -96 -318 -220 83
984 83 -35 70 -152 12 3 -6 -37 -48 -253 -122 -108 120 120 26 -218 -133 244 287 -219 -155 191 250 183 128 -68 5
1010 5 58 -140 62 -33 -207 -65 -129 -138 23 -10 -293 78 82 -242 89 -212 11 59 -260 56 116 282 78 -102
1034 -102 -321 69 -391 -216 28 -58 152 -19 138 -316 34 32 -121 -57 -88 33 69 104 -193 -17 177 8
1056 8 46 220 49 -232 27 69 -22 264 407 217 130 247 75 179 -65 78 -278 60 -150 -383 -152 -162
1078 -162 40 82 -144 -218 -65 83 294 -71 -129 -395 -50 -98 -19 -255 -156 -81 58 -91 131 -4 -163 -79 239
1101 239 -97 -233 -79 54 -23 -27 -98 -126 109 110 -73 -172 -54 -89 -43 -186 68 -163 98 -46 195 -14 -3 -20
1125 -20 -50 -319 278 54 83 -122 -38 100 28 -36 63 161 121 37 -94 -111 -81 -8 -107 247 -45 -94 69 11 175
1150 175 125 82 -181 203 -28 5 33 -73 -73 -220 -205 -58 -43 -51 -97 -172 238 54 1 110 -54 -105 -13 -57 -116 116
1176 116 203 -56 -12 9 -59 279 277 0 149 28 102 -500 81 -98 214 -131 -476 -32 -237 -75 -201 119
1198 119 73 160 -228 215 -141 -249 120 162 -88 -18 280 220 9 207 82 -30 -103 -74 33 -22 68 9 -135
1221 -135 -100 -68 -93 -11 -141 -307 -9 131 -65 -165 180 -82 -142 263 77 48 -209 -208 229 138 101 11 110 0
1245 0 129 267 46 417 215 85 -172 -18 8 50 -189 -155 109 81 86 -74 -18 117 -427 142 -37 104 -54
1268 -54 67 -57 -191 259 -102 -68 82 153 84 -170 14 -270 232 150 -29 -5 -9 87 125 -72 234 -95 -168 -225
1292 -225 -109 85 -114 141 505 105 146 -225 -180 71 1 280 99 91 86 -37 -280 -132 -61 26 -145 29 437
1315 437 126 -184 16 64 -154 -10 133 159 -110 -184 14 79 -92 220 -8 -59 -12 107 -122 34 -19 91
1337 91 368 -104 -71 -235 -51 217 -120 -3 247 -106 287 -11 -225 -159 -43 5 -82 -71 86 22 -275 100
1359 100 171 -40 53 -42 -30 -118 73 85 93 -79 -98 -138 -71 8 -78 146 155 -184 335 357 -94 -130 -82 -43 15 -15 301
1386 301 143 131 168 202 28 -78 141 -79 -91 397 32 68 5 288 -52 223 91 -240 -244 -183 -216 46 175
1409 175 -323 -256 -61 6 -34 32 -32 -239 25 45 -328 -95 206 70 41 16 -8 175 -167 110 -87 76 -66
1432 -66 -65 -171 -107 -92 -19 107 -24 -23 -71 118 101 18 -103 331 -46 -75 -234 -41 127 -56 -150 -159 -31 -89 -3 20
1458 20 -108 151 270 32 172 -194 162 -119 -139 -57 140 53 -26 307 -341 20 -44 -261 65 -192 -174 -31
1480 -31 151 -254 -64 -69 -236 309 55 -143 69 198 -49 -99 22 38 105 64 -211 -64 -47 87 -82 244 -50
1503 -50 -280 67 -53 74 -253 203 26 -131 240 94 -148 10 -162 -145 217 99 42 -258 -52 221 97
1524 97 -83 106 302 95 133 -250 -26 -147 407 -322 -121 171 92 -65 81 -350 -103 -190 95 51 98 -53
1546 -53 -342 96 -73 199 127 1 39 -362 -56 -30 187 231 91 99 18 -80 121 -38 -46 12 -249 133 190 60
1570 60 -265 82 -132 -189 161 41 88 -252 -183 -177 -210 10 7 -90 -11 -37 252 -108 -51 393 21 17 82 -99 -88 -157
1596 -157 85 -30 -509 -142 -146 -187 327 -88 -226 198 -168 20 202 -41 139 54 59 205 81 68 25 66 53
1619 53 -18 329 -246 18 30 121 -257 -95 21 118 180 -42 223 106 -277 50 -86 -114 100 -221 9 -146
1641 -146 53 -189 -93 244 82 132 28 -153 280 -286 274 -93 -163 -30 -19 -32 -64 -27 5 -88 18 25 -57 425
1665 425 169 191 79 -29 133 -66 -134 119 -8 30 -17 199 -2 19 -59 -13 60 -2 233 -55 -42 -41 26 221
1689 221 -36 -62 -193 -69 176 -95 -127 -18 109 -100 -185 -197 -61 6 -229 171 206 153 -27 -192 -92 -3 425
1712 425 6 -15 245 18 -123 -123 -84 260 -169 299 -45 175 -157 -225 -120 16 138 -123 29 12 -172 300
1734 300 59 231 191 -104 -226 -195 32 240 28 -40 -173 -127 100 -42 201 -63 -195 -207 -46 29 188 -306
1756 -306 244 -366 -97 120 -119 36 65 -247 -156 134 -291 401 -28 38 362 -75 -20 44 66 50 221 -265
1778 -265 75 284 -20 -117 116 76 146 -94 136 -64 -28 103 102 29 -77 179 244 205 -165 -458 -101 334 -1
1801 -1 -79 -46 143 -105 153 -82 259 -61 68 75 -229 124 400 -9 207 85 290 1 -238 -170 -52 34 -163
1824 -163 68 -108 -48 -98 -25 -140 -97 -55 -137 83 -138 146 -225 -72 -59 -78 101 162 -62 -105 -39 45 -17 -312
1848 -312 -114 -164 -61 -60 -139 -37 -60 5 92 -35 313 -15 -147 -217 361 191 -92 -144 213 -66 -124 75 56 -119
1872 -119 -311 -145 14 19 -15 -14 -18 -170 232 -10 -118 -11 -181 84 204 250 -390 -36 -161 23 263 -19 -106
1895 -106 -89 108 -202 148 -238 79 -54 97 185 110 -183 -146 24 157 -47 -53 119 -218 81 64 38 73 253
1918 253 17 -108 84 296 130 226 213 189 27 116 59 277 162 197 298 -229 -114 280 69 11 -236 218
1940 218 117 113 -43 -202 -81 -60 -114 -159 -93 -339 207 33 -158 -36 -98 -341 334 199 -52 -232 13 -28 92
1963 92 70 262 72 -32 -15 229 -28 -368 -273 -42 -68 -146 198 264 -51 126 271 187 128 -103 -59 -19 -464 158
1987 158 -405 -177 -203 411 -95 -141 382 3 123 -83 183 41 41 -7 -140 -12 176 63 188 -64 113 185
2009 185 -125 -191 73 154 -53 62 -10 -338 -110 47 -133 -239 90 87 -276 391 -50 -8 -229 89 74 -158
2031 -158 -113 238 -131 -101 -171 -41 100 -117 -10 -276 -237 -92 -166 149 120 -132 -109 7 -75 65 -45 46 172
2054 172 -149 -141 98 72 148 148 -26 -149 -157 49 142 65 204 30 -165 -19 -103 12 27 36 120 -112 90 153 38
2079 38 -44 35 -249 64 -48 -198 110 -3 314 -243 -206 -64 -338 -27 -64 206 73 32 177 61 132 -73
2101 -73 133 390 -232 -93 -94 -179 248 -144 336 67 126 94 161 273 -34 -137 -62 -150 71 -45 244 58 -18
2124 -18 309 223 -302 143 12 -196 71 -62 291 -32 -193 254 -74 30 16 -368 -77 -109 27 -284 116
2145 116 -36 162 -142 -51 -150 208 33 -225 308 -54 -44 -27 201 -50 76 -17 -47 148 -65 -162 4 0 83
2168 83 52 140 -156 -213 333 66 -10 42 -50 -56 75 3 -187 90 20 27 -146 141 137 -240 -36 69 103 157 -150 52
2194 52 240 -320 245 39 62 177 19 -68 -284 195 19 -111 -202 -98 -156 -77 -259 93 -367 -114 75 -183
2216 -183 -177 -287 45 151 272 -78 46 -262 167 55 -106 -188 -111 -38 -210 -140 -241 -9 59 95 -115 -271 -198
2239 -198 102 0 69 -89 13 63 39 114 74 -63 69 -120 84 54 66 14 116 116 157 30 210 129 86 -151
2263 -151 -91 -127 -23 155 -91 138 -149 5 111 49 147 98 -42 43 -73 -163 112 233 -139 -57 -245 -90 -254
2286 -254 138 -169 -47 -154 -108 -54 -18 -4 -359 -32 -194 -67 -348 105 195 286 -50 -62 57 0 -77 35 48
2309 48 125 338 -480 -180 -56 87 -2 -96 42 -29 -60 197 431 10 10 -332 88 24 -78 5 -231 -192 -56 246
2333 246 -13 193 342 -78 95 97 63 -135 56 -144 150 138 394 21 -110 -39 153 54 -121 -165 -150 53 -21
2356 -21 49 50 120 289 -66 -241 -440 -84 34 -133 70 279 -191 130 60 64 184 -23 39 -133 -158 -185 -274 -21
2380 -21 90 112 146 156 -217 -160 -43 -42 461 -49 -195 73 -174 139 46 -81 93 212 156 111 -44 145 55 118
2404 118 238 180 124 -152 -58 99 -192 53 61 -74 35 -208 57 45 308 -31 102 -75 -52 -94 -271 218 -264
2427 -264 145 -363 -162 24 -75 72 -171 -229 -21 -376 -270 74 148 117 -307 -145 35 -39 -162 159 -37 -282
2449 -282 5 -163 205 73 41 -234 185 -33 242 66 -25 129 -13 144 -242 307 50 -112 143 4 -21
2470 -21 -237 -24 31 -229 -299 -24 62 -73 32 11 254 87 -269 15 145 136 205 -223 -108 -352 57 -213 -26
2493 -26 -21 87 96 -252 -97 204 86 30 87 175 -4 -92 -165 -38 -24 -141 -107 85 -28 35 32 -205 -272 13 -52 7
2519 7 -3 59 13 216 -232 -153 -9 -302 93 -133 17 22 102 -239 152 82 44 204 114 43 88 74 193 -252 195
2544 195 145 -95 290 152 -113 -331 -205 -40 -23 -40 -255 98 104 -149 182 -209 -73 28 -376 111 210 -241
2566 -241 -86 188 130 -21 142 90 62 302 -25 213 3 -74 60 -211 -73 62 5 -89 -186 -103 -155 30 -70
2589 -70 -327 -203 41 -317 38 -144 -103 -77 -56 478 -208 -120 125 -187 -57 55 -90 -60 -196 217 -1 -145
2611 -145 -284 -85 -95 11 172 -254 -269 267 193 -219 53 28 -162 100 -53 -172 193 -74 -37 202 83 38
2633 38 56 161 -89 -176 -4 117 54 -127 -128 207 -78 33 -231 33 -52 6 -75 -172 21 -185 -255 100 19 33
2657 33 88 -146 244 -211 -46 -123 135 170 63 -142 -31 35 -207 189 -265 63 369 229 -53 -96 324 -440
2679 -440 109 -149 -312 -201 -105 -183 -133 52 25 100 -291 -133 -79 28 -138 -101 93 98 200 -83 148 -191 97
2702 97 -71 193 -139 -68 3 -216 353 -266 172 3 -55 -120 -124 -35 -109 140 -188 -26 139 32 45 -86 51
2725 51 163 -41 12 44 334 -49 130 18 41 77 -89 102 -43 137 202 193 38 -159 -359 7 36 -106 177
2748 177 -47 -138 211 167 -59 -129 -85 289 -81 -351 103 55 134 16 185 300 -215 59 -118 181 -51 -11
2770 -11 253 -19 28 237 29 -126 221 105 -221 -4 154 -184 -74 214 -266 47 81 -1 38 113 77 -52
2792 -52 -137 -66 -68 -108 -93 -332 255 19 72 -109 -228 8 -31 -109 -129 253 27 70 -182 -196 72 -107 -177 -141 158
2817 158 -128 -6 130 117 -203 -56 77 -123 -149 146 72 30 -170 -171 -247 -95 -123 -72 206 68 45 200 92
2840 92 -83 -179 138 81 44 -31 -3 -50 175 -3 268 -106 -195 -115 2 -252 -91 -35 -85 -168 -120 248 -97 65
2864 65 -19 -163 -56 64 -7 50 -31 -311 98 182 33 -119 92 93 6 -109 173 -188 17 49 48 274 -169 55
2888 55 20 -11 134 8 137 74 25 36 103 -47 -67 316 92 -47 -28 66 -183 -218 103 88 -39 -14 -253 52
2912 52 -240 205 22 -233 114 27 -16 169 -205 -4 -147 -119 61 19 131 93 -69 17 23 193 166 -192 96
2935 96 77 -323 -79 -82 -122 43 -10 37 270 -41 -83 135 -111 -77 119 221 101 144 -98 -5 -330 -127 -92 -240
2959 -240 319 -5 -87 -53 150 -75 76 105 -230 74 98 32 -146 24 89 -101 4 236 -32 -189 33 -92
2981 -92 36 -63 -257 -9 104 110 -115 -174 -37 264 206 -155 -113 -114 234 145 -57 177 37 -145 -8 -118 112
3004 112 -97 105 -302 329 -85 -116 -226 -101 61 -161 -132 225 -143 273 40 149 91 0 163 -15 -10 -4 226
3027 226 -292 -135 80 154 -70 58 -68 230 53 -166 198 -96 -108 139 -261 -268 167 -135 29 8 -14 361
3049 361 -53 88 -172 176 -51 194 -76 285 306 168 -128 -59 4 -191 279 22 -96 220 2 -238 -9
3070 -9 135 -5 -473 -47 -225 204 -11 -25 -193 182 45 180 168 -140 42 -152 -256 -113 56 -32 364 197
3092 197 208 263 -173 -146 -121 186 82 -48 -47 204 -67 175 83 -377 -101 -273 144 -163 231 -191 275 -183
3114 -183 106 -28 -71 -62 9 115 89 -116 -20 -105 212 131 67 285 153 116 148 -157 -18 -41 -249 -97 135 -46
3138 -46 -94 -33 -48 92 -102 55 -27 77 60 7 53 134 27 -77 114 -191 153 82 -332 28 15 -28 334 81
3162 81 -107 146 188 -133 -160 64 -88 188 202 7 -66 -123 50 -4 -24 372 111 -207 379 -31 -42 -280 22
3185 22 -84 35 -76 -18 -158 9 172 50 94 51 -100 -9 85 -46 249 31 55 -66 -269 -150 113 -168
3207 -168 234 91 -143 150 38 -82 187 101 257 -147 30 -159 -9 -80 171 -41 101 -101 -10 -104 27
3228 27 101 -172 85 -85 64 87 -17 52 69 -159 181 -49 196 124 148 65 -77 -41 -174 146 -6 -252 -61
3251 -61 8 22 -96 253 -79 29 -4 111 -187 -105 -117 35 -106 144 -46 182 -131 -55 156 -142 -62 -277 216
3274 216 -66 -89 -199 -255 56 98 203 271 -158 -332 -134 -75 284 -4 117 18 -302 171 164 -192 188 -3 -4
3297 -4 284 -63 91 402 -200 129 -60 24 49 14 -129 145 141 182 126 -55 -159 155 -380 -42 -47 84 150 -293
3321 -293 -121 -188 327 -125 -301 -244 -13 269 -311 46 66 17 -218 -279 107 -219 173 -210 88 171 -277 -238
3343 -238 12 -182 110 -129 108 229 -103 27 163 -151 10 -84 95 -74 71 16 230 -196 118 -180 40
3364 40 96 98 -1 101 39 101 -111 -56 -3 72 87 -10 197 -44 65 -60 252 131 308 191 -307 256 55 -116
3388 -116 -144 292 275 -220 -191 100 -51 -317 241 -121 -108 -64 -60 89 -91 107 22 -105 216 437 -161 -113 2
3411 2 31 222 106 -24 270 25 -63 -167 -58 -22 119 199 -238 62 40 -85 -123 231 -3 120 -222 37 165
3434 165 31 -51 141 186 -30 11 87 -4 10 -93 79 -175 -63 44 -217 -153 289 -53 230 -36 -105 -11 -86
3457 -86 -236 142 -53 -11 77 -44 -43 -115 27 -126 180 -90 337 -114 -159 -246 -56 -60 169 8 -32 -33 356 105
3481 105 -41 88 -196 -435 18 -130 -46 137 -28 -63 -75 320 -79 -70 -56 -328 42 -395 -148 -153 -137 150 -36
3504 -36 -14 19 212 -252 68 -254 291 -104 -393 -286 281 5 -88 60 81 2 47 -114 -40 56 -211 154 243
3527 243 13 87 -285 42 -166 28 0 -43 218 -305 -189 148 -94 -40 253 -231 26 39 29 -98 0 -239
3549 -239 -204 -61 -44 -72 -86 -29 136 161 -56 288 120 -26 112 -89 121 -53 -15 285 252 142 -58 -223 19
3572 19 -73 -47 308 45 127 -109 66 79 -174 103 124 -15 -177 -2 -11 5 -273 37 -54 139 -190 145 -99
3595 -99 -77 43 -66 278 178 -130 -238 62 -169 -17 46 521 -37 76 209 -18 168 83 -123 88 -3 -340
3617 -340 -375 235 260 112 -38 -119 130 -14 120 36 187 44 -38 -110 16 142 56 -89 -270 108 -111 48
3639 48 -129 345 -32 15 144 -84 -116 141 170 -10 370 178 191 19 244 247 138 152 -201 167 -16 3 43
3662 43 253 125 122 403 182 -230 -76 -11 -152 -182 -105 74 66 -262 -202 25 -244 65 -72 163 -123 9 6 76
3686 76 160 -221 163 -345 -85 172 -224 107 135 -36 -29 200 119 -174 121 -248 280 -242 -222 47 46 -3 -493
3709 -493 64 -211 58 46 -98 -269 -41 -88 46 51 163 -114 64 -30 157 48 -120 -23 -216 -185 79 -8 -298
3732 -298 -68 -27 148 -2 126 -246 111 -5 62 51 -256 51 -31 21 0 78 15 1 114 23 -39 -6 -42 -42 130
3757 130 -263 -95 211 -140 -112 19 37 -13 265 -239 96 -119 194 -49 125 -75 -63 108 -126 180 -134
3778 -134 -65 -290 -44 53 -22 139 -222 -103 -34 -63 155 129 -112 -290 95 415 66 100 508 -171 80 106 -196
3801 -196 339 83 -94 -70 174 90 -71 80 -221 112 138 98 -41 -178 -217 323 151 47 -34 6 91 -329 -151
3824 -151 -18 82 -72 229 57 -193 4 -271 -86 101 -61 92 -12 -123 -67 16 -52 176 42 92 -84
3845 -84 65 260 148 -44 -116 -111 316 43 -129 124 206 60 -140 166 -35 -239 -163 71 -52 -234 167 39
3867 39 -133 39 -44 -416 -24 -69 90 -56 1 -125 -419 172 -145 -4 -159 -83 -220 45 134 424 -180 103
3889 103 236 -161 -217 76 -28 -238 -120 -142 -129 186 50 180 122 -26 -111 112 35 -5 -77 144 93 101 -172 -40
3913 -40 -38 0 55 -118 -39 87 181 -25 -86 -110 -99 68 -62 -249 -68 -332 -9 -149 33 -147 151 -173 -195 76
3937 76 -200 145 22 23 -35 -47 121 56 301 -95 242 -38 -160 178 -14 169 -1 316 159 -105 77 -37
3959 -37 -242 59 -256 -195 207 314 33 271 145 -188 73 -100 -109 -4 1 69 8 61 193 134 63 -23 -23 -153 10
3984 10 -142 -77 -6 162 93 -119 181 -195 99 -80 137 -66 -243 128 574 -175 -200 -104 63 -134 71 129
4006 129 -329 20 -305 143 -52 -227 114 -38 174 52 -89 127 113 -72 -200 19 142 -35 203 252 5
4027 5 -91 45 116 -111 -104 303 200 -82 283 -125 -116 -32 -295 -114 -31 169 -50 184 16 325 106 84 126 -44
4051 -44 -49 135 31 117 263 345 -251 166 97 -420 -277 -29 -30 -161 127 274 -326 289 -25 -226 3 193 -71
4074 -71 21 121 33 -146 324 -5 395 92 -89 -82 52 238 1 -368 35 171 214 -142 50 73 -96 55
4096 55 -70 63 -141 -212 -100 -54 164 133 69 51 47 -4 42 61 141 -40 -196 92 95 -153 131 -39 139 103 -182
4121 -182 -86 -126 56 127 88 -224 -3 137 71 -76 34 86 207 -43 -62 138 -48 -180 38 -4 61 -154 214
4144 214 -95 -195 -26 121 30 -324 -18 -243 41 152 104 -108 69 -188 331 19 -75 -122 78 -48 -9 126
4166 126 -9 -18 136 19 37 -68 -39 -100 28 -17 282 70 -94 68 -33 -167 157 223 6 -54 -17 -155 162
4189 162 49 -68 24 -7 -117 -44 280 -170 -198 158 68 -201 393 -45 156 42 21 97 10 265 154 -96 -80
4212 -80 -112 -131 325 -115 162 114 -216 111 -21 287 24 134 165 -16 -241 267 19 179 -69 -75 -171 238 -460
4235 -460 -181 -37 -576 -67 -213 -104 3 27 294 165 -92 122 -252 222 171 76 78 -102 112 -46 122 -292
4257 -292 164 188 -330 213 97 60 114 -202 -147 -217 -32 -256 156 -92 318 199 94 192 -166 -13 272 271 78
4280 78 306 20 21 -197 55 -65 107 87 -3 -52 -119 9 -156 -15 -189 -224 34 232 69 -146 134 33 196
4303 196 88 -111 80 -27 -97 145 6 241 -181 209 -5 -132 157 209 300 232 68 0 -147 69 -57 -267
4325 -267 -426 221 -144 -152 15 53 250 135 -64 142 -70 -218 -130 -174 90 53 -269 -176 -285 48 -191 -225 -112
4348 -112 -295 -57 -356 400 332 -3 -106 170 144 -165 -183 36 -31 130 -118 204 -4 -162 256 -54 -63 119
4370 119 177 86 -256 -48 -169 47 119 94 92 48 255 -319 117 -39 -4 -159 -179 -107 85 -70 248 -52 -67 211
4394 211 -41 -84 158 127 229 192 28 -68 101 108 -65 -80 -79 -230 -254 -71 174 -133 -66 79 25 -19 -344 281
4418 281 171 -107 126 112 -51 270 -65 119 -41 -128 -77 112 -14 30 147 106 -76 52 -292 -161 249 100
4440 100 -119 -77 303 36 7 -55 -116 181 -58 147 -101 74 359 274 268 -283 -132 410 -155 279 96 50 -107
4463 -107 90 88 83 202 1 -263 -226 131 -71 270 -206 -106 53 115 -111 -182 132 26 130 -223 -301 -158 -263
4486 -263 -133 -319 -77 424 -100 -66 34 65 144 46 2 21 -127 338 -45 123 25 -171 -162 -97 104 -9 125
4509 125 -85 249 -56 118 123 -195 -191 45 -219 168 97 -20 61 -18 -102 -221 361 81 79 -80 18 -8 216 -9
4533 -9 -25 37 153 301 -222 79 136 -230 183 -15 -289 397 1 -151 93 -36 235 -145 -2 76 -144 -35
4555 -35 206 -10 213 158 -292 -104 109 24 12 -52 -160 -215 -43 -225 -178 7 116 -360 -179 7 23 28 17 40
4579 40 -91 228 -220 108 -60 -158 -122 -52 18 -146 -49 153 -8 34 115 -54 -31 102 -102 -31 198 15 -39 57
4603 57 -29 -287 10 109 -272 39 -89 142 -87 -26 -102 -26 154 -206 177 171 -1 84 -277 -59 -241 108 129
4626 129 119 186 -133 -91 -29 -22 -78 39 123 -270 24 78 -173 319 158 -24 38 -42 -65 -55 55 171 -140 -138 99
4651 99 76 -181 373 103 -359 -217 -162 -81 -48 154 109 -176 -50 -199 -40 197 45 -217 -211 71 170 -91 164
4674 164 -61 16 90 -432 70 -132 156 300 19 -29 128 121 236 -84 97 -247 206 -199 -35 179 244 2
4696 2 188 211 -210 18 101 -54 66 65 99 200 -59 -174 -41 210 86 33 -119 -168 63 -416 227 -77 18
4719 18 -72 47 -27 197 77 -200 238 -246 221 -202 70 -334 -125 4 -129 -15 -93 -54 67 -112 -42 -280
4741 -280 -105 -341 -178 -82 55 9 -56 75 -279 142 127 101 1 11 154 -201 -107 183 258 310 284 318 -92 -92
4765 -92 -79 -48 -21 207 14 191 -27 -152 -8 315 23 -67 -8 174 -173 -94 9 -51 -65 -75 -18 202 -6 60
4789 60 -53 239 -142 2 -126 2 63 327 -230 -127 35 -260 -124 24 -79 87 138 -7 205 76 -216
4810 -216 -191 173 -272 -171 -92 41 81 153 44 -5 271 394 -17 50 65 30 80 223 210 -200 -26 -114 271 -89
4834 -89 -201 123 204 102 -47 104 77 145 73 165 112 -135 -69 166 17 221 141 320 -40 -188 45 161 -84
4857 -84 -41 179 -128 236 -28 12 117 -308 70 -27 -203 231 44 34 128 -557 -145 -66 -72 -140 44 28 -282 -166
4881 -166 99 100 -130 -396 246 -232 55 -127 -38 -39 190 453 -42 0 -103 349 -24 -67 -160 86 93 134 -133 76
4905 76 180 -300 -120 -123 -280 -188 2 124 120 -90 78 6 289 -77 79 -131 -226 41 306 261 -188 -99 58
4928 58 329 -13 140 275 -306 102 -66 249 66 62 -235 -160 191 23 23 -162 249 174 -227 86 196 -163
4950 -163 203 118 183 99 305 182 -164 27 277 298 -62 -29 274 174 143 -59 59 -217 -323 195 -165 138
4972 138 63 -111 89 145 155 -20 182 -132 -117 157 89 108 67 137 -183 -251 4 181 -92 -253 299 -106 72
4995 72 148 178 -68 -170 -184 -22 229 19 35 -149 -47 -165 -164 -177 -9 -74 -255 -199 273 -293 -79 85 -48
5018 -48 75 107 20 3 -71 32 135 -37 309 82 1 -15 -108 -89 22 -79 -47 -301 179 -361 -2 -243 -65
5041 -65 -151 12 -175 112 -26 320 79 128 104 149 -81 91 -75 21 -69 -161 -9 92 80 -6 11 51 288 143
5065 143 -46 111 12 -168 15 -260 227 4 -33 83 -197 -186 -68 138 -118 1 -233 -157 162 238 141 139 -57
5088 -57 -210 87 61 250 426 -52 -13 268 124 -316 -50 206 -34 -199 126 -77 -134 93 -5 91 -159 123
5110 123 122 47 292 -226 49 68 128 82 -96 -370 -26 205 -124 -119 264 -204 72 219 -228 -425 36 -45 167
5133 167 -140 11 -47 -225 73 -58 -65 -144 -110 -79 -32 73 -23 -72 -426 -144 102 400 -49 -9 140 31 -107
5156 -107 275 -50 261 147 159 -116 134 -158 78 124 -97 -219 113 -49 -5 61 -156 237 -23 -70 7 11 -78
5179 -78 -137 -155 -121 98 69 -91 281 63 -161 155 38 116 -78 -189 -203 -5 -366 -6 -222 -107 -146 -10 79
5202 79 211 101 -235 -142 -148 119 -46 165 -417 102 40 -11 107 29 101 -87 122 -212 -95 -137 -20 9 189
5225 189 -218 441 113 243 296 -252 91 -41 -321 232 223 -149 -133 49 185 -26 164 101 152 -145 -124 -170 -158
5248 -158 -269 10 222 -75 68 266 59 -137 -140 -65 -63 -519 251 217 -100 117 -79 56 -200 112 144 29
5270 29 -37 259 164 -346 146 -260 -123 233 -356 139 162 -156 272 -142 58 184 -89 -162 -308 136 35 137
5292 137 134 -34 -193 -88 -54 -17 81 135 -54 -20 -80 124 5 -67 43 49 -131 88 -340 -305 -177 68 -170 252
5316 252 67 102 147 149 -82 177 66 -81 -104 -60 -211 -15 0 99 123 -5 -192 -70 -156 160 45 -55 52
5339 52 42 64 -55 -119 -107 83 179 -313 378 15 -66 -256 -290 142 -60 142 -70 92 118 94 -122 314 112
5362 112 109 -35 105 -144 65 196 54 -273 7 -207 -8 84 67 69 -71 -32 243 148 67 -36 -179 72 95
5385 95 196 -193 -131 -280 113 13 140 -169 24 -324 89 -137 -284 -88 -159 19 242 -166 33 -171 -185
5406 -185 289 -338 -229 122 -58 -174 10 -63 -163 -178 -180 65 181 -255 -12 -77 53 149 -172 -2 63 -10 132
5429 132 139 189 26 21 146 -281 84 -264 114 60 -98 -109 -197 -73 -222 -11 -3 -98 141 -67 -155 -71 -166 -162 271
5454 271 18 114 107 -137 -98 -169 42 46 20 -388 20 -120 58 -81 113 56 3 -114 94 138 131 173 79 -186 -60
5479 -60 -322 177 -69 -86 326 -15 -40 2 -63 101 -133 -19 176 -130 55 178 260 -8 173 -71 -125 144
5501 144 205 -110 258 -77 95 -497 -47 179 59 107 169 195 103 -81 233 65 -172 7 7 281 -136 155
5523 155 123 2 -88 -64 211 87 -34 -60 -373 145 58 251 -166 60 43 148 -70 -213 59 150 10 -151
5545 -151 215 -195 -249 140 -105 -153 56 -267 -125 163 -17 79 -56 55 -213 -112 28 0 -3 93 262 217 -126
5568 -126 -263 106 -28 185 -184 -58 -128 50 284 36 -180 -93 183 326 -228 -114 23 62 119 67 72 85 -64
5591 -64 -81 -14 15 57 -12 159 -156 108 -155 -2 -2 95 123 -28 -22 221 107 25 -148 49 8 219 138 -236 31
5616 31 53 1 -141 -165 -106 424 185 -61 111 9 120 -224 -34 -295 -62 201 -109 -129 480 -74 18 25 -145
5639 -145 278 238 200 190 -33 -311 32 7 -38 -80 46 -151 148 17 -4 120 189 12 -216 -130 168 274 143
5662 143 65 -242 86 57 141 -60 41 -162 -352 -186 175 6 -41 -265 -273 394 -85 -120 -209 110 11 156 -170
5685 -170 63 138 57 -23 -1 255 -211 218 94 -53 104 -216 156 -20 106 -128 -213 524 104 65 -137 -161
5707 -161 236 191 88 0 172 -18 -188 132 -266 -418 91 -29 -213 -150 -305 -101 -345 -24 75 -91 -94 -58
5729 -58 28 18 92 -139 134 284 -2 -237 -393 -138 146 -14 -154 200 54 -132 199 175 -174 -103 74 -158
5751 -158 191 184 -235 -298 -239 -75 -165 -211 -125 185 -122 -78 152 -24 -411 -235 26 -140 361 83 -170 -22 -139
5774 -139 132 14 -326 259 6 180 -41 -219 3 -80 -133 -35 112 204 -77 127 -313 -53 38 104 -73 -74 456
5797 456 -141 71 181 88 -139 -45 171 -236 101 32 -21 -231 172 63 16 -179 -154 -73 -203 226 -55 39 334
5820 334 -123 74 5 104 46 15 31 47 -68 97 -29 20 210 143 109 71 20 103 -60 286 -86 17 -192 77
5844 77 -225 -68 98 98 -131 -16 321 24 -48 137 -119 21 20 -201 -73 297 -122 -21 77 -19 71 46 -16 -257
5868 -257 -71 -99 -15 228 -279 18 -228 52 -4 118 96 37 12 185 -153 -52 -160 130 -17 51 184 78
5890 78 84 326 -34 -13 361 -185 254 -114 66 -103 148 -77 -143 177 -193 -16 111 -207 86 -42 -5 -124
5912 -124 -138 -56 -269 -19 19 -197 -119 89 211 190 16 157 23 -314 -71 -11 17 214 216 -106 95 127 217 -211
5936 -211 176 -340 153 -94 220 28 195 106 -271 61 211 128 -53 63 96 130 337 10 2 79 -245 -184 -114
5959 -114 5 103 40 6 -153 -31 127 23 -244 270 181 -278 -92 -294 -32 74 205 55 15 74 -65 -10
5981 -10 -62 -152 -40 158 -28 -170 -95 -83 -201 -50 280 179 -136 56 -88 -25 448 -68 170 -54 68 -35
6003 -35 228 83 -197 -120 39 -218 14 35 -41 63 121 -267 498 -54 -49 184 -10 -221 -77 -341 -68 -167 91
6026 91 -223 -115 163 21 164 -143 -67 143 117 19 -85 -200 336 70 39 -245 166 -45 -87 -74 41 -45 275
6049 275 7 -249 -75 -112 -39 -207 -223 432 -136 -145 232 -72 -292 -34 139 326 -79 181 -44 314 283 -72
6071 -72 -122 -24 191 -227 6 35 56 177 4 218 -78 -38 246 19 79 27 258 -155 108 70 -88 -44 31 186
6095 186 259 -90 149 -182 -104 -177 -348 414 -45 32 8 148 -28 -159 85 -50 -33 -255 -15 -233 -133 110
6117 110 141 119 244 -264 143 -111 278 195 22 -6 -60 3 0 -4 -50 -72 304 229 1 -118 145 208 -244 -13 170
6142 170 45 0 -7 77 110 263 -66 -285 -207 349 -263 -50 34 52 -38 -106 -33 67 -74 -90 143 232 180 69 83
6167 83 -224 77 107 -164 180 -62 186 73 -92 -188 91 20 -184 16 60 88 50 119 11 108 -145 -10 -133
6190 -133 -97 -82 -52 -239 130 -124 250 -289 -12 229 -345 254 -68 288 293 290 -84 113 333 60 -128 -28
6212 -28 223 -220 -41 -289 127 -83 -25 -217 175 420 10 -4 -48 -155 -8 125 127 -297 -25 -104 -151 292 437
6235 437 53 4 -298 -18 146 -200 -216 32 -259 -263 -53 19 -283 -4 -20 -11 22 58 149 40 208 221 21 -162
6259 -162 230 -21 -51 286 -145 -120 92 185 12 -119 77 -53 -82 12 24 171 48 40 -26 -69 111 -46 -23 -51
6283 -51 -233 -241 136 327 8 1 24 14 344 195 73 -85 19 -74 183 65 -253 81 280 23 20 -10 115 128
6307 128 -408 -191 -130 -131 108 -91 79 -241 226 110 5 -241 387 289 -231 143 25 322 30 -60 -91 -101
6329 -101 94 221 -186 -24 151 -77 -90 -101 -255 85 -306 -19 214 162 80 130 -261 289 -36 -160 125 -312
6351 -312 58 -114 -150 53 -213 185 203 22 42 246 -232 89 -16 -38 259 39 193 -114 39 57 13 209
6373 209 -2 -26 181 -152 -62 -162 -59 40 141 -18 241 -161 -175 -56 59 -56 -121 66 72 55 -320 -87 98
6396 98 -31 156 118 -101 95 167 -7 103 -117 -57 -23 -299 487 182 69 -211 459 -168 -212 94 11 15 217
6419 217 92 -211 305 -111 122 101 -215 19 203 83 -16 56 -106 -127 291 5 6 -207 25 -271 -59 187
6441 187 28 171 -178 -40 151 13 190 108 -61 -336 31 141 33 -245 -255 145 -14 49 159 98 -61
6462 -61 54 -306 149 162 75 110 153 76 -110 227 297 47 26 83 -21 -240 -46 -56 81 118 -123 -158 243 -48
6486 -48 295 188 -74 -192 17 -252 37 -164 -140 -97 -232 -143 22 176 155 21 -20 27 17 -199 143 32 -142
6509 -142 105 62 -67 -356 163 -45 66 67 -120 -266 -161 -152 161 -3 -98 -155 66 -111 -77 -177 0 139 -143
6532 -143 -10 182 5 47 56 -31 -70 -227 93 -304 123 84 -254 141 84 40 61 -150 207 -57 -165 51 -626
6555 -626 -220 251 294 -39 -152 134 -19 7 48 100 1 207 57 233 212 125 -90 -130 107 161 -8 6 0 -212
6579 -212 -20 282 183 3 -102 -11 -111 -80 43 -192 -46 -310 177 -118 -51 -119 247 230 140 -66 -245 -123
6601 -123 109 163 -17 -400 -28 79 -145 -115 300 -60 137 43 -120 -155 -275 -119 -17 92 -218 -77 -35 236
6623 236 17 -91 -115 -48 22 -134 55 -115 -409 -71 -102 203 58 20 -149 121 -230 270 -70 22 277 -67
6645 -67 -103 -176 -311 -209 -83 31 -136 -112 -184 -50 -118 -47 -106 -350 -105 -253 -220 34 -150 273 -85 89 -29
6668 -29 310 4 31 -17 -18 104 65 -165 194 -216 21 17 92 51 -99 9 -31 78 -212 -2 88 114 6 91 -287
6693 -287 106 -39 -232 72 -36 -354 -84 242 77 -37 46 129 -113 344 107 -147 106 -88 -84 31 -115
6714 -115 -58 -157 -249 -60 88 161 -59 -42 77 100 -175 125 229 -48 115 -106 -124 -126 28 -28 -73 -79 39 -38 -105
6739 -105 -156 259 -71 -96 -20 122 -331 -32 16 169 10 -43 193 37 -86 69 404 -122 94 34 159 -152
6761 -152 -195 -196 61 -50 83 -38 26 -237 160 16 -120 -141 -39 35 202 80 -117 219 46 65 321 -2
6783 -2 300 67 13 -27 52 155 47 77 -263 -123 94 -162 175 346 -264 -348 117 15 277 -36 -278 -136
6805 -136 -11 -153 -51 282 254 28 5 196 6 258 2 -160 81 -1 -3 61 134 145 -30 47 -179 23 -136
6828 -136 7 31 -78 118 7 -387 -61 100 150 -7 -136 247 -16 9 106 177 130 20 101 72 -10 -175 166
6851 166 228 -24 -81 -230 -54 -61 139 -200 164 258 218 -126 130 -83 -231 100 252 29 -166 -17 -39 -36 121
6874 121 -93 -143 188 160 -494 -15 200 -222 -88 186 51 338 88 133 -37 -117 34 223 -52 -165 175
6895 175 576 140 93 234 232 -57 -12 -270 -251 327 -140 265 12 -160 -91 70 265 51 -106 -62 -24 262 -139
6918 -139 -158 -7 -3 -227 -223 -42 -131 -149 234 181 -288 -126 334 -3 -87 215 69 -180 12 152 180 -75 59
6941 59 -144 -29 -262 -51 156 237 67 -287 -25 -183 295 174 42 89 104 175 -236 -111 -21 -187 -140 128
6963 128 255 28 -167 -418 198 280 138 -189 112 40 -29 89 55 235 -76 4 132 173 -91 -132 -278 -52
6985 -52 -37 -43 -313 -63 76 -253 -182 86 213 -116 135 177 162 -280 -101 299 -340 -32 -10 87 -32 -1 47 205
7009 205 166 88 8 -308 154 -57 -74 27 64 -213 344 -100 -83 61 290 -221 -40 80 88 0 4 119 178 209
7033 209 -153 -410 -88 -186 71 200 198 -211 132 -48 85 197 -4 -130 81 312 -19 81 294 -190 -99
7054 -99 56 -136 194 109 137 84 33 139 -42 78 77 90 227 83 -73 81 -123 -83 174 48 106 -1 244
7077 244 292 55 42 69 -10 -61 -77 -194 24 33 -283 43 189 -243 -140 59 -167 -35 15 -144 -15 -228 207
7100 207 -105 47 21 -65 -44 -73 -257 -136 -139 47 13 -15 -170 -7 241 122 147 -6 -42 -3 212 -106 39 -137
7124 -137 232 30 -224 -230 304 62 -30 -217 -217 314 62 -143 185 -252 73 243 -170 163 95 -48 -126 78
7146 78 -178 237 -245 -13 -35 -175 -229 -115 160 234 75 -28 297 -44 152 -9 46 -77 71 -91 -300 42
7168 42 -120 132 56 57 -123 -39 46 137 -102 173 -118 108 200 332 264 311 46 32 157 12 149 -55 -113 97
7192 97 -85 -97 -16 -68 0 -244 95 20 131 100 -234 46 -179 -150 -90 67 -91 -70 219 -48 252 28 138
7215 138 -340 62 -84 -55 152 -383 82 -315 80 -50 60 -62 75 237 -136 -43 36 -51 -61 -5 -75 -165 -43
7238 -43 9 92 4 -87 -167 -75 104 -351 101 255 60 238 94 362 175 -50 83 492 119 -257 -55 -194
7260 -194 68 98 14 224 -87 17 166 -3 -142 184 -156 -142 -167 199 -28 39 -80 -22 39 91 -255 -68 -277
7283 -277 -39 -286 97 87 165 111 160 26 -240 75 -101 -373 192 121 26 -58 83 266 13 142 -156 -21
7305 -21 -179 18 388 121 -120 -22 255 -22 154 -71 143 -201 33 -87 -162 109 -46 -101 -80 -31 144 -436
7327 -436 -72 -71 112 61 22 161 -92 179 -79 178 -158 52 -235 -79 36 -185 -76 -27 -89 138 1 81
7349 81 67 63 44 -8 -127 -51 99 -270 102 -74 227 -45 136 156 -250 117 -20 -114 -96 -32 -183 -3 30 -21
7373 -21 -142 -49 82 265 57 -112 -307 436 62 -235 -263 -102 254 -278 85 118 -147 -164 -126 -54 80 -117
7395 -117 -153 -146 139 -98 -117 60 -125 129 38 158 63 -226 -252 -29 61 112 359 -262 -78 -235 64 -316 -70
7418 -70 -149 -67 196 -200 86 11 -32 70 -63 -81 49 -266 16 -86 219 -76 -3 -103 -173 201 43 142 71
7441 71 10 -204 -52 -121 -41 -307 7 -143 -52 101 -7 -90 1 82 228 38 -54 -28 12 -186 17 -45 -133 -56 -574
7466 -574 -35 -14 -17 -314 35 84 -149 203 92 -57 38 10 -135 -163 162 -51 -191 209 252 -100 -201 -80 -181
7489 -181 62 221 -158 57 272 43 244 31 -306 6 -128 -346 -9 142 -319 245 -31 -460 45 162
7509 162 107 183 76 -264 -499 148 -206 39 -146 -276 -96 -149 243 -363 -276 110 109 101 98 175 -48 -85 412 -222
7533 -222 8 143 150 -222 244 -64 -80 -96 348 -13 -339 -152 -125 20 -204 20 -259 -215 -130 -32 -281 -64 252
7556 252 244 129 -83 -41 263 297 23 -139 -98 82 73 88 350 -171 -25 -117 50 430 -191 134 -255 85 -102
7579 -102 47 81 184 193 -22 142 -26 -337 -131 176 252 -125 -102 -17 -152 18 -333 -4 -173 24 63 -63
7601 -63 196 293 -196 51 186 63 -447 -91 -173 110 91 10 170 -25 253 81 139 -171 59 -99 -207 131
7623 131 213 116 -48 -38 71 30 116 96 -218 -102 158 229 20 -230 30 188 130 -212 -120 222 -57 247 -230
7646 -230 -373 55 -145 -105 -233 -35 67 -247 193 -95 58 -108 70 -117 -267 -151 153 274 266 53 -141
7667 -141 -20 -286 81 73 24 -76 -29 -67 -258 194 1 9 179 56 -56 -71 7 -91 94 -55 239 35 138
7690 138 -52 -211 -52 -476 -146 -13 461 -129 100 -207 59 316 18 93 -290 -35 -103 -23 -50 -223 -198 152
7712 152 -145 -133 201 -178 -110 233 90 48 -252 248 -129 -4 46 123 -348 68 52 85 370 -153 32 56 -199
7735 -199 8 179 -232 38 234 135 -142 -10 -202 82 89 305 -283 -78 -6 -122 353 128 64 -273 -82 15
7757 15 118 120 -105 -39 -116 211 143 62 403 24 -183 -38 -210 100 263 114 76 169 100 -25 212 243 88 45
7781 45 -35 -142 177 13 35 201 92 8 -28 175 -2 -44 -161 -216 -95 -84 273 -144 -186 257 -381 106 307
7804 307 -32 -111 395 149 -161 -145 137 -15 -335 46 75 145 182 -69 -36 71 -169 -148 1 223 -43 -164
7826 -164 166 227 49 -71 157 -329 185 -331 86 -153 303 -170 -89 6 -87 75 -192 -135 174 -7 -127 -74
7848 -74 -223 -67 283 -180 -74 -133 -11 59 125 -62 45 78 -167 -191 98 81 -174 11 37 -234 292 29 -227
7871 -227 -192 -186 48 -87 92 168 24 -166 274 -23 -80 259 60 -92 -307 -26 -7 273 -66 114 191 97 -200
7894 -200 -55 93 -218 -122 -85 -173 155 -134 99 -53 -200 -26 55 123 231 70 -184 15 377 160 -187 -10
7916 -10 -210 25 75 -192 -316 95 27 18 -67 234 -200 108 -68 -260 -64 24 225 -67 255 108 29 83 34
7939 34 -220 -34 -225 159 278 -86 36 -206 -280 -134 -185 109 -239 27 72 109 125 41 95 78 206 173 21
7962 21 155 172 -172 61 297 38 70 -31 92 59 -15 0 -25 116 80 127 -119 240 79 7 50 -61 -153 -7
7986 -7 -34 160 397 60 -183 -107 -29 -242 -250 242 265 -84 -231 55 -102 -17 -70 -218 65 105 -131 -160 -61 115
8010 115 -47 -307 13 -157 -151 29 -117 69 118 162 -151 -20 -30 86 218 124 -53 61 -92 -24 193 65
8032 65 53 2 86 71 -134 -73 100 24 -42 -182 -238 219 -127 -80 -201 76 123 316 -128 97 67 50 133 -202 192
8057 192 -253 -78 -164 208 24 -220 94 -102 -54 -164 201 73 -57 347 140 -72 -59 -49 -105 36 -54 -6
8079 -6 478 -3 -192 -174 11 -164 -162 28 224 169 -59 -16 171 -126 -49 -39 -13 45 79 8 -188 -22 -327 -151
8103 -151 -106 -124 172 2 -106 93 -105 33 32 -131 101 -104 85 -191 -14 15 30 97 -131 -238 -142 116 -114
8126 -114 -137 -78 234 106 5 43 -172 -70 -135 -70 100 -107 62 -46 -46 202 2 -72 116 168 -26 -275 119
8149 119 305 38 -226 76 -70 157 72 -45 -79 -511 -94 282 317 68 218 -132 148 -73 91 25 -329
8170 -329 -180 28 -286 -150 133 0 42 -103 79 377 -124 188 -150 -136 -3 9 -8 176 -232 81 251
8191B51
$$ Imaginary data points
##PAGE= N=2
##DATA TABLE= (X++(I..I)), XYDATA
0 0 0 0 0 0 0 0 -8 8 -8 8 -16 16 -24 24 -32 34 -45 49 -61 71 -82 96 -110 128 -147 167 -192 216 -247 278
30 278 -312 350 -392 438 -488 542 -605 671 -742 823 -912 1008 -1116 1238 -1371 1522 -1692
47 -1692 1890 -2115 2376 -2688 3068 -3536 4136 -4932 6041 -7703 10467 -15889 30559 -151679
61 -151679 -458558 -160232 -32999 -206793 -235937 7940 8819 -192059 -185481 -26753 -97897
72 -97897 -226813 -129685 11358 -49228 -94938 1612 19366 -128666 -193797 -119503 -87614 -122551
84 -122551 -92261 -31109 -27924 -45580 -41202 -67552 -103462 -79674 -31304 -20189 1910 56593
96 56593 65044 16541 -3597 533 -29808 -50319 -10238 20415 5496 17439 56982 30331 -41198
109 -41198 -48315 -11283 -12587 -10852 44606 81869 59040 52877 73152 42489 -8655 13356 61113
122 61113 46497 32598 83118 100762 28766 -25165 -7302 -10715 -56208 -52926 -6448 -5855 -36339
135 -36339 -27797 -17302 -60881 -101686 -81121 -47589 -44006 -33014 8089 32346 18726 789
147 789 2815 12942 19328 21489 34180 65479 88359 72317 41671 32783 22841 -11184 -25972
160 -25972 1162 14262 -10077 -13843 10505 -4778 -52632 -55185 -22888 -26791 -39185 3717 52905
173 52905 39155 13175 32840 45456 17591 11757 47354 58361 38864 48280 69656 43577
185 43577 -966 -5132 -124 -23844 -36043 -10284 -35 -25054 -36038 -27261 -40711 -65859 -60417
198 -60417 -42116 -42666 -37473 -8833 4335 -15338 -26201 -15338 -16356 -26420 -14774 7526 10983
211 10983 5554 11599 11804 -7053 -21195 -20168 -19251 -20646 -11327 2073 1684 -7427 -14138 -17687 -21237
226 -21237 -19522 -14560 -8056 4979 19067 20319 13706 13200 13194 4302 1352 15892 28585 26266 24982
241 24982 31068 25917 10610 4977 7601 2376 -1134 11282 22684 15850 6262 7339 3476 -9144
255 -9144 -10815 1018 6198 4405 9751 16833 11278 793 -1371 -2746 -7864 -6014 4547 8598
269 8598 3413 412 -2001 -9874 -17847 -18197 -16426 -16278 -12266 -4732 -1990 -5804 -9256 -10652 -12828 -12327
285 -12327 -5166 2257 6104 9455 11580 9011 4894 2579 -194 -3439 -1407 4567 7016 4877 2631
300 2631 -516 -7170 -11739 -10119 -7639 -6495 -2047 4941 6456 3546 2712 2811 -1016 -3193 3082 10500
316 10500 11317 10227 11432 10405 3300 -1359 -1398 -2065 -3969 -1844 2241 2356 -1797 -5306 -8316 -12282
332 -12282 -14284 -11638 -7771 -6326 -4653 -2587 -2493 -5774 -7899 -8309 -7484 -6335 -2936 1831 4298 2637
348 2637 336 -1329 -3214 -4892 -5677 -4540 -2301 -1167 -878 -1431 -3593 -6578 -8662 -8259 -6373 -3576
364 -3576 -345 2462 3361 2187 1835 1362 685 88 2162 5258 6790 6943 6542 5012 1309 -1623 -2311
381 -2311 -1857 -1551 -147 1451 2403 909 -347 -1240 -3036 -3694 -2201 1026 2854 3712 4150 3454 956
398 956 -943 -1254 -1410 -1310 -303 1169 2357 1488 -496 -2183 -4034 -4682 -4448 -2693 -964 150 503
415 503 47 -991 -2093 -3155 -3276 -2621 -1392 786 2295 2657 1019 65 -290 -420 -611 95 1823 3045
433 3045 3225 2957 2636 1143 -651 -1799 -1093 -380 422 1222 1775 819 -55 -621 -1277 -1301 -1407 267 1719
452 1719 2181 3001 2734 1222 -283 -830 -96 228 750 1599 2268 1737 833 -460 -1077 -1845 -1898 -774 11
471 11 885 1230 809 92 -1036 -1599 -1320 -1071 -564 526 1310 1105 426 136 -833 -1006 -903 -525 1046 1346
491 1346 1789 1812 1634 864 47 -166 128 681 790 1798 2105 1625 683 95 -280 -756 -650 213 1005 1134
511 1134 1039 1308 537 -326 -1123 -485 -147 170 725 1434 1065 302 195 -540 -1079 -983 -91 289 327 901 921
532 921 1 -784 -465 -906 -962 -627 170 33 3 110 -158 -789 -1367 -1062 -1085 -729 -319 204 168 -458 -711 -737
554 -737 -1101 -1471 -588 -40 5 355 494 -6 -719 -832 -678 -801 -290 261 650 376 -195 -127 -257 -1416 -1025
575 -1025 -661 -267 172 231 509 -52 -188 -554 -403 -545 -214 23 310 408 469 549 -29 -702 -441 -190 156
596 156 229 428 428 362 60 -160 -245 -307 -214 259 405 938 912 772 415 235 42 359 82 344 419 328 706 344
620 344 58 -157 -174 -258 -132 174 391 259 62 365 333 -169 -340 -78 148 77 558 306 674 -37 -86 -61
642 -61 -525 -266 118 89 -171 -123 -3 -167 -311 -326 -101 -559 -425 65 -17 188 -266 -310 -237 -237 -557 -109 -143 -50
666 -50 103 379 65 -16 -94 -298 -45 96 -310 -21 -9 261 44 -187 -252 -194 -44 -205 5 -13 200 323 -24
689 -24 285 -86 -192 178 -30 75 243 245 84 -222 -204 -452 -287 -209 -72 -57 -21 -35 -68 9 -156 -31 120 -74
713 -74 -160 212 279 21 103 80 -171 -133 -287 46 -164 216 -72 80 120 -148 8 126 -347 -128 31 444 169
736 169 26 363 -36 -320 51 -181 194 39 131 152 215 247 -50 -173 28 43 -214 336 117 259 101 160
758 160 -92 26 -7 -357 45 122 33 724 422 134 338 -63 -9 -17 -150 265 142 55 234 -37 231 -282 137
781 137 95 96 9 33 485 195 176 123 -182 96 -103 -22 225 110 136 44 119 -5 106 445 -340 -41 -39 -108 105
806 105 280 -435 -50 -19 -190 -165 -316 -196 -212 287 -1 173 49 -81 -39 -106 -113 118 96 -218 -100 284 223
829 223 -64 -254 -79 -367 -10 -89 -121 -123 -271 -101 -87 -52 -104 -130 141 49 384 104 15 -40 59 -18 32 96 98 -61
855 -61 34 -59 -228 -209 -115 -29 -32 146 -75 527 371 -361 -34 169 214 110 261 127 155 -347 -86 -127 -273 19
879 19 -61 -173 85 -194 -115 -162 133 -109 -7 -222 -299 57 -36 -52 -245 -324 -115 13 -170 22 50 48 28 29 110
904 110 121 28 -191 22 -31 271 196 -239 -26 -40 172 119 6 332 91 59 298 72 208 83 139 -138 277
927 277 199 322 103 6 -229 68 -211 -224 -139 -444 -69 99 -434 -44 -118 122 -311 -78 -133 -16 38 -260 -359
950 -359 245 49 -77 -79 2 90 -3 -79 86 -122 65 -89 -60 64 -51 -141 -299 -10 128 72 306 -51 -159
973 -159 78 -283 290 -253 -52 -285 -232 -18 73 35 -336 64 256 147 35 111 118 -179 -158 -74 183 227 64
996 64 -230 108 232 -158 100 133 28 -165 -200 25 -2 -188 -128 28 19 177 -35 -92 -33 170 4 87 184 -274
1020 -274 57 -132 84 -171 90 -226 -269 156 60 1 -163 -112 -97 224 56 148 315 133 359 -164 290 10
1042 10 -37 344 -124 193 108 13 -62 -72 132 107 -50 -8 34 20 -177 316 -45 -113 -82 8 205 -205 -261 70 -17
1067 -17 6 183 64 268 -254 -108 -186 32 79 -54 -90 -518 -4 20 -67 -177 10 -39 -241 -2 -57 -222 -105
1090 -105 171 32 -99 -82 77 132 -13 9 88 131 167 189 203 225 145 -32 176 73 -108 246 -66 -94 119 243
1114 243 -32 90 33 -161 -324 336 5 -16 58 272 95 182 176 11 12 -151 119 -46 -151 -114 92 -25 -74
1137 -74 89 -338 97 -65 93 19 -65 -75 70 30 135 108 -8 290 337 -37 173 53 -100 -131 -28 -19 169
1160 169 170 121 35 -338 -234 170 43 42 57 -41 -97 100 27 -267 -42 -142 129 62 13 -132 -58 -188 -90 -194 -250
1185 -250 97 -3 -85 -94 -220 63 -231 -30 -19 -102 7 -148 -237 -46 183 -89 9 -66 123 193 -125 -220 173
1208 173 -164 58 209 -11 -84 -86 48 176 -56 -38 -134 148 110 49 -428 -47 310 -137 -247 22 -148 -133 -172
1231 -172 148 235 24 6 199 -64 15 246 -163 -96 -48 -69 56 -117 -127 128 -263 -196 61 103 115 -110 -71 -45
1255 -45 -27 -86 -132 -25 -18 -38 -297 130 71 113 208 236 -20 189 -224 -136 27 189 154 -130 -183 156 -141 42 -144
1280 -144 -162 44 -156 50 22 113 -117 91 106 -107 -212 -126 -57 46 169 60 -5 -6 -97 -191 57 -42 280 69
1304 69 291 7 -33 -258 -70 -12 101 -63 57 377 -35 58 -182 -129 -337 45 -40 -75 -45 -37 86 119 -121 74
1328 74 473 114 130 285 -35 -3 -69 -421 -167 -313 1 -23 201 107 -112 132 121 77 -160 -142 93 148 283
1351 283 -87 232 172 54 11 -62 -42 -160 31 90 -122 -71 74 123 257 -95 -360 15 -158 14 112 -43 -105
1374 -105 -277 79 -143 -83 -190 17 1 -16 19 -210 201 114 -150 -5 -128 -124 188 122 4 -13 -89 407 247
1397 247 -108 -72 -100 -100 -288 -72 -156 -258 177 155 -276 -85 -43 165 -304 -234 110 -264 118 -210 -28 200 -94
1420 -94 -138 271 164 -99 -31 37 16 -44 86 -24 -219 -19 81 191 -86 186 -82 -90 63 79 -66 212 -230
1443 -230 1 -88 46 -42 59 -201 139 100 -231 485 -80 -369 -57 147 62 -201 226 101 21 53 -22 -148
1465 -148 20 -126 -94 203 -316 52 -70 -59 52 58 -255 -183 -113 122 -304 -28 260 75 -51 71 -65 -52
1487 -52 -103 52 129 78 50 113 -199 44 -103 -31 6 -22 -220 84 -97 111 -158 -65 -294 -19 -317 -124 -61 155
1511 155 32 -290 102 124 163 -17 74 -16 -399 8 -190 13 -105 -326 -11 -68 198 -90 434 -157 230 264
1533 264 -100 163 51 -51 -166 -143 71 8 20 83 53 -132 -153 39 92 251 89 166 -84 -41 24 35 -156 214
1557 214 -36 -40 165 -97 -70 -20 -42 -110 -154 -156 430 -12 7 -77 46 -42 -15 62 -15 139 -196 84 78 87 -204 -151 57
1584 57 -428 152 72 66 224 -164 -162 -225 246 267 155 -126 -204 295 -212 155 24 -118 103 103 195 326 186 205
1608 205 124 115 65 159 83 233 19 23 118 -180 139 38 59 -18 16 -269 63 -146 109 10 -105 -32 39 -110 -35
1633 -35 26 191 77 25 67 -2 -26 165 2 42 -76 38 101 -10 74 363 23 -122 -169 -91 -183 -225 -191 -255 -230
1658 -230 31 -26 103 25 -80 -153 124 -69 -50 21 54 3 117 72 88 353 -7 -18 105 -161 -5 91 -184 68
1682 68 -53 99 -197 -98 -66 223 26 -287 -253 -164 -21 130 2 294 202 -83 -39 -10 221 154 -211 -268 241
1705 241 -1 -10 359 -109 -107 -89 30 104 9 -122 -113 20 -85 -47 -231 -78 -56 24 -411 20 -61 47 -123 312
1729 312 32 -2 76 66 98 -32 -46 -101 61 41 26 -147 -62 -272 -141 23 -179 182 210 60 96 153 -90 -126
1753 -126 40 -9 -282 -7 93 -9 14 131 -277 28 -197 -204 124 89 165 36 246 -166 -119 -320 -60 -57 133
1776 133 -60 191 45 38 62 38 312 -35 149 374 99 -126 260 174 36 243 145 -202 223 -29 116 378
1798 378 19 -82 -65 197 23 110 -60 -106 -16 -306 -201 -91 111 119 -6 11 -62 -54 -43 -19 3 -135 62 10 -116
1823 -116 -45 -61 118 93 -22 -51 135 91 42 -23 149 90 -60 -135 60 -68 -126 81 257 155 -151 -135 -20 -341
1847 -341 -199 -153 -164 -361 200 210 -64 -95 -210 55 248 -77 27 -259 117 168 75 19 -64 47 -207 -44 6
1870 6 106 139 110 -246 46 20 -152 236 127 -231 -31 -26 -28 -67 69 -171 -45 6 172 -248 20 -59 116 145
1894 145 183 27 268 8 -92 -213 225 -19 43 231 59 97 268 -300 236 40 32 -70 -34 51 8 -176 -57
1917 -57 155 -97 5 22 -25 -196 -71 61 182 -144 -159 86 -226 -117 162 -252 -79 -65 -21 325 -90 -51
1939 -51 171 -19 202 -62 -89 -10 -7 -171 -91 -187 11 156 9 -264 147 56 -132 -243 290 -109 160 -17 -361
1962 -361 180 105 71 -428 -131 127 -117 218 -165 98 111 -337 -217 -95 3 -179 -175 79 -147 105 -237 -159
1984 -159 -29 -78 -36 -53 168 325 155 69 -169 8 121 -21 130 -282 -47 81 -55 45 153 -104 44
2005 44 -287 67 -193 -246 -121 -17 44 -168 166 -218 -50 -128 -120 239 -67 -171 50 -52 188 38 89 23 -251
2028 -251 -147 -4 -133 -47 145 165 -43 -110 22 -76 -323 89 -106 -43 -275 -156 -68 -183 63 -90 -168 -71 213
2051 213 -71 -275 -75 158 47 -83 52 213 101 -177 -46 60 74 -111 100 -221 72 -85 -97 81 413
2072 413 252 -93 365 171 397 229 146 258 537 23 -191 -201 -198 -307 -101 -7 -86 -341 -59 62 -38 112
2094 112 237 -68 42 395 99 -190 61 186 -150 -88 -66 -43 -97 -64 99 76 29 -182 90 107 -180 -64 79
2117 79 -233 -75 150 -13 -108 -47 80 -234 -43 39 -104 71 83 104 -11 162 -13 16 -124 -291 -130 185
2139 185 31 26 -54 204 -212 37 203 -189 67 115 -17 129 -75 -14 -58 -1 -14 165 52 -317 260 -97 275
2162 275 121 -119 187 210 182 63 116 79 21 227 -9 -154 -79 -131 -236 -51 221 93 -10 -12 37 -290 -38
2185 -38 -22 317 111 -82 269 -106 70 49 -137 58 194 -218 56 -137 60 -212 -149 107 -232 225 76
2206 76 -282 -162 -172 -230 -110 -114 1 -150 8 -212 263 226 -199 -37 334 79 -302 163 -83 -128 231 162 209
2229 209 -210 -4 -188 25 -68 -41 349 19 -81 -140 -94 -124 152 200 86 215 26 40 -253 208 31 -40 -56
2252 -56 49 -27 -55 29 -115 180 188 255 -159 38 44 -171 -221 86 52 -26 -146 -15 66 102 -153 -108 53 161 -151
2277 -151 -60 -21 -31 -143 128 -289 14 -129 -351 190 -151 267 -24 -117 21 -51 72 -15 138 -27 -200 -108
2299 -108 -6 64 -78 -63 43 -135 -138 114 143 -136 359 -29 -106 32 -392 294 -4 -29 -224 86 -87 121
2321 121 -102 125 178 165 -24 -44 -122 13 101 85 -4 290 322 -173 51 -86 88 -15 242 -155 259 49 -162
2344 -162 112 149 86 -52 -429 -87 -127 13 -75 110 67 11 -51 89 -46 71 66 -134 -486 99 -125 25 -12
2367 -12 -346 188 -46 -75 91 93 -109 -257 164 176 340 -15 100 79 115 -151 49 17 46 206 108 237 37
2390 37 32 -116 -6 221 -123 92 -21 137 -74 111 -87 -27 -160 91 10 -232 27 -200 -127 -65 -146 130 64
2413 64 132 56 -152 100 -1 207 112 -24 -37 282 116 -18 -259 82 -22 -307 88 -150 -3 -198 -22 315
2435 315 150 187 149 190 239 -341 64 307 -168 -30 -121 -212 20 -65 -27 230 208 -104 -334 -6 322 -250 141
2458 141 86 71 -156 159 64 -107 -16 79 248 77 24 55 45 201 -70 156 238 77 -62 -13 127 207 -143 -248
2482 -248 -78 141 138 169 -78 103 123 -95 175 -56 166 -22 -449 -148 -10 306 -77 246 -285 161 16
2503 16 -26 -139 17 19 54 -561 -239 -35 -72 -72 18 118 -151 -11 -25 -30 -101 46 50 95 -253 31 -316 204 -24
2528 -24 -42 61 105 150 175 -127 -152 173 -139 -28 -548 362 -130 -53 -240 32 -190 -4 98 345 -175 48
2550 48 13 37 -146 -334 -235 38 68 98 102 -185 -237 -251 241 -107 -109 -188 132 19 89 -5 278 15 -196 184 -34
2575 -34 86 40 -8 -116 18 -169 -226 256 -226 29 115 -160 131 -48 -143 79 129 256 -132 -120 -308 28 355
2598 355 185 -53 79 87 258 -63 -142 -24 -173 211 74 121 94 34 -5 264 -204 -12 160 -54 -174 62
2620 62 -169 -96 -20 73 -220 266 -6 142 59 -58 224 179 -45 12 -401 108 -185 18 20 87 390 4 325
2643 325 88 -41 348 23 -154 66 -55 -60 55 -60 -20 275 -135 207 230 224 -101 114 -192 -23 281 -27
2665 -27 34 80 -113 -159 -35 -2 93 -53 -138 -82 56 -172 210 53 -130 -106 -171 -161 127 -78 -41 149 -256 26
2689 26 116 -124 246 2 -28 -35 -59 -303 134 5 -141 44 46 59 -113 250 -39 35 180 119 197 -48 68 27
2713 27 116 97 -94 -45 -148 175 26 -37 59 -170 182 -216 -248 -70 -3 71 6 -78 59 -44 -480 105 -170 -49
2737 -49 -127 165 -32 202 -46 106 75 -211 -112 -340 70 436 -36 -206 -12 133 27 18 -234 -13 93 -55
2759 -55 146 -48 84 367 130 -43 34 -151 -40 -151 -26 68 -19 -62 157 -71 -147 -334 59 276 216 54
2781 54 5 80 -172 -311 -96 233 -241 -13 -116 141 -50 58 -106 -85 -13 204 38 -248 64 -192 126 254
2803 254 35 -323 123 73 302 -179 65 116 9 98 104 72 -162 104 -69 111 76 5 -235 -242 54 -4 37 -304
2827 -304 -3 6 27 -128 56 260 111 -169 333 261 230 -275 174 -46 -15 -128 137 109 -163 115 91 119 76
2850 76 -259 -111 43 -33 -241 86 91 27 -378 -92 -188 264 -14 51 -180 234 -33 50 107 -130 195 -112 309
2873 309 -71 -106 16 -42 -189 -110 -44 95 -49 -94 172 51 8 -416 130 -126 320 484 53 -155 32 -48
2895 -48 -231 159 -73 -332 -154 -103 -200 50 75 206 96 -100 -105 -277 46 -241 -14 248 1 -36 13 43 -207
2918 -207 34 34 95 78 103 -165 34 -30 -144 -121 18 -243 -51 -57 -128 -86 -348 29 195 -225 92 5 -194 -162
2942 -162 -45 -62 121 173 -32 -237 -212 87 44 167 14 -97 -117 39 -61 -169 -168 107 97 157 13 155 146 -102
2966 -102 -13 203 -41 8 104 40 -214 -52 183 263 79 -59 143 235 -104 330 -153 228 8 -99 103 -215
2988 -215 106 -118 242 194 12 -377 -210 -301 -128 421 -203 89 -57 -29 -13 -87 -201 -27 -69 -209 314 -96
3010 -96 254 34 -207 -324 -44 107 -370 -170 -127 87 77 -52 70 115 -287 277 -41 -36 -278 -251 190 -32
3032 -32 45 46 134 -172 -1 -146 121 -42 144 196 53 197 3 -341 -97 206 111 -195 -139 -13 81 -91 154
3055 154 203 62 -65 -277 -23 -21 74 62 -253 -59 261 58 51 -186 -52 -113 181 82 -276 262 300 131 203 4
3079 4 -106 -47 15 160 -314 -77 86 94 91 82 -45 -221 64 -100 88 138 -123 106 -45 -357 -13 145 -88 -179
3103 -179 -110 63 -106 -68 174 -321 -384 -152 -14 32 -163 228 163 73 118 -267 91 148 -235 73 -5 84 -37
3126 -37 -16 -33 -153 67 0 25 -73 127 -158 -22 -260 -87 81 -103 37 -154 -44 -104 100 -142 18 -370
3148 -370 124 115 -7 -107 -86 -158 168 -42 94 64 6 -45 62 -80 -116 132 42 -185 128 187 -285 83 176 223
3172 223 243 -8 180 -222 -30 90 113 -241 -94 -191 76 -167 268 24 -67 -93 110 97 23 322 -54 192
3194 192 -48 -39 -86 6 17 71 133 -21 -131 241 32 269 -38 263 74 36 -107 45 19 -205 0 -201 -36
3217 -36 -202 -187 -167 63 136 -122 -12 192 -153 -129 -69 -143 -259 159 -26 111 -206 50 16 45 219 -309 -45
3240 -45 43 -23 105 -34 -129 -101 96 -21 -602 230 -328 30 -182 -70 35 80 167 241 -34 -141 113 125 77
3263 77 39 94 -30 19 -143 -165 -42 111 -17 26 -17 47 -148 -167 -9 -353 18 26 137 194 182 -118 -26 57 11
3288 11 -96 -121 188 -185 -1 174 79 20 161 -35 -251 -82 -225 10 31 -265 -42 201 46 -36 -166 -60
3310 -60 175 -119 82 -163 273 -28 40 -50 -415 175 -221 -228 -19 9 36 178 62 -60 -4 187 -109 86 -53
3333 -53 237 90 207 103 226 110 -86 108 -50 60 -111 116 -259 -288 -96 -226 -103 -69 -36 33 -29 116
3355 116 -102 152 117 -15 14 76 -1 276 41 -164 1 166 -258 -176 261 224 -445 -325 284 39 188 -39
3377 -39 -51 -234 -87 -195 108 -106 -264 53 -1 42 65 14 -173 47 -156 -60 -64 52 163 74 -228 -172 89 -43
3401 -43 -218 77 26 22 202 23 12 43 -126 59 148 132 227 121 -49 -41 -116 -96 167 -225 163 -173 166 -170
3425 -170 291 142 -383 -205 -114 99 -192 -92 210 249 -42 61 -44 -16 120 25 134 -11 215 208 229 70
3447 70 -246 -248 -103 169 -184 164 108 25 96 -210 -128 -139 35 23 51 -341 296 279 -299 152 238 27 -275 152
3471 152 -217 188 -79 264 357 -12 -59 -265 18 -256 26 -27 91 -270 101 -43 -334 -136 -73 -29 204 -121
3493 -121 58 27 25 -116 230 -154 -38 -183 -63 225 -5 185 -213 101 151 268 -120 45 75 285 -76 163
3515 163 -82 121 -246 -124 21 51 173 -88 186 -2 284 -86 35 -115 135 -125 -234 -70 -111 -99 -137
3536 -137 -91 232 210 -188 -45 -348 -109 80 84 -9 -209 87 35 -30 -142 -130 159 93 234 -268 69 117 256
3559 256 377 -122 -52 169 67 -183 -141 -390 381 -147 -94 -201 23 -37 275 288 -136 129 -54 129 -111 -44
3581 -44 96 -105 19 -4 9 -4 -152 180 180 122 56 17 139 -84 -41 74 -447 -49 -45 9 8 -51 -10 -256 243 4
3607 4 -158 -146 115 -255 321 -119 31 -124 75 -126 -24 -139 -195 -3 -100 324 101 -59 -209 151 36 295
3629 295 54 -146 -198 73 329 99 107 -22 322 210 -171 287 -129 25 64 -185 127 169 -92 165 137 -306
3651 -306 -98 -87 121 -306 -292 28 -463 107 174 -49 128 -5 20 -80 352 -51 -7 -148 -47 84 -19 106
3673 106 -200 -167 119 206 -288 -25 -200 141 118 -122 74 138 10 -263 -15 -239 -94 220 101 142 89 -107
3695 -107 51 -279 -51 158 -60 -228 20 62 219 -35 -59 -24 -48 -157 35 -269 -2 157 44 -63 -82 -134
3717 -134 14 -240 74 -51 -50 -43 -258 210 -166 188 -313 -43 -85 -27 35 -180 -6 -52 147 143 56 -200 0 172
3741 172 -317 -29 16 -12 175 -188 212 -91 25 225 -80 -104 7 -78 94 93 51 129 178 14 291 138 -144
3764 -144 -57 -149 -25 350 -48 39 133 114 -14 -139 -162 -317 7 -17 183 28 189 -60 124 -133 -8 -20 -54
3787 -54 -67 223 -243 -125 41 -73 -72 -53 -43 -23 -95 308 -81 206 16 -80 240 0 190 -161 -16 230 -135
3810 -135 -89 -78 -22 137 -392 107 -415 -403 108 -425 -100 -125 39 213 -17 68 -313 85 -3 -11 -72 -293 -85
3833 -85 49 -149 52 -201 -14 -75 81 -408 8 -163 42 272 -234 116 -80 -16 -228 194 152 -202 -176 56
3855 56 121 73 105 -75 138 -109 -38 122 -27 -51 153 -173 -280 116 -19 -53 -283 -63 -218 3 -11 201 -104
3878 -104 -68 -76 116 19 -299 64 -27 -188 91 35 -12 -191 -166 73 -11 178 133 98 -184 -53 70 48 97 66 -309
3903 -309 -123 191 157 85 -187 -64 222 -25 -158 167 -108 -205 171 -257 -123 7 -59 -56 -224 93 -342 110
3925 110 -76 119 125 12 38 15 217 -337 89 37 -401 145 -273 314 -57 -104 -293 158 -241 15 -51 5 -190
3948 -190 224 108 8 -38 193 19 -232 26 31 -6 285 66 268 103 -190 14 -138 34 -96 -125 299 237
3970 237 -217 175 366 -215 137 -210 -236 153 281 11 -159 -328 -143 -235 238 183 249 4 -225 -102 -219
3991 -219 101 -102 84 36 101 -106 -169 -3 61 200 -228 192 16 136 -18 132 241 -120 143 -340 143
4012 143 188 146 337 78 -122 -100 -83 -24 -162 -166 -210 257 -112 -23 20 -236 -120 95 -175 -332 10 74 -16 318
4036 318 -185 207 -50 65 -103 -10 216 -420 233 -328 182 -130 -7 -107 19 9 -111 9 -139 457 20
4057 20 -105 -72 84 58 -103 28 -48 82 81 20 154 128 11 384 -152 93 -19 -107 131 116 -91 411 -123
4080 -123 -213 39 61 66 -77 -322 189 61 -85 -107 -8 -103 -120 70 -116 -49 -13 -254 74 336 -23 9 -241 107
4104 107 33 -118 24 51 0 -48 -299 -140 164 -116 -180 215 -184 34 362 39 -125 -34 102 116 66 75 142 -176
4128 -176 85 -6 95 -162 136 68 159 -124 21 75 -197 144 -89 177 -44 131 247 115 -13 -71 -20 153
4150 153 23 252 -245 -221 -93 -25 3 -83 63 -58 30 -38 -41 -27 -74 44 53 75 -52 -177 121 63 61 197 -65
4175 -65 79 -162 -34 252 62 35 89 71 331 -103 -40 -456 157 114 -165 175 -68 236 -98 -78 129 216 83
4198 83 138 -118 -178 -289 -98 -256 187 169 93 -125 43 37 213 49 -160 -23 141 97 149 -29 213 -129 3
4221 3 -165 16 30 69 81 351 148 88 -103 202 -70 271 233 -109 4 79 15 316 -61 0 -197 104 363
4244 363 212 -126 1 -15 43 108 130 -104 44 -205 -148 -50 110 81 -76 -147 176 159 129 148 -80 -178 -100 -79 107
4269 107 67 56 -19 -73 92 352 17 353 79 430 123 -132 -219 53 3 -177 -163 -239 -81 -41 -29 -264 282
4292 282 318 45 -33 -134 -89 90 48 346 226 144 153 -40 238 109 -101 29 -142 33 -36 -82 -185 1 290
4315 290 -100 8 -119 116 132 -110 -56 101 -44 -77 -415 176 99 212 -40 46 -74 153 -164 46 12 282
4337 282 77 -14 282 9 288 62 63 1 47 -442 70 -71 67 -191 -177 194 11 58 -98 -80 -215 113 -270
4360 -270 147 -156 -70 -51 -99 -145 -213 37 -77 -38 78 -88 -459 82 226 -216 -211 29 67 100 262 -96 139
4383 139 -33 -89 -137 -157 -185 27 -198 29 147 43 82 -240 -37 -216 -119 -151 164 -81 -67 91 21 -213 -298
4406 -298 -21 -44 7 -7 -21 183 -22 -25 138 -96 -112 -159 -155 -136 42 -171 -24 101 282 -167 -174 431 57 131 7
4431 7 -134 113 -258 -47 -236 -152 18 -161 -123 -6 160 64 11 -1 -359 14 -26 -91 -50 -107 84 274 360 -202
4455 -202 41 71 21 -307 170 -40 -174 -30 -173 -55 144 72 73 85 -163 191 109 182 -121 55 -110 19 4
4478 4 -80 -179 -160 125 125 195 166 187 117 -182 111 18 -21 442 -129 89 25 127 -51 152 -20 221 -153 18 197
4503 197 82 -207 262 89 -262 -133 -395 113 -104 -94 -96 -60 -30 290 -83 113 -40 -385 41 62 74 70 154
4526 154 -211 82 52 -243 -334 91 78 22 9 140 169 202 146 96 121 91 -51 -65 18 93 -58 320 85 130 5
4551 5 -247 4 -42 -86 -163 177 197 -302 -4 79 104 276 242 84 -26 -123 -45 39 85 -163 75 -105 26 -187
4575 -187 219 182 -111 -2 22 35 132 149 147 104 88 -28 369 175 320 160 64 -55 152 -182 -72 -6 250 142
4599 142 -39 332 -339 152 -155 -30 146 17 58 176 -282 -96 30 -96 -18 215 -7 123 290 227 -336
4620 -336 228 125 -315 426 -11 -64 -162 98 65 -341 -37 -98 -136 -146 186 -101 -8 93 91 -80 162 -122 -243
4643 -243 -167 315 158 103 205 104 -145 -265 -94 79 -55 102 -283 162 11 -282 -23 -54 171 26 90
4664 90 63 211 95 235 256 11 -19 -211 266 195 163 -132 -109 485 40 -156 192 37 -259 16 158 69 -75
4687 -75 285 385 204 -142 91 297 68 -69 -97 328 159 -201 -43 122 57 17 107 -2 148 126 225 61
4709 61 -88 219 223 133 313 -202 23 117 62 -220 -61 -128 -227 -196 -6 71 -12 73 -95 -221 -69 155 -137 96
4733 96 -97 99 54 19 -91 -22 146 160 -364 -88 65 -198 -54 368 90 95 270 118 -19 -88 75 -95 -147
4756 -147 -84 59 91 -79 -115 48 166 88 96 34 -88 -139 -97 195 -123 -15 221 -78 -92 358 123 -189 181
4779 181 -149 -37 123 -47 215 28 -393 21 143 -54 133 -88 45 -134 -277 156 -215 -240 -7 -227
4799 -227 16 -157 -107 -148 -47 6 39 162 -214 -131 -243 241 -88 -320 108 -288 70 -398 -159 -109 110 334
4821 334 10 193 131 211 66 128 -248 -236 42 115 -199 99 21 -254 25 -74 -50 61 19 261 22 221 39
4844 39 -64 -47 56 -204 -162 263 -170 211 -124 -198 -68 -24 208 -92 174 38 -129 -135 -16 -322 -177 92
4866 92 65 213 -4 -246 20 409 -106 -52 320 94 -2 230 -117 162 168 223 99 237 -135 -216 256 -295 -133
4889 -133 -105 -2 -127 164 183 19 -159 -3 429 27 102 -186 266 90 59 176 56 167 -27 -109 121 99
4911 99 42 -49 -7 -171 14 61 -119 161 140 289 -80 -93 -48 144 -468 -24 -69 163 -67 231 223 -155 101 60
4935 60 -233 109 -375 -41 -104 104 -54 134 -224 -194 -126 123 29 -157 59 -1 -100 240 46 134 -38 -223 82
4958 82 14 -85 -46 -340 -215 85 35 -61 60 294 217 229 -74 -301 -30 86 -246 290 68 7 -269 177 -41
4981 -41 -376 -71 4 136 182 143 249 41 50 -227 107 -119 25 129 20 -43 65 63 -164 -77 -3 -272 135 144
5005 144 1 260 -24 206 -260 -179 278 267 44 -168 62 105 -255 319 -6 6 -184 -75 4 27 141 83
5027 83 -287 -149 43 408 -402 291 37 6 42 -159 -204 -184 -49 -210 -15 39 -110 123 12 118 -64 13
5049 13 100 -47 68 -402 -50 -52 -74 -52 -319 266 -114 -239 -15 133 232 -182 131 170 158 -206 -148 119 78 -84
5073 -84 236 -390 -145 -68 -34 98 41 -36 -91 -99 -40 178 -134 64 131 -72 87 60 -154 -149 60 -309 135 75 -449
5098 -449 -116 140 -53 208 -110 218 -38 194 -272 191 138 -161 181 -354 57 292 -45 69 -90 -83 -22
5119 -22 -164 151 -124 -155 54 -81 -149 239 31 127 112 41 15 137 -4 -94 239 175 -347 21 -284 -232 192
5142 192 -63 -67 -95 128 302 -204 129 71 186 -186 220 -158 -249 5 -167 84 205 -87 -93 -158 -240 257 72
5165 72 -215 -39 -12 -260 -228 -75 -230 -357 129 -308 -120 -20 -8 -120 -296 -120 49 -31 -118 189 -5 -86
5187 -86 56 -19 234 306 181 60 50 56 -194 278 -31 -208 92 33 136 130 183 109 -170 -11 58 -88 77 -178
5211 -178 -333 114 -201 -162 256 -19 -91 229 -299 -90 -101 -82 -73 -300 210 107 53 -28 -341 -76 -96 -86 60
5234 60 87 -60 135 44 200 190 -90 -145 -44 -24 216 181 -295 -212 -163 -63 310 79 -128 -57 54 40 36 -190
5258 -190 223 59 50 -182 255 -36 74 53 -177 -148 -331 103 66 165 202 334 201 241 121 -81 -215 -120 105
5281 105 -57 -31 30 84 196 -286 86 -79 -72 -199 10 -102 -176 80 36 -117 -17 287 -30 49 -15 -16 42 94
5305 94 -120 100 6 283 164 -33 231 -221 -237 89 -159 -109 -146 -397 128 -133 174 -293 -184 263 -59 317
5327 317 -22 -118 -30 -35 -51 11 -262 -27 -12 57 1 -248 -122 19 212 164 73 -167 -128 -25 -248 29 -94 18
5351 18 -334 -290 118 -429 -23 -183 71 -84 25 -218 15 250 42 -112 30 199 301 -90 22 147 -118
5372 -118 -100 -48 95 -214 96 91 42 193 147 -340 -233 183 13 218 -242 -111 136 -80 84 32 -56 21 28 45
5396 45 -170 -26 -211 -50 -232 254 -60 -79 89 191 -273 79 83 269 31 -25 64 73 -70 0 -81 -173 -162 61
5420 61 -211 -19 -68 -104 -144 84 216 -56 50 123 423 -154 104 -23 12 -246 24 5 -68 183 24 111 93
5443 93 212 -136 96 273 65 144 -82 -56 -93 157 72 69 123 148 -150 -151 35 -16 -74 245 46 129 4 -168 272
5468 272 -176 92 7 -85 221 199 11 -40 -31 -24 -150 142 140 43 -41 20 95 -153 67 -60 -110 -157 64 -404 -156
5493 -156 103 143 -112 -233 -314 63 -81 23 -91 -97 -16 6 -76 205 -83 28 13 95 -21 -67 108 109 -13 -194
5517 -194 -160 -148 102 -296 -169 -21 280 -228 -404 -310 249 83 179 -297 -68 -243 -241 159 81 229 216 74 -42
5540 -42 5 -218 -79 199 0 -138 -222 8 158 95 -157 115 -173 153 174 -4 108 199 -224 -26 -270 220
5562 220 165 -146 154 -342 -16 224 230 -41 254 390 -185 -50 -154 5 162 72 -9 -3 337 -10 395 134
5584 134 291 -38 -176 76 -98 51 -21 39 101 285 -192 106 -68 209 -181 -166 148 -82 -61 -62 -192 -126 -210
5607 -210 9 60 -45 -440 325 77 17 155 104 -187 -73 -352 290 10 -254 -156 -65 -56 42 211 -14 17 -130
5630 -130 206 -128 -240 79 108 -176 226 -60 -46 80 223 303 -175 2 119 -157 35 -67 -159 16 -169
5651 -169 16 123 174 -22 158 -30 37 -217 35 -156 -59 -58 9 -135 104 186 -79 -14 -189 134 -20 15 285
5674 285 -168 266 44 160 35 -9 -140 -37 80 142 -48 78 73 -190 94 -230 -8 -11 27 169 -81 130
5696 130 -141 -247 34 -31 200 85 154 -10 -50 102 309 -198 -189 -24 276 107 34 -145 130 -212 -194 -30
5718 -30 -87 -11 93 79 200 -368 207 -155 -187 -70 -255 -125 157 76 221 -43 -242 -132 -12 423 -37 114
5740 114 197 -31 94 -149 -141 21 -58 331 53 -172 262 -267 25 -9 179 201 212 -152 168 -44 43 203 109
5763 109 36 -6 -104 -275 -107 86 -265 -67 147 -39 226 28 -225 -168 -97 -112 12 -246 -47 -5 -110 -129 -95
5786 -95 -218 -51 -171 16 -146 -100 -11 -209 -116 130 -129 -14 -119 -19 -118 160 -33 -237 248 56 243 -101
5808 -101 -210 121 -132 -191 -190 200 52 60 -149 10 174 282 -97 -127 155 7 46 -18 -228 -79 199 -188 154
5831 154 58 -58 -45 -33 247 -140 -192 238 82 102 -48 -102 -108 -184 342 176 -275 -139 74 71 -168 171 -3 225
5855 225 -306 -81 280 99 -5 10 182 -39 -44 -101 -124 323 -236 162 -41 -47 264 -62 42 167 317 -104
5877 -104 58 -106 -21 197 212 132 218 9 147 -97 95 -58 105 187 -118 -38 206 26 -163 -33 167 -185
5899 -185 -176 11 37 -73 51 88 338 -23 154 46 239 65 18 155 -78 -157 105 -25 616 -210 -36 136
5921 136 -145 457 -240 125 14 -200 140 -139 59 142 161 93 50 310 -137 1 202 -102 -184 -72 199 -174
5943 -174 -156 15 -89 287 189 63 -156 2 474 -57 -97 -180 -18 121 -271 -48 50 96 45 114 -19 -51 -223
5966 -223 -448 -7 345 79 124 -91 165 6 -77 241 -44 110 -6 -127 -449 191 -83 150 -69 107 219
5987 219 14 15 -159 -49 -89 -146 56 153 207 259 224 -232 109 -277 -254 44 -95 -1 140 110 -122 114 244 48
6011 48 141 -129 -128 162 -262 -242 -137 136 -1 -204 -104 287 -76 173 -58 35 -18 291 -184 48 65 33 -30
6034 -30 -145 -112 20 -141 -257 267 20 153 88 153 142 313 31 186 3 -39 -44 -8 -5 198 -71 -171 256 11
6058 11 -181 -64 141 -53 114 -81 -230 88 45 30 51 -16 -108 -97 122 -317 -14 12 101 11 158 69 114 133
6082 133 -143 -3 92 109 98 -63 221 -53 -228 160 -118 3 22 28 140 106 -397 96 93 -146 171 -85 -94 -313
6106 -313 -58 147 278 87 -285 216 -12 86 104 -167 -168 201 388 -88 -115 199 -227 -96 -117 127 65 12 106
6129 106 121 212 -27 -193 -166 -97 -112 111 191 -38 77 58 -150 24 460 -215 -143 -30 1 70 224 154 -62 -56
6153 -56 41 197 -111 -267 105 -65 86 236 17 93 -195 -122 113 155 -155 -179 220 -183 70 -192 -77 156
6175 156 -60 288 224 -87 1 236 -245 -104 -252 73 -139 -55 168 -251 159 -144 -23 27 27 -25 -47 32 62
6198 62 89 -246 -135 1 89 1 -28 17 -229 -44 -81 -56 -49 -234 1 -1 -11 42 55 397 -105 76 313 116 8
6223 8 163 -39 243 -327 -180 -329 -73 139 78 274 106 -67 81 3 80 -193 167 95 -154 -169 -411 104
6245 104 -119 -92 -131 -29 -45 -72 79 90 -2 -204 -229 -66 106 -2 31 324 -146 -49 57 277 -22 86 -29
6268 -29 -42 -143 -110 -94 -25 157 -129 -118 60 77 104 -62 -253 -112 203 159 -70 -228 19 15 154 -160 -121 402
6292 402 -174 -45 87 375 318 -348 -126 114 74 -350 146 38 -42 -78 -127 -240 158 35 -75 131 -265 205
6314 205 -129 1 -141 -184 -102 -205 127 -215 124 16 170 -111 -266 0 -136 -58 -111 119 -236 129 -3
6335 -3 -167 -96 212 340 109 -61 24 169 314 -85 -280 275 368 125 54 -203 -323 30 161 -97 36 -157
6357 -157 35 132 81 7 -112 -187 -86 162 142 82 -47 186 -39 129 51 268 -87 123 -14 146 178 -91 193
6380 193 122 -96 -209 -132 123 47 -220 10 26 -52 -98 -357 -26 -9 142 129 -71 20 -144 -83 140 179 10 -39
6404 -39 -67 77 141 104 65 -57 -317 -27 128 51 283 7 60 10 38 -185 146 56 186 64 113 -102 -124 -199
6428 -199 138 219 -252 -115 -80 -70 231 109 3 -110 370 -9 -132 40 -98 -174 80 -247 -204 -11 -348 73
6450 73 -128 44 133 -16 -255 -52 159 -210 -128 213 13 -478 214 -27 139 -272 81 -165 68 -269 244
6471 244 -142 -322 253 -35 -211 169 100 104 243 -9 -109 200 6 159 135 43 39 -26 20 -243 -174 149 244 22
6495 22 -122 -169 66 20 -239 -92 159 -94 78 93 46 -272 0 57 89 233 -363 39 101 -111 17 86 -77
6518 -77 86 70 189 -123 -54 -39 -63 -36 13 100 -14 -310 -161 -76 -268 106 155 11 187 10 -120 475 145
6541 145 -238 10 -126 -8 58 91 -73 2 -54 -96 77 42 65 84 49 -36 -145 -93 -158 50 50 -12 204 117 -201
6566 -201 -354 336 -13 33 -146 -315 436 2 -27 57 152 -158 57 -16 -99 -142 -160 -110 -130 311 109 -2 -21 286
6590 286 -52 216 -119 -132 -25 58 116 -329 -33 7 199 -175 -94 90 210 -174 23 -8 38 80 132 60 248
6613 248 -11 212 130 10 114 227 232 -124 71 -205 -121 187 -285 -60 310 -34 80 -97 123 147 -34 -114
6635 -114 -4 220 -104 -63 167 308 -51 329 -21 -114 97 -435 35 138 -178 -145 -66 -9 -48 -116 112 -54
6657 -54 -47 29 -98 106 -196 -79 114 -250 -76 73 -108 -79 -260 -67 120 57 135 -134 204 338 -93 97
6679 97 101 -142 -74 -131 -149 39 -280 -112 -183 -131 -26 -146 -88 68 103 -21 -215 -18 54 -57 54 23 56 67 -110
6704 -110 -209 277 182 33 20 -189 79 -84 -140 -77 -107 -132 167 -239 186 48 96 285 -188 142 -203 -108 -63
6727 -63 113 -45 296 -3 66 -95 19 -82 -47 -219 -312 342 57 -32 -15 4 -267 -113 89 52 107 17 -234
6750 -234 317 -245 -20 1 10 143 -106 390 -152 -61 -5 -148 -146 -92 -49 -189 -213 -78 15 -156 127 60 309 333
6774 333 -9 -343 94 180 160 165 -150 -12 180 -5 -336 12 216 145 19 -24 -282 106 67 143 -152 -37 -157
6797 -157 33 -209 7 61 -11 11 115 -138 48 0 -162 -20 -78 -224 478 -104 -85 48 -348 -9 -31 -179
6819 -179 30 24 83 77 -133 -30 -205 -7 126 88 51 5 -98 58 107 -84 149 83 35 16 116 -119 -11 -205
6843 -205 -39 -377 -77 -205 -231 234 155 -210 -195 46 -288 -130 59 -59 16 -127 -140 120 275 -109 16 53
6865 53 83 -92 247 9 154 -22 -206 -88 64 184 -304 -66 -10 -103 112 -152 264 187 173 40 -7 -212
6887 -212 172 158 -93 335 -67 200 359 135 -43 -172 193 147 55 -74 131 -63 -202 267 272 -6 -177 175
6909 175 133 59 94 -25 20 -56 -287 36 -62 -212 -23 -220 -267 -26 -102 -219 73 28 -266 -164 -4 117 75
6932 75 -17 -133 223 -8 -252 270 -181 -288 -147 -210 100 236 -334 -74 162 29 -53 -175 274 -69 -77 -168
6954 -168 152 -229 293 -22 -58 86 119 30 124 -224 -133 114 191 -217 -267 72 69 -69 85 58 -83 -13 24 92
6978 92 -315 -78 24 -54 -34 33 -48 -125 215 -184 -273 99 98 90 -85 -52 192 -7 134 -62 -132 71 9 425 -225
7003 -225 -237 -14 186 53 -160 160 177 46 -90 -15 444 11 -134 195 25 58 -132 -2 -232 -161 -106 -87
7025 -87 -78 -448 -395 -225 47 -196 -197 34 -18 -164 9 -154 69 71 -150 -140 -284 196 79 -23 159 -89 47
7048 47 217 -119 251 -129 -121 259 -260 149 239 5 -98 -395 -101 235 -152 162 49 -23 169 5 214 -150
7070 -150 -29 -163 -105 336 -228 213 183 -321 222 3 -117 -7 94 -158 332 20 14 387 182 145 -99 29
7092 29 44 -401 -291 31 -59 -16 170 -287 50 -150 -42 73 107 61 -36 90 -172 103 -509 -83 265 328 179
7115 179 81 -23 -107 -41 -29 35 338 -295 -252 62 42 86 -97 31 244 -126 121 38 138 -189 72 131 -370
7138 -370 -144 -51 11 155 -50 -39 -315 64 -259 43 39 -136 85 -49 143 -67 96 -58 55 -163 -140 225
7160 225 262 71 138 -46 74 -120 -7 -163 -171 -139 -88 185 23 -44 18 -60 -141 -4 -216 -233 -57 0 96 141 152
7185 152 77 -77 -67 121 -76 -126 -153 72 -14 -43 -23 81 74 -87 305 43 128 117 85 -146 -99 7 32 35 -87
7210 -87 326 -260 33 108 12 244 131 164 -267 241 45 -51 47 -109 -110 100 -131 237 76 121 209 46 78 -244
7234 -244 -167 6 181 -68 52 -30 95 -200 308 -100 -133 13 50 8 94 251 -147 -43 8 -273 187 -66
7256 -66 141 27 4 41 -38 -117 -90 134 189 60 -141 -215 -84 42 50 -14 124 -143 212 -62 33 -207 -325 -308
7280 -308 -199 88 -204 -76 -407 130 197 -52 -219 233 -21 206 46 -188 73 -16 -110 81 118 136 -17 61
7302 61 97 227 -185 -129 37 28 -149 -8 105 -103 -253 -69 265 -38 176 268 40 -121 109 137 31 -227
7324 -227 -264 70 -32 -24 192 -318 -150 -159 39 347 -306 271 -74 -121 149 -18 -12 27 16 174 -173 -125 49 -3
7348 -3 47 -69 47 -77 -21 -506 -189 -22 -37 79 24 140 62 239 -120 -55 -122 125 -70 63 170 189 -37
7371 -37 -26 102 22 91 287 -80 -112 110 191 -110 119 -80 80 49 44 -106 -53 92 -64 -24 11 27 9 -141 57
7396 57 -241 -48 250 -12 -72 -32 -312 46 -79 -26 5 12 -150 75 62 -9 62 -136 -82 -97 -104 -86 -24 -50 -132 -236
7422 -236 -190 101 181 41 60 47 202 -66 -340 80 -202 -88 -17 138 -305 9 -59 -148 -365 -117 34 -228
7444 -228 17 86 -26 398 80 -184 -45 -127 -235 83 32 68 -17 -108 -74 -26 -84 62 -108 -45 25 59 162 -74
7468 -74 -444 -42 -72 186 193 313 116 -77 309 -92 -134 -204 -96 13 -146 333 -109 -195 -195 192 -51 55 -314
7491 -314 -73 -167 -117 23 -106 137 -149 172 118 249 72 -215 -71 42 37 -107 356 3 -200 -150 63 174
7513 174 78 -149 117 46 -264 -230 -151 -280 -297 -102 -36 76 -108 117 -82 13 168 185 -174 -119 -209 -23 -260
7536 -260 213 28 -154 -194 -197 -56 -65 -505 -60 210 -15 -116 -64 -18 97 172 -236 -118 9 387 77 94 -314
7559 -314 -31 -228 -279 167 270 -320 -259 140 38 58 -41 -304 -43 231 6 118 -174 55 -255 -148 34
7580 34 -147 -47 62 -2 -115 220 -58 82 45 127 18 154 22 -88 -122 -70 -176 -159 -116 26 -206 43 46
7603 46 35 125 -344 368 -83 -179 -109 -174 -84 19 37 -31 -136 124 -14 -25 -164 -211 106 132 -152 124 36 77 71
7628 71 226 -293 -179 140 53 172 5 -72 -30 174 0 233 -104 155 -14 -4 -428 -114 159 -173 13 84
7650 84 312 -147 108 -118 -11 28 -66 26 284 -162 118 -147 -59 146 -184 -182 -42 112 117 46 224 263 140 417
7674 417 -155 -276 -135 34 60 -110 -158 -43 202 -24 -2 -19 -58 187 -32 102 -116 125 -176 275 215 30
7696 30 64 -77 239 14 -15 -43 94 114 214 -156 -26 -136 22 -69 -11 -84 -404 53 -145 -220 -202 -225 -102 -30
7720 -30 -148 -189 119 44 -301 41 -57 60 -190 -113 -185 -23 -127 47 114 101 -29 -12 98 -122 0 147 -47
7743 -47 -268 301 -171 -42 138 14 -88 102 93 -23 -49 -137 161 217 170 -44 62 -72 -79 6 -212 -145 -116 146
7767 146 -105 -3 -35 -140 -6 96 155 -70 -58 -45 146 98 -166 442 140 342 -47 -153 85 53 -99 -25
7789 -25 13 -43 -74 7 5 -66 -167 57 8 -243 151 93 -136 -149 -152 -150 397 -118 26 91 182 -125 -190 -125 -517 31
7815 31 -179 154 32 -141 50 -82 175 33 -226 146 -9 178 -73 130 -70 52 284 109 -313 -192
7835 -192 -225 -6 -202 -50 74 -419 -17 15 -105 150 -285 27 71 56 -27 23 272 -144 -64 58 -96 -301
7857 -301 46 4 -59 17 252 -47 354 140 18 -302 138 -187 80 -24 -165 73 -220 300 303 192 -103 -79
7879 -79 -215 -154 -174 -63 144 63 -8 277 103 9 139 -164 -54 145 81 162 -32 -92 285 -165 -248 -136 -121 -189
7903 -189 -53 -232 225 -177 19 -107 112 -150 145 31 -6 76 215 -128 -131 268 -23 68 -264 120 43 -65
7925 -65 -109 359 47 99 145 -14 -27 -56 77 -37 226 -167 -103 61 -269 -263 -242 66 -43 -46 322 244 150 109 -65
7950 -65 -141 111 133 -36 -38 -74 19 -113 30 293 -108 -65 -145 83 89 -337 352 163 -110 149 188 -111 -11 -175
7974 -175 -86 28 -22 171 -52 -106 -46 99 40 -214 -61 72 -87 30 7 -104 -33 16 145 -57 60 186 164
7997 164 98 -174 76 -40 -154 -136 -58 3 -254 39 103 -52 -77 43 59 -113 -248 -49 102 248 181 35 -284
8020 -284 -26 -15 -103 -8 -92 29 177 -28 -108 -259 -188 -121 -12 38 -118 19 173 -347 45 -165 89 20 174
8043 174 50 -168 161 215 75 -126 -33 -91 -149 -248 16 34 267 -182 -64 64 160 237 -246 -285 -197 310 300 164
8067 164 -56 -134 -360 -161 -21 191 29 371 49 210 13 -163 -224 70 -118 -41 -153 47 -16 202 230 133
8089 133 412 263 192 -85 40 93 -232 -163 -25 27 342 -261 -154 -22 -47 -166 -167 68 -24 -73 11 108 -37 39
8113 39 -73 -233 -17 -191 63 -7 -385 -122 -124 -199 89 325 114 -135 -128 -57 -44 89 -145 65 177 -111 75
8136 75 82 -137 -80 39 -352 277 20 106 163 94 -38 165 277 -149 79 -175 105 -145 -183 67 -223 76 46
8159 46 -6 10 55 89 136 102 -11 130 -446 -173 -57 116 -273 113 -67 -66 60 -86 39 67 -102 136 298
8182 298 191 -195 -40 -298 -27 173 126 34 67
8191F7
##END NTUPLES=NMR FID
##END=
