##TITLE=1H_IAMT-MAT
 DMSO-d6, 8 sc, 
 31.5.2019
##JCAMPDX= 6.0         $$ Bruker NMR JCAMP-DX V2.0
##DATA TYPE= NMR FID
##DATA CLASS= NTUPLES
##ORIGIN= UXNMR, Bruker Analytische Messtechnik GmbH
##OWNER= root
$$ XWIN-NMR		Version 3.5
$$ Fri May 31 14:16:57 2019 Russian Standard Time (UT+4h)  she@DPX200
##.OBSERVE FREQUENCY= 200.13155
##.OBSERVE NUCLEUS= ^1H
##.DELAY= (6, 6)
##.ACQUISITION MODE= SIMULTANEOUS
##.ACQUISITION SCHEME= undefined
##.AVERAGES= 8
##.DIGITISER RES= 18
##SPECTROMETER/DATA SYSTEM= spect
##.PULSE SEQUENCE= zg30
##.SOLVENT NAME= DMSO
##.SHIFT REFERENCE= (INTERNAL, DMSO, 0, 15.7039)
##AUDIT TRAIL= $$ (NUMBER, WHEN, WHO, WHERE, WHAT)
$$ ##TITLE= Audit trail, XWIN-NMR		Version 3.5
$$ ##JCAMPDX= 5.01
$$ ##ORIGIN= Bruker BioSpin GmbH
$$ ##OWNER= she
$$ F:/spectra/data/she/nmr/H-F/1/audita.txt
$$ ##AUDIT TRAIL=  $$ (NUMBER, WHEN, WHO, WHERE, WHAT)
(   1,<2019-05-31 14:15:44.29 +0400>,<she>,<DPX200>,
      <created by zg, POWCHK disabled, PULCHK disabled
       configuration hash MD5:
       00 E9 B6 7A A2 85 ED C7 34 08 36 98 17 FE 4E 26
       data hash MD5: 16K
       EF 12 3C 93 4B 4D 48 8C 6F 2B 18 D6 72 B2 7E 1C>)
$$ ##END=
$$ 
$$ hash MD5
$$ 50 FA DA 41 D9 CC 10 4E 61 DC B4 87 EE AC F6 76
##$RELAX= 
##$RELAX= 
##$RELAX= 
##$RELAX= 
##$RELAX= 
##$RELAX= 
$$ Bruker specific parameters
$$ --------------------------
##$DU= <F:/spectra>
##$EXPNO= 1
##$NAME= <H-F>
##$PROCNO= 1
##$TYPE= <nmr>
##$USER= <she>
##$AMP= (0..31)
100 100 100 100 100 100 100 100 100 100 100 100 100 100 100 100 100 100 
100 100 100 100 100 100 100 100 100 100 100 100 100 100 
##$AQSEQ= 0
##$AQ_mod= 1
##$AUNM= <au_zg>
##$AUTOPOS= <>
##$BF1= 200.13
##$BF2= 200.13
##$BF3= 200.13
##$BF4= 200.13
##$BF5= 200.13
##$BF6= 200.13
##$BF7= 200.13
##$BF8= 200.13
##$BYTORDA= 1
##$CFDGTYP= 0
##$CFRGTYP= 5
##$CHEMSTR= <none>
##$CNST= (0..31)
1 1 145 1 1 1 1 1 1 1 1 1 1 1 1 1 1 1 1 1 1 1 1 1 1 1 1 1 1 1 1 1 
##$CPDPRG= <>
##$CPDPRG1= <>
##$CPDPRG2= <>
##$CPDPRG3= <>
##$CPDPRG4= <mlev>
##$CPDPRG5= <mlev>
##$CPDPRG6= <mlev>
##$CPDPRG7= <mlev>
##$CPDPRG8= <mlev>
##$CPDPRGB= <>
##$CPDPRGT= <>
##$D= (0..31)
0 1.2 0 0 0 0 0 0 0 0 0 0.03 0 0 0 0 0 0 0 0 0 0 0 0 0 0 0 0 0 0 0 0 
##$DATE= 1559297743
##$DBL= (0..7)
120 120 120 120 120 120 120 120 
##$DBP= (0..7)
150 150 150 150 150 150 150 150 
##$DBP07= 0
##$DBPNAM0= <>
##$DBPNAM1= <>
##$DBPNAM2= <>
##$DBPNAM3= <>
##$DBPNAM4= <>
##$DBPNAM5= <>
##$DBPNAM6= <>
##$DBPNAM7= <>
##$DBPOAL= (0..7)
0.5 0.5 0.5 0.5 0.5 0.5 0.5 0.5 
##$DBPOFFS= (0..7)
0 0 0 0 0 0 0 0 
##$DE= 6
##$DECBNUC= <off>
##$DECIM= 24
##$DECNUC= <off>
##$DECSTAT= 4
##$DIGMOD= 1
##$DIGTYP= 9
##$DL= (0..7)
0 120 120 120 120 120 120 120 
##$DP= (0..7)
150 150 150 150 150 150 150 150 
##$DP07= 0
##$DPNAME0= <>
##$DPNAME1= <>
##$DPNAME2= <>
##$DPNAME3= <>
##$DPNAME4= <>
##$DPNAME5= <>
##$DPNAME6= <>
##$DPNAME7= <>
##$DPOAL= (0..7)
0.5 0.5 0.5 0.5 0.5 0.5 0.5 0.5 
##$DPOFFS= (0..7)
0 0 0 0 0 0 0 0 
##$DQDMODE= 0
##$DR= 18
##$DS= 0
##$DSLIST= <SSSSSSSSSSSSSSS>
##$DSPFIRM= 0
$$ [...]
##$SUBNAM2= <"">
##$SUBNAM3= <"">
##$SUBNAM4= <"">
##$SUBNAM5= <"">
##$SUBNAM6= <"">
##$SUBNAM7= <"">
##$SUBNAM8= <"">
##$SUBNAM9= <"">
##$SW= 24.9336996594482
##$SWIBOX= (0..15)
0 0 2 0 0 0 0 0 0 0 0 0 0 0 0 0 
##$SW_h= 4990.01996007984
##$TD= 16384
##$TD0= 1
##$TE= 0
##$TE2= 300
##$TE3= 300
##$TEG= 300
##$TL= (0..7)
0 120 120 120 120 120 120 120 
##$TP= (0..7)
150 150 150 150 150 150 150 150 
##$TP07= 0
##$TPNAME0= <>
##$TPNAME1= <>
##$TPNAME2= <>
##$TPNAME3= <>
##$TPNAME4= <>
##$TPNAME5= <>
##$TPNAME6= <>
##$TPNAME7= <>
##$TPOAL= (0..7)
0.5 0.5 0.5 0.5 0.5 0.5 0.5 0.5 
##$TPOFFS= (0..7)
0 0 0 0 0 0 0 0 
##$TUNHIN= 0
##$TUNHOUT= 0
##$TUNXOUT= 0
##$USERA1= <user>
##$USERA2= <user>
##$USERA3= <user>
##$USERA4= <user>
##$USERA5= <user>
##$V9= 5
##$VALIST= <valist>
##$VCLIST= <CCCCCCCCCCCCCCC>
##$VD= 0
##$VDLIST= <DDDDDDDDDDDDDDD>
##$VPLIST= <PPPPPPPPPPPPPPP>
##$VTLIST= <TTTTTTTTTTTTTTT>
##$WBST= 1024
##$WBSW= 4
##$XGAIN= (0..3)
0 0 0 0 
##$XL= 0
##$YL= 0
##$YMAX_a= 319560
##$YMIN_a= -318649
##$ZGOPTNS= <>
##$ZL1= 120
##$ZL2= 120
##$ZL3= 120
##$ZL4= 120
##$ABSF1= 10
##$ABSF2= 0
##$ABSG= 5
##$ABSL= 3
##$ALPHA= 0
##$AQORDER= 0
##$ASSFAC= 0
##$ASSFACI= 0
##$ASSFACX= 0
##$ASSWID= 0
##$AUNMP= <proc_1d>
##$AZFE= 0.1
##$AZFW= 0.1
##$BCFW= 1
##$BC_mod= 2
##$BYTORDP= 1
##$COROFFS= 0
##$CY= 11.3945322036743
##$DATMOD= 1
##$DC= 2
##$DFILT= <>
##$DTYPP= 0
##$F1P= 18.9103706918063
##$F2P= -1.10871071338519
##$FCOR= 0.5
##$FTSIZE= 0
##$FT_mod= 4
##$GAMMA= 1
##$GB= 0.15
##$INTBC= 1
##$INTSCL= 1
##$ISEN= 128
##$LB= 0.24
##$LEV0= 0
##$LPBIN= 0
##$MAXI= 10000
##$MC2= 0
##$MEAN= 0
##$ME_mod= 0
##$MI= 1.114404
##$NCOEF= 0
##$NC_proc= 0
##$NLEV= 6
##$NOISF1= 3.799351
##$NOISF2= 2.8
##$NSP= 1
##$NTH_PI= 0
##$NZP= 0
##$OFFSET= 15.70392
##$PC= 1
##$PHC0= -8500.922
##$PHC1= 13.80023
##$PH_mod= 1
##$PKNL= yes
##$PPARMOD= 0
##$PSCAL= 0
##$PSIGN= 0
##$REVERSE= no
##$SF= 200.130013532006
##$SI= 16384
##$SIGF1= 3
##$SIGF2= 2
##$SINO= 400
##$SIOLD= 16384
##$SREGLST= <1H.CDCl3>
##$SSB= 0
##$STSI= 0
##$STSR= 0
##$SW_p= 3612.71676300578
##$SYMM= 0
##$S_DEV= 0
##$TDeff= 0
##$TDoff= 0
##$TI= <>
##$TILT= no
##$TM1= 0
##$TM2= 0
##$TOPLEV= 0
##$USERP1= <user>
##$USERP2= <user>
##$USERP3= <user>
##$USERP4= <user>
##$USERP5= <user>
##$WDW= 1
##$XDIM= 8192
##$YMAX_p= 0
##$YMIN_p= 0
$$ End of Bruker specific parameters
$$ ---------------------------------
##NTUPLES= NMR FID
##VAR_NAME=  TIME,          FID/REAL,        FID/IMAG
##SYMBOL=    X,             R,               I
##VAR_TYPE=  INDEPENDENT,   DEPENDENT,       DEPENDENT
##VAR_FORM=  AFFN,          ASDF,            ASDF
##VAR_DIM=   8192,          8192,            8192
##UNITS=     SECONDS,       ARBITRARY UNITS, ARBITRARY UNITS
##FACTOR=    0.0002004,     1,               1
##FIRST=     0,             0,               0
##LAST=      1.6414764,     0,               0
##MIN=       0,             -318649,         0
##MAX=       1.6414764,     319560,          0
$$ Real data points
##PAGE= N=1
##DATA TABLE= (X++(R..R)), XYDATA
0@%%%%%%JrJ6j6K4l2M0n4O2p2Q8j05J22j46J77k06K39k76L16l63M17m73N37o11
$$ 0 0 0 0 0 0 0 1 -8 8 -8 16 -16 24 -30 32 -40 48 -57 65 -81 96 -110 129 -147 169 -194 223 -250 287 -324
30c24O86p70Q68r73J086j212J347j497J665j846K046k269K510k777L079l414L789
$$ -324 362 -408 460 -513 573 -639 708 -789 876 -970 1076 -1193 1317 -1460 1619 -1795 1994
47A994m215M700n260N918o698P644q825J0338j2356J5216j9609K7300m4704J56132
$$ 1994 -2221 2479 -2781 3137 -3561 4083 -4742 5596 -6760 8456 -11153 16147 -28557 127575
61A27575k3219k94244N4372K36988K18088q3146k51019j87187Q5402K24427J37485
$$ 127575 104356 -189888 -135516 101472 319560 236414 -14605 -201792 -116390 108037 245522
72B45522j12355k32285j37057J02258K21812J23174j17821k36193j13087J49843
$$ 245522 133167 -99118 -236175 -133917 87895 211069 93248 -142945 -256032 -106189
82a06189K59683R7983j78606k54399m7442K23198K48450N263k40807k15776L9501
$$ -106189 153494 251477 72871 -181528 -228970 -5772 242678 247941 7134 -208642 -169141
93a69141K43948J76660p4232k38297j48795Q4409K20396J26322r2169k15884j19651
$$ -169141 74807 251467 177235 -61062 -209857 -125448 94948 221270 129101 -86783 -206434
104b06434J00962K25056J17036j19613k37184r9420J53930K46981O7859j92199
$$ -206434 -105472 119584 236620 117007 -120177 -219597 -65667 181314 249173 56974
114E6974k45625k9337K16349K16871k4110k36108j89206N4293K25630J48908p8135
$$ 56974 -188651 -217988 -1639 215232 191122 -44986 -234192 -179899 45731 194639 116504
125A16504k14987j26305Q6804K06383J16472r0187k04956j08343J06117K17830
$$ 116504 -98483 -224788 -137984 68399 184871 94684 -110272 -218615 -112498 105332
135A05332J00520j31907k31412p9338J65205K31737L9076k00523k18308M368K18221
$$ 105332 205852 73945 -157467 -236805 -71600 160137 199213 -1310 -219618 -215250 2971
146B971J90217m1505k16945j50730P4196K13321J29848p8042j94448j07309Q8834
$$ 2971 193188 151683 -65262 -215992 -141796 71525 201373 123331 -71117 -178426 -89592
157h9592J94461J02527r8420k04513j00780J10624K06373P3491j52908k25393
$$ -89592 104869 207396 108976 -95537 -196317 -85693 120680 194171 41263 -184130
167a84130n7013J72134K07760Q932k02205j88995L0366K12548J64106n1406j95785
$$ -184130 -241143 -69009 138751 147683 -54522 -243517 -213151 -603 163503 112097 -83688
178h3688j21381Q1716J99447J17109p4215j78041r6528Q8744J87353R4179j01289
$$ -83688 -205069 -123353 76094 193203 118988 -59053 -155581 -66837 120516 214695 113406
189A13406j98518q9100J18900K00671N8490j58413k10314l3361J77980J89441
$$ 113406 -85112 -174212 -55312 145359 203849 45436 -164878 -198239 -20259 169182
199A69182r714j95315j63488M4397J97741J37203o1721j83693j08052P7635J78080
$$ 169182 159468 -35847 -199335 -154938 42803 180006 118285 -65408 -173460 -95825 82255
210H2255R7180p8732j74043r1939Q6897J78726Q2490j08531j92513p0024J32580
$$ 82255 179435 100703 -73340 -165279 -78382 100344 182834 74303 -118210 -188234 -55654
221e5654J94556M1709j59848j85414n105J82214J69429k4564j83560j36703N5199
$$ -55654 138902 180611 20763 -164651 -169756 12458 181887 157323 -26237 -162940 -107741
232a07741J82380J14211o7407j71189r6871P2080J62792Q5705q2746j70311q4575
$$ -107741 74639 188850 121443 -49746 -146617 -74537 88255 173960 91214 -79097 -163672
243a63672R1526J74309O9650j16567j83181m9840J42485J81706K1300j62538j65553
$$ -163672 -72146 102163 171813 55246 -127935 -177775 -35290 146416 167716 5178 -160375
254a60375J4434J76044J43214m2255j74824j17940N7455J64590R5386p0218j60447
$$ -160375 -145941 30103 173317 131062 -43762 -161702 -104247 60343 155729 85511 -74936
265g4936q7530P1783J56379P9949q1930j61501p1046J02066J73874O0316j20417
$$ -74936 -162466 -90683 65696 145645 63715 -97786 -168832 -66766 107108 167424 47007
276D7007j69732k8549J50219J66760R40j62860j45265K8806J65080J17846n5337
$$ 47007 -122725 -151274 -1055 165705 166645 3785 -141480 -112674 52406 170252 114915
287A14915j65677j02992N9298J49330Q0893p2061j51853p7775P4655J52144P2421
$$ 114915 -50762 -153754 -94456 54874 135767 63706 -88147 -165922 -91267 60877 133298
298A33298q5643j56534n6932J11309J66968M4179j27770j57137j1340J49257J47071
$$ 133298 47655 -108879 -165811 -54502 112466 156645 28875 -128262 -139602 9655 156726
309A56726j5380j58192j26924L7797J54077J01050n7195j51305q8472O1830J43056
$$ 156726 141346 -16846 -143770 -105973 48104 149154 91959 -59346 -147818 -85988 57068
320E7068P6026o8246j42000o8754Q0080J49691O3757r2427j51751m4975J15781
$$ 57068 133094 64848 -77152 -145906 -65826 83865 147622 55195 -96556 -141531 -25750
331b5750J54404K3435j35572j45958K327J45004J25282l1584j52283j08620M6020
$$ -25750 128654 152089 16517 -129441 -127114 17890 143172 111588 -40695 -149315 -103295
342a03295J44265Q7688n8327j38265p4642O5382J38164P0327o8315j36507n9742
$$ -103295 40970 128658 70331 -67934 -142576 -77194 60970 131297 62982 -73525 -133267
353a33267Q5348J45585N1450j00723j46939l2930J19106J40616N650j37111j31471
$$ -133267 -47919 97666 149116 48393 -98546 -131476 -12370 128246 133896 -3215 -134686
364a34686J5100J39835J09881l8711j41182r1695N1522J36644P8739n6679j28773
$$ -134686 -119586 20249 130130 91419 -49763 -141458 -89936 46708 125447 68768 -60005
375f0005o6183O6476J33045O3529p3388j34481n2935Q8248J37974L7354j08651
$$ -60005 -126188 -59712 73333 136862 63474 -71007 -123942 -35694 102280 139634 30983
386C0983j39847j9988J20739J27214p959j33997j14686K6876J35425R6581m2350
$$ 30983 -108864 -128852 -8113 119101 111142 -22855 -137541 -110665 24760 121341 78991
397G8991j30517p8452N4672J29593P0308n8604j24190n9953O8181J27422N3733
$$ 78991 -51526 -129978 -75306 54287 124595 65991 -58199 -118152 -49971 77451 131184
408A31184p9760j32028m3930R3887J31262K4206j12877j27775l823J23416J15526
$$ 131184 51424 -80604 -124534 -30647 100615 124821 11944 -115831 -119654 3762 119288
419A19288j7734j28184r7717L7200J29579Q3783m6530j23770o9029N5517J20837
$$ 119288 101554 -26630 -124347 -87147 42432 126215 79685 -44085 -113114 -57597 63240
430F3240O0612o3190j22318n5837P0198J22237M3351q6263j28278l1691R9689
$$ 63240 123852 60662 -61656 -117493 -47295 74942 118293 32030 -96248 -127939 -28250
441b8250J24095J2785j13086j14484R976J23781J03807k5686j22109q4373M2336
$$ -28250 95845 108630 -4456 -118940 -108964 14817 118624 92938 -29171 -113544 -71208
452g1208J21759P2843n0413j18488o3589N6156J14973N2787o7572j19830m8126
$$ -71208 50551 123394 72981 -45507 -109096 -52940 62033 114820 47248 -72582 -120708
463a20708P5545J19536L4224r0862j19578j7432J06172J15574Q71j12076j01498
$$ -120708 -45163 74373 108597 17735 -101843 -119275 -13103 102471 103342 -8734 -110232
474a10232K1554J20062Q9885l4476j17953p4929M3941J13276O1636n4927j15164
$$ -110232 -88678 31384 121269 86793 -31160 -106089 -62148 51128 112764 57837 -57327
485e7327n8015N6757J11036M5976o9954j15946l9246Q0842J16533K6616r2623
$$ -57327 -115342 -58585 52451 98427 28473 -87473 -126719 -45877 70656 97272 4649
496D649j10799n713J08373J06423p336j10384r0132K8501J15275P8525l8375j12095
$$ 4649 -106150 -111863 -3490 102933 95597 -14787 -104919 -76418 38857 117382 79007 -33088
508c3088o7363M6162J08772N5461n5621j11006n0881O0982J09295M0317p3640
$$ -33088 -100451 -54289 54483 109944 54323 -56683 -107564 -46582 62713 103030 29390
519B9390j11490l0437Q5180J10590J5744r6916j03928J830J06109R4438j7668
$$ 29390 -82100 -112537 -27357 83233 98977 2061 -101867 -100037 6072 100510 82842
530H2842j09155q2039L1730J08884P0621m1613j06727n9397M9440J06862N3318
$$ 82842 -26313 -108352 -76622 32262 102883 61270 -45457 -104854 -55414 51448 104766
541A04766n5520j05054m3237O7560J08285L5987p5917j06502k1021Q8489J03448
$$ 104766 49246 -55808 -99045 -31485 76800 112787 36870 -69632 -90653 -2164 101284
552A01284N572r8576r6548Q259J02085Q4037k5537j06704p4641L4745J03477O2861
$$ 101284 106856 8280 -88268 -80009 22076 106113 80576 -26128 -100769 -66024 37453 100314
564A00314m3675j01903n3677N1785J03868M7568n7947j02487l6775O9848J03900
$$ 100314 56639 -45264 -98941 -47156 56712 104280 46333 -56154 -92929 -23081 80819
575H0819K6957q0018j02466j3862Q8491R4696l014r8528q8389J5011J00139P5740
$$ 80819 107776 27758 -74708 -88570 -79 94617 91603 -6925 -95314 -80303 19836 95576
587I5576k8143j01330o5280L9393J01227N8882m3704r7615m7326N5162J01163
$$ 95576 67433 -33897 -99177 -59784 41443 100325 56621 -40994 -88320 -33158 68005
598F8005M1591o1163r9970l2115P0762R8172J7363q4206r8011q700Q7259Q5928
$$ 68005 109596 48433 -51537 -83652 -12890 85282 102645 18439 -79572 -88272 -1013 84915
610H4915j0911r7418q1399J9619R6155O8530l1219r7424n8532M1351R8172N2808
$$ 84915 74004 -23414 -104813 -85194 10961 79491 48272 -49152 -107684 -66333 31839 84647
622H4647m5980r4613m1696N7814R7829L6091o4239r5801k4017P4533R3704J1219
$$ 84647 38667 -55946 -97642 -39828 58001 94092 29853 -65948 -89965 -15432 78272 89491
634H9491q3813q9021M54Q8323P9960j4752r3361p2557K4291R3289O2114l4576
$$ 89491 5678 -83343 -82889 5434 85394 70642 -22719 -95276 -70985 22304 84418 49842
646D9842r3750n5107M1563R3067M5841n0030r4054l9120N7498R3872K8888o7143
$$ 49842 -43908 -99015 -57452 35615 81456 31426 -62628 -101748 -44250 49622 78510 11367
658A1367r2270j8264P6307Q9182P124q2127q0929P193Q8731P5689j6213q8474
$$ 11367 -80903 -99167 -22860 66322 73446 -8681 -89610 -82417 6314 82003 65790 -22684
670b2684o4762K7843R1513N8000l5949r0610m9793M3922Q9887M1707n2518r1017
$$ -22684 -87446 -59603 31910 89910 53961 -36649 -86442 -42520 47367 89074 36556 -54461
682e4461l4140O0309Q9734K3649o8466q7328j1632P6319Q4011R64q0972p5279
$$ -54461 -88601 -28292 61442 85091 16625 -70703 -82335 -6016 77995 78959 -2013 -77292
694g7292J1533Q6003O7901k1621q7140o0192K9636Q6669N0856l9170q8388m5201
$$ -77292 -65759 20244 88145 66524 -20616 -80808 -51172 35497 86353 47183 -41205 -86406
706h6406M5839Q7519L5719n4232q6983k6363O4379Q6992J8264o8937q0203l314
$$ -86406 -40567 46952 82671 28439 -58544 -84907 -20528 66464 84728 15791 -64412 -67726
718f7726P8791P7777m657q0185o8563J6932Q3625O1219k6428q6262n4759L2265
$$ -67726 11065 88842 84185 4000 -64563 -47631 35994 97213 70785 -15477 -70236 -37971
730c7971Q3675M4549m3797q7385l9949M8076Q3882K9401n8250q4448k0377O5320
$$ -37971 45704 90253 46456 -40929 -80878 -32802 51080 80481 22231 -62217 -82594 -17274
742a7274Q1546J0469p1415p5480J381P7890P1162j0605p9542o3053K1792Q1512
$$ -17274 64272 74741 3326 -72154 -70773 7117 78279 67674 -11868 -74921 -53129 28383
754B8383N6355k9845q2777m8564L7532Q3272M0433m5520q3339l2097N2247Q2173
$$ 28383 84738 54893 -27884 -76448 -38916 44356 84789 39269 -44070 -76167 -23920 58253
766E8253K3147o0034q0251j4500O5970P5833L595p2925p1705M449P4967O4673
$$ 58253 81400 21366 -58885 -73385 -7415 68418 72013 -912 -72617 -68168 6799 71472
778G1472j5848p9606n8847K3340P9796N0812l2031q0923m3667M0221Q1284L6631
$$ 71472 55624 -23982 -82829 -59489 20307 71119 39088 -41835 -85502 -45281 36003 72634
790G2634m6542p9840k7474N4821P9046J9822o1260p5531r453O7057P1773o62p1961
$$ 72634 26092 -53748 -81222 -26401 52645 72467 11207 -64324 -73777 -6720 65053 64391 -7570
803g570o6117R431P4962O0028j8642p7340n2972K7578P8497M6792l4593p8203
$$ -7570 -73687 -64256 10706 70734 52092 -25248 -78220 -50642 27855 74647 40054 -38149
815c8149l8945M2359P8745L1271m9419p7677k3368N5459P4570J3467o2943p2690
$$ -38149 -77094 -34735 44010 75281 25862 -51815 -75183 -19724 54846 68313 5370 -67320
827f7320n255O6661O6830m781p1190o1724J3844P4011N6040k0834p4408m7802
$$ -67320 -72575 -5914 60916 56135 -15055 -76779 -62935 11076 67116 46282 -28126 -75928
839g5928L0788P7563M2759l5627p5899l3638M4847P6209K6808n1022p4291j8314
$$ -75928 -45140 32423 75182 39555 -36344 -69982 -25135 51074 77882 26860 -47431 -65745
851f5745N6884P0896Q862o3529o8500n30O6408O2301q848p0603n7292J6687P2560
$$ -65745 -8861 62035 70897 7368 -61132 -61662 4746 67047 58199 -12404 -69696 -53009 19551
864A9551N0779k4392p3970m4086L2383P5122L7259m0316p3766k9563M6797P3024
$$ 19551 70330 45938 -28032 -72118 -39735 35387 72646 32330 -41436 -70999 -24202 48822
876D8822K1108n2955p0799j2669N9080O7138M122o3163o2502M868O7541N8010
$$ 48822 69930 16975 -53824 -66493 -7413 59725 63847 684 -61818 -56950 10591 68601
888F8601j2846o9355n1717K1079P1767M5343k8356p2333l9486L5308P1941L1749
$$ 68601 55755 -13600 -65317 -44238 27529 72872 44516 -27817 -67303 -31995 39946 71695
900G1695m2889p2255k5101M8698O9592J5792n5501o7108p672N9449O3356k70o3481
$$ 71695 28806 -43449 -68550 -19852 49740 65532 10031 -57077 -64749 -5300 58056 57786 -5695
913e695n8932R333O6818N3663j6595o8991m7300K4516P0277M1087l1903p0785
$$ -5695 -64627 -55294 11524 65187 48592 -20399 -67699 -43183 27094 68181 36278 -34507
925c4507l4221L9037P0136K6884m5528o8333j9280N1225O6327J1422n5593o3407
$$ -34507 -68728 -29691 40445 67329 21801 -46532 -65812 -14587 51740 63162 7569 -55838
937e5838k607O0334N9128m551o3980n4083J2663O5960M9014k0942o7986m3361
$$ -55838 -58445 1889 61017 56466 -7514 -61597 -48934 17026 66040 45098 -22888 -66249
949f6249K7765O8305L5838l5111o8970k9322M1448O7381K2132m7152o5971j3808
$$ -66249 -38484 29821 65659 30548 -38422 -67744 -26296 41085 63217 16065 -49906 -63714
961f3714N2869O3180O608n6843n9136K135O0828N5056r273o3536n0129J7144O5796
$$ -63714 -10845 52335 58943 2100 -57036 -54901 5927 60983 51710 -11826 -61955 -44811 20985
974B0985M3755k3985o7168l7847L1213O7086L1115l8076o6299k3975M3925O4839
$$ 20985 64740 40755 -26413 -64260 -33047 34039 65154 27078 -39221 -63196 -19271 45568
986D5568J6724m9465o2246q891N4360N9129Q40n7780n5590O114O1028N0510j3996
$$ 45568 62292 12827 -49419 -58310 -3950 55179 56019 -1761 -57351 -51237 9791 60301 46305
999D6305o3779m5153K0515O4468L9571k7677o5200l3271L4190O5335K6833m0030
$$ 46305 -17474 -62627 -42112 22356 61927 34250 -30950 -64221 -30031 35304 62137 22107
1011B2107o4016j9447M6003O1894J2638m9998n9664m658N4534N5609k540n8290
$$ 22107 -41909 -61356 -15353 46541 59179 9181 -50483 -55141 -607 55002 52462 -5828
1023e828n1253R237O0572M6589j6716o2648m1700K4007O3469L5416l0589o3368
$$ -5828 -57081 -47844 12728 59317 42601 -20047 -61747 -37740 25729 61145 30556 -32812
1035c2812k8802L6702O3164K2421m2063o1284j5219M7367N8827Q232n1699n6184
$$ -32812 -61614 -24912 38252 60673 18610 -42674 -57893 -10526 48301 56533 4834 -51350
1047e1350n35N4936N2264o890n8387m7440J3429O0043M2580k0269o1827l6749
$$ -51350 -51885 3051 55315 48425 -9962 -57402 -43973 16070 58650 38381 -23446 -60195
1059f0195K7046O2140L0764l3193o1749k4022L9376O0481J7826m4614n7913j0397
$$ -60195 -33149 28991 59755 26562 -35187 -59209 -19833 40648 58474 13860 -44053 -54450
1071e4450M8828N6080K834n2484n2338M141N5837M7892j0571n8437m3447J8109
$$ -54450 -5622 50458 53292 808 -51530 -47389 8448 56340 45769 -12668 -56115 -38006
1083c8006N9522L7675k4353o0590l2044L0482O0122K6118l6325n9670j9672M0968
$$ -38006 21516 59191 34838 -25752 -57796 -27314 32808 58926 22601 -37069 -56741 -15773
1095a5773N7910J2905m6190n5686n956M9850N2452j113n3690m8162P827N5976
$$ -15773 42137 55042 8852 -46834 -52790 -2940 49512 48399 -5291 -53453 -45626 10350
1107A0350M3271j4476n7764l8495K1329N8481L3765k7254n8990k7456L3056N8242
$$ 10350 53621 39145 -18619 -57114 -35785 22696 56461 29207 -29783 -57239 -24183 34059
1119C4059K1472l8279n6871j5366M3474N4691Q307m7196n2567j683N0792M8609
$$ 34059 55531 17252 -39619 -54985 -11511 43180 51487 4291 -48276 -49959 833 49442
1131D9442n062n4085m4604J1332N5415L9871j8018n6860l5039K3551N7638K8978
$$ 49442 44380 -9705 -54309 -42977 12438 52309 34291 -22569 -57608 -34057 23581 52559
1143E2559k9695n7122k3526L4662N6235J7909m0040n4781j0789M4429N2511M591
$$ 52559 22864 -34258 -57784 -23122 33113 51022 10982 -43799 -54588 -10159 42352 46943
1155D6943m7375m9465K212N1377M5572q158n2989m0893J4225N4644L7268k0132
$$ 46943 -432 -49897 -47685 3692 49264 41106 -11883 -52776 -38551 16093 53361 33229
1167C3229n5573l1528K5455N6124K6253l1028n5530k0794L5929N4304J4950m0790
$$ 33229 -22344 -53872 -28417 27707 53960 22932 -32598 -53392 -17463 36841 51791 11001
1179A1001n2636q769M4480N0149K296m7969m6518M399N0711M3013r996n2916l8177
$$ 11001 -41635 -50404 -5924 44225 46521 -1448 -47966 -43567 7144 50157 40161 -12755 -50932
1192e0932J6947N4129L3625k1809n3993k8483K7783N4407K3083l2308n3534j7312
$$ -50932 -33985 20144 53769 31960 -22033 -50516 -22733 31674 54757 22449 -31085 -48397
1204d8397L7734N2216J0992m1160n0292m793M5330M7147j007m7833m3568P110
$$ -48397 -10663 41553 52545 11385 -38907 -43700 1630 48777 47770 -63 -43631 -36521
1216c6521N0480L9687j3263n2094l5133J9008N2409L0278k5088n2985k5044K9319
$$ -36521 13959 53646 40383 -11711 -46844 -27836 24573 54851 29763 -23222 -48266 -18947
1228a8947N2435J8947l4895n1552j3484L8873M9579P208m3057m7211j094M6617
$$ -18947 33488 52435 17540 -34012 -47496 -8623 40956 48164 5107 -42104 -43198 3419
1240C419M3821n071m8163l9740J1444N0376L5824j6626n0962l1172K2063N1010
$$ 3419 47240 42169 -5994 -45734 -34290 16086 51910 35284 -15678 -46850 -24787 26223
1252B6223K6227k7351n1586k1329L1107N0336J5330l6307m9669j0694L9665M6953
$$ 26223 52450 25099 -26487 -47816 -16709 33627 48957 12650 -37019 -47713 -8048 38905
1264C8905L710m3490m4638J452M6169M0725q138m7969l6951J3527M9473L2452
$$ 38905 42615 -875 -45513 -44061 2108 42833 34695 -13274 -50225 -36698 12775 45227
1276D5227j9127m9916k7740K3714N0302K3185k8647m9670j8070L3393M8514J2528
$$ 45227 26100 -23816 -51556 -27842 22460 45645 16998 -32672 -50742 -17349 31165 43693
1288D3693l7163m7318o585M0706M4794J073m4024m1720M932M6284L7449j0654
$$ 43693 6530 -40788 -47373 -6667 38127 39200 -4824 -46544 -41612 4672 42121 31467
1300C1467m7341l4033J5651M8603K9191k0572m8671k5248K5629M8231K0559k9798
$$ 31467 -15874 -49907 -34256 14347 43538 22966 -25705 -50953 -25324 22907 43466 13668
1312A3668m8326j4494L4383M6407J0070l7560m5298l481M0978M2383j765m3625
$$ 13668 -34658 -49152 -14769 31638 41708 4148 -41150 -44631 -3653 38730 36965 -6660
1324f660l8929P840M5534L5177j2758m6522l0756J8354M7355K6933k2602m6837
$$ -6660 -45589 -37749 7785 42962 30204 -16318 -47074 -28720 18635 45568 22966 -23871
1336b3871k1622K7626M7284J7333l1439m5914j1458L6108M3883O186l8988m2184
$$ -23871 -45493 -17867 29417 46750 15311 -30603 -42061 -5953 37930 44116 5128 -37056
1348c7056k83M1716L8592n449m3846l5751J0690M4732L1282j5835m5544k7985
$$ -37056 -37339 4377 42969 37520 -6326 -42077 -31387 13345 44627 28792 -16752 -44737
1360d4737K0988M6498K3003k4766m5751j7576K9372M5556J3060l2144m3796p548
$$ -44737 -23749 22749 45752 20986 -24765 -42341 -12969 32587 45647 13503 -30293 -37841
1372c7841L6800M1918K593l9713l9416L498M1444L5639q449m3796l2413J3164
$$ -37841 -1041 40877 43470 3757 -35659 -32161 9283 44922 36473 -7323 -39736 -26572
1384b6572M4321K7762j8054m4833k4490K2149M4851J9895k6543m4576j5021L0120
$$ -26572 17749 45511 27457 -17376 -41866 -19717 25134 45029 18486 -26090 -41111 -10991
1396a0991M3385J0676l4114m1796n332L6884L9337j72l9416l6816N496M0949L3473
$$ -10991 32394 43070 8956 -32840 -38172 -1288 38049 37877 -1539 -38355 -32859 8090 41563
1409D1563j0441m2787k9568J4809M3628K5302j9472m3372k1289K3132M3520J6641
$$ 41563 31122 -11665 -41233 -26424 17204 42506 23034 -20338 -41627 -18495 25025 41666
1421D1666k7775m2385j2586L1350M1630P101l4940l9738j869L7303L6886l279
$$ 41666 13891 -28494 -41080 -9730 31900 39001 4061 -35677 -37546 -243 36643 33364
1433C3364l9633l3837Q156M1223K9961j3241m1482k6422J7358M2377K1565k1538
$$ 33364 -6269 -40106 -31950 9273 39234 25993 -15489 -41911 -24553 17824 39389 17851
1445A7851m2062j8227K5486M1681J3297k9290m0679q772L2404L9256M236l5602
$$ 17851 -24211 -42438 -16952 24729 38026 8736 -31943 -40715 -8311 30945 35181 -421
1457d21l6468J155L8127L3864n740l9346l0329J1057M0242K7341j5079m0837k3324
$$ -421 -36889 -35734 2393 36257 30517 -8829 -39158 -28101 12141 39482 24403 -16434 -39758
1470c9758J8847M1467J9130k3040m1103j5522K6546M0176J0232l0183l8578o143
$$ -39758 -20911 20556 39686 16646 -24457 -39979 -13433 26743 36975 6792 -31786 -37929
1482c7929L3294L6914J002l5524l4159L772L7797L1264p751l8998k7763J2935
$$ -37929 -4635 32279 33281 -2243 -36402 -32630 5167 36431 28680 -10318 -38081 -25146
1494b5146M0077K4123j6898l9829k0645K0786L9951J6523k4676l9326j2482K8179
$$ -25146 14931 39054 22156 -17673 -38318 -17532 22419 38942 14266 -25060 -37542 -9363
1506i363L8237P608l1110l6805k617L3839L4545j935l6174l1592O705L7504K8280
$$ -9363 28874 36482 5372 -31433 -34050 -211 34334 32399 -3775 -35367 -28662 8842 37122
1519C7122j0724l8619k5252J4915L8929K1586j8773l9029j7635K2319L8367J3824
$$ 37122 26398 -12221 -37473 -22558 16371 37957 19184 -19845 -37480 -15161 23206 37030
1531C7030k5764l8087r045K8745L6969M424l1571l4684n1L4622L1760m501l5882
$$ 37030 11266 -26821 -35866 -7121 29848 34272 2701 -31983 -32034 2588 34348 29847 -6035
1544f035k9001Q863L6833K5874j3155l7787k2565J7219L7317J8779k0423l7919
$$ -6035 -35036 -26173 10660 36534 23379 -14408 -36973 -19754 17563 36342 15919 -22000
1556b2000j4612K3960L6956J0705k7118l5681o203L0013L4327J912l2478l1960
$$ -22000 -36612 -12652 24304 35009 7891 -27790 -33993 -3980 30347 32259 -219 -32179
1568c2179K548L4426K9156o615l6216k6092J1231L6431K3011j5340l6949j9206
$$ -32179 -29631 4795 33951 27336 -8880 -34972 -23741 12690 35701 20361 -16588 -35794
1580c5794J8818L6333J5991k2530l5838j1827K5209L5241Q238k8197l4149l533
$$ -35794 -16976 19357 35348 12818 -23020 -34847 -9638 25603 33841 5644 -28505 -32038
1592c2038L0628L2339p07l2649k9624M992L3918K7206r246l5128k3928J2954L5870
$$ -32038 -1410 30929 30222 -2427 -32051 -27059 6859 34065 24819 -10309 -34237 -21283 14587
1605A4587K0707j6809l5698j7184J9943L5971J3051k3237l4624r609K5671L3884
$$ 14587 35294 18485 -17213 -34397 -14454 21517 34568 11331 -23293 -32902 -7231 26653
1617B6653N617k8982l2185j418L0984L0031l079l2483k7365P262L3750K4385j0762
$$ 26653 32270 3288 -28897 -30315 669 30700 27621 -4862 -32227 -24965 8785 33170 22408
1630B2408l4562k1264J4801L5109J7967j7878l4926j4378K1015L4243J0785k4317
$$ 22408 -12154 -33418 -18617 16492 34459 16581 -18345 -32723 -11708 22535 33320 9003
1642I003l3583o634K6428L1575L080k9248l0361J046L0714K8340n463l1941k5385
$$ 9003 -24580 -31214 -4786 26789 29869 621 -29740 -28694 2020 30360 24897 -7044 -32429
1655c2429R025L3241K2368j2351l3846j8709J6135L4036J5480j9235l3147j2327
$$ -32429 -23404 9837 32205 19854 -13992 -32701 -16566 17470 32950 13715 -19432 -31759
1667c1759K2241L3061Q023k4984l1556m842K7640K9876l4k9766k7620L271L0999
$$ -31759 -9518 23543 31566 6582 -24974 -29816 -2176 27700 27666 -2100 -29720 -26449 4550
1680D550K5698p606l2295k2914J1591L2806J9816j4538l2961j6248J7521L3338
$$ 4550 30248 22642 -9653 -32567 -20976 11830 31646 17108 -15853 -32101 -14580 18758
1692A8758J3399k1048l1697r392K3412L1116O086k5754k9963k256K7687K8206
$$ 18758 32157 11109 -20588 -29980 -6568 24548 30634 4880 -25083 -27339 348 28554
1704B8554j581k9741k6391N200L0820K3224q855l1702k1025J2575L2245J7559
$$ 28554 26973 -2768 -29159 -23959 6861 30085 21230 -10472 -31497 -18922 13323 30882
1716C0882j5672l2305j3958J9076L2050J1130k2045l0874o911K4563K9643L662
$$ 30882 15210 -17095 -31053 -11977 20073 31203 9158 -21716 -28627 -4064 25579 29241
1728B9241k6449k7994J6K8402K5869m212k9801k3654P277L0501K0891j1282l1250
$$ 29241 2792 -25202 -25186 3216 29085 24873 -4928 -28582 -21305 9196 30087 18805 -12445
1741a2445j8011J4048L1092J5042j7244l1106j1438J9940L0676Q351k2784k9130
$$ -12445 -30456 -16408 14684 29726 12482 -18624 -30062 -10122 20554 28905 6121 -23009
1753b3009m468K5279K7886J115k7493k5793K625K8542K3952o274k9851k1668R459
$$ -23009 -27477 -2198 25688 26803 -690 -26483 -23858 4684 28636 22362 -7489 -29157 -19698
1766a9698K9944J9010j2994l0714j6381J5685L0340J3033j8794l0333r583K1112
$$ -19698 10246 29256 16262 -14452 -30833 -15148 15192 28225 9431 -20902 -30485 -9373
1778i373K9617O160k3763k7745k377K5611K6254o84k7180k3987M341K8265K2436
$$ -9373 20244 26404 2641 -25104 -27481 -1870 24384 23700 -3480 -27467 -23126 5139 27575
1791B7575q087k8822j9826J1049K9446J7051j4600k9656j4157J6849K9376J0478
$$ 27575 19488 -9334 -29160 -18111 11335 28386 13786 -15870 -30027 -13178 16198 26676
1803B6676j9437k9120p563K1633K8284M324k4237k6418m45K5860K4795k534k6631
$$ 26676 7239 -21881 -29444 -7811 20473 24797 560 -25858 -26303 -443 24352 21818 -4813
1816d813k2507O196K8350K0611r202k8863j7487J2255K8970J4852j5037k9111
$$ -4813 -27320 -21124 7226 27837 18635 -10228 -27715 -15460 13510 28362 13325 -15786
1828a5786j1878J7415K8506Q685k0426k8094n518K2716K6602K060k4390k4485
$$ -15786 -27664 -10249 18257 26942 6516 -21578 -27096 -4380 22222 24282 -108 -24593
1840b4593J248K6095K3251m245k6864k0426P952K7845J9143j1058k8080j5410
$$ -24593 -23345 2750 26001 21756 -5108 -25534 -17582 10263 29406 18348 -9732 -25142
1852b5142J3318K8566J2800j6222k8675r717J8396K7283O842k1251k6112l902
$$ -25142 -11824 16742 29542 13320 -15355 -25072 -6676 20607 27449 6198 -19914 -23816
1864b3816K2712K5224K19k4283k3400K462K6073K1744n654k6929j8873Q900K7584
$$ -23816 -1104 24120 24339 56 -23344 -20882 5191 26935 21281 -5648 -24521 -15621 11963
1877A1963J6870j1810k7773j3856J4516K7410J1307j7437k7000q319J9767K5940
$$ 11963 28833 17023 -10750 -24606 -10090 17320 28627 11190 -15810 -24129 -4362 21578
1889B1578N222k1864k5112j879K2788K3676j385k4754k2331M576K5627J9620p455
$$ 21578 26800 4936 -20176 -22055 733 24409 23024 -1730 -24061 -19485 6142 25762 18307
1902A8307k6522j7763J0204K6984J4909j3139k6958j2327J5643K7109R338j7790
$$ 18307 -8215 -25978 -15774 11210 26119 12980 -13978 -26305 -10662 16447 25785 7995
1914G995k6246o471K0024K5121L304k1919k3746p33K3127K2246k700k4955k0438
$$ 7995 -18251 -24722 -4698 20423 23727 1808 -21938 -22671 456 22702 20002 -4953 -25391
1927b5391N324K5259J8098q543k6508j5698J1172K6633J3420j3695k6470j0614
$$ -25391 -20067 5192 23290 14747 -11761 -27459 -16287 10346 23766 10071 -16399 -27013
1939b7013J6532K6441P811j8727k4698n191K0970K3799J732k2541k2628J052K3855
$$ -27013 -10481 15960 23771 5044 -19654 -24845 -3875 19924 21656 -885 -23513 -22461 1394
1952A394K0356m644k4709j8845P111K5452J6289j0163k5591j3753J2629K6333
$$ 1394 21750 17106 -7603 -26448 -19337 6115 22404 12241 -13350 -27103 -14474 11859
1964A1859J1390j5231k5174q492J7958K5034N769j9285k3881k281K0947K2439
$$ 11859 23249 8018 -17156 -25648 -7690 17344 23113 3828 -20053 -22334 -1387 21052
1976B1052o4k3037k0755L216K3579J8723n999k4588j7099R114K5116J4505j1754
$$ 21052 20988 -2049 -22804 -19588 3991 22714 16715 -7873 -24972 -15858 9258 23763 12009
1989A2009k4876j1744J4109K4994R463j6281k4516o211J8413K3559L861k0274
$$ 12009 -12867 -24611 -10502 14492 23955 7674 -16842 -23053 -4640 18919 22780 2506
2001B506k2399q18K1867K1353k399k2956j9050M901K3903J7559p894k4448j4881
$$ 2506 -19893 -20711 1156 22509 20110 -2846 -21896 -16995 6908 24467 16573 -7875 -22756
2014b2756J0589K4817J2523j2862k4138j0486J4890K4557P415j7388k3518m980
$$ -22756 -12167 12650 25173 12311 -11827 -22313 -7423 17134 24549 7161 -16357 -21337
2026b1337J8699K2509J874k0477k1498P99K1949J9931l799k2792j7622O511K3931
$$ -21337 -2638 19871 21745 1268 -20230 -19431 2518 22449 18650 -4142 -21764 -15253 8678
2039H678J5748r241k4028j3151J1555K3709J0947j3320k4324q810J5778K3156
$$ 8678 24426 15185 -8843 -21994 -10439 13270 24217 10897 -13427 -22237 -6459 16697
2051A6697O253j8384k2549l684J9746K1384N83k1251j9785K456K2444J8283m909
$$ 16697 22950 4566 -17983 -21667 -1921 19463 20046 -1205 -20990 -18534 3910 22193 17284
2064A7284k3188j6050Q288K3118J4268j0579k3730j1763J2620K3452R151j5677
$$ 17284 -5904 -21954 -13666 9452 23720 13141 -10589 -22352 -9732 13720 22871 7194
2076G194k3055o782J6834K2153M018j8976k1410q08K0408J9948j753k1764j7733
$$ 7194 -15861 -22643 -5809 16344 20362 1386 -20024 -20832 -424 19524 17771 -3993 -21726
2089b1726M831K2938J6044p344k2968j3438R766K2784J1962j2613k3034r372J4120
$$ -21726 -16895 6043 22087 14743 -8225 -21663 -11897 10887 22849 10236 -12798 -22170 -8050
2102h050K2200P072j6296k2152m384J7886K1487J739j9634j9733R02K1342J8562
$$ -8050 14150 21222 4926 -17226 -21610 -3724 17763 19502 -132 -19865 -18963 2379 20941
2115B0941l742k1978j6340O255K2327J4521q993k2450j2365J0890K2030R980j2977
$$ 20941 17199 -4779 -21119 -14864 7463 21984 12991 -9459 -21824 -10934 11096 21076 8099
2128H099k1972q064J4656K1868N753j6454k0865l380J8532K0533Q68j9632j9218
$$ 8099 -13873 -21937 -7281 14587 20340 3886 -16979 -20359 -1827 18706 19574 -58 -19276
2141a9276K385K1062J7161n056k1744j5102P310K1760J2820r721k2157j0995J1606
$$ -19276 -16891 4171 21332 16276 -5468 -20570 -13260 8500 21320 11599 -10558 -21553 -9947
2154i947K1382R009j3560k1377o767J5982K1104M113j7101k0391j467J9370J9233
$$ -9947 11435 20444 6884 -14493 -21260 -5278 15826 19939 2838 -17553 -19020 350 19583
2167A9583j058k0771j7441M048K1171J5119o792k1641j3432Q570K1649J1143j1245
$$ 19583 18525 -2246 -19687 -15639 5532 20651 13859 -7782 -21214 -12644 9005 20148 8903
2180H903k0958r198J2880K1331P053j4405k0411m841J6568J9906K681j8057j9441
$$ 8903 -12055 -21253 -8373 12958 20011 5606 -14805 -19646 -3078 16828 19509 1452 -17989
2193a7989Q06J8938J7480l280k0657j5859N673K0850J3727q168k0894j2064J0316
$$ -17989 -17183 1755 19235 15955 -4702 -20561 -14888 5962 19689 11521 -9373 -21437 -11121
2206a1121K0625J0231j1606k0992p030J3533K0487N701j5330k0076k768J6729
$$ -11121 9504 19735 8129 -12863 -19893 -6360 14127 19828 4498 -15578 -18346 -1617
2218a617J9157O61j8698j8021J497J9925J6019m395k0915j4475P122K0974J1877
$$ -1617 17540 18201 -497 -18518 -17021 2904 18923 14528 -6387 -20862 -13740 7234 19111
2231A9111q555k0485j0161J0916K0983Q376j2518j9980o378J4429J9639M024j5812
$$ 19111 10556 -9929 -20090 -9174 11809 20185 7667 -12313 -18691 -4262 15377 19401 3589
2244C589j9515j944J7437J8205j008j9092j6954L289J9781J5150o153k0303j2249
$$ 3589 -15926 -17870 -433 17772 16764 -2328 -19282 -15993 3788 18938 12785 -7518 -19767
2257a9767P924K0478J1060r726j9956q465J1621J9689P099j3064j9900m700J4466
$$ -19767 -11843 8635 19695 9969 -9987 -18452 -6831 12858 19957 6893 -13007 -17707 -3241
2270c241J9069K713j7126j8532N1J7756J6750j988j9690j5128N115K0127J3412
$$ -3241 15828 18541 1415 -17117 -17066 690 17440 15452 -4238 -19366 -14251 5876 19288
2283A9288p376j9789j0959R283J9819R342j0433j9396p689J1873J9015N798j3917
$$ 19288 11912 -7877 -18836 -9553 10266 19608 9175 -10221 -17910 -6037 12978 18776 4859
2296D859j8988m024J5142J8349J357j7035j7415J071J8777J5946l715j9057j4139
$$ 4859 -14129 -18153 -3011 15338 16695 -340 -17755 -16684 2093 18039 14324 -4733 -18872
2309a8872O398J9939J1814q138j9332r720J0139J8513P547j0795j9116o479J2453
$$ -18872 -12474 7465 19279 11141 -8191 -17911 -7772 10741 18288 7493 -11623 -18102 -5649
2322e649J8410M206j4095j8488k498J6335J7149L39j7535j5768K862J8586J4697
$$ -5649 12761 16967 2872 -15616 -18114 -1779 15370 15709 -1826 -17594 -14732 3854 18551
2335A8551n195j8819j2274P497J8930J0289r397j8682q331J0128J8130O690j2278
$$ 18551 13356 -5463 -17737 -10240 8690 18979 9582 -9100 -17431 -7303 10827 17517 5239
2348E239j7796n346J3531J7759K799j4592j7228p30J7065J6362j368j8038j4763
$$ 5239 -12557 -17903 -4372 13387 16186 1594 -15634 -16364 701 17063 15695 -2343 -17106
2361a7106M485J8641J3103o527j8921j0815Q220J8353Q511r746j8138p598J0860
$$ -17106 -12621 6020 19123 12596 -6325 -17140 -8920 9433 17944 8198 -9940 -17538 -6678
2374f678J7947N334j2375j7393m014J4364J7193K238j5505j6310O59J7191J5296
$$ -6678 11269 16603 4228 -13165 -17179 -2815 14378 16616 1111 -15199 -14540 2651 17947
2387A7947k594j8540j3537N363J8087J1354p684j8390r346Q616J7908P401j0174
$$ 17947 15353 -3187 -16724 -11361 6726 18080 10396 -7994 -17340 -8724 9184 16585 6411
2400F411j7355o345J1694J7390M543j2738j7043k774J4730J7170M21j6394j5655
$$ 6411 -10944 -17289 -5595 11795 16338 3600 -13443 -16217 -1487 15683 16104 -290 -15945
2413a5945K225J7383J4028m981j8437j2375O930J7840R687q477j7652q329J0031
$$ -15945 -13720 3663 17691 12710 -5727 -18102 -11172 6668 16355 7878 -9774 -18103 -8072
2426h072J6814O795j0967j6626m741J2150J7112L785j3952j6449j388J5354J5855
$$ -8072 8742 15537 4570 -12056 -16797 -4647 12465 16250 2298 -14151 -15539 -185 15670
2439A5670r92j7211j4527L361J7336J2814o268j7997j0483P319J7939Q561r402
$$ 15670 14678 -2533 -17060 -13699 3637 16451 10183 -7814 -18297 -10978 6961 15522 6120
2452F120j6707o718J0391J6528O062j1238j6409m078J2972J6364K303j4330j5964
$$ 6120 -10587 -17305 -6914 9614 15676 4438 -11971 -16049 -3077 13287 15590 1260 -14704
2465a4704m19J5580J4973k705j7186j3322M860J7770J1033p247j7079q676Q267
$$ -14704 -15123 457 15430 12725 -4461 -17783 -12923 4847 15880 8633 -8446 -17122 -8855
2478h855J7068P276r144j5804o087J0798J6059M972j2183j5841l014J3361J5671
$$ -8855 8213 15489 6345 -9459 -15546 -4748 11311 16283 4100 -11741 -14755 -1394 14277
2491A4277Q98j5345j5358J840J6318J3682m257j7275j1479O505J7198J0057q180
$$ 14277 15175 -170 -15528 -13688 2630 16312 12055 -5220 -16699 -10194 7004 17061 8881
2504H881j6469p647R355J6382N954j0088j5634n084J1272J5920L178j2522j6079
$$ 8881 -7588 -15235 -5880 10502 16456 6368 -9266 -14350 -3078 12842 16020 3498 -12581
2517a2581j682J3971J5388o82j5862j4111L396J6642J2379n488j6827r752P763
$$ -12581 -14263 -292 15096 14414 -1448 -15559 -12163 4479 16858 11370 -5457 -15209 -7446
2530g446J6623P901q543j5894o560J0035J5133N324j0910j5925m019J1992J4830
$$ -7446 9177 17078 8535 -7359 -13919 -3884 11249 16573 5663 -10262 -14281 -2289 12541
2543A2541K193j3586j4945m84J4886J4359k309j5866j2676M648J7128J0655o606
$$ 12541 14734 1148 -13797 -14281 605 14964 12655 -3211 -15887 -11239 5889 16544 9938
2556I938j6435q439Q149J6220O567r381j5268n584R795J4829M253j1452j4813
$$ 9938 -6497 -14936 -6787 9433 16000 6619 -8649 -14233 -4438 10391 14644 3192 -11621
2569a1621l355J1993J5000J541j3801j4663O66J5677J3445l273j6242j0830N017
$$ -11621 -14976 -2983 12017 13558 -243 -14906 -14240 1437 14882 11609 -4633 -15463 -10446
2582a0446J6981R275p387j5879p529Q028J5150O186r586j5285m689J0191J4404
$$ -10446 6535 15810 8423 -7456 -14985 -6957 8193 14379 4793 -10492 -15181 -4990 9414
2595I414L637j1386j4864k094J2891J4819M7j4078j3495K189J5892J2228m358
$$ 9414 13051 1665 -13199 -15293 -2402 12417 12464 -1614 -15109 -12920 2972 15200 10842
2608A0842j6036j0322O358J5874Q141q322j5274o240Q389J5116M629r346j4492
$$ 10842 -5194 -15516 -9158 6716 14857 6535 -8739 -14979 -6590 8526 13155 3809 -10683
2621a0683m325J0848J4180L204j1756j4456q19J3409J4288j207j5008j2294L230
$$ -10683 -15008 -4160 10020 13224 1468 -12988 -13807 -398 13890 12683 -2325 -14619 -11389
2634a1389J5925J0743o112j5582r042P488J4926O900q542j4765n272R484J3943
$$ -11389 4536 15279 9167 -6415 -15457 -7969 6957 13857 5315 -9450 -14722 -5238 8705
2647H705M915j0352j3535k999J1087J4289K067j2465j3701J6J4255J3065l096
$$ 8705 13620 3268 -10267 -13266 -2179 12110 14177 1712 -11989 -11973 2282 15347 12251
2660A2251j4917j1428M393J5924Q898o924j5275p652P772J4808N561q315j4511
$$ 12251 -2666 -14094 -9701 6223 15121 8197 -7078 -14730 -6958 7850 13411 5096 -9415
2673i415m262R408J4336L655j0714j3461k349J1870J3779O92j3277j3253J518
$$ -9415 -13677 -4269 10067 13722 3008 -10453 -12802 -932 12847 13539 262 -12991 -11473
2686a1473J4474J1802m056j5329j0303O155J4837Q204p455j4711o100Q469J4507
$$ -11473 3001 14803 10747 -4582 -14885 -8730 6107 14311 6856 -7855 -13955 -5486 9021
2699I021M391q755j3445l706J0112J3334K619j1030j3341j388J2307J2765p88
$$ 9021 13412 4657 -8788 -12494 -2382 10952 13571 2541 -10800 -12188 119 12884 12096
2712A2096j3688j2082K401J4363J0763n373j4769r088P353J4645O658p789j3907
$$ 12096 -1592 -13674 -11273 3090 13853 8480 -6289 -15377 -8024 6621 13279 5490 -8417
2725h417n123R119J3341M374r398j3282k907J0353J3018J983j2050j2816l42J2913
$$ -8417 -13540 -4421 8920 13294 3896 -9386 -12293 -1940 11078 13061 1011 -11805 -12147 766
2739G66J2588k409j4304j0622M097J4606R637o443j4658p039P243J4554N404q197
$$ 766 13354 10945 -3359 -13981 -9884 4722 14359 7916 -6742 -13781 -6538 8016 13420 5223
2753E223j3052m498R001J2856L387j0099j2577k222J0572J2353P07j2090j2572
$$ 5223 -7829 -12327 -3326 9530 12917 2818 -9759 -11981 -1409 10944 11651 -439 -13011
2766a3011J329J3070J1336l104j4366r275N750J4262Q053o971j4217n199P873
$$ -13011 -11682 1388 12724 9620 -4746 -14021 -8271 5991 14044 7073 -7144 -12343 -4470
2779d470J3353M454q804j2844l407R656J1928K581j0855j2479q86J1399J2138
$$ -4470 8883 13337 4533 -8311 -11718 -2062 9866 12447 1592 -10887 -11773 -374 11764
2792A1764o55j2911j1252K863J3807R982m566j4226q007O305J4134O178p923j2925
$$ 11764 11109 -1802 -13054 -10191 3616 13598 9032 -5194 -13201 -6896 7238 13416 5493 -7432
2806g432m935Q129J2979L390r355j2451k295R316J2103J563j0436j2280K06J2205
$$ -7432 -12367 -4238 8741 12131 2776 -9675 -11970 -2654 9449 11012 576 -11704 -11498 707
2820G07J1560j864j2702j0626M219J3509R154n770j3917o966P092J3212N396q443
$$ 707 12267 10403 -2299 -12925 -8706 4803 13957 8187 -5730 -12696 -5604 7608 13004 4561
2834D561j2500m225Q537J2244K475r378j1949j808R982J1799O43j0898j1488J143
$$ 4561 -7939 -12164 -3627 8617 11092 1714 -10235 -12043 -2061 9738 10381 -517 -12005 -10862
2848a0862J2595J0389k597j3072r800N346J3392P598o560j3305n965P665J2982
$$ -10862 1733 12122 9525 -3547 -13347 -8001 5391 12989 6429 -6876 -12841 -5176 7806
2861G806M216q620j2279l396Q880J1818K553r610j1727q68J0300J1776O0j1889
$$ 7806 12022 3402 -8877 -12273 -3393 8425 10978 1368 -10359 -11227 -927 10849 10909 -980
2875i80j0533J948J2703R698l739j3548q083N621J3311N984o787j3077m612Q069
$$ -980 -11513 -9565 3138 12836 9097 -4451 -12534 -6913 6398 12382 5595 -7482 -12094 -4025
2889d025J1872L596q934j1503k488R163J1537J648j0255j0678n23J1243J1046
$$ -4025 7847 11443 2509 -8994 -11482 -2319 9218 10866 611 -10067 -10590 653 11699
2902A1699j471j2452r495K713J2960R016n498j2545p377O418J2997M972p181j2223
$$ 11699 10228 -2224 -11719 -9006 3954 12970 7472 -5073 -12450 -6032 6965 11937 4756 -7467
2916g467m003Q115J1640L041q588j1440j911R481J0766J213j0293j0805N34J1392
$$ -7467 -11470 -3355 8285 11326 2738 -8702 -10613 -1132 9634 10847 554 -10251 -9717 1675
2930A675R866k022j2469r112L668J2767P638n916j2368n928P030J2053M576p686
$$ 1675 11541 9519 -2950 -12062 -8394 4373 12011 6095 -6273 -12201 -5171 6882 11458 3772
2944C772j1594l003Q201J1519K004q735j0711j528J0063J0185M2j0903j0082R98
$$ 3772 -7822 -10825 -2624 8895 10899 2164 -8547 -10075 -12 10173 10215 -688 -10770 -9772
2958i772J1618R479l012j2491q172M886J2339O672o525j1696n190P524J1700L694
$$ -9772 1846 11325 8313 -4178 -12350 -7464 4875 11547 5022 -6674 -11864 -4340 7360 11054
2972A1054p958j0556k868Q406J0649J936q925j0877n65J0152R942p92j1306r453
$$ 11054 3096 -7460 -10328 -1922 8727 10663 1738 -9139 -9704 448 10390 9598 -1708 -11161
2986a1161K461J1210Q815l923j2667p016N810J2090N957o936j1832l826P480J1529
$$ -11161 -8700 2510 11325 7402 -5265 -12281 -6471 5619 11576 4640 -7192 -11018 -3538 7991
3000G991K720p958j0692k099Q912J0002J100r328j0175J56J0436R516j343j1290
$$ 7991 10711 2753 -7939 -10038 -1126 8876 9976 648 -9527 -9371 1065 10581 9238 -2052
3014b052q505K757J1962P363m641j1527o329N979J1505N121p219j1106l799P544
$$ -2052 -10557 -7800 4162 11525 6884 -4643 -10972 -4993 6512 11633 4414 -6692 -10491 -2947
3028b947J0689K831q163j0973j489R223R971N15r709r791R19J0292R562k927j0568
$$ -2947 7742 10573 2410 -8563 -10052 -829 9142 9657 -52 -9843 -8924 1368 10930 8003 -2565
3043b565q326M244J1139P249n564j1453n392O289J0978M120p103j0946k480P492
$$ -2565 -10891 -6647 4492 11741 6177 -5276 -10668 -4379 6599 10719 3616 -7330 -9810 -2318
3057b318J0460J832q229j0278j171R244R934l00r883r205J540J0706Q718l578
$$ -2318 8142 9974 1745 -8533 -9704 -460 9474 9174 -709 -9914 -8374 2332 11050 7472
3071G472j1313p291M969J1198N797n915j1020m988O649J0702L173p213j0455k457
$$ 7472 -3841 -11132 -6163 5035 10832 4917 -6103 -11091 -4442 6260 9433 2220 -8235 -10692
3085a0692Q111R881J433q875r229o35R871R465r82r904r043L131J0706P513l883
$$ -10692 -2581 7300 8733 -142 -9371 -10006 -135 9330 8348 -1556 -10599 -7468 3238 10751 6868
3100F868j1199o073M952J1142M838o446j0375l996P154J0151K582p753j0010j534
$$ 6868 -4331 -10404 -5452 5690 10528 4082 -6293 -10289 -3135 7016 9598 1845 -8165 -9699
3114i699P953R661J001r306r412L13J0153Q500j486j0860p518L198J0944O715
$$ -9699 -1746 7915 8916 -390 -9802 -9489 664 9164 7678 -3182 -10700 -7502 3442 10157
3128A0157m914j0635n541N978J0217M676o641r946l139P148J0110K247p825r566
$$ 10157 5243 -5392 -10933 -4955 5262 9938 3297 -6649 -9788 -2640 7470 9717 1892 -7674
3142g674j077Q415R476N8r182q931R55J0023Q110k192j0644p142L851J0554N963
$$ -7674 -8751 -336 9140 9198 16 -8915 -7960 2063 10173 7981 -2663 -9805 -5954 4600 10563
3157A0563n189j0581n002O088J0445L368p220r579k553P664R264J901p697r639
$$ 10563 5374 -5207 -10209 -4121 6324 9692 2472 -7107 -9660 -1996 7268 9169 1472 -8167
3171h167o79Q886R017o40r409q441K361J0038P434l290j0402o060M485J0469N520
$$ -8167 -8846 40 9057 8417 -992 -9433 -7072 2966 10400 7110 -3292 -9352 -4867 5602 11122
3186A1122n606j0551l984O548R738K651o884r417k118P966R096N76q753q416k85
$$ 11122 5516 -5035 -9019 -2471 7267 9918 3034 -6383 -8501 -535 8561 9137 384 -8032 -8317
3201h317R480Q056j623r877p774K972J0003O399l951r999n571M929J0467M451
$$ -8317 1163 9219 7596 -2281 -10055 -7083 2920 9319 5368 -4631 -10202 -5273 5194 9645
3215I645o270r707l399O895R814K362p590r335j065Q418Q822P4q244q490O93R477
$$ 9645 3375 -6332 -9731 -2836 6978 9340 1750 -7585 -8650 -232 8590 8664 420 -8070 -7377 2100
3231B100P494k026j0121p001L573R999N711m355j0052m905N332R553L712o423
$$ 2100 9594 7568 -2553 -9554 -5981 4018 9729 5374 -4678 -9583 -4251 5302 9014 2591
3245B591r472k518O698R344J764q051q706p00Q240Q248K3r026p783J231R563P547
$$ 2591 -6881 -9399 -2701 6643 8407 356 -8350 -9050 -810 7438 7461 -1565 -9348 -8117 1446 8993
3261H993k552r693o228L799R743N260m365r820m419O149R500L340o666r241k074
$$ 8993 6441 -3252 -9480 -5681 4062 9322 4957 -4863 -9282 -3133 6367 9707 3041 -6200 -8274
3276h274O902R271P45p968q386j75Q628P541q32r137p252J996R119O716l485r628
$$ -8274 -1372 7899 8644 676 -7710 -7885 743 8284 7452 -1685 -8937 -6941 2178 8894 5409 -4219
3292d219n859N036R236M444n085r447l715O253R068K817o756r004j363P720Q473
$$ -4219 -10078 -5042 4194 8638 3553 -5894 -9609 -3356 5712 8529 1773 -7231 -8594 -874 7599
3307G599P03p976p849N34Q483P750j896q969o652K490R571N691l741r476n166
$$ 7599 8302 326 -7523 -6989 1494 9244 7348 -1621 -8273 -5783 3788 9479 5738 -3738 -8904
3322h904N163R430L472n815r423k558O221Q930J555o957q725p62P666P897k13
$$ -8904 -3741 5689 9161 3346 -6077 -8635 -2414 6516 8071 1114 -7611 -8373 -707 7190 6977
3337F977q388p665J511Q908O903k304q948o248L565R430N125m145r344l923N356
$$ 6977 -1411 -9076 -7565 1343 8246 5942 -3006 -9254 -5689 3741 8866 4721 -4623 -8546 -3190
3352c190R093L273o290q608j804O195Q697Q60p177q451L50P624P243p27q389o990
$$ -3190 5903 9176 2886 -5722 -7526 -1331 7366 8226 1049 -7402 -7052 572 7815 7088 -1301 -8291
3368h291J846Q732O175k942q824o026M310Q934M529m879r361k950N262Q910K571
$$ -8291 -6445 2287 8462 5520 -3304 -9330 -5020 3914 8443 3564 -5797 -8747 -3485 5425 7996
3383G996o586q295j581O963Q179Q53p398q230P38Q325P322j537q262o761K873
$$ 7996 1410 -6885 -8466 -1503 6676 7529 131 -8099 -7361 964 8286 6749 -1513 -8274 -5401
3398e401Q960N401l112r048n086M789Q690M131n656q542l357N999Q648J866o703
$$ -5401 3559 8960 5848 -3200 -8286 -3497 5193 9324 3668 -4874 -8231 -2232 6416 8282 1579
3413A579q159j203P120P759k83p722o950P78Q260O570j983q564n948L363Q536
$$ 1579 -6580 -7783 -663 7096 6813 -909 -7859 -7081 1179 7749 5766 -2798 -8746 -5383 3153
3428C153N330m034q607m146N082Q356L475n540q635j995O008Q341J457o797p795
$$ 3153 8483 4449 -4158 -8304 -3222 5134 8609 3069 -5566 -7561 -1553 6788 8245 1448 -6347
3443f347l59P231P389l75q188o795J605Q244O183k564q783n647L685Q451M790
$$ -6347 -6706 525 7914 7539 -649 -7444 -5839 2405 8588 6024 -2759 -8406 -4721 3730 8520
3458H520m944q873l298M968Q853K202n929q065j798O614P839R46p415o836L45
$$ 8520 3576 -5297 -8595 -3627 5226 7428 1499 -6566 -8364 -1750 6089 7035 -380 -7216 -6871
3473f871P570O724r40p820o262K111Q340N594l359q484m721M213Q333L805m920
$$ -6871 699 7423 6483 -1337 -7599 -5488 2852 8446 5087 -3397 -8118 -3905 4428 8233 3313
3488C313q262l101N414Q061K064n875q272n54O398P443O74p694o858P06P637O296
$$ 3313 -4949 -8050 -2636 5425 7489 1614 -6658 -7212 -814 6629 7303 -391 -7249 -6543 1094 7390
3504G390j553q159n763K514Q411N116m020q346m137M543Q203L102n096q268k168
$$ 7390 5837 -2322 -8085 -5571 2840 7956 3936 -4410 -8547 -4004 4199 7301 2205 -6063 -8231
3519h231O287P536J778o775p231m92P027P177j91p692o253J493P788N577k242
$$ -8231 -1944 5592 7370 595 -6636 -7128 -101 7076 6885 -807 -7060 -5567 2221 7798 5556
3534E556p939n332L499Q019L970m045p992l665N327P370K598n502p603j559O034
$$ 5556 -2383 -7715 -4216 3803 7773 3728 -4264 -7929 -2602 4768 7366 1864 -5739 -7298 -1264
3549a264P476P63o896p089J28P464O324j024p585n943K094P624N318k580p910
$$ -1264 6212 6975 79 -7010 -6882 582 6906 5882 -1703 -7646 -5552 2072 7390 4810 -3100
3564c100m711L999Q262L756m786p621k943N102P709J750n788p664q12O265P132
$$ -3100 -7811 -3812 4450 8206 3420 -4201 -7144 -2042 5667 7417 1629 -6035 -6847 -582 6550
3579F550Qo946o656L41P733O211j793p853n214K418Q002M812l569p337l857L872
$$ 6550 6558 -388 -7044 -6703 1030 7241 5448 -2405 -7619 -5201 2801 7613 4044 -3293 -7150 -3278
3595c278Q051L147n070p633k207N560P375J256o100p227r62O809O608l26o948
$$ -3278 4773 7920 2850 -4783 -6990 -1430 5945 7201 1101 -6126 -7088 -279 6329 6003 -945
3610i45o423J064P524N430k032p428n103L279P625M350l480p676l653M729P845
$$ -945 -7368 -6304 1220 6650 4618 -2810 -7913 -4634 2991 7341 3861 -3815 -7468 -2739 5106
3625E106K680n238p412j811N646P177J051o594o623n17O841O380q02p343n643
$$ 5106 7786 2548 -4864 -6675 -1029 6148 7199 605 -6018 -6535 306 6686 5884 -1459 -7102
3640g102J737P010N496l043p301m136L073P742L839m092p521k959M985P508J800
$$ -7102 -5365 1645 7141 4098 -3203 -7339 -4266 3476 7315 3223 -4298 -7257 -2272 5236 7036
3655G036n191p645j070O460O780M10o552o609N27O963N972j478p180n404K076
$$ 7036 1845 -5800 -6870 -410 6370 6780 228 -6381 -5854 1109 7081 5603 -1577 -6981 -4905
3670d905P426M439k580p613l699L563P370L231m192p246k672M805P410K194o090
$$ -4905 2521 6960 4380 -3233 -6932 -3369 4001 7232 3040 -4206 -6878 -2073 5337 7531 1441
3685A441p015r58O605O538oo741n771K42P107N625j999o985n200K321P320M219
$$ 1441 -5574 -6532 73 6611 6605 -136 -5907 -5665 1442 7067 5068 -1917 -7117 -4796 2524 6743
3701F743l208p516l844M204P320K855m698p107j816N367P232J187n664o787m5
$$ 6743 3535 -3981 -7825 -3621 3699 6554 1856 -5251 -7067 -1700 5532 6719 1055 -5732 -5777
3716e777O394O395m53o524n587R11P045N316k525p351m477K588P022L998l825
$$ -5777 617 7012 6559 35 -5552 -4641 2404 7720 5195 -2156 -6633 -4045 2977 6975 3150
3731C150p460l291M340O905K421m835p170j573N499O938J116n649o980N18O370
$$ 3150 -4310 -7601 -3261 3644 6065 1230 -5940 -7513 -2014 4924 6040 391 -6589 -6071 299
3746B99N797q32o653n059J670P167M745k245p346m164L197P219L161m073p005
$$ 299 6096 5264 -1389 -6448 -4778 2389 7134 4889 -2457 -6621 -3424 3795 6956 2883 -4122
3761d122k886M686P182J561n172o884p70N783O263J45o138n725K48O508N388j367
$$ -4122 -7008 -2322 4860 6421 1249 -5635 -6405 -622 5641 5786 -352 -6077 -5829 679 6067 4700
3777D700o481n175K258O893M089k912o842l639L721O818K856m098o698k405N052
$$ 4700 -1781 -6956 -4698 2195 6284 3372 -3470 -7109 -3388 3430 6286 2188 -4510 -6915 -1863
3792a863O682J366n508o024n56N880N987l23n814n931J445O169N143j820o467
$$ -1863 4819 6185 677 -5347 -5903 -23 5964 5641 -173 -6104 -4659 1510 6653 4833 -1634
3807a634m549K513P014L626k975p067k882L858O535K238m317o604k011N201O150
$$ -1634 -6183 -3670 3344 6970 3995 -3072 -5954 -2096 4439 6677 2360 -4244 -6255 -1054 5096
3822E096Q67n583o370k23N651N762m26o426n319J674O447M864k382o357l616K831
$$ 5096 5963 380 -5990 -6213 -562 5200 4774 -1652 -6971 -5297 1150 6014 3632 -2725 -6341 -3510
3838c510O786L753l901o338k201M123O665J800m871o466r80N240N825K23n844
$$ -3510 3276 7029 3128 -3210 -5411 -1288 5377 7177 2306 -4160 -5140 100 5925 6148 304
3853C04n974M46N810N510j614o431m392K055O334L814k626o459l539L418O514
$$ 304 -5670 -5224 586 6096 4482 -1949 -6341 -4286 2048 5862 3236 -3223 -6762 -3344 3170
3868C170K691l634o658k074M484O580J043m977n598q72N571N458N8n811n301J027
$$ 3170 5861 2227 -4431 -6505 -2021 4559 5602 625 -4973 -5845 -274 5184 5242 -569 -5870 -4843
3884d843O074N013j419o205m281K351O381L914l165o470l040L422O409K255m101
$$ -4843 1231 6244 4825 -1380 -5661 -3310 3071 6985 3820 -2650 -5690 -2268 4141 6396 2295
3899B295o557j745M525N907P43n148n635k96N746N168o78n713m809R08O232M479
$$ 2295 -4262 -6007 -1482 4425 5168 20 -5615 -5911 -165 5003 4325 -1388 -6197 -5289 943 5422
3915E422j594o133l854K557O346L407l462o078k340L573O463K017m412o068j233
$$ 5422 3828 -2305 -6159 -3602 2744 6151 2689 -3389 -5729 -2156 4307 6324 1912 -4156 -5389
3930e389M968N793K43n093n414J00N860M677n23o031m772J695N878M263k437o207
$$ -5389 -421 5372 5615 522 -4892 -4792 1068 5745 5222 -809 -5581 -3886 1992 6255 3818 -2389
3946b389l567K875N915K662l753o075k243M333N999J188m405n716n80N345N324
$$ -2389 -5956 -3081 2834 5496 1743 -4332 -6575 -2242 3757 4945 540 -5176 -5756 -411 4913
3961D913K56n653n015P66N965M611j373n930l941J883O153L627k441o507k809
$$ 4913 5169 -484 -5499 -4733 1232 5843 4470 -1460 -5401 -3518 2635 6262 3821 -2686 -5495
3976e495L452N801K241l761n752j757M390N671Q53m751n444o94N381M889o70n047
$$ -5495 -2043 3758 5999 2238 -3514 -5271 -881 4790 5643 892 -4552 -5246 135 5024 4354 -693
3992f93n003Q31N462M234j865n242m144K099O152L359k992o026k254L671N925
$$ -693 -5696 -4865 597 4831 2966 -2276 -6420 -4321 1831 5190 2198 -3828 -6082 -2411 3514
4007C514K007l819n705j116M701N414O65m849n043J43N523M446j204n387m640
$$ 3514 5521 1702 -4003 -5119 -418 4996 5661 812 -4231 -4088 1435 5881 4677 -710 -5350
4022e350J718N097L806k039n929l357K748N705K537l192n795j942L842N619J382
$$ -5350 -3632 1465 5271 3232 -2697 -6054 -3306 2399 4936 1744 -4051 -5993 -2151 3468 4850
4037D850m102n084p61M563N150L40n205m751L55N627M311j112n531m249J835N892
$$ 4850 748 -4336 -5097 -534 4616 4956 -249 -5000 -4645 982 5293 4181 -1350 -5599 -3764 2128
4053B128L338k367n648l105L148N958K104l329n807j470M115N311J103m454n243
$$ 2128 5466 3099 -2549 -5654 -2506 3452 5556 2227 -3580 -5050 -935 4376 5479 1025 -4218
4068d218k82M777M889j16n399m489J130N103L967j800n181l552J799N750K630
$$ -4218 -4500 277 5166 5050 -349 -4838 -3708 1395 5362 3562 -1619 -5171 -3372 2378 5008
4083E008k352o066k339L358N414K154m127n239j081L972N472O16m751m640m5N370
$$ 5008 2656 -3410 -5749 -2391 3023 5177 1050 -4189 -5270 -1298 4174 4790 39 -4601 -4646 724
4099G24M373o45m895m095J276N515L692k028n213l312K333N481K179k816n506
$$ 724 5097 4452 -443 -4538 -3262 2253 5945 3917 -1296 -4608 -2275 3206 5385 2569 -2937
4114b937k165L499N015J574m082n619q81M437M772J92m657m260L48M908M438j128
$$ -2937 -5102 -1603 3412 4986 904 -4715 -5596 -1159 3613 3805 -852 -5112 -4764 144 4582 3454
4130C454m980l583J603N439L545j906n552k844L052N305K082l178n516j629L516
$$ 3454 -1526 -5109 -3506 1933 5478 3572 -1980 -4824 -1772 3533 5615 2437 -3079 -4708 -1192
4145a192N060R72m176n136p59M784M290J46n068m161J029M656M169j158m753l996
$$ -1192 3868 4840 664 -4472 -5231 -447 3843 3989 -1079 -5240 -4211 445 4614 3456 -1297 -5293
4161e293K383N239L284k648n222k259K967M559K154l371n449j079M004M717P15
$$ -5293 -2910 2329 5613 2965 -2257 -4516 -1549 3010 5164 1793 -3656 -4735 -731 3986 4701
4176D701m410m848J07M175M325k44m979l915J230M939L548j645n052l055K270
$$ 4701 291 -4557 -4450 -275 4050 3806 -1173 -5088 -3858 1081 4629 2984 -2068 -5123 -2853
4191b853N229K885k499n472j922L287M837J937l978m589j113L751M619L73m219
$$ -2853 2376 5261 2762 -2710 -4632 -1345 3492 5429 1451 -3138 -4251 -500 4119 4492 273
4206B73m669L21M419L710l31n175l829J430M777L419j803m907k950K423N433K008
$$ 273 -4396 -4075 344 4054 3723 -1452 -5281 -3851 926 4345 2542 -2365 -5315 -2892 2541 4549
4222D549k566n058j533L539M710J577l963m318o78M061M747l81m498m260N95M505
$$ 4549 1983 -3075 -4608 -1069 3641 5218 1255 -3063 -3741 320 5067 4686 188 -4072 -3477 1028
4238A028L576j057m917l512J528M784K712j930n257k142K520M911K222k983m948
$$ 1028 4604 3547 -1370 -4882 -3354 1430 4142 2212 -3045 -5187 -2667 2244 4466 1483 -3465
4253c465j042L608M420J326l848m395m40M393M052l03m400l931N30M796L294j515
$$ -3465 -4507 -899 3521 4847 999 -3396 -3836 557 4609 4306 -94 -4025 -3495 1301 4595 3080
4269C080m659l297J999M442K828k798m595k532L305N016J421l204m415j192L902
$$ 3080 -1579 -4876 -2877 1565 4393 1595 -3000 -5532 -2227 2789 4210 1006 -3409 -4601 -699
4284f99M851J49l755l982k11M267M079l82m636l399R93M362L203j639n094k783
$$ -699 4152 4301 546 -3436 -3647 620 4699 4317 -319 -3718 -2725 1637 4840 3201 -1893 -4676
4300d676K156M869J855k737m627j830L253M383J384l479m473p28L927M156N84
$$ -4676 -2520 2349 4204 1467 -3160 -4990 -1737 2646 4030 551 -3922 -4650 -723 3433 4017
4315D017m080m204M92M594L752j071m315l097J059N260K373j871m781k420K287
$$ 4017 -63 -4267 -3775 819 4571 3500 -815 -3912 -2853 2407 4780 2909 -1872 -4292 -2005
4330b005M622K078k908m758j451L105M479R41l612m414l64L885M144k80l864l683
$$ -2005 2617 4695 1787 -2971 -4422 -1317 3162 4103 491 -3923 -4287 -402 3742 3462 -402 -4085
4346d085P50M629L069j099m296k838J277M730K654k243m623k215K714M301J552
$$ -4085 -3335 1294 4363 3264 -1032 -3870 -2593 2137 4791 2548 -2075 -4290 -1576 2725 4277
4361D277l132m377j148L095M792M8l659m152Q1M053L775l56l987l246R15L977
$$ 4277 1145 -3232 -4380 -1285 3507 3555 -104 -4256 -4175 -122 3653 3297 -690 -3936 -3021 956
4377I56L427j181m436k592J698M440K283k043m874j443K711M240J157l337m401
$$ 956 4383 3202 -1234 -3826 -2128 2312 4595 2552 -2322 -3765 -1054 3186 4343 1006 -3395
4392c395p58L672L830L90m170m060K95M036L576p21m024l137J250M471K978j670
$$ -3395 -4153 -481 3349 3739 -431 -4491 -4196 -160 3416 2695 -1329 -4466 -3216 1255 4233 2563
4408B563m704j909K510L809K256k594m224j364K639M507Q47l123m575m59L966
$$ 2563 -2141 -4050 -1540 2269 4525 1931 -2293 -3657 -1018 3489 4336 1213 -3362 -3821 145
4423A45L766P7m308l258L55L663L640j379m101l062J229M621K728j987m473j853
$$ 145 3911 3988 -320 -3578 -3223 440 4080 2701 -1400 -4462 -3233 1388 4116 2129 -2344 -4197
4439d197J847M475K100k986m194j195L377L628J010l559l587n47L897L548m91
$$ -4197 -2350 2125 4225 1239 -2955 -4150 -773 2855 3865 306 -3281 -3828 69 3617 3126
4454C126l640k921L12M355K934j404m192k459J537M305K284k290m118j846K370
$$ 3126 -514 -3435 -3123 1232 4166 2762 -1430 -3889 -2352 1953 4237 1947 -2171 -4017 -1647
4469a647M196J451l075l953r28L326L736P54l655l763k4L722L485n88l815l207
$$ -1647 2549 4000 925 -3028 -3956 -630 3106 3860 205 -3558 -3582 140 3625 3037 -778 -3985
4485c985J098L957K771j536m377k101J935M364J758k528m149j036K411M196J271
$$ -3985 -2887 1070 3841 2305 -2072 -4173 -2238 2126 3884 1356 -2793 -3829 -1418 2778 4049
4500D049k829m358n19L538L543J31l294l438n7L750L372p34l976l015R43M407
$$ 4049 1220 -3138 -3657 -119 3424 3555 261 -3177 -3234 516 3888 3154 -822 -3837 -2894 1513
4516A513K457j855m056k109J822M313J406k201m040j218K668L748J024k704m001
$$ 1513 3970 2115 -1941 -4050 -2228 2085 3491 1290 -2750 -3968 -1300 2448 3472 768 -3233
4531c233n31L254L726j5l572l101M57L679L076r55m143k259J219L988K487j728
$$ -3233 -3764 -510 3216 3201 -371 -3472 -3015 664 3740 2785 -1358 -3617 -2398 1590 4077 2349
4547B349l915k022J845M346J367k566l912j157L489L327N80l358l568k99L274
$$ 2349 -1566 -3588 -1743 2603 3970 1404 -2508 -3665 -176 3151 3731 373 -3195 -3494 -220
4562b20L627n85l596k987P14M009K267r41l922k461J577M183J908j626l800j824
$$ -220 3407 2822 -774 -3761 -3047 962 3229 2288 -1634 -4095 -2518 1665 3573 1947 -1853 -3677
4578c677K616L843R71k602l958k18K782L395Q27l641l265k49L732K961n83l742
$$ -3677 -1061 2782 3753 1151 -2807 -3025 -243 3152 3979 338 -2927 -3176 556 3517 2934 -808
4594h08k729Q22L891K437j241m025j987J497L686K261k376m025j565L203L506
$$ -808 -3537 -2715 1176 3613 2372 -1653 -3640 -2143 1543 3804 1428 -2597 -4162 -959 2547
4609B547J117l441l015o22L199L809l38l510k913K19L465K822o16l673k783J209
$$ 2547 3664 223 -2792 -3414 -215 3594 3256 -254 -3167 -2948 517 3339 2723 -950 -3733 -2524
4625b524L679K639j889l472k167K052L930J380k513l643j327K833M111N5k562
$$ -2524 1155 3794 1905 -1567 -3734 -1682 2248 3628 1115 -2528 -3855 -1022 3089 3144 582
4640E82l327m38L318L273q3l513l330Q96L859K170p82l835k662J969L149K075
$$ 582 -2745 -3183 135 3408 3325 -188 -3518 -2622 1237 3407 2625 -1210 -3872 -1903 1246 3321
4656C321j791l929j396K008L834R92k638l519l88K806L492K32k740l191J71L045
$$ 3321 1530 -2399 -3795 -1787 2047 3039 401 -3118 -3506 -700 2792 3024 284 -2907 -2736 309
4672C09K954l19l666k405R36L228K938j764l331k081J560L508J465j952l903j030
$$ 309 3263 2944 -722 -3127 -2191 1037 3975 2211 -1120 -3201 -1641 1867 3332 1380 -2523 -3553
4688c553K162L799P12k775l409k66K767L304L73l609l021N07L280L347p86l479
$$ -3553 -1391 2408 3120 345 -3064 -3330 -563 2741 3114 -495 -3516 -3009 271 3618 2832 -647
4704f47k711J128L787K031j371l596k163K322L490J444k359l574j269K695L437
$$ -647 -3358 -2230 1557 3588 2217 -1379 -3542 -1220 2270 3714 1355 -2219 -3488 -793 2644
4719B644M91k888l285n27L451K891j02l142k973N94L326K782j278k929k264J259
$$ 2644 3135 247 -3038 -3565 -114 2777 2675 -467 -3440 -2846 480 3262 1984 -945 -3209 -1950
4735a950L531J927j421l657j515J772L696J095k406l441p92K708L032M59l066
$$ -1950 1581 3508 2087 -1570 -3085 -1313 2383 3478 1072 -2369 -3161 -453 2579 3038 -28
4750b8l441N01K963K527J20l521k632J259L393K143j279l597j688J610L664J527
$$ -28 -3469 -2968 -5 2522 2642 -879 -3511 -2252 1141 3284 2005 -1592 -3280 -1670 1994 3521
4766C521j841l485j309K620L192P11k314l598m57K703L102k49k994k542OL527
$$ 3521 1680 -1805 -3114 -494 2698 3409 1095 -2503 -2960 -257 2845 2596 -398 -2940 -2934 593
4782E93K179n01l389k545R32L512K240j367l417j688J858L660J326k147l371p68
$$ 593 2772 2271 -1118 -3663 -2731 781 3021 1654 -1763 -3451 -1593 2067 3393 1246 -2125 -2893
4798b893K433L163Q15k481l639l1L107K781n24l055k603O55K946K191q44k948
$$ -2893 -460 2703 3518 1037 -2602 -2633 474 3255 2731 -324 -2927 -2272 674 2865 2021 -927
4814i27k714J289L544J942j875l202j436K231L191J093k178l201o51K346L193
$$ -927 -3641 -2352 1192 3134 1259 -1943 -3379 -1148 2043 3136 958 -2243 -2894 -548 2645
4829B645N14k955k594o2L112K740o96l296k663R77K963K328j118l162k025J448
$$ 2645 3159 204 -2390 -2452 660 3400 2704 -592 -3255 -2278 685 3013 1895 -1267 -3292 -1844
4845a844L309J705k052l105j473K257L354Q08k280l245Q6K130K909L84k881k334
$$ -1844 1465 3170 1118 -1987 -3460 -1203 2151 2959 679 -2566 -2480 -350 2559 2943 62 -2272
4861b272O2L204K123n50k869k874J267L109J820j148l339j731J535L352J196j833
$$ -2272 -2210 994 3117 2567 -302 -3176 -1909 1200 3020 1872 -1467 -3198 -1663 1689 2885 1052
4877A052l185j102K185L326N65k819k548m01K847K691J04l206k212L53L180K440
$$ 1052 -2133 -3235 -1050 2276 2841 22 -2526 -2927 -80 2611 2715 -491 -2703 -2350 830 3270
4893C270r59k739k417J292K859K200j707l584j184J774K767J234k059l185o78
$$ 3270 2311 -428 -2845 -1553 1306 3506 1799 -1785 -2969 -1195 1572 2806 747 -2438 -3116
4908c116K503L011J59k505k743k28K736K984l85k940k131O35K868K308p30l281
$$ -3116 -613 2398 2557 52 -2691 -2919 -183 2801 2416 -524 -2655 -2020 848 3156 2426 -855
4924h55j997J272L179J772j774l282j377J687L490M98j737l415k43K589K468M20
$$ -855 -2852 -1580 1599 3371 1597 -1685 -3062 -1375 2115 2613 876 -2539 -2782 -193 2275 2695
4940B695k736l094L79L121K264p68k507k376R38L011K180r32l227j818J394L303
$$ 2695 -41 -3135 -2756 365 2629 1861 -646 -3022 -2084 927 3107 2175 -1052 -2870 -1476 1827
4956A827J249j479l332r84J886L197O68k694k546n96K658K641m51k383k545M18
$$ 1827 3076 1597 -1735 -2719 -833 2364 3032 338 -2208 -2804 -146 2495 2044 -339 -2884 -2466
4972b466K632K521n17l037j900O84L131J883j296k759j930J759K834J710k020
$$ -2466 166 2687 2170 -867 -2767 -2083 1048 2931 1635 -1124 -3054 -1295 1539 3249 1229
4987A229l111j029K626K488L67k276k544l90K674K269M5k442k462L59K370K517
$$ 1229 -1882 -2911 -285 2203 2570 294 -2250 -2640 34 2303 2348 -94 -2556 -2197 173 2690
5003B690q96k649k259J173L051J995j614l062j426K062K939Q35j790l005n37J815
$$ 2690 1794 -855 -3114 -1941 1110 3105 1491 -1571 -2997 -935 2004 2839 1049 -1956 -2493 -678
5019f78K976O91k636k728j56K990K242p53k356k274M92K757K217j164k681j784
$$ -678 2298 2989 353 -2375 -2531 459 2701 1948 -408 -2682 -2190 567 2784 1620 -1061 -2845
5035b845R25K915J715j390l212j047J839K883J056k407k640k08K275K697j47k760
$$ -2845 -1920 995 2710 1320 -1892 -2939 -1100 1783 2839 432 -2208 -2416 -141 2556 2409 -351
5051c51k090L87K497K014l13k603k129Q35K661J785o46k872j953R83L578P12j189
$$ -351 -2441 -2054 443 2457 2144 -459 -2588 -1753 908 2693 2047 -825 -2778 -1795 1783 2495 1306
5068A306l030j000K094K464O97k142k525m32K485K603L3k899k148J23K487K428
$$ 1306 -1724 -2724 -630 1834 2531 389 -2136 -2568 -83 2520 2553 -346 -2494 -2371 116 2544
5084B544q64k380j652M80K978J659j395l103r61J570K727J078j748k762m84J933
$$ 2544 1680 -700 -2352 -1872 1106 2765 1370 -1733 -2694 -1124 1603 2681 933 -1829 -2313 -380
5100c80K625K12k305k261r1K604J827P3k636j975N05K663J670m90k940j771J091
$$ -380 2245 2457 152 -2109 -2200 404 2231 2304 -332 -2307 -1802 861 2531 2041 -899 -2670 -1579
5117a579K695J588j399k709j103J467K877O13j631k637r29K214K629K24k195k377
$$ -1579 1116 2704 1305 -1404 -2507 -1040 1837 2450 819 -1818 -2747 -533 2096 2320 125 -2252
5133b252K50K271K024r1k620k231J170K168J722o38k519j932J415K556J372j459
$$ -2252 -2002 269 2293 2202 -418 -2649 -1479 689 2411 1773 -746 -2678 -1263 1293 2665 1206
5149A206k744j039J827K776L66j823l003j19K754K033k25k277k368N12K592J816
$$ 1206 -1538 -2577 -750 2026 2392 569 -2434 -2553 201 2234 2009 -268 -2636 -2124 468 2284
5165B284n81k321k013Q57K535J994j444k750j275J472K766J306j891k746n60J940
$$ 2284 1703 -618 -2631 -1774 761 2755 1311 -1439 -2714 -1242 1524 2830 939 -1807 -2367 -427
5181d27K212L50j766k595O5K519K056m98k013k177K10K810J691n12k672j951J307
$$ -427 1785 2135 369 -2226 -2161 358 2414 1916 -97 -2274 -2064 746 2437 1925 -747 -2698 -1391
5198a391K299J845j640k579j238J750K373Q44j574k752o20K240K255L68k217k232
$$ -1391 908 2753 1113 -1466 -2704 -954 1419 2263 689 -2063 -2683 -443 1812 2180 -37 -2269
5214b269J94K484K101m63k461j986Q53K494J653j099k314j671J155K452J395j226
$$ -2269 -2075 409 2510 2047 -414 -2400 -1547 947 2600 1501 -813 -2484 -1329 1123 2518 1292
5230A292k458j210J620K655P01k295k072l66K026K349k56j946k037K00J964J848
$$ 1292 -1166 -2376 -756 1899 2600 305 -1767 -2133 -107 2242 1986 40 -1997 -1797 167 2015
5246B015k50k267k088Q39K394J580q76k671j490J431K584J235j524k856o59J960
$$ 2015 1765 -502 -2590 -1751 643 2223 1347 -1324 -2814 -1383 1201 2436 912 -1944 -2603 -643
5262f43K160N66j651k389j62K192K165q7k563j739N40K193K103r21k338j660R01
$$ -643 1517 2083 432 -1957 -2119 73 2238 2151 -412 -2151 -1611 582 2685 1764 -574 -2234 -1333
5279a333K451J252j109k588j307J906K211J078j865k581p22K427K056L63k341
$$ -1333 1118 2370 1261 -1327 -2634 -728 1483 2561 696 -1885 -2607 -180 1876 2239 -102
5294a02k079J20K262K080j36k269k350P21K449J760p32k395j501R24K513J270
$$ -102 -2181 -2061 201 2281 2145 -124 -2474 -1753 696 2456 1724 -671 -2172 -1248 1265 2535
5310B535j442k577p25J714K276N91k222j887k40J970J879K5j841k121M77J765
$$ 2535 1093 -1484 -2209 -495 1781 2372 150 -1737 -1977 -7 1872 1897 56 -2065 -1588 177
5326A77J724j69k379j615N51K334J515r49k535j080J460K104J304j739k362q28
$$ 177 1901 1732 -647 -2262 -1711 623 2138 1189 -1346 -2426 -966 1138 2442 703 -1659 -2487
5342b487J461K349Q55j914k155j91J859K421j39k192j992L77K124J776k72k694
$$ -2487 -1026 1323 2178 264 -1891 -2082 -223 2198 2059 -133 -2125 -1748 376 2152 1880 -814
5358h14j726J219K170J610j185k462j235J645K223Q33j672k391o12J801K472J89
$$ -814 -2540 -1321 849 2459 1274 -1188 -2423 -778 1445 2278 606 -1785 -2397 -596 1876 2065
5374B065j979k138n8K222J795m84k143j780O80K424J593j190j863j362O58K400
$$ 2065 86 -2052 -2110 112 1907 1423 -720 -2500 -1820 604 2197 1007 -856 -2218 -1560 840
5390H40J264r63k544j026J576K908M44j742k478n42K140K285j57k439j116k23
$$ 840 2104 1141 -1403 -2429 -853 2055 2499 757 -1721 -2263 -123 2162 2005 -434 -1550 -1773
5406a773K067J689j73k410j666N69K605J065r23k079j275J275J926J405j540k240
$$ -1773 294 1983 1810 -600 -2266 -1697 908 1973 1050 -1029 -2304 -1029 897 2302 762 -1478
5422a478p44J470K348P12j765k386j39K251J808k51j909j692j29K143J593n67
$$ -1478 -2222 -752 1596 2308 543 -1843 -1982 269 2077 1826 -83 -1775 -1904 239 1832 1265
5438A265j660j591P99K371J231j323k111j025J244K185J047j677k428p50K114
$$ 1265 -395 -1986 -1187 1184 2415 1092 -1019 -2044 -800 1385 2432 755 -1673 -2423 -309
5453c09K121j14j674j564k13J959J854m50k080j354J99K183J490p80j644k004
$$ -309 1812 1698 24 -1540 -1753 206 2060 1610 -470 -1824 -1625 558 2048 1268 -376 -2380
5469b380J250J973J319q02k426j069J265K392P45j736k200n31K033K169jj886
$$ -2380 -1130 843 2162 1360 -1066 -2135 -870 1522 2267 531 -1669 -2200 -167 2002 2001 115
5485A15j694m4J770J891l68j868j838N90J988J298o10k187j248Q62K456R87j173
$$ 115 -1579 -1623 147 2038 1670 -198 -2036 -1446 542 1840 1230 -957 -2205 -1343 1113 2100 927
5502I27k284r55J702K237K6j301k108l20K023J657J15j829j939M33J870J747p80
$$ 927 -1357 -2312 -610 1627 1653 352 -1756 -2076 -53 1604 1719 -110 -2049 -1616 254 2001 1221
5519A221j872j295N82J858J556r49k261q65J228J882Q59j199k089r72J668K508
$$ 1221 -651 -1946 -1364 494 2050 1101 -1160 -2025 -797 1085 1944 745 -1344 -2316 -648 1860
5535A860q0j789j571o5J814J836k02j929j604K41K320J128o22j850j755J142K206
$$ 1860 1780 -9 -1580 -1645 169 2005 1803 -126 -1730 -1489 831 1959 1337 -513 -2268 -1126 1080
5552A080Q49p64k173j074J526J608Q59j421k209o13J919K166L9k074j546J35K084
$$ 1080 1929 1165 -1008 -2082 -556 1052 1911 490 -1719 -2332 -413 1753 1792 -282 -1828 -1693 391
5569C91J451k36k148j447N38K431R59p27k160j083J072K080J147j573j911m21
$$ 391 1842 1606 -542 -1989 -1451 980 1939 1212 -948 -2031 -959 1121 2268 695 -1216 -1637
5585a637J061K227L47j936j566j87J730J500l2j591j967N83K164J423o35k039
$$ -1637 -576 1651 1998 62 -1504 -1691 39 1539 1507 -84 -2051 -1468 696 2119 1484 -555
5601e55j234O57J846J492j296j892q37R69J810O69r01j813j061J735K112N6j571
$$ -555 -1789 -1132 714 2206 910 -982 -1819 -850 960 1629 728 -1085 -2146 -411 1701 1757 186
5618A86j858j52J840J943m90k011j266P69J368J275k98j995j208R15J777J362
$$ 186 -1672 -1824 16 1959 1469 -542 -1808 -1039 329 1604 1306 -689 -1897 -982 795 2157
5634B157j200k242m48J092K037Q08j793j475p22J829J471J74j764j494j18K099
$$ 2157 957 -1285 -1733 -641 1396 2204 411 -1064 -1786 43 1514 1688 -76 -1570 -1688 411
5650D11J298l91j984j424O79K015J182q16j865r57Q40K156O28j070k073o90J619
$$ 411 1709 1318 -666 -2090 -1411 604 1786 970 -895 -1852 -1012 1144 1772 702 -1371 -2061 -442
5667d42J666N32j134k104n1J387K009J05k024j618N0J699J529m18j902j104N68
$$ -442 1224 1756 622 -1482 -1533 -146 1863 1968 -56 -1674 -1624 75 1604 1186 -716 -1820 -1252
5684a252J968J468j073k010j222J227K007O85j203k157n05J521J906K67j215k149
$$ -1252 716 2184 1111 -899 -2121 -894 1113 1798 595 -1562 -2067 -546 1360 1627 412 -1737
5700a737p7J841J570l89j654j452P56J577J364p18j754j086Q27J797Q90o73k162
$$ -1737 -1814 27 1597 1208 -446 -1898 -1142 435 1799 1081 -673 -1759 -932 865 1755 1082 -1080
5717a080m79J020J923P81j715j374r78J812J563L3j234j723M26J301J445j90j993
$$ -1080 -1559 -539 1384 2165 450 -924 -1902 -90 1473 1506 272 -1451 -1025 276 1721 1531 -462
5734d62j396O07J834R79n89j632j248R12J702J024j199j642q06J162J889N54j485
$$ -462 -1858 -1251 583 1562 973 -659 -1907 -995 707 1731 532 -1110 -1916 -754 1135 1689 204
5751B04j580l81J628J687r5j442j472m6J867J439m78j869j100J132J170J391r98
$$ 204 -1376 -1757 -129 1558 1463 21 -1451 -1497 370 1809 1331 -538 -1638 -506 664 2055 1057
5768A057j833o01L67K053Q45j441j764m93J624J450K06j421j987K30J374J762
$$ 1057 -776 -1377 -1010 1043 1888 447 -1317 -1810 -186 1264 1470 49 -1938 -1708 -334 1428
5784A428J47j898j409L59J822J274j017j564p86N85K165P35r13j856o70R16J897
$$ 1428 1575 -323 -1732 -1373 449 1723 706 -858 -1644 -1059 1106 1841 928 -928 -1598 -682 1215
5801A215N41j078j664p11J838J334M47j641j656M01J401J465o68j380j428O66
$$ 1215 1756 678 -986 -1697 141 1475 1922 281 -1375 -974 427 1892 1224 -156 -1584 -918
5817i18J448J103o45j927j078J078J612N64n63j822o45J190J936M08j398j751
$$ -918 530 1633 988 -939 -2017 -939 673 1237 674 -1148 -1793 -603 1333 1741 343 -1408
5833a408j4J254J870j1j617j339RJ786J335n10j893j176P26J934P18r16j417r63
$$ -1408 -1422 -168 1702 1691 74 -1265 -1256 530 1865 1355 -538 -1714 -988 946 1664 748 -669 -1632
5851a632P38J977N79j381j590m94J283J757K63j261j648k34J479J791l30j760
$$ -1632 -894 1083 1662 281 -1309 -1803 -520 1237 1500 239 -1409 -1643 -164 1627 1297 -463
5867d63j083L20J647P70m13j274j072M65J787O31q06j186r55Q05J917Q08j761
$$ -463 -1546 -1226 421 1191 778 -496 -1568 -1103 684 1315 509 -677 -1632 -827 1090 1898 137
5884A37j496R0J288J205L60j112j729j00J803J183j78j488j352M99J658J045r38
$$ 137 -1359 -1269 19 1224 1584 472 -1257 -1357 446 1629 1451 -37 -1389 -890 768 1813 875
5901H75j608j109Q77J578P10q27j505q75P95K093K47j034j867o3J474J372M91
$$ 875 -733 -1842 -965 613 1323 496 -1009 -1884 -1089 1004 1251 217 -1650 -1713 -239 1133 1624
5918A624j624j641M72J046J541J50k009j357Q86J602O81m89j437p42P39J754K78
$$ 1624 0 -1641 -1169 -123 1418 1568 -441 -1798 -912 690 1371 882 -555 -1297 -558 1196 1474
5935A474o82j468m89J162J253J64j127j407o48J575J799n15j265j631O64J266
$$ 1474 792 -676 -1165 -3 1250 1414 287 -1120 -1768 -193 1606 1091 -174 -1805 -1141 125
5951A25J152m30j641o38P95J239J013o20j636o02R68J464M58r34j627q19J437
$$ 125 1277 847 -794 -1432 -637 602 1615 995 -641 -1243 -275 1189 1647 713 -914 -1733 -296
5968b96J898J93j692j632J48J456J409k72j587r95L04J349J362p29j531r29R30
$$ -296 1602 1795 103 -1529 -1381 75 1484 1212 -375 -1370 -1066 283 1645 916 -615 -1544 -614
5985f14J701N97o61j831n38J326J131N43j617j152r3Q19J815n33j458r58jJ452
$$ -614 1087 1684 1023 -808 -1346 -20 1111 1654 37 -1115 -1208 -389 1426 893 -565 -1523 -1524 -72
6003g2J565n14j520p91L39J519R68p87j176q50Q73J254R46j015j630m18Q40J733
$$ -72 1493 979 -541 -1332 -993 526 1494 707 -469 -1319 -446 808 1754 739 -891 -1309 -469 1264
6021A264J57j095j545j30J435J312q8j587j454L71J633J018k63j426j404R27J603
$$ 1264 1421 326 -1219 -1349 86 1398 1310 -277 -1731 -1360 273 1291 1028 -398 -1802 -875 728
6038G28Q27j219j242p18J188J082N32r38j245l83J006J551O4j280j086M2J307
$$ 728 1555 336 -906 -1624 -436 646 1178 240 -1005 -1388 -382 1169 1233 -47 -1133 -1091 216
6055B16J313o4j543j363Q91R38R53m49j518n75M90J372P79j066j140j112J251
$$ 216 1529 1465 -78 -1441 -550 388 1341 892 -626 -1201 -711 661 1440 374 -766 -1878 -627
6072f27J493L13j008j496J8R56J584k22p85j321J78J277J189n41j336o28J62J547
$$ -627 866 1179 171 -1325 -1307 -351 1233 1011 226 -1095 -917 360 1549 1008 -328 -956 -794 753
6090G53Q71q81j272o26N98J383L98q14j583m73J386J014O59j190j400O5J264R55
$$ 753 1624 743 -529 -1155 -557 826 1224 410 -1173 -1646 -260 754 1413 223 -1177 -1112 152 1107
6108A107K81j268r84J46J012J180o14j162r16N83J125Q81n91j611k15M49J293
$$ 1107 1388 120 -864 -718 294 1474 860 -302 -1218 -635 490 1371 780 -831 -1046 -597 696
6125F96K30o80j343m35J401J208L10j191j249o0J550Q22k34j045j087K96J380
$$ 696 926 246 -1097 -1532 -131 1077 1387 196 -1053 -1113 437 1259 1025 -20 -1107 -811 569
6142E69R61p52j263o13M95J285R87r74j273q08J101J186Mo27j245J13O38J492
$$ 569 1530 778 -485 -1098 -603 682 1669 695 -578 -1386 -285 901 905 278 -967 -854 -216 1276
6160A276j79j152j402L59J258J160n82j104j071M52J278J077p15j449m90P82J131
$$ 1276 1097 -55 -1457 -1098 160 1320 738 -366 -1437 -985 293 1370 655 -794 -1284 -502 629
6177F29M92p98r22n91J226J148j09o78j192l71J108J180j35j062j296L55J352
$$ 629 1121 323 -599 -1190 36 1184 1075 397 -795 -1166 -58 1122 987 -75 -1371 -1016 336
6194C36R02m02j504o98O15J263O63r46q60n47Q06J505K27n64j296p62J032J122
$$ 336 1238 836 -668 -1366 -751 512 1175 229 -631 -1178 -372 1133 1360 796 -500 -1262 -230 892
6212H92kp22j036j86J215J170n61j262n17k44J596R35n47j421m56M20J096P38
$$ 892 890 168 -868 -1054 161 1331 770 -492 -1009 -1253 343 1278 731 -690 -1146 -726 370 1108
6230A108o18j097o02O15J792M6j041r12q44J276J139N65j273j482J19J658Q16
$$ 1108 490 -607 -1209 -594 1198 1244 203 -709 -1553 -277 862 1427 154 -1328 -1209 449 1265
6247A265n73j191p48N55J221N48k45j297q18P63J195N11m81j262q30J300J199
$$ 1265 692 -499 -1247 -692 529 1077 832 -465 -1283 -520 675 1186 705 -557 -1387 -87 1112
6264A112L0j112j082l01J071J595m47j336m83j09J198R19m10r32r43R05Q88P64
$$ 1112 1142 30 -1052 -1353 -282 1313 866 -470 -953 -1062 136 1055 645 -287 -1230 -325 563 1327
6282A327n79j245o06N60J027P27o08j677J37Q59Q91O1q58j227L7J057J290k66
$$ 1327 748 -497 -1103 -543 484 1211 603 -1074 -937 -78 813 874 16 -1211 -1174 -117 1173 907
6300I07j028q31R4J389N94l31j106o67M63J012Q81o91j358p21Q20J178M48r47
$$ 907 -121 -952 -858 531 1125 794 -312 -979 -516 496 1377 686 -672 -1393 -573 605 1053 106
6318A06j057r0Q03J364n9r54p81l51J386J002n73q44j058O48Q47P86l63j448o03
$$ 106 -951 -1041 -238 1126 1067 113 -668 -1019 367 1369 796 -48 -1106 -458 389 1175 812 -636 -1239
6337a239P31J334K70n74j353n70O94J593M37j088j192k85J326J092k16r57j384
$$ -1239 -508 826 1096 522 -831 -1401 -707 886 1323 235 -957 -1242 84 1176 960 3 -1381
6354a381N76J163N45m05p27r07J62J357Q49p52j293m92N54J150N82o48r87n22
$$ -1381 -805 358 903 498 -229 -1136 -974 383 1232 480 -813 -1305 -751 399 981 333 -654 -1176
6372a176J062R03M62j005r64l92J345Q43K89j324j086J73J172P66q55q04n50O52
$$ -1176 -114 789 1251 246 -718 -1110 235 1078 1367 43 -1043 -870 302 1068 213 -591 -1141 -489
6390d89R37M29n71r91m45M60P43Q13o18j376j89J115J079Kq83r13J37Q76Q38o
$$ -489 448 877 306 -685 -1130 -670 73 886 268 -1108 -1297 -182 897 899 16 -897 -760 116 954 948
6410I48j033j185M69R29P77k29j297m62L22J258P12q06j076k2O45P16N46j045
$$ 948 -85 -1270 -801 128 905 676 -621 -1083 -761 497 1209 403 -673 -695 -50 666 1212 167
6428A67j038o5J074O92n2o03j266M4J436O34j62j270r08P21Q21P77m12j161o70
$$ 167 -871 -936 138 830 778 175 -1091 -1047 389 1023 861 -409 -1317 -596 225 1002 590 -571 -1241
6447a241O19J289Q94r91j103p55J151Q63M12q30r85j99Q22J225k46o26j093K40
$$ -1241 -622 667 1561 570 -533 -1288 -137 726 1138 308 -677 -876 -54 1171 925 299 -794 -554
6465e54R46O10k83r42o51P60O41R76q92o32j033P78Q97M55q39q14l02O96R84j28
$$ -554 392 1002 719 -223 -874 -114 527 1503 611 -21 -1054 -276 621 1076 237 -577 -879 -183 801 673
6485F73p50j033J58Q28J018k45o85q54K60R17Q02o13q11o59N46J111M90o90q73
$$ 673 -77 -1110 -952 -124 894 649 -36 -890 -630 287 1089 476 -335 -994 -448 663 1153 463 -410
6504d10q44J182M80P10j054r02P6N31J010J4q76j014lJ154Q15k43q32o24K68Q33
$$ -410 -1254 -72 408 1118 64 -838 -762 -231 779 793 -83 -1097 -1100 54 869 626 -206 -830 -562 271
6524B71Q68o85j182l24Q28Q05M72q94q71j78N37R47K45o02j203L6Q28Q25R2r83
$$ 271 1139 454 -728 -1052 -224 581 1053 159 -712 -890 -353 594 839 237 -966 -930 -102 723 815 -168
6544a68j124J80J405O00J3j215o03N00Q60O69r17q27l85M56J104J45n24j045r4
$$ -168 -1292 -1112 293 893 906 -309 -912 -412 448 1117 200 -627 -1012 -556 548 693 169 -876 -970
6563i70P45Q99Q2q03j005j63J168P85k13p44j060M81J121Q61m45j189o74J97J455
$$ -970 -225 674 756 -47 -1052 -1215 -47 738 525 -219 -1279 -798 323 1184 739 -450 -1124 -927 528
6582E28L43l73j085m97Q71J020k48l93q83m17J139J288k70r36o99J16O94Q81k71
$$ 528 871 498 -587 -1084 -213 807 559 166 -717 -1134 5 1293 1023 87 -612 -496 198 1079 808
6601H08j106l66M5Q52P66o69o76m95J44J043P67o75j000k98N79R25N9q30m70l5
$$ 808 -298 -664 -619 233 999 330 -346 -841 -697 346 1113 438 -562 -860 -281 644 703 -127 -597 -632
6621f32P55O41J40p04q42p0J179Q15l38j216m87M55Q96J06K4j225l75K10J135
$$ -632 123 764 904 200 -642 -712 467 1282 944 -272 -759 -304 592 698 722 -503 -878 -668 467
6640D67M28p37p98m39J147Q89K8o87q88j19P87R30M7j260o85J05Q65O19k72p57
$$ 467 895 158 -640 -1079 68 957 985 298 -590 -709 78 1008 1055 -205 -890 -785 80 699 427 -330
6660c30m89M15Q86K99n18r79j40M13J358j15o26r33m3N40J043j3n55j017M2J001
$$ -330 -819 -404 482 781 263 -716 -856 -443 915 800 174 -759 -802 -262 781 768 213 -804 -762 239
6680B39M24M6j132n28O0Q70J077n30j010m15O10P67M47p83j021o1O53J197R4r34
$$ 239 663 709 -423 -951 -891 -21 1056 526 -484 -899 -289 478 925 142 -879 -940 -287 910 1004 70
6700G0p99k09J023N25P3r02n41J36M82Q77k08r22o25L50R90P21q99p48J18P0J238
$$ 70 -729 -938 85 610 683 -219 -760 -624 -142 735 527 -395 -1020 -670 320 1041 142 -606 -488 -418 820
6721H20K55p63q55k39Q42N64M94j202j017M37Q77O61n04p87p57N49O85R32m79
$$ 820 1075 312 -543 -782 60 624 1118 -84 -1101 -664 213 874 370 -417 -1174 -625 60 992 513
6740E13q16o35L26Q29O32n69q81k02P69N51J92o08q22j95Q60O40K43r31o85k25
$$ 513 -303 -938 -612 217 849 280 -601 -803 -34 517 709 101 -721 -916 -56 584 827 -104 -789 -1014
6760a014J033Q44k95m16j220K79J135P75m54j111k65O75M83N18n91q49p60R93
$$ -1014 19 863 568 152 -1068 -789 346 1121 667 -444 -709 -34 449 967 376 -473 -1233 -240
6778b40Q74Q5o62q56J47N67P67R9q78q18o1J252O54o67o91l47L47J001K66l19
$$ -240 634 719 57 -799 -652 -85 682 781 -97 -915 -976 276 930 263 -428 -775 -428 573 839 520
6798E20j043m08M51P02N24k62j293O0N55Q35J14o81o59n6N56R97j21q50r11M61
$$ 520 -523 -931 -480 222 746 484 -809 -749 -194 641 755 74 -585 -641 -85 912 791 -59 -970 -509
6818e09P07M83k21q62l79K20Q42Q36o83q39m52L22J145j62m41n00k18O20P37N2
$$ -509 198 681 460 -402 -781 -561 281 1117 434 -405 -857 -535 610 448 7 -493 -711 -91 646 698
6838F98j076m51M13O65L74n8o77n97N06O01N43m03q48n29K68R12K63k55r74l70
$$ 698 -378 -829 -416 249 623 565 -112 -709 -203 398 941 538 -310 -839 -571 341 604 349 -625 -995
6858i95O30O96M65n70j073R9Q88Q26n76m12o10k32J191K09N9p75n44K73J103J19
$$ -995 -365 331 796 226 -847 -748 140 966 390 -22 -632 -864 327 536 595 -180 -724 -451 652 771
6878G71m16o30o54M65Q79M19o80p96k04R34O69N4o95n95k73R55N27L4r18l41J32
$$ 771 355 -275 -929 -464 415 834 154 -642 -846 88 757 811 116 -479 -752 203 730 764 -154 -495 -363
6899c63N63P59l70q82o85M10Q55Q6k2q33k21N15P54J44l77o21o15J163L06J57
$$ -363 200 959 589 -293 -978 -568 287 373 351 -482 -703 -188 566 710 333 -288 -903 260 566 723
6919G23m97r13j1O31O86j82n65o59J27J054J77l84m69n32K78P79N46m38j160N6
$$ 723 226 -687 -698 -67 619 437 -128 -787 -660 394 571 187 -282 -814 -536 243 789 351 -809 -753
6939g53N60P58L56o06r96R9N87P74j50o95m79L9P22M98m30o17p58M24J056K81
$$ -753 -193 565 921 315 -681 -582 5 779 629 -66 -545 -506 216 714 284 -333 -1091 -667 389 670
6959F70l72m66m30O32O17J40k99j051j03Q05L26L67o61o68j30N62R04l54p10o31
$$ 670 298 -168 -598 34 651 791 492 -559 -662 143 469 836 175 -493 -623 -61 843 489 -221 -852
6979h52O58M45O98m79p09o96M08Q23N86n03o67m63N54P94J54o16l64n62Q27P47
$$ -852 -194 251 949 470 -239 -935 -527 296 882 379 -288 -751 -197 597 751 135 -229 -791 36 783
6999G83j55n37r86K34M81P33k3r00m15K09J023L50l92l75o89N31P62r9l92n16
$$ 783 628 91 -895 -661 -180 553 530 -370 -785 -576 447 797 405 30 -659 -128 634 535 143 -373
7019c73l04N29N02K98n41q20n0O81P61j95p49n05J96N05P90k24o63n36L68P57
$$ -373 -677 -148 354 652 111 -709 -759 -78 683 488 -261 -766 -570 -65 725 501 -162 -698 -330 427
7039D27M63p52n04m80O77N98L61l80j200K04K75Q79Q4o57o90r1N49P73M2p94m10
$$ 427 890 138 -366 -846 -169 429 790 410 -790 -586 -311 568 652 -5 -695 -786 -237 536 578 -216 -626
7060f26J07Q91K33j46o53p87N05P08M59m68o09l60L80J053q0l00q89j79N36O88
$$ -626 -519 372 605 459 -194 -981 -476 232 691 223 -386 -746 -366 687 607 307 -582 -761 -225 463
7080D63K54n84n44k3J72Q97r6p18m79M97J65N13k27n24k98M8R63K2j12j012j83
$$ 463 717 133 -411 -434 -262 635 539 -179 -658 -161 4 517 290 -234 -532 -484 479 501 389 -623 -806
7101h06R06L73J31o58k12j97K40P49R7n38n85j11R06N23l76k10p46L0R16M91p43
$$ -806 100 473 604 -54 -266 -463 -223 526 623 85 -500 -611 295 818 442 232 -514 -484 432 923 180
7122A80m51n31N61M75N04k59r62n5K25N19M33n21o28K69N58O47m24o27o34M62
$$ 180 -271 -802 -241 234 738 479 -483 -538 -313 206 639 118 -510 -241 317 964 540 -87 -721 -259
7142b59P59L74o82l33j89J1M65O75l10o70k25J26P20j19k68n43j96P00N60L47
$$ -259 500 874 192 -141 -330 -319 146 821 511 -159 -384 -258 462 343 75 -468 -664 36 596 943
7162I43j035k99Q6K47P16j11q62n72L62Q28M11o03n00k48L67O40K11p3r12k34
$$ 943 -92 -391 -305 -58 658 547 -315 -887 -525 303 714 111 -389 -637 -270 370 581 508 -404 -638
7182f38L06R53Pp05n56R2P29K9m5j39n48l8N06N74j41r79L4K89P65pk44n90l62
$$ -638 -332 621 628 -77 -633 -541 188 217 172 33 -515 -553 -47 527 386 -593 -559 -270 495 488 244 -346 -708
7205g08N87J92L19l66n29k63P24N86P1o91o19L9O70L14k1n10l77J26N16O17n87
$$ -708 -121 71 390 24 -505 -768 -44 542 613 -78 -697 -658 12 326 305 -205 -582 -456 60 677 90
7226I0l76m39K22P33J92k72l83k67J33J045K72p63p59j10M93O45m8m26m93J3P22
$$ 90 -286 -725 -503 230 422 150 -233 -500 -367 678 950 187 -572 -682 -189 456 408 -18 -511 -498 224
7247B24M14J07r98m45m7Q25M38j89q30O8K65L96N30m88o95r4N09M00N27j016l63
$$ 224 638 745 -253 -698 -745 80 518 329 -501 -433 -168 228 758 270 -425 -519 -10 390 917 -99 -462
7268d62j2M55M11J47o49l18j74P56N99j90o01l70O7M53L95j83o10l97M78O30J56
$$ -462 -474 -19 392 539 -110 -428 -602 154 753 563 -38 -408 -341 112 507 324 -286 -683 -205 425 581
7289E81l82p23J51M93L13J07l56p95n9O24O89k19l77m52J95O16J40k3p77k12L75
$$ 581 199 -524 -373 120 433 540 184 -611 -670 -46 643 424 47 -405 -210 406 546 523 -254 -466 -91
7310i1O32J59n95n91j86N96O09O5p12r2l19L87M09J93k61p09kQ96j03K63r83R0
$$ -91 541 700 105 -486 -672 -76 533 598 -114 -206 -525 -138 271 464 203 -506 -508 388 285 548 -435 -345
7332c45m6L72O10l50l91n38K27P45L12m46m68n08N73N00L68l71o66p5N23N26j45
$$ -345 -391 -19 591 241 -150 -688 -461 284 596 150 -318 -826 -253 247 615 244 -422 -497 26 552 407
7353D07o00k28P9M36N23l58q30l3L38P42Pj19p79L2m0P93N5k46n25k77M34Q15
$$ 407 -193 -421 -342 94 617 259 -571 -604 -266 476 483 364 -415 -383 -423 370 425 179 -346 -623 -189 626
7375F26k66l15k41o41O74O51j39l37n76J5O25L12Q7r22J9n4L54O02m68k28n64
$$ 626 360 45 -196 -837 -163 488 349 12 -564 -549 76 388 475 -447 -428 -482 -128 474 6 -222 -786
7396g86L73O87r3k66k91n10O82N36K17m06o24l2O23O22n70l07k97J62L71N24k52
$$ -786 -413 274 181 -85 -376 -886 -204 332 549 143 -481 -513 110 732 162 -145 -442 -280 91 615 363
7417C63o11m22N15K86N11n92m38k29N41L93L47o52l87k43O06R20n89m10l38N1
$$ 363 -248 -670 -155 131 642 50 -388 -617 -76 317 664 12 -375 -618 -12 908 319 -91 -429 -378
7437c78L42M10L56o36p88L30N11K94o9m73m95L28Q89K42r16m64j13L63O85O6m19
$$ -378 -36 374 730 94 -694 -364 147 441 372 -101 -596 -268 621 863 -53 -517 -630 -267 418 484 65
7458F5o98K57O60J32R0o86k92k21P17N24L7o96m20OQ79R2j88q61k18P23M21L1
$$ 65 -633 -376 284 416 506 -180 -472 -693 24 548 585 -111 -531 -525 354 446 258 -603 -821 -98 323 354
7480C54k79p21J70K35M10K88n46l82K64N40l59M17l85m84K40N66L86l32p63j98
$$ 354 75 -646 -476 -241 169 457 -89 -471 -207 333 -26 391 6 -478 -238 328 714 382 -381 -579
7500e79K25O25M45m01l60k94K01J65K86m19k36j89Q61J90l08k6o48J38M55L44
$$ -579 -354 271 716 315 -45 -339 -138 27 313 -106 -342 -531 330 520 212 186 -462 -324 131 475
7520D75J75p72m23L21K75N20m12p07Q2J95N63K85l92p96L17L73K74j06j49o21
$$ 475 650 -122 -545 -224 51 571 159 -548 -466 -271 292 577 185 -611 -294 79 353 247 98 -523
7540e23j51P88M95k37l98m75K87N82L13k44n15k15N2M50K25J6p57p7J63K90K94
$$ -523 -674 114 609 372 -26 -501 -214 368 681 437 -78 -293 -241 209 434 450 -307 -384 -221 69 363
7561C63k62n60J76M23L05j34o19j07j35N29M05L5n80j52j14N94L56l07l98j44
$$ 363 101 -459 -283 140 445 311 -308 -415 -550 -21 384 419 -161 -313 -427 167 523 216 -182 -326
7581c26rM47L35j95n83k70N33M56J8l44k62m48O90L78j97l57k12R3L52J55j1l32
$$ -326 -335 112 447 252 -331 -601 -68 388 406 62 -200 -648 42 420 223 -134 -346 -253 99 254 243 -89
7603h9j72k84O80K29l94M7m44J87N03K92l54o46k28O73O33J5l53p25M0N60K18
$$ -89 -261 -545 135 364 -30 17 -427 -240 263 555 201 -445 -673 0 633 648 295 -430 -390 170 388
7624C88j59m52k88J04L09O96l81m02l16K10P88Q4O6q10l25L01P17q7m56j95j51
$$ 388 229 -223 -511 -407 -98 598 217 -185 -501 -291 497 581 647 -163 -488 -187 530 443 -13 -208 -359
7645c59L97L78P5m75l08j09Q68j23r5o07j3J65N08K69j61n58l27J32O01J8k54
$$ -359 38 416 491 16 -292 -401 467 344 249 -358 -371 -206 302 571 410 -148 -475 -343 258 276 22
7666B2k36j90K98K34K91l25p31M7M56O28L31r20l70q2M75L88M3j98o20K46N16
$$ 22 -214 -404 -106 128 419 94 -637 -590 -134 494 825 -95 -465 -547 -72 316 359 161 -459 -213 303
7687C03O1r0o69Pj98Q06K34m50M5p12M19O96k34l01m50j61N92M57k09k57n84N24
$$ 303 364 274 -395 -388 -586 220 454 4 49 -663 -244 452 218 -83 -533 -694 -102 355 146 -111 -695 -171
7709a71M03L24n13j84m50K04M93M79j94r00m19O48N83P7k35q43K04M15K29J78
$$ -171 232 556 43 -141 -591 -387 106 585 391 -509 -928 -280 303 380 145 -698 -494 -79 150 328
7729C28m99k47l5M20M76k77k36l67k12R97Jl15k71o13M83M95M04l07m93J10R6
$$ 328 -171 -418 -453 -33 443 166 -70 -437 -649 348 349 34 -237 -850 -367 128 532 225 -268 -158 -62
7750f2O33J34q92l67o9N61O95m02o87K13R1K67M19m35j9j12L6K41L09k10k46o02
$$ -62 571 705 -187 -554 -623 -62 633 231 -456 -243 -152 115 534 99 80 -32 4 245 554 344 98 -504
7772e04M73K03M13m96n00o8M84L49L48q40L7j25K76K11L17n84n03K38L66L64l95
$$ -504 -31 172 585 89 -411 -479 5 354 702 -138 -101 -226 50 261 578 -6 -509 -271 95 459 64
7793F4j24k73K06O76l6j24n44k26N3O63J49l12j83l39M29J96J50m95j66k2M01
$$ 64 -60 -333 -127 549 513 389 -155 -381 -328 335 484 172 -11 -350 79 275 425 -70 -236 -258 143
7814A43M69l40m40j87p2O47P2J57m43k93K07M08QM5o51j69L98M00J33o24m48J33
$$ 143 612 272 -168 -355 -427 220 292 449 6 -287 -80 328 336 381 -270 -439 -41 359 492 -132 -580 -447
7836d47M26M01n8k61n55J6O32R1j53m62j48L24L80L46k89o81K9J93K80K67j42
$$ -447 -21 380 322 61 -494 -478 154 245 92 -370 -518 -194 186 532 243 -438 -409 -216 64 331 189
7857A89q15K33L54J75K46k08p64R1M89K48J09l89n75M06M35L4j86l12j64L8O48
$$ 189 -626 -393 -39 136 382 174 -590 -499 -10 238 347 -42 -617 -211 224 258 72 -240 -404 -366 282
7878B82k6o1m92k89M19L01j6q0m26O6L87J43J69m55l02J05O44m0j57k16j99r0
$$ 282 256 195 -297 -586 -167 134 118 38 -388 -322 65 208 377 -78 -380 -275 369 329 172 -44 -243 -333
7900c33N32L4k09l61j13J36O48M76m91r35K11O5P99L5k76m83p6L74L92k2m97j59
$$ -333 199 233 24 -337 -450 -314 334 810 319 -616 -405 -340 459 494 218 -265 -341 33 425 403 -94 -253
7922b53n4M66K29k5l15j96J9N3O29j94p51l2J8P64l58j05k33m5L24k2L77n04j50
$$ -253 -307 159 388 363 48 -148 -129 -76 553 359 -392 -424 -406 358 0 -105 -338 -383 -59 -81 296 -208 -358
7945c58J30M12M34k52l95k63k07O67K06%n49k55M19J7K08Jl48k98L72M58J8j99
$$ -358 -228 184 618 366 -29 -292 -499 168 374 374 -175 -430 -11 6 214 215 -133 -431 -59 399 417 218
7967B18l48k77L26K95K5m04n24O35M2K13o0k14k29k50Q38J11o6p34K00K21K83
$$ 218 -130 -407 -81 214 239 -165 -689 -54 -12 201 141 -73 -302 -552 286 397 331 -403 -203 18 301
7988C01jj66n78M58k28K96K44J01r16L08L21Nj41k88M8l5L29J81n7l57r1M56k5
$$ 301 300 134 -444 14 -214 82 326 427 -489 -181 140 145 4 -284 -236 -271 58 239 182 -175 -266 190 165
8011A65J35j44l26nj89Q28k30m8o03M6J59M85K01o28j40M5J75M08K8k14n67K97
$$ 165 300 156 -170 -175 -364 464 234 186 -417 -371 -212 273 474 -154 -294 -249 -74 334 362 148 -419 -122
8033a22J44P7J18o59K52M81l1J95k48m96j13L77N37p0j02o37K4L51M38L3n92l43
$$ -122 22 99 217 -442 -190 291 260 455 207 -289 -402 -25 512 442 340 -297 -273 78 516 549 -43 -386
8055c86P9M46R6m2m65r8j42M51L13n4l50k85P5P06mk47k18j81Q9N05O8k71l44
$$ -386 -307 139 235 193 -272 -370 -512 -61 252 198 -152 -437 -362 344 340 93 -125 -306 -217 288 356 85 -259
8078b59j60O91J37O5l13m84JM48L18l95j09l71K59K45L3l02M7l08K46N02L33m72
$$ -259 -419 272 409 474 161 -323 -322 126 444 49 -60 -431 -172 73 106 -196 -149 -457 -211 291 624 152
8100A52m24L6J38K63r4k09k8M1K19nP7k52j61k24N45J46j21j96k40J23L46J92
$$ 152 -272 -236 -98 165 71 -138 -166 -125 94 89 166 -86 -247 -471 74 220 99 -97 -337 -214 132 324
8122C24j89l20j29L48K29J67m47J7l42L78L82O2o97l29J42N20L92m56j82Pl12
$$ 324 135 -185 -314 34 263 430 -17 0 -342 36 418 480 -217 -546 -404 116 508 52 -130 -123 -435
8143d35L69K89l39q5k48L21M89M5L6p65N4L31L97J4m26l23j1M75P1P4r8o03P5
$$ -435 -66 223 -116 -201 -449 -128 361 406 442 -323 -269 62 459 473 47 -276 -287 188 259 333 235 -368 -293
8166b93L08N09m21l35k9M1N61P3l49O5q30O90M68k76j19m32L82P7L20j3k30l13
$$ -293 15 524 103 -232 -261 -220 341 414 65 130 -700 -10 458 182 63 -369 13 90 410 397 167 -146
8188a46l13L92M26
$$ -146 -459 -67 359
8191C59
$$ Imaginary data points
##PAGE= N=2
##DATA TABLE= (X++(I..I)), XYDATA
0@%%%%%%qJ6qQj6J6k4L2l2M0n3O1p2Q8j00J16j37J56j80K06k32K64l04L43l85
$$ 0 0 0 0 0 0 0 -8 8 0 8 -8 8 -16 16 -16 24 -29 32 -40 48 -52 64 -73 83 -97 109 -123 141 -163 180 -205
31b05M36m87N43o08O76p51Q37r28J027j140J263j397J549j715J900k113K352k624
$$ -205 231 -256 287 -321 355 -396 441 -487 540 -600 663 -734 815 -900 1000 -1113 1239 -1385
49a385K946l325L774m327N022n924P158q951J1801j7072L0057j20845k17578J85902
$$ -1385 1561 -1764 2010 -2317 2705 -3219 3939 -5012 6789 -10283 19774 -101071 -318649 -132747
63a32747K82152J25123j77083k44240n9875K01283K32757L8078j94970k12255
$$ -132747 149405 274528 97445 -146795 -206670 -5387 227370 265448 70478 -141777
73a41777k3715J85998J94545M147k05889k10992m559K14544K02368l3965k50340
$$ -141777 -165492 20506 215051 219198 13309 -197683 -202242 12302 214670 180705 -69635
84f9635j95888P5054K71500J68890j16646k69629j19399J60263K63636Q2568j74494
$$ -69635 -265523 -190469 81031 249921 133275 -136354 -255753 -95490 168146 250714 76220
95G6220k33540m4117J80901K10282K4208j79864j97857j7609J80004J95491P065
$$ 76220 -157320 -201437 -20536 189746 213954 34090 -163767 -181376 -1372 194119 201184
106B01184j95763j98209J6089K24097J97016m6244k43194j71718R4433K61006
$$ 201184 5421 -192788 -176699 47398 244414 198170 -45024 -216742 -122309 138697
116A38697J40057j32943k55169r5756J59681K31190N2419j74165k10707l3492
$$ 138697 278754 145811 -109358 -205114 -45433 185757 238176 64011 -146696 -180188
126a80188J67295J87252J5829j71307j84163j0046J78851J85150l547j98088j85027
$$ -180188 -12893 174359 190188 18881 -165282 -175328 3523 188673 185126 -12962 -197989
137a97989L2287K23849J73306p3164k43528j46692J11491K40881J01701j48490
$$ -197989 -165702 58147 231453 158289 -85239 -231931 -120440 120441 222142 73652
147G3652k32106o6419J60261K05703L4529j63089j82432j3920J65841J77881J4677
$$ 73652 -158454 -224873 -64612 141091 175620 12531 -169901 -183821 -17980 159901 174578
158A74578j60696j67181O165J84649J76964k0111k02375j68584N2194K18817J41207
$$ 174578 13882 -153299 -147134 37515 214479 194368 -8007 -176591 -124397 94420 235627
169B35627r9512k38686j21863J19489K16040O7991j55090k09799m6626J53436
$$ 235627 136115 -102571 -224434 -104945 111095 179086 23996 -185803 -232429 -78993
179g8993J82367K3061j51135j63760o564J60491J69377J0842j56306j58083J5201
$$ -78993 103374 126435 -24700 -188460 -195024 -34533 134844 145686 -10620 -168703 -153502
190a53502J85197J66250l3405k01391j51439O8872K14513J20404j09207k20583
$$ -153502 31695 197945 164540 -36851 -188290 -119418 95095 215499 106292 -114291
200a14291r1930J29162K00148N1360j46454j83131k7919J48099J65351J5374j43341
$$ -114291 -206221 -77059 123089 174449 27995 -155136 -183055 -34956 130395 145769 2428
211B428j52401l933J51358J55157k189j62995j55197K2258J82089J45552n4844
$$ 2428 -149973 -153906 -2548 152609 150420 -12575 -167772 -145514 36575 182127 127283
222A27283k01496j29949Q4085K04204R6796j15577j98011o3511J35378J82977
$$ 127283 -74213 -204162 -120077 84127 180923 65346 -132665 -196176 -60798 122179
232A22179L8542j36415j59305j4535J41251J52303J0146j38588j44733r6J48862
$$ 122179 160721 24306 -134999 -149534 -8283 144020 154166 15578 -129155 -129251 19611
243A9611J44954j5532j67394j43727L6451J80999J27663o9925j93753j04470R8859
$$ 19611 164565 149033 -18361 -162088 -125637 55362 183025 113100 -80653 -185123 -86264
254h6264J92917P4571j19899j77175m2619J32421J61171K3758j32165j46620j2297
$$ -86264 106653 181224 61325 -115850 -158469 -26048 135123 158881 26716 -119904 -132201
265a32201J30506J36662J388j39634j40475L792J47139J34768k6398j66910j28965
$$ -132201 -1695 134967 136355 -3279 -143754 -139962 7177 141945 115547 -51363 -180328
276a80328N3721J81795J12322q0068j80174p7501J11676J79358N5392j19417j57457
$$ -180328 -126607 55188 167510 87442 -92732 -170233 -58557 120801 176193 56776 -100681
287a00681k6328J27000J43480J1575j28776j36102q104J24393J25735p399j40067
$$ -100681 -127009 -9 143471 155046 26270 -109832 -117936 6457 132192 124793 -15274
298a5274j33257J4444J49123J24299l9317j64959j10992O7810J75516R2210q8622
$$ -15274 -148531 -134087 15036 139335 100018 -64941 -175933 -108123 67393 159603 70981
309G0981j67640o0068J11802J60533L8227j18029j43819j9644J18728J29421O337
$$ 70981 -96659 -156727 -44925 115608 153835 35806 -108013 -127657 -8929 120492 126829
320A26829j22922j26964k175J24812J22557j0883j37632j20594K9545J52794J13475
$$ 126829 3907 -123057 -125232 -420 122137 111254 -26378 -146972 -117427 35367 148842
331A48842m9449j59815r2136P9281J65326P1253r8171j56136m5339J09326J41040
$$ 148842 99393 -60422 -152558 -73277 92049 163302 65131 -91005 -136344 -27018 114022
342A14022K2096j16771j32107j3047J13205J18782J219j18681j17728O205J27328
$$ 114022 136118 19347 -112760 -125807 -12602 106180 107399 -11282 -129010 -122805 4523
353D523J17580j7807j36829j08569M2117J52474R9362o1846j54681p7031Q5289
$$ 4523 122103 104296 -32533 -141102 -98985 53489 152851 91005 -63676 -140707 -55418
364e5418J51891N2057j02070j43787l3728J05395J27275J4070j11217j19900o343
$$ -55418 96473 148530 46460 -97327 -131055 -25660 101615 115685 4468 -115432 -121775
375a21775J11645J14014o01j15860j09529J4907J29163J10214k7554j36322r8074
$$ -121775 -10130 103884 103283 -12577 -122106 -107199 21964 132178 104624 -31698 -129772
386a29772N1098J47108Q1963p2818j48778o2673Q7896J38579L7127j02194j30440
$$ -129772 -78674 68434 150397 77579 -71199 -133872 -45976 92603 129730 27536 -102904
397a02904k3253J03196J17498R208j05943j09798L90J11163J08323o741j16022
$$ -102904 -126157 -22961 94537 103745 -2198 -111996 -111606 -443 107880 101139 -14883
408a4883j02946K2463J28789R8785l9949j37658q6213N9994J39684O5700q0598
$$ -14883 -117829 -95366 33423 132208 92259 -45399 -131612 -71618 68066 133766 53168
419E3168j38085m6709R1631J28055K7358r8354j16864j1679J02895J10013N220
$$ 53168 -84917 -131626 -39995 88060 115418 17064 -99800 -111479 -8584 101429 106649
430A06649j02667j02547N965J10537J01457j6448j18605r7107K9595J26396Q5419
$$ 106649 3982 -98565 -92600 17937 119394 102946 -15659 -112766 -83171 43225 128644
441A28644n1653j35944p2977O6788J32578N2208q3494j27081l3490R3739J18845
$$ 128644 76991 -58953 -131930 -65142 67436 119644 36150 -90931 -124421 -30682 88163
452H8163K0260r4898j06574n293J01121J03064r84j03386r7774J0896J09673R2530
$$ 88163 108423 13525 -93049 -98342 2779 105843 104859 1473 -96301 -85405 24268 116798
$$ [...]
8191F4
##END NTUPLES=NMR FID
##END=
