##TITLE=1H_IAMT-302
 CDCl3
 8 sc, 
 9.7.2024
##JCAMPDX= 6.0         $$ Bruker NMR JCAMP-DX V2.0
##DATA TYPE= NMR FID
##DATA CLASS= NTUPLES
##ORIGIN= UXNMR, Bruker Analytische Messtechnik GmbH
##OWNER= root
$$ XWIN-NMR		Version 3.5
$$ Tue Jul  9 15:48:50 2024 Russian Standard Time (UT+4h)  she@DPX200
##.OBSERVE FREQUENCY= 200.1314
##.OBSERVE NUCLEUS= ^1H
##.DELAY= (6, 6)
##.ACQUISITION MODE= SIMULTANEOUS
##.ACQUISITION SCHEME= undefined
##.AVERAGES= 8
##.DIGITISER RES= 18
##SPECTROMETER/DATA SYSTEM= spect
##.PULSE SEQUENCE= zg30
##.SOLVENT NAME= CDCl3
##.SHIFT REFERENCE= (INTERNAL, CDCl3, 0, 15.7039)
##AUDIT TRAIL= $$ (NUMBER, WHEN, WHO, WHERE, WHAT)
$$ ##TITLE= Audit trail, XWIN-NMR		Version 3.5
$$ ##JCAMPDX= 5.01
$$ ##ORIGIN= Bruker BioSpin GmbH
$$ ##OWNER= she
$$ F:/spectra/data/she/nmr/H-F/1/audita.txt
$$ ##AUDIT TRAIL=  $$ (NUMBER, WHEN, WHO, WHERE, WHAT)
(   1,<2024-07-09 15:47:20.56 +0400>,<she>,<DPX200>,
      <created by zg, POWCHK disabled, PULCHK disabled
       configuration hash MD5:
       00 E9 B6 7A A2 85 ED C7 34 08 36 98 17 FE 4E 26
       data hash MD5: 16K
       51 6D 32 A3 67 4B 9D D5 17 AF 0C F7 A2 39 F8 69>)
$$ ##END=
$$ 
$$ hash MD5
$$ 0E 2F 37 19 FE C7 50 D3 B0 24 BA 84 17 96 9F 79
##$RELAX= 
##$RELAX= 
##$RELAX= 
##$RELAX= 
##$RELAX= 
##$RELAX= 
$$ Bruker specific parameters
$$ --------------------------
##$DU= <F:/spectra>
##$EXPNO= 1
##$NAME= <H-F>
##$PROCNO= 1
##$TYPE= <nmr>
##$USER= <she>
##$AMP= (0..31)
100 100 100 100 100 100 100 100 100 100 100 100 100 100 100 100 100 100 
100 100 100 100 100 100 100 100 100 100 100 100 100 100 
##$AQSEQ= 0
##$AQ_mod= 1
##$AUNM= <au_zg>
##$AUTOPOS= <>
##$BF1= 200.13
##$BF2= 200.13
##$BF3= 200.13
##$BF4= 200.13
##$BF5= 200.13
##$BF6= 200.13
##$BF7= 200.13
##$BF8= 200.13
##$BYTORDA= 1
##$CFDGTYP= 0
##$CFRGTYP= 5
##$CHEMSTR= <none>
##$CNST= (0..31)
1 1 145 1 1 1 1 1 1 1 1 1 1 1 1 1 1 1 1 1 1 1 1 1 1 1 1 1 1 1 1 1 
##$CPDPRG= <>
##$CPDPRG1= <>
##$CPDPRG2= <>
##$CPDPRG3= <>
##$CPDPRG4= <mlev>
##$CPDPRG5= <mlev>
##$CPDPRG6= <mlev>
##$CPDPRG7= <mlev>
##$CPDPRG8= <mlev>
##$CPDPRGB= <>
##$CPDPRGT= <>
##$D= (0..31)
0 1.2 0 0 0 0 0 0 0 0.06 0 0.03 0 0 0 0 0.0002 0 0 0 0 0 0 0 0 0 0 0 0 
0 0 0 
##$DATE= 1720525640
##$DBL= (0..7)
120 120 120 120 120 120 120 120 
##$DBP= (0..7)
150 150 150 150 150 150 150 150 
##$DBP07= 0
##$DBPNAM0= <>
##$DBPNAM1= <>
##$DBPNAM2= <>
##$DBPNAM3= <>
##$DBPNAM4= <>
##$DBPNAM5= <>
##$DBPNAM6= <>
##$DBPNAM7= <>
##$DBPOAL= (0..7)
0.5 0.5 0.5 0.5 0.5 0.5 0.5 0.5 
##$DBPOFFS= (0..7)
0 0 0 0 0 0 0 0 
##$DE= 6
##$DECBNUC= <off>
##$DECIM= 24
##$DECNUC= <off>
##$DECSTAT= 4
##$DIGMOD= 1
##$DIGTYP= 9
##$DL= (0..7)
0 120 120 120 120 120 120 120 
##$DP= (0..7)
150 150 150 150 150 150 150 150 
##$DP07= 0
##$DPNAME0= <>
##$DPNAME1= <>
##$DPNAME2= <>
##$DPNAME3= <>
##$DPNAME4= <>
##$DPNAME5= <>
##$DPNAME6= <>
##$DPNAME7= <>
##$DPOAL= (0..7)
0.5 0.5 0.5 0.5 0.5 0.5 0.5 0.5 
##$DPOFFS= (0..7)
0 0 0 0 0 0 0 0 
##$DQDMODE= 0
##$DR= 18
##$DS= 0
##$DSLIST= <SSSSSSSSSSSSSSS>
$$ [...]
##$SUBNAM2= <"">
##$SUBNAM3= <"">
##$SUBNAM4= <"">
##$SUBNAM5= <"">
##$SUBNAM6= <"">
##$SUBNAM7= <"">
##$SUBNAM8= <"">
##$SUBNAM9= <"">
##$SW= 24.0689651099613
##$SWIBOX= (0..15)
0 0 2 0 0 0 0 0 0 0 0 0 0 0 0 0 
##$SW_h= 4816.95568400771
##$TD= 16384
##$TD0= 1
##$TE= 0
##$TE2= 300
##$TE3= 300
##$TEG= 300
##$TL= (0..7)
0 120 120 120 120 120 120 120 
##$TP= (0..7)
150 150 150 150 150 150 150 150 
##$TP07= 0
##$TPNAME0= <>
##$TPNAME1= <>
##$TPNAME2= <>
##$TPNAME3= <>
##$TPNAME4= <>
##$TPNAME5= <>
##$TPNAME6= <>
##$TPNAME7= <>
##$TPOAL= (0..7)
0.5 0.5 0.5 0.5 0.5 0.5 0.5 0.5 
##$TPOFFS= (0..7)
0 0 0 0 0 0 0 0 
##$TUNHIN= 0
##$TUNHOUT= 0
##$TUNXOUT= 0
##$USERA1= <user>
##$USERA2= <user>
##$USERA3= <user>
##$USERA4= <user>
##$USERA5= <user>
##$V9= 5
##$VALIST= <valist>
##$VCLIST= <CCCCCCCCCCCCCCC>
##$VD= 0
##$VDLIST= <DDDDDDDDDDDDDDD>
##$VPLIST= <PPPPPPPPPPPPPPP>
##$VTLIST= <TTTTTTTTTTTTTTT>
##$WBST= 1024
##$WBSW= 4
##$XGAIN= (0..3)
0 0 0 0 
##$XL= 0
##$YL= 0
##$YMAX_a= 44975
##$YMIN_a= -31332
##$ZGOPTNS= <>
##$ZL1= 120
##$ZL2= 120
##$ZL3= 120
##$ZL4= 120
##$ABSF1= 10
##$ABSF2= 0
##$ABSG= 5
##$ABSL= 3
##$ALPHA= 0
##$AQORDER= 0
##$ASSFAC= 0
##$ASSFACI= 0
##$ASSFACX= 0
##$ASSWID= 0
##$AUNMP= <proc_1d>
##$AZFE= 0.1
##$AZFW= 0.1
##$BCFW= 1
##$BC_mod= 2
##$BYTORDP= 1
##$COROFFS= 0
##$CY= 11.3945322036743
##$DATMOD= 1
##$DC= 2
##$DFILT= <>
##$DTYPP= 0
##$F1P= 15.6554695791079
##$F2P= 12.8336369535428
##$FCOR= 0.5
##$FTSIZE= 0
##$FT_mod= 4
##$GAMMA= 1
##$GB= 0.15
##$INTBC= 1
##$INTSCL= 1
##$ISEN= 128
##$LB= 0.24
##$LEV0= 0
##$LPBIN= 0
##$MAXI= 10000
##$MC2= 0
##$MEAN= 0
##$ME_mod= 0
##$MI= 1.114404
##$NCOEF= 0
##$NC_proc= 0
##$NLEV= 6
##$NOISF1= 3.799351
##$NOISF2= 2.8
##$NSP= 1
##$NTH_PI= 0
##$NZP= 0
##$OFFSET= 15.70392
##$PC= 1
##$PHC0= -25660.39
##$PHC1= 16.38748
##$PH_mod= 1
##$PKNL= yes
##$PPARMOD= 0
##$PSCAL= 0
##$PSIGN= 0
##$REVERSE= no
##$SF= 200.130013532006
##$SI= 16384
##$SIGF1= 3
##$SIGF2= 2
##$SINO= 400
##$SIOLD= 16384
##$SREGLST= <1H.CDCl3>
##$SSB= 0
##$STSI= 0
##$STSR= 0
##$SW_p= 3612.71676300578
##$SYMM= 0
##$S_DEV= 0
##$TDeff= 0
##$TDoff= 0
##$TI= <>
##$TILT= no
##$TM1= 0
##$TM2= 0
##$TOPLEV= 0
##$USERP1= <user>
##$USERP2= <user>
##$USERP3= <user>
##$USERP4= <user>
##$USERP5= <user>
##$WDW= 1
##$XDIM= 8192
##$YMAX_p= 0
##$YMIN_p= 0
$$ End of Bruker specific parameters
$$ ---------------------------------
##NTUPLES= NMR FID
##VAR_NAME=  TIME,          FID/REAL,        FID/IMAG
##SYMBOL=    X,             R,               I
##VAR_TYPE=  INDEPENDENT,   DEPENDENT,       DEPENDENT
##VAR_FORM=  AFFN,          ASDF,            ASDF
##VAR_DIM=   8192,          8192,            8192
##UNITS=     SECONDS,       ARBITRARY UNITS, ARBITRARY UNITS
##FACTOR=    0.0002076,     1,               1
##FIRST=     0,             0,               0
##LAST=      1.7004516,     0,               0
##MIN=       0,             -31332,          0
##MAX=       1.7004516,     44975,           0
$$ Real data points
##PAGE= N=1
##DATA TABLE= (X++(R..R)), XYDATA
0@%%%%%%%%%%%%%%%%%%%%%%%%%%%JkLmMmNoOpRj0J0j3J7j9K0k2K4k6K8k9L0l0
$$ 0 0 0 0 0 0 0 0 0 0 0 0 0 0 0 0 0 0 0 0 0 0 0 0 0 0 0 0 1 -1 2 -2 2 -2 3 -3 3 -4 5 -5 5 -8 9 -10 10 -12 12 -14 14 -15 15 -15
51a5K9k7K1j0j2O0j60M01j188R237L6639j4029j1616o169q664K395k5987j2237
$$ -15 14 -13 8 -2 -14 46 -114 287 -901 8336 44975 30946 19330 13161 4497 6892 -19095 -31332
69c1332J6352K0498K696k2005R708K3890J96o304k6295k78K1002j4965n713O676
$$ -31332 -14980 5518 8214 -13791 -4083 19807 20003 13699 -12596 -12874 8128 -6837 -12550 -5874
83e874J2141J7082k0960j6784J0831Q979L147k0019m833J8285L768Q24r165O245
$$ -5874 6267 23349 2389 -14395 -3564 5415 8562 -11457 -16290 1995 5763 6587 -2578 3667
97C667K2195j7822k1912p474L151K3328l868q483J6747P268j987j8427j0833J5764
$$ 3667 25862 8040 -13872 -21346 -18195 5133 1265 -7218 9529 16797 14810 -3617 -14450 1314
111A314M139n614j2431PK3824l795j1946J906Q89J4224q403j7329J2845R186K45
$$ 1314 5453 -161 -12592 -12585 11239 7444 -4502 -2596 -1707 12517 4114 -13215 -370 8816 9061
126I061j1379j3935J3910P657l559o173j740J7401l384j4839Q42L550J5643l556
$$ 9061 -2318 -16253 -2343 5314 1755 -4418 -6158 11243 7859 -6980 -6138 -2588 13055 9499
140I499j9927O198N878q05m320r042J4246R924p234p050m561J4229K437j4417
$$ 9499 -10428 -4230 1648 843 -3477 -12519 1727 11651 4417 -2633 -7194 7035 9472 -4945
154d945j690J482J0138L70j5793P158Q716q83k468j1244Q804J1377p179p170n420
$$ -4945 -6635 -5153 4985 5355 -10438 -3280 5436 4553 2085 -9159 -355 11022 3843 -3327 -8747
169h747Q548N533j0489M99N015Q822N64j7667J219Q899q82m86q953N681J3098
$$ -8747 -199 5334 -5155 -4656 359 9181 9745 -7922 -6703 2196 1314 828 -8125 -2444 10654
184A0654n966o274k460N307N788j1896m438M414Q042N581j1444L57R071k199k741
$$ 10654 4688 -1586 -4046 1261 7049 -4847 -9285 -4871 3171 8752 -2692 -2335 6736 4537 1796
199A796r946J365J2148n010n054L7O038R330p536o494K437K460K022j0353j385
$$ 1796 -8150 -6785 5363 353 -4701 -4664 1374 10704 3168 -3326 -889 1571 3593 -6760 -8145
214h145J1070J163j42o804p62J1649m423p133j191J710P933n443n242O019M231
$$ -8145 2925 4088 3946 -2858 -3620 8029 3606 -3527 -4718 -3008 4925 -518 -5760 259 4490
229D490L045q459n915Q266O40j354m651j134J0641j481p021O1J490P058l417q354
$$ 4490 7535 -924 -6839 1427 2067 713 -3938 -5072 5569 4088 -2933 -2872 -1382 5676 2259 -6095
245f095M189M189L269n155o191O527J133l007l119j278J1005J489p097r43j47
$$ -6095 -1906 2283 5552 397 -5794 733 1866 -1141 -4260 -5538 5467 6956 -141 -1084 -1231
260a231M820j929q396L566M351J760l053n331P030M185l420l514l503O234J790
$$ -1231 3589 1660 -6736 -3170 1181 2941 -112 -5443 1587 5772 2352 -1162 -4665 1569 3359
275C359o873L31J808N127Q77q234K023M447k38k794o993M429O321j541j101j738
$$ 3359 -3514 -3183 -1375 3752 4629 -3605 -1582 2865 2627 -167 -7160 -2731 3590 2049 948 -790
291g90M842J697r573k116J130M455L457n787K126N638o60j521o796J838N481m161
$$ -790 4052 5749 -3824 -5940 -4810 -355 3102 -2685 -559 5079 4419 2898 -3898 -2060 3421 -740
307g40k418j937M616N450n366j273K047K498K034p027q85M615o30j463m854K099
$$ -740 -3158 -5095 -479 4971 -395 -1668 379 2877 4911 -2116 -3001 1614 984 -479 -5333 -3234
323c234P446j604k302k085J505M049n030k544L240L387K270o468k595M188k38
$$ -3234 4212 2608 306 -1779 -274 3775 -1255 -3799 -559 2828 5098 -1370 -3965 223 -15
338a5n12k896J182P018j149l325j436P94M209m282m543K820K470K801l415k815
$$ -15 -527 -3423 -2241 4777 3628 303 -1133 -339 3870 -412 -4955 -2135 335 3136 -279 -3094
354c094M240Q63j452k072l57M875j87l653j268K19L767j226l216K102J675J019
$$ -3094 1146 2009 557 -1515 -1872 3003 2816 -837 -2105 -1886 1881 655 -2561 -459 1216 2235
370B235l172l119M242K287m61j797j447L911j161m040q81K17M448j63k814K507
$$ 2235 -937 -4056 186 2473 2012 215 -1232 2679 1518 -2522 -3403 -3186 1262 1099 -1715 792
386G92K243Q61k428m870K284J488j468o80n85L786J352l173m20N40K704R6m331
$$ 792 3035 3896 1468 -3402 -1118 370 -1098 -1778 -2363 1423 2775 -398 -818 -278 2426 2522 -1809
403a809N86J209Jn89k454K629L360j355j396k041J950J991l285m8Q09J908Q34
$$ -1809 -1223 -14 -13 -602 -3056 -427 2933 1578 182 -1859 91 2082 -1203 -1251 -442 1466 2300
420B300l888L18J769J05p44k807J739L633j000q07j214J027J746l278n07O00J898
$$ 2300 -1588 -1270 499 604 -140 -2947 -1208 2425 1425 618 -596 431 2177 -1101 -1608 -1008 890
437H90J027l432l07K732k77K62k096Q92K702j926j247p45Q16K677k227j937J596
$$ 890 1917 -1515 -1822 910 633 895 -1201 -309 2393 467 -780 -1525 -709 1968 -259 -2196 -600
454f00J104J553k730q11K659J76m33k506M42L040j218j204j154K61L039j189j159
$$ -600 504 2057 -673 -1484 1175 1351 918 -1588 -1146 1894 676 -528 -1682 -1421 1618 429 -730
471g30J108Q95O48k350j688K361K75k53j520m08K876l32q46n45J97K348j753k103
$$ -730 378 1273 1921 -429 -2117 244 519 266 -1254 -1662 1214 882 36 -509 -312 2036 283 -1820
489a820J088Q10J108j662j570K678O85l02q53j258K236k54k231k08K67K711m0
$$ -1820 -732 78 1186 -476 -2046 632 1317 1015 162 -1096 1140 886 -1345 -1553 -1286 1425 1385
506A385k258J132P04J20r22k287J653R63o98l04n49K594O94j744p32l70J215n47
$$ 1385 -873 259 963 1083 161 -2126 -473 490 -208 -512 -1061 1533 2227 483 -249 -619 596 49
524D9k519J522J517R87k86k004J262R30j225p79j442J616J062j487N57N57J315
$$ 49 -2470 -948 569 1556 1270 -734 528 1458 233 -546 -1988 -372 690 -797 -240 317 1632
541A632K75k800k33O97K66k63j458J552K065n60o64j064R16J192k390o57j90J444
$$ 1632 1907 -893 -1126 -429 -163 -426 -1884 -332 1733 1173 509 -555 361 1553 -837 -1494 -1684 -240
559b40J201j319K93J743m91o11j856j1J860p02P2p90R82J721j626j004K15O18
$$ -240 961 -358 -65 1678 1187 576 -1280 -1291 569 -133 -61 -851 131 1852 226 -778 -563 55
577E5M77j656N8J937qK63j848j18J470o50n90l65M96J625j099p62J155L79O22
$$ 55 532 -1124 -1066 871 863 1126 -722 -840 630 -20 -610 -975 -479 1146 47 -715 440 819 1441
596A441j479j428J051K13p6p69N56J948l84p60n12m04P74m78q99J041N81N02l52
$$ 1441 -38 -1466 -415 -202 -278 -1047 -491 1457 1073 313 -199 -603 171 -307 -1206 -165 416 918 566
615E66j584J074M61m98p84n25J998L09o88j72k48J038o03j347K83R04L43n29j347
$$ 566 -1018 56 517 19 -765 -1290 708 1017 329 157 -91 947 344 -1003 -720 184 527 -2 -1349
634a349J405O11J11o06n11J342l01j308l25J75J335j30j757J036P84K96l42j416
$$ -1349 56 667 778 172 -339 1003 702 -606 -931 -756 579 449 -1308 -272 512 808 466 -950
652i50R65P73m41p10n52Q59P93j503J0K84J115N68j342Q8M15k2o02j046O52J473
$$ -950 15 788 347 -363 -915 -56 737 -766 -756 -472 643 1211 -131 -43 372 350 -252 -1298 -646 827
672H27m29n9p57O11P58j338m87J20J287L32j385L80P93O4k90j356o8J284o01m4
$$ 827 398 339 -418 193 951 -387 -874 -754 533 865 -520 -140 653 717 427 -929 -997 287 -314 -358
692c58k16N78R60q55o36L50M86M07j420l83R71J17J04l05K18J298q11n51m09j1
$$ -358 -574 4 964 109 -527 -177 309 716 -704 -1087 -116 1 105 -200 18 1316 505 -46 -455 -466
712d66Q21n14l85N30M11K65p71m92O70K13j60j26m98J356k39r77k74L31Q47n97
$$ -466 355 -159 -544 -14 397 662 -109 -601 69 282 122 -4 -502 854 615 -362 -636 -305 542 -55
732e5n15P41K98L61m69r89M01L19J06m43p17J646k42m50m3n28J309m24o42K9K76
$$ -55 -570 171 469 830 361 -628 -227 92 198 -245 -962 684 442 -8 -51 -579 730 306 -336 -307 -31
753c1L22po94N17L08q6n78o28J050r9n15J89J8N87O50j228j80N47j74n9o92O45
$$ -31 291 284 -410 107 415 329 -249 -877 173 74 -441 -252 -234 353 1003 -225 -405 142 -32 -91 -783 -138
775a38N40k70L06n50M32L52j070M0n5M21M25j206O49L31J42N4j002L46N65k10
$$ -138 402 132 438 -112 320 672 -398 -358 -413 8 433 -773 -124 207 349 403 -599 -253 312 102
795A02j77k65P22K24p34j63n5M18P46j365Q6M55J41R2n54J4P46n10k65l29M01
$$ 102 -75 -340 382 606 -128 -291 -346 72 818 -547 -461 -6 135 227 -327 -313 433 -77 -342 -671 -270
816b70R22n69J5JJ7L36o10m9M35j39J60o23J48O95k9k42l16k37M24l68k79K79
$$ -270 652 83 98 99 116 452 -158 -207 228 89 249 -374 -226 469 440 198 -118 -355 69 -299 -578 -299
838b99N01L63n89p9K12n9j02l19J78L84M5l44l0R4O16m03l97K35m7M04l87o33
$$ -299 202 565 -24 -103 109 50 -52 -371 -193 191 236 -108 -138 -44 572 169 -228 7 -40 364 -23 -656
860f56R08j55L77o15k15R61l71m29J1m03M93K77m47J46N80L9m06l04L6L30j87
$$ -656 252 97 474 -141 -356 605 234 -195 -184 -587 -94 183 -264 -118 462 501 95 -209 -173 157 -30
881c0J0o73R20P5m53J70kK55r1n11j25M70K8r7l68K25K79J41M3l23K74J30m44
$$ -30 -20 -693 227 302 -151 19 17 272 181 -330 -455 15 43 -54 -422 -197 82 223 266 -57 217 347 -97
904i7L5j33L73P9m79J21J39L54l88m22L45L93n15K50n12O57J78m30j36j32L59
$$ -97 -62 -195 178 257 -222 -101 38 392 4 -418 -73 320 -195 55 -457 200 378 -52 -188 -320 39
925C9K32l35QK49j8Q1k98p2L32P2q1n11L83K81n45O8n4K08L50o73n8O42n5M0k27
$$ 39 271 -64 -56 193 175 256 -42 -114 218 290 209 -302 81 362 -183 -115 -169 39 389 -284 -342 300 245 285 58
950E8m45O91k90k1l35M73L12k56n19K13L89Q3m86l33K71J26k1m15L79L16J6lk86
$$ 58 -387 304 14 -7 -342 131 443 187 -332 -119 270 353 -133 -466 -195 -69 -90 -505 -126 190 206 203 -83
973h3K93J1l30J12m3Q2K20l92j7N44k59J78j97j81Q2K81n79n6J08j59J47L5M89
$$ -83 210 221 -109 3 -40 42 262 -130 -147 397 138 316 119 -62 20 301 -278 -334 -226 -385 -238 -203 286
996B86r0R0m22k20L43j11J9J45j39K22J27n35L39j47K26J93o98K82J22M38k57
$$ 286 196 286 -136 -356 -13 -124 -105 40 -99 123 250 -285 54 -93 133 326 -372 -90 32 470 213
1017B13k49m7K22L5l26j14J54L54m57n7L65J29R9n67J56L23k31j4l33J03L65N8
$$ 213 -36 -83 139 174 -152 -266 -112 242 -215 -272 93 222 321 -246 -90 233 2 -12 -345 -242 123 181
1039A81Q7k64M51k76k41j06j8M01o4l65o6N36m78N08m12J18K87j07j66j13L09
$$ 181 268 4 455 179 -62 -168 -186 215 151 -214 -280 256 -222 286 -126 -8 279 172 6 -107 202
1060B02m6k87k16P7J53L47k72R1L15m89M42k64j66L71j92J93l74J15J53j62l9
$$ 202 156 -131 -347 -270 -117 230 -42 49 364 -125 317 53 -113 258 66 259 -115 0 153 -9 -48
1081d8P9J55j69Q6j79k57K35P3Q7O7k23M28n59J89l1L57k88k67N3M40j09M7n65
$$ -48 31 186 17 103 -76 -333 -98 -25 62 129 -94 334 -225 -36 -67 290 2 -265 -212 228 119 166 -399
1104c99O0N57k20j00R6K25l78K8K41J07J28k6n11k4M3N1M8m7kL60q2o1l51L64
$$ -399 -339 218 -2 -102 -6 219 -159 -131 110 217 345 319 -192 -216 -173 -122 -74 -121 -123 237 155 94 -257 107
1128A07n8p0n8J81k4k33J11k82M11j46M59k45k54j02L11M7l09L28n52K52L7k49
$$ 107 49 -21 -79 102 78 -155 -44 -326 85 -61 398 153 -101 -203 108 155 -154 174 -378 -126 -89 -338
1150c38M24j1j95K06k37M30k59j99K08J31m5J43o32N98M4m30J59j64K54J6l3N8
$$ -338 86 75 -120 86 -151 279 20 -179 29 160 115 258 -374 224 268 -162 -3 -167 87 103 70 128
1172A28J68k03p2j19j0P7k67L16l42K50J56K6J5k40MM88o51M0J83O9J06j29k93
$$ 128 296 93 21 -98 -108 -31 -298 18 -324 -74 82 108 123 -117 -113 375 -276 -236 -53 16 122 -7 -300
1195c00K72Q3J9k30J93J61j55Q0j03qQ1k34K78j04K82j94j96O8L32j19k34l19
$$ -300 -28 55 74 -156 37 198 43 123 20 12 93 -141 137 33 315 121 -75 -7 325 206 -28 -347
1217c47j23M86j27nM4J7K34m9n8j06m4RK85m66M50j72j02J37j80M98j76k24l3
$$ -347 -470 16 -111 -116 -72 -55 179 130 72 -34 -78 -69 216 -250 200 28 -74 63 -117 381 205 -19 -52
1240e2J04K0m7j71N8K34k81m2q0R8j75M45j48n4j0jq3K08oL9J04j10j2k94P9L81
$$ -52 52 72 25 -146 -88 146 -135 -177 -257 -159 -334 111 -37 -91 -101 -102 -185 23 17 56 160 50 38 -256 -177 204
1266B04n22K20J40j42R6l05L03J76k67L92j18l82K73k12L89k31K81k84P4j65Q9
$$ 204 -318 -98 42 -100 -4 -309 -6 170 -97 295 177 -205 68 -144 245 14 295 11 85 -80 9
1287IN6j03nJ59k9j77K77j16J32k0k72p7J36l4pk57K57l2K91j24k08M60k50M1
$$ 9 65 -38 -43 116 87 -90 187 71 203 183 -89 -166 -30 -64 -71 -328 -71 -103 188 64 -144 316 66 107
1311A07j95J01J84l19j26J85Q6Q5j27j58K42j17l08L64k06K14J80q1l06J02L72
$$ 107 -88 13 197 -122 -248 -63 23 108 -19 -177 65 -52 -360 4 -202 12 192 111 -195 -93 279
1332B79k57m41J81J12K8o8O7n2K3N45l78nj60L53K5l03K15j87o1J75j07J13J32
$$ 279 22 -419 -238 -126 -98 -166 -99 -151 -128 417 39 34 -126 227 252 -51 164 -23 -84 91 -16 97 229
1355B29k17j12P1k52K65k56K9L03J36k10J96j00N8O1k10m34L49R8R0k09j42R1
$$ 229 12 -100 -29 -281 -16 -272 -243 60 196 -14 182 82 140 201 -9 -443 -94 4 94 -115 -257 -166
1377a66L30k49L45l75K53j57j76L34k23J56j5rJ57Q3l45J37k15J48n8k71N14m93
$$ -166 164 -85 260 -115 138 -19 -195 139 -84 72 57 48 205 288 -57 80 -135 13 -45 -316 198 -295
1399b95M33R8j58j56K29J0k7k01k72L23j19L22l93K43K89m07k0J55j81K73Nj67
$$ -295 138 236 78 -78 151 161 134 -67 -339 -16 -135 187 -206 37 326 -81 -101 54 -127 146 151 -16
1421a6K26k41k7J67J8N6m6j26P6l28P4L02n3j35o5J38J0N1k18K60j87K02R4N2
$$ -16 210 -31 -58 109 127 183 137 11 87 -241 -167 135 82 -53 -118 20 30 81 -137 123 -64 138 232 284
1445B84l23L39j85l1n1j12K10l31L09o9j62j00l4K00K6j19K35QJ31j66r8j21L73
$$ 284 -39 300 115 84 33 -79 131 -200 109 40 -122 -222 -256 -56 -30 -149 86 94 225 59 -39 -160 213
1468B13l43j38J85P6P2l15K10M2j27j52J8J75K0l5J27j20j99K59J4O9J33j26m3
$$ 213 -130 -268 -83 -7 65 -250 -40 2 -125 -277 -259 -84 -64 -99 28 -92 -291 -32 -18 51 184 58 15
1491A5K27m15M48l55j32N17l14k01l7O7K30j37M3Q6j1j21JJ27k4j17K52l18j15
$$ 15 242 -173 275 -80 -212 305 -9 -210 -247 -180 50 -87 -44 42 31 -90 -89 38 14 -103 149 -169 -284
1514b84L85l23N7K19N4j92j60N6J72j3K52k46K89m18J14J76J10k01L11k97Q0j89
$$ -284 101 -222 -165 54 108 -84 -244 -188 -16 -29 223 -23 266 -152 -38 138 248 47 358 61 141 -48
1536d8j04K94l53K26j18O2j29K96m6R1n54P5J00K38k97k6M35k57J35K39r2k55
$$ -48 -152 142 -211 15 -103 -41 -170 126 80 171 -383 -308 -208 30 -267 -293 142 -115 20 259 167 -88
1558h8j6j53L00R2k92K49l0j33j4N8o2j10K43O7k23K00k77j7K68l43J39o6K62
$$ -88 -104 -257 43 135 -157 92 62 -71 -85 -27 -89 -199 44 111 -112 88 -189 -206 62 -281 -142 -208 54
1581E4j27J64k03K17l47J69K88l0m3J25j34J6j13J05J70l59q8M1j92J72J01k53
$$ 54 -73 91 -112 105 -242 -73 215 185 142 267 133 149 36 141 311 -48 -136 -95 -287 -115 -14 -267
1603b67L11j55q9P4J70j98K07L6pN6N3k09k44J13K66j40J16j45J28K37m83K08
$$ -267 44 -111 -200 -126 44 -154 53 89 82 138 191 -18 -262 -149 117 -23 93 -52 76 313 -170 38
1625C8J99j30k73L17j49j3R0m43M02r6L6m6j6K71k43J55j49Q1K04j86r7J6p4R8
$$ 38 237 107 -166 151 2 -11 79 -364 38 -58 -22 -68 -84 187 -56 99 -50 31 235 49 -48 -32 -106 -8
1649hK75r3k33M3J78j11KK6m43N69k74j67K12j48j07J94J35k70K50J12j69M8k95
$$ -8 267 174 -59 -16 162 51 53 79 -364 205 -69 -236 -24 -172 -279 -85 50 -220 30 142 -27 21 -274
1672b74J48j69ML89j54K35l06M09k37l27K09L36j12r1M9k24K07l51L23o7o7K52
$$ -274 -126 -295 -291 98 -56 179 -127 282 45 -282 -73 263 151 60 109 -115 92 -259 64 -3 -70 182
1694A82j3l01K53j38N6j42Q0M4J01k06Q0l84N88l12j04P3M3K94n9k72k8nK47m8
$$ 182 169 -132 121 -17 39 -103 -23 21 122 -84 -4 -388 200 -112 -216 -143 -100 194 135 -137 -165 -170 77 29
1718B9j02o6o6J01Q1J42j88J25j77Lj28K50j12J15J16l46L77L2m84J19L9K99j29
$$ 29 -73 -139 -205 -104 -23 119 -69 56 -121 -118 -246 4 -108 7 123 -223 154 186 -298 -179 -140 159 30
1741C0j13j39K79n4j29o5L08q7K01k55K72l71%M2J47j44j11K64l99L56j82K50
$$ 30 -83 -222 57 3 -126 -191 117 30 231 -24 248 -123 -123 -81 66 -78 -189 75 -324 32 -150 100
1763A00l07J30J61mj76N4N2Q9J29k10J43j64J71j63j38k7K85m34O87m99M4N3o
$$ 100 -207 -77 84 80 -96 -42 10 99 228 18 161 -3 168 5 -133 -160 125 -309 378 -121 -77 -24 -30
1786c0J22l34K34q3K99p0k15o7j10K69j81p5M76n29L9L12l7L3m02L03j2O4j92
$$ -30 92 -242 -8 -91 208 138 -77 -144 -254 15 -166 -241 235 -294 -255 57 20 53 -349 -46 -58 6 -186
1809a86O1l6L22j05j05J24k24K00j74J89lk17mJ44p7K27Q3l39K09n7j82J49P0
$$ -186 -125 -161 161 56 -49 75 -149 51 -123 66 63 -154 -158 -14 -91 136 219 -120 89 32 -150 -1 69
1832F9j04K10k74J9K17j13K52k74L35m00m4J91j74K39l26M0q6K99l5N0K35m27
$$ 69 -35 175 -99 -80 137 24 276 2 337 -63 -107 84 -90 149 -177 -137 -223 76 41 91 326 -101
1854a01J57NK2q4mr5J59m5j82J84P7K9P1l12J68K9j24PJ25j3K5Q0l97L25J26m15
$$ -101 56 61 83 -1 -5 -100 59 14 -168 16 93 122 193 -119 49 78 -46 -39 86 73 98 178 -219 106 232 -183
1880a83K88M8j33j9kj60L1L52q0k63j46K5J60J48j95J87L19l00j42J02N3J72m39
$$ -183 105 153 20 1 -1 -161 -130 222 142 -121 -267 -242 -82 66 -129 58 377 77 -65 37 90 262 -177
1903a77L33j06k0M7j41jR9r5j26J72lm7L88k76Q3k14J08k72J98K97m47K35J28
$$ -177 156 50 30 77 -64 -65 34 -61 -187 -15 -18 -65 323 47 130 -84 24 -248 -50 247 -200 35 163
1926A63K8j05M8J84j98j53J40k47L4O3R3Q0k70Q2k2L09k07K01q9r5L5rM5l81K31
$$ 163 191 86 134 318 120 -33 107 -140 -106 -43 50 130 -140 -58 -80 229 22 223 134 39 74 65 110 -271 -40
1951d0K56k87J9L7k4J0j22K53k98J22N3j85J32R0J42k09J29k40J12o6J05R1J7
$$ -40 216 -71 -52 -15 -39 -29 -151 102 -196 -74 -21 -206 -74 16 158 -51 78 -162 -50 -116 -11 80 97
1974I7k1m5J39j59p3L4j88K40J78j84n4L2K70J2l29M62k95j64k3j53K53j0NK90
$$ 97 76 31 170 11 -62 -28 -216 24 202 18 -36 -4 266 278 -51 411 116 -48 -71 -224 29 19 24 314
1998C14m05k11n5J04L11j48J67j16kR0K35k64j28J01J46j76o6P6j3KK55k52j33
$$ 314 -91 -302 -357 -253 58 -90 77 -39 -41 49 284 20 -108 -7 139 -37 -103 -27 -40 -38 217 -35 -168
2021a68P0R2k5O8k19L21n7l57N67k07J28j95k40K80k05K29j45j07L58l81K24N1
$$ -168 -98 -6 -31 37 -182 139 82 -275 292 85 213 18 -222 58 -147 82 -63 -170 188 -193 31 82
2043H2j55K24J9j59o3K64k04k02K27j27O9k7L0O5J6P5k18P5m9n1QJ67j38q9j3
$$ 82 -73 151 170 11 -52 212 8 -194 33 -94 -25 -52 -22 43 59 134 -84 -9 -58 -109 -101 66 -72 -161 -174
2068a74J56K92l37N9j00N7Q3j50j41J98J28j5j65KK05l30P1M17k67J32K76j63
$$ -174 -18 274 -63 -4 -104 -47 36 -114 -255 -57 71 56 -109 -107 98 -232 -161 256 -11 121 397 234
2090B34j36l38K82K30j83O4j51k58L87n76M63k2j82L7K53j63j40K32j39m8j01
$$ 234 98 -240 42 272 89 153 2 -256 131 -445 18 -4 -186 -149 104 -59 -199 33 -106 -154 -255
2111b55J97j94k5K53j14K21k51J88n4J11j44J54j06O2Nn1j21q1j8K47J73j1j01
$$ -255 -58 -252 -277 -24 -138 83 -168 20 -34 77 -67 87 -19 43 48 -3 -124 -205 -223 24 197 186 85
2134H5k1k08J43J66N9j87o7K09k79K70j60j72n4K83l1o4J04M5QJ6k0k77R3op3
$$ 85 64 -144 -1 165 224 37 -30 179 -100 170 10 -162 -216 67 36 -28 76 121 129 145 125 -152 -59 -65 -138
2159a38k7R0N5r9Lk0K13Q3J50l48J10k35J44M2j36L07k04J0nj07N3jJ30J5k62
$$ -138 -165 -75 -20 -119 -116 -136 77 160 310 -38 72 -163 -19 23 -113 194 -10 0 -5 -112 -59 -60 70 85 -177
2184a77L28J2k27j38J24M00l28K88n1l15m7J55Q1M1j29P1K53l10j85P5L59k71
$$ -177 151 163 -64 -202 -78 322 -6 282 231 -84 -131 24 105 146 17 88 341 31 -154 -79 280 9
2206Ik53M20o4j97L06k10O9J7K3j31J32J3l41M17l09p0K02n8M69n43M3J3K43j30
$$ 9 -244 176 112 -85 221 11 80 97 120 -11 121 134 -207 210 -99 -169 33 -25 444 -99 -56 -43 200 70
2230G0j90L03j3J09k46K68Ql15k97K90O1j59K15L00k69m1j21rk40K19J62Qr3r7
$$ 70 -120 183 170 279 33 301 309 -6 -303 -13 48 -111 104 404 135 94 -27 -36 -276 -57 105 113 20 -77
2254g7j70N46l71Jr9R0M6j04L85l22k15K97j35j68L72J17K0j27r2J46j43K84l66
$$ -77 -247 299 -72 -71 -170 -80 -34 -138 247 -75 -290 7 -128 -296 76 193 213 86 -6 140 -3 281 -85
2277h5L6J43L5j07L7P2k86J79J70l77J59l30m7M02mJ45j87N5K13q0j34J42n6%
$$ -85 -49 94 129 22 59 131 -155 24 194 -183 -24 -354 -401 1 -3 142 -45 10 223 143 9 151 95 95
2301I5Q7l42L92j9l3m35N46l61J48J32l40K12j74J01R1j48J90k73N4J84M8m2j81
$$ 95 182 -160 232 213 180 -255 291 -70 78 210 -130 82 -92 9 100 -48 142 -131 -77 107 155 113 -68
2324f8L71m99K40M8q1J89j13j74J65m0O1P0j48k5N4J4J15j18j32N7o2K2l6o8J53
$$ -68 303 -196 44 92 11 200 87 -87 78 38 99 169 21 -4 50 64 179 61 -71 -14 -76 -54 -90 -158 -5
2349el6L6j51J08P5j21M15m81P7N1j07J57j27l7M40k07j98LL08l25k01L15K08
$$ -5 -41 -5 -156 -48 27 -94 321 -160 -83 -32 -139 18 -109 -146 294 87 -111 -108 200 -125 -326 -11 197
2372A97k52j27J80K34m70J53LN3r7K17j68P3j69J09M0J64j34L55l70l4O1k07O8
$$ 197 -55 -182 -2 232 -238 -85 -82 -29 -126 91 -77 -4 -173 -64 -24 140 6 361 -9 -43 18 -189 -121
2395a21J44R0j04j04J55M1p7J04J04k53j90L52p4J59k68M1k09J24j62L45J13j74
$$ -121 23 113 9 -95 60 101 24 128 232 -21 -211 141 67 226 -42 -1 -210 -86 -248 97 210 36
2417C6r3q2m7L41N0j73j5Jk22J05K4l6J49J69Kn18J99k5L50l00k94N40J02k44
$$ 36 -57 -139 -186 155 205 32 17 18 -204 -99 -75 -111 38 207 209 -309 -110 -135 215 -85 -379 161 263 19
2441A9j12K40j90j14l3L05j07Rk60M66j41o0J25o2J70k27J38j60p7j80M2J41L49
$$ 19 -93 147 -43 -157 -190 115 8 17 -243 223 82 22 147 85 255 28 166 6 -71 -251 -209 -68 281
2464B81l86j4J73q5j06K41O6j77P7j97L78n9k12J27k75L18j07j50N2l2M3O0Jj24
$$ 281 -105 -119 54 -31 -137 104 170 -7 70 -127 251 192 -20 107 -168 150 43 -107 -55 -87 -44 16 17 -107
2488a07J65l25K20j63m0L38j54K91j19n34J90K79Mj00NO1L6j45K22j41K53m09
$$ -107 58 -267 -47 -210 -250 88 -66 225 106 -428 -238 41 45 -55 -50 11 47 -98 124 -17 236 -173
2510a73K20M0l42N3J4L41j16j23J88j26O2l4j8O0k29M8K15k9k28J79j35J11L3
$$ -173 47 87 -255 -202 -188 153 37 -86 102 -24 38 4 -14 46 -183 -135 80 51 -177 2 -133 -22 11
2533A1r4j15K31J00j95r2n9K71K08k95q2p4O9M10l25J57J00j86P9j29j28p4L33
$$ 11 -83 -198 33 133 -62 -154 -213 58 266 -29 -111 -185 -116 294 -31 126 226 40 119 -10 -138 -212 121
2556A21j84pL1j83K58j90K91l20L20M0j00o9K1M1j77p8Q8J80k29J87J90k75qK86
$$ 121 -63 -70 -39 -222 36 -154 137 -183 137 177 77 8 29 70 -107 -185 -97 83 -146 41 231 -44 -52 234
2580B34j58rq8J33k3j57lK20l13M15n33L64LM8j32N09q65L68k7r1m8M3J09J41
$$ 234 76 67 -21 112 89 -68 -71 149 -164 251 -282 82 85 133 1 510 -355 13 -14 -105 -153 -110 -1 140
2604A40k97L83k99M53k25j79j28J51j8j4O1l7RR2l63Q0K12j44k07K25K29Ol22
$$ 140 -157 226 -73 380 155 -24 -152 -1 -19 -33 28 -9 0 92 -271 -191 21 -123 -330 -105 124 130 -192
2627a92Q1R8l23L51k21K05K5L2m21M60k87j8M61m28O7o1K20j26l16N35k54K40
$$ -192 -111 -13 -336 15 -206 -1 24 56 -365 95 -192 -210 251 -177 -110 -171 49 -77 -393 142 -112 128
2649A28k22M4L36j65j65J38R2l65L77k04K66j46j17m8m8J70J69K8k41O6p7L80
$$ 128 -94 -50 286 121 -44 94 186 -179 198 -6 260 114 -3 -51 -99 71 240 268 27 93 16 396
2671C96k71m47k9K79J19j41M33k62j11o4Q7m2o8j65K63K12o0j23K0J5n4J23j28
$$ 396 125 -322 -351 -72 47 -94 339 77 -34 -98 -11 -53 -121 -286 -23 189 129 6 26 41 -13 110 -18
2694a8L2J35l50J04J93k72K26Q1J16k40q0j0M6J67j85K06j80K71l4l24K7J31O
$$ -18 14 149 -201 -97 96 -176 50 131 247 7 -73 -83 -37 130 -55 151 -29 242 208 -116 -89 42 48
2717D8J26k63Mk46O05n5l23LK75p6L3k76QM06l52J81j13k66J78M25l10p1J29j2
$$ 48 174 -89 -85 -331 274 219 -104 -101 174 98 131 -145 -137 269 -83 98 -15 -281 -103 322 12 -59 70 58
2741E8k70M25k82j04J23j05K85j75j16K9J73K44l02j00r1N8K94j94L2r6K45j20
$$ 58 -212 213 -69 -173 -50 -155 130 -45 -161 -132 41 285 -17 -117 -208 -150 144 -50 -18 -114 131 11
2763A1L9L6m8K81k34O1j35J67k85K38M5l30J53j5K07k31J55Mm01J73K38J38m75
$$ 11 50 86 38 319 85 146 11 178 -107 131 176 -154 -1 -16 191 -40 115 119 -282 -109 129 267 -208
2786b08J93J66j30j50m2J45J64Q7p2j52k35P9p4K33k01m6K74q2m8m3OL58l09J9
$$ -208 -15 151 21 -129 -171 -26 138 225 153 1 -234 -155 -229 4 -197 -243 31 -51 -99 -142 -136 222 -87 -68
2810f8J52j44K8J26p0J82Q8j78l49J82L32n37O08j17k00J14P7rj68r2M8R0j19
$$ -68 84 -60 -32 94 24 206 294 116 -233 -51 281 -256 352 235 35 149 226 217 49 -43 5 95 -24
2833b4R7j0J24n2j38K81k77K1K11j58j40L74r8o8k05q7J51j21L52l10j60L71j12
$$ -24 73 63 187 135 -3 278 1 22 233 75 -65 309 211 143 -62 -149 2 -119 233 -77 -237 134 22
2856B2Oj84J12K9J0l9J0K76l10N6k55K10J65k06K22n8j47j61J40K97R3k6m20J88
$$ 22 28 -156 -44 -15 -5 -44 -34 242 -68 -12 -267 -57 108 -98 124 66 -81 -242 -102 195 288 262 -158 30
2880C0l1K36j83L0Lj59N5J82m1J58j80Q9l40L5l6q4O0J72j76J3R1M15k40j59l7
$$ 30 -1 235 52 82 85 -74 -19 163 122 280 100 189 -151 -116 -152 -236 -176 -4 -180 -167 -76 339 99 -60 -97
2905i7Qp4N9M7n9J18j96J44k8r4K45K4k06J41K05k44J49l06J01j24J38k29J39
$$ -97 -89 -163 -104 -57 -116 2 -194 -50 -78 -172 73 97 -109 32 237 -7 142 -164 -63 -187 -49 -278 -139
2928a39K57J23j96l0k27K65K3J05j85K28j90M1j20j09J58J22j47j93O16n10j1
$$ -139 118 241 45 15 -212 53 76 181 -4 224 34 75 -45 -154 4 126 -21 -214 402 -108 -119
2949a19J44m3M7p7j77L23J77j70m09M99j29O4L8k56J49j94r3K47J60j89n1K20
$$ -119 25 -18 29 -48 -225 98 275 105 -304 195 66 130 168 -88 61 -133 -226 21 181 -8 -59 161
2971A61N3j44k81L03j49k9R0m36M89m2N5k20J02M06n62J07K15K8m08j0L31j62
$$ 161 214 70 -211 92 -57 -86 4 -432 57 15 70 -150 -48 358 -204 -97 118 146 -262 -272 59 -103
2993a03j57L82n0kK9Pk40M7K04J01l59L37n6J83l82J03j88K95n69N36k76J33J20
$$ -103 -260 122 72 70 99 106 -134 -87 117 218 -141 196 140 323 -59 44 -144 151 -418 118 -158 -25 95
3016I5j04R2j2n5j35J40n9j31Q8j51N68j91l15J84J2k9J02q2L3k30L19J6k20J76
$$ 95 -9 83 71 16 -119 21 -38 -169 -81 -232 336 145 -170 14 26 -3 99 17 50 -180 139 155 -65 111
3040A11l70J04M02o1l2M1m98L89j80k62L73J77j84K0j2k0K02j44J5k15K74k94
$$ 111 -259 -155 247 186 154 195 -303 86 -94 -356 17 194 10 30 18 -2 200 56 71 -144 130 -164
3062a64J71o5m0J99j64O0rPP9R0j88J61j08j22R4r2m6J0N5M09n58Ol7Q7L68K3
$$ -164 7 -58 -98 101 -63 -3 -12 -5 74 164 -24 137 29 -93 1 -91 -137 -127 -72 337 -221 -215 -252 -165 203 226
3088B26k29O1o8l8J69k55j81L71R7l11K01k8J10k85j27J57j22M44k18L79m84P7
$$ 226 -3 58 -10 -48 121 -134 -315 56 153 -158 43 15 125 -160 -287 -130 -252 192 -26 353 -131 -54
3110e4O3K55n28K31K13k92j04K56l19J54M6M6j47N66m02k07L21j25J01k30J88
$$ -54 9 264 -264 -33 180 -112 -216 40 -279 -125 -79 -33 -180 386 -16 -223 98 -27 74 -156 32
3131C2M0j24p3J24O1p1j03k4L4J57J3j09J48K00l64j89K04Q1O8L1j20J56m34K67
$$ 32 72 -52 -125 -1 60 -11 -114 -138 -104 53 66 -43 105 305 -59 -248 -44 37 105 136 16 172 -262 5
3155EP0%l00J95K10j09j32j85N8l2K72k33N78o54J38L51k97p4O1J84ll22M36k66
$$ 5 75 75 -225 -30 180 71 -61 -246 -188 -220 52 -181 397 -257 -119 232 -65 -139 -78 106 103 -219 217 -49
3179d9k1O3O6j47K73k81J89k55r5J39J83pK6j72L71j13k39j09J54J07J77j45n33
$$ -49 -70 -7 59 -88 185 -96 93 -162 -257 -118 65 58 84 -88 283 170 -69 -178 -24 83 260 115 -418
3202d18M39J13qj74P5J09O6J33k55p0l24K89K25k08J12p1J17j07l3n4j63J66J70
$$ -418 21 134 126 -48 27 136 202 335 80 10 -314 -25 200 -8 104 33 150 43 10 -44 -207 -41 129
3225A29l1k5j16j43N9K48jl30J94K01j88j47J03J47l75L42q6n5K12k65L1J56n7
$$ 129 98 73 -43 -186 -127 121 120 -210 -16 185 -3 -150 -47 100 -275 67 -19 -74 138 -127 -96 60 3
3248CJ95m4k22N0Nl6lK19k34K96l2j94Q8j49K17k51n5L98l09k78L04L97m63j38
$$ 3 198 154 -68 -18 -13 -49 -52 167 -67 229 197 3 91 -58 159 -92 -147 251 -58 -336 -32 365 -98 -236
3272b36N57k24J00k03J22J9j25J87j33k16K17j84J49m1m2K77l12L35j43jR8j16
$$ -236 321 97 197 -6 116 135 10 197 64 -152 65 -119 30 -11 -53 224 -88 247 104 103 201 85
3294H5k73k7O04m26r2J23j53M5K57Q5l27J5L01k88j0K37k43j21K9NL29j75J05
$$ 85 -188 -215 389 -37 -129 -6 -159 -114 143 228 -99 -84 217 -71 -81 156 -87 -208 -179 -174 155 -20 85
3317H5J03j61M2P2r7j53K43k92Q2K64K0k61R7n3k2L0j92K78K36k03k70m6K72j54
$$ 85 188 27 69 141 44 -109 134 -158 -76 188 208 -53 44 -9 -31 -1 -193 85 321 118 -152 -198 74 -80
3341h0J6q5K73jq2k01K66k65K34j76r3R3j47L91k78M49j95l02L41k01R7k08L8
$$ -80 -64 -149 124 123 41 -160 106 -159 75 -101 -194 -101 -248 143 -135 314 119 -183 158 -43 54 -154 -116
3364a16P7o9K20J10k88N0l9n7J22o8l31J51L7J45O8R0l53M60Lm45K39j12K31j9
$$ -116 -39 -108 112 222 -66 -16 -55 -112 10 -58 -389 -238 -201 -56 12 102 -251 209 212 -233 6 -106 125 106
3388A06l40J41J34L2l43L94l74J36L36k44K78m63o3P1K65j28n7J62j47K9J49J20
$$ 106 -234 -93 41 73 -270 124 -250 -114 222 -22 256 -207 -270 -199 66 -62 -119 43 -104 -75 74 194
3410A94l63L65j77J38j51M5j78M50m33j59M91J70o80K60l2J9K09o5P7j30J45m29
$$ 194 -169 196 19 157 6 51 -127 323 -110 -269 222 392 -288 -28 -60 -41 168 103 180 50 195 -234
3432b34J98l2L3K07j72j57J84k9Mj19J31p9K59J4p3L9j3k00L46l16j08O1J87k02
$$ -234 -36 -68 -35 172 0 -157 27 -2 2 -117 14 -65 194 208 135 174 161 -39 307 -9 -117 -56 131 -71
3456g1j21K08N7k19j35L71k23k39K24K4L46k75N1p1J39j71K50j42pJ3k00K06l2
$$ -71 -192 16 73 -146 -281 90 -133 -372 -148 -124 222 -53 -2 -73 66 -105 145 3 -4 9 -191 15 -17
3479a7l4J0j6q9K47k27K62K80m60j3j01K38l1r9M8J8J21k92j50M18J22O3o3ok57
$$ -17 -51 -41 -57 -146 101 -126 136 416 -44 -57 -158 80 49 -50 -2 16 137 -155 -305 113 235 298 235 229 -28
3504b8R8pqj48m4L2jJ70j44Q7R1j90k36L96L2p7j58j50K18N3K02q9J37j52O6j38
$$ -28 70 63 55 -93 -137 -105 -106 64 -80 7 98 -92 -328 68 100 23 -135 -285 -67 -14 188 99 236 84 150 12
3530A2J07l18N08l53j13J54k16L42J79j47J48m4k45J4kj88J54j58N6J07L28m43
$$ 12 119 -199 309 -44 -157 -3 -219 123 302 155 303 259 14 28 26 -162 -8 -166 -110 -3 325 -118
3552a18j00M06n41L69J37k26O6M37n54K73l07L35j20j86M4r6J73KJ0k76R6o3J28
$$ -118 -218 188 -353 16 153 -73 -7 430 -124 149 -158 177 57 -129 -85 -181 -8 -6 4 -272 -176 -239 -111
3575a11lK78l49J53kP7j74OM8J7j72J98K3nO1j92K91k37n8L88l02J28K31k15j68
$$ -111 -114 164 -185 -32 -34 43 -131 -125 -77 -60 -232 -34 -11 -16 45 -147 144 -93 -151 237 -65 63 294 79 -89
3600h9K03k26O6L21j37r6L2R9j72k37K88k61r5J49qO3K51k0l64K62OR6j88O8p5
$$ -89 114 -112 -46 275 138 42 74 173 1 -236 52 -209 -304 -155 -163 -100 151 131 -233 29 35 131 -57 11 -64
3625f4P1j06J58j20j41N8L04q2M5m9j11j45J26N8j30J32K22k48m4J87k66J09j41
$$ -64 7 -99 59 -61 -202 -144 160 78 123 74 -37 -182 -56 2 -128 4 226 -22 -66 121 -145 -36 -177
3648a77N6J14J83k75J21k48L20j27m5J89j12J95j46j00Q6j31K8j1j88J66J44k05
$$ -177 -121 -7 176 -99 22 -226 94 -33 -78 111 -1 194 48 -52 34 -97 -69 -80 -268 -102 42 -163
3670a63o1K07L5k40K99kJ34n29J44J3R6M2L4j36J30K18k37J71j14K28k80o6J58
$$ -163 -224 -17 18 -222 77 75 209 -320 -176 -163 -67 -25 9 -127 3 221 -16 155 41 269 -11 -77 81
3693H1Qo1q4j83Q3P6L96k06k23R2J50j38j11j44K50Pn6K59m76J84L0j09r2L26
$$ 81 89 28 -56 -239 -156 -80 316 110 -113 -21 129 -9 -120 -264 -14 -7 -63 196 -280 -96 -66 -175 -267 59
3717E9j07j32mK20r0j00l8K12L18k43l2l7k25L98n0j46n3k19L81j38p3L34k05
$$ 59 -48 -180 -184 36 -54 -154 -192 20 338 95 63 26 -199 199 149 3 -50 -269 112 -26 -99 235 30
3740C0P2j32o0J90j27l09L05R0k20M81l91J76j21j8J67k79j84K78o1J42%r8L87
$$ 30 102 -30 -90 100 -27 -336 -31 59 -161 320 -71 105 -16 -34 133 -146 -330 -52 -113 29 29 -69 318
3763C18l59O2L6J44j51j45k03M02N5o6J36l09O6K13j33J3J8n4N8p0q3M54n13K6
$$ 318 -41 21 57 201 50 -95 -298 104 159 93 229 -80 -14 199 66 79 97 43 101 31 -52 402 -111 -85
3787h5M6k5l0l4J48k8Q3j58Q7L8J71l01O5n7K56k51J57J10k05N3r7j34L0j22K75
$$ -85 -39 -64 -94 -128 20 -8 75 -83 4 42 213 -88 -23 -80 176 -75 82 192 -13 40 -57 -191 -161 -283 -8
3812hK5j98L16k36P4R4P6j36K9R2r0qk0Ol5QN6q2J10J46j42j45m0kj7L50j18j29
$$ -8 17 -181 135 -101 -27 67 143 7 36 128 38 30 10 16 -19 -11 45 -37 73 219 77 -68 -108 -110 -127 223 105 -24
3840b4J04N3k26K15k42K95l96M57j10j15p5J56k9j63L27l81o8K81k55J9M22k34
$$ -24 80 133 -93 122 -120 175 -221 236 126 11 -64 92 63 -100 227 -154 -222 59 -196 -177 245 11
3862A1R0l5j35N6p3j48J24J88l06L14r1K2k98K66j6q4J70M6J44k17k17J52j12
$$ 11 101 66 -69 -13 -86 -234 -110 78 -228 86 -5 17 -281 -15 -31 -115 55 101 245 28 -189 -37 -149
3885a49p7L12j13p5L61q0n1m9j8j98QJ9J67J59l31L78j51m7kR6p3o5Q3j25q9M8
$$ -149 -226 86 -27 -102 259 179 128 79 61 -137 -129 -110 57 216 -115 263 112 65 63 159 86 21 104 -21 -110 -62
3911f2K48k84J77j70J16m9J0j87N83k48O5l43L13m32K70J40l37L45k15L40l21
$$ -62 186 -98 79 -91 25 -24 -14 -201 382 134 199 -144 169 -263 7 147 -190 155 -60 280 -41
3932d1l3K71n6o8o1L7L8j55J8L19k88K66K8m57K91k62k7N9K11k7r3J13l02J8K76
$$ -41 -74 197 141 73 12 49 87 -68 -50 269 -19 247 275 -182 109 -153 -180 -121 90 63 -30 83 -219 -201 75
3957G5k37k01K78K02P3M8r3k9k8j80J48j58K45Lj40%k18J29j23K38j44J10o3p5
$$ 75 -162 -363 -85 117 190 238 145 116 88 -92 56 -102 143 146 6 6 -212 -83 -206 32 -112 -2 -65 -140
3981a40J12j18K30j22j44L90q6k81N3j52M45m21K38J67j97J41J60j91j37J52m17
$$ -140 -28 -146 84 -38 -182 208 122 -159 -106 -258 187 -234 4 171 -26 115 275 84 -53 99 -318
4002c18M70%k83K51J8j66m44N77n4k03P9K59j16j76k7L19m55N08m05M38j16k46
$$ -318 152 152 -131 120 138 -28 -472 105 51 -152 -73 186 70 -106 -133 186 -269 239 -166 272 156 -90
4024i0M7n1K47l46K69j74J37N1k12Q6lK53l02K7J56j45j9n8J57n3L7p6j88N93
$$ -90 -43 -94 153 -193 76 -98 39 90 -122 -36 -39 214 -88 -61 95 -50 -69 -127 30 -23 14 -62 -250 343
4048C43n15k6J45L21m41k1K76l61M06l04J66J47k89j1M2J81n9Q8P1l55N15k71
$$ 343 -172 -198 -53 268 -173 -194 82 -279 127 -177 -11 136 -153 -164 -122 59 0 88 159 -196 319 48
4070D8K55m47J05M39p01J56N3r5N8K89Q0l16K15m68K70k2R7L6o4L2J2J16l70M37
$$ 48 303 -144 -39 400 -301 -145 -92 -187 -129 160 240 -76 139 -329 -59 -81 16 52 -12 20 32 148 -222 215
4094B15k51l5J44l09l1K00M2J90Mm35K41K06l19j5J88o6K13k76K78k04J26j06
$$ 215 -36 -71 73 -236 -267 -67 -25 165 169 -266 -25 181 -138 -153 35 -31 182 -94 184 -20 106 0
4116@J47J18k24l3L9N5k18M2K0J40l34J17K6P2P2J8p0J51r4j96K95k75J59j16
$$ 0 147 265 41 8 47 102 -116 -74 -54 86 -248 -131 -105 -33 39 57 -13 138 44 -152 143 -132 27 -89
4140h9J88j71j00K54J49j36k53M2J70l1j15p6k24L33j73J64j0L7j54R8M46m94
$$ -89 99 -72 -172 82 231 95 -158 -116 54 23 -92 -168 -392 -59 -232 -68 -78 -41 -195 -97 349 -145
4162a45j52M33j42k57M77k65J68k54K81Q5j46k56L48k77p3L02P3k73K72j00k58
$$ -145 -297 136 -6 -263 214 -51 117 -137 144 229 83 -173 175 -102 -175 127 200 -73 199 99 -159
4183a59n4J95J89m6q4k02M2N60l30N7k83J51n2k8k6p2j1RL25l17J95K19j06j23
$$ -159 -213 -18 171 125 41 -161 -119 441 111 168 -115 36 -16 -44 -70 -142 -153 -144 181 -136 59 278 172 49
4207D9j07l8J3K09J52j93k83L54n8o0N5o7J5r7Q9j53p0M42k25R8Q8n48J74J11
$$ 49 -58 -96 -83 126 278 85 -198 156 98 38 93 26 41 -56 33 -120 -190 252 27 125 213 -335 -161 -50
4231e0m7j17M05m87K75MN6J56k76K29l85K29J9k6m9J53j5l1N4K18m02L20m00O7
$$ -50 -97 -214 191 -296 -21 -17 39 195 -81 148 -237 -8 11 -15 -64 89 74 43 97 315 -87 233 -167 -100
4255a00j53m5J73K83k21K00j23p4j0j09M85l13k05N07j84k44M5p6K69j32p3Q6
$$ -100 -253 -298 -125 158 -63 137 14 -60 -70 -179 306 -7 -212 295 111 -133 -88 -164 105 -27 -100 -14
4277a4l5J29k35J24J87P4l09Q0J10M2k97K0PK87j12k92M8J21J22k8j09J82m48
$$ -14 -49 80 -155 -31 156 230 -79 1 111 153 -144 -124 -117 170 58 -234 -186 -65 57 29 -80 102 -346
4300c46J31L79k42L3J2K3j80K75j43J19K1j05J71r4k97K41J78l52J0J30J94k71
$$ -346 -215 164 -78 -45 -33 -10 -190 85 -58 61 82 -23 148 54 -243 -2 176 -176 -166 -36 158 -113
4322a13n6L50n18L31j58R4J18j83r8N8Q8J60J71k42j15l9O9l3m2K20k29J92K02
$$ -113 -169 181 -337 -6 -164 -70 48 -135 -233 -175 -87 73 244 2 -113 -152 -83 -116 -158 62 -167 25 227
4345B27k96J36r9r9m2j08J24J25J49l16J98j7R3k95K25o1K43k66P9l7R8K0j10
$$ 227 -69 67 -32 -131 -173 -281 -157 -32 117 -199 -1 -18 75 -220 5 -56 187 -79 0 -37 61 81 -29
4368b9m2j00J27J21K8rj41j52K01j39K76j43L5j35R5Q1j70j5l9J93j94J53k61
$$ -29 -71 -171 -44 77 105 96 -45 -197 4 -135 141 -2 33 -102 -7 74 -96 -111 -150 43 -151 2 -259
4391b59J24J68K25j95j4Q2j42l23L21o0Q1k9P9K02l60O2p2r0J55J93r4n1j63J93
$$ -259 -135 33 258 63 49 131 -11 -334 -13 -73 8 -21 58 260 -100 -38 -110 -200 -45 148 54 3 -160 33
4415C3r3o3k11K89O5J07k63K04l86N93j34k1j12K99j59j14j01J60j9j19J16r8
$$ 33 -60 -123 -334 -45 20 127 -136 68 -318 275 141 120 8 307 148 34 -67 93 74 -45 71 -27
4437b7L0ok7j11J12j19J14l5j41M01k79K96l03J61k96j2K84j53L61l73K48K5m59
$$ -27 3 -3 -30 -141 -29 -148 -34 -69 -210 191 -88 208 -95 66 -230 -242 42 -111 250 -123 125 150 -309
4460c09O12k46j07J43k22J55J14l30j9K37m1r0L20k86m9k78K98J57n6L66o57K00
$$ -309 303 57 -50 93 -129 26 140 -190 -209 28 -13 -103 217 -69 -118 -396 -98 59 3 369 -288 -88
4482h8O4m78J78O00l69lK12j51Q8m4q0K59k88r4J07K2J50K90j46l63j21M30n25
$$ -88 -24 -502 -324 276 -93 -96 116 -35 53 9 -71 188 -100 -194 -87 -65 85 375 229 -134 -255 175 -350
4505c50L6K79n5O1k6M38kl95J60j45l8j0p1R8n1J75j13k11K53r7J59q5Mk28J42
$$ -350 -314 -35 -90 -29 -55 383 381 -14 146 1 -37 -47 -118 -20 -71 104 -9 -220 33 -64 95 10 14 -214 -72
4530g2O6J5M7k18j0J87L6K37l56J56l3m72L47K10k5J26l13K79m38J08K37L0l90
$$ -72 -6 9 56 -162 -172 15 51 288 -68 88 55 -417 -70 140 115 241 -72 207 -231 -123 114 144 -246
4553b46O8k1OM4L37Mp5l20K76j88L23k71P8p5r6L91k29K14l47L3L19l70J41J28
$$ -246 -178 -199 -193 -149 188 192 117 -203 73 -115 208 -63 15 -60 -156 235 6 220 -127 -94 225 -145 -4 124
4577A24n3k75P7Q6P7k08O8l24M44N5k24R2j08J59j19J28MK17k95J37j4l1k24L41
$$ 124 71 -204 -127 -41 36 -172 -104 -428 16 71 -153 -61 -169 -10 -129 -1 3 220 -75 62 48 17 -207 134
4601A34j73j83q2J41K45R4j6j01m7Q2m6k8J78j86k2m1J02o2N2l30P54p10L91k8
$$ 134 -39 -222 -304 -163 82 176 160 59 12 94 48 20 198 12 -10 -51 51 -11 41 -289 465 -245 146 118
4625A18k12k21O20j97J32o42L55j2l09M08J06j69J23k76p5J76J19%j87K37J63
$$ 118 -94 -315 305 108 240 -402 -47 -59 -368 40 146 -23 100 -176 -251 -75 44 44 -143 94 257
4646B57n14J83l8O8J33r7n4J10q0j3q5J99k6o6j30K09j69k7J98J4N5Q6l52J44
$$ 257 -257 -74 -112 -44 89 -8 -62 48 -32 -45 -130 69 43 -23 -153 56 -113 -140 58 72 127 213 -139 5
4670EK06l23Q4J55k83L1J95J45k07m3L20L9k63j4m5J65k01j75oM4P7o4K29j30
$$ 5 211 -112 -28 127 -156 -125 70 215 8 -35 285 324 61 47 2 167 -34 -209 -215 -171 -94 -158 71 -59
4694e9N2Q8j37J75j35J42k15Lj08j37L28n6M07k73k3j2p8n6K40o5k21L9KK22q5
$$ -59 -7 81 -56 119 -16 126 -89 -86 -194 -331 -3 -59 348 75 52 40 -38 -94 146 81 -140 -101 -99 123 38
4719C8J21j87pJ16l8J04k03j43K5J20N9J29J1j17k58N3J22R9O6L4j97m8Qk16K93
$$ 38 159 -28 -35 81 43 147 -56 -199 -174 -54 5 134 145 28 -230 -177 -55 44 110 144 -53 -101 -93 -309 -16
4744a6j77K87K8k00O5J48r1J07OK25l59J82o3k97K51J40l42J61q3O0r9K27k45
$$ -16 -193 94 122 -78 -13 135 44 151 157 382 23 205 142 -155 96 236 -106 55 -28 32 -67 160 -85
4767h5J61M6r6O0k78M14j23J23k20l9nl3r5J04K02j74N8R7k93L24k03J38j75l82
$$ -85 76 122 26 86 -192 222 99 222 2 -37 -42 -75 -170 -66 136 -38 20 117 -176 148 -55 83 -92 -474
4791d74L53J76K2r6K86l77K23q1R2R6l28K97Pm27J25K35k40l2J81OL2K3p2K87
$$ -474 -121 55 77 -19 267 -110 113 32 124 220 -108 189 196 -231 -106 129 -111 -143 38 44 76 99 27 314
4815C14j89k77K21j02L12k47Rn5j75K58p2p8K50J80k92K0l03L09m25L46P2k10
$$ 314 125 -152 69 -33 279 32 41 -14 -189 69 -3 -81 169 349 57 77 -226 83 -342 4 76 -134
4837a34KJ14J05k85L20j36m4Q9k06L56k42j9K7R6J6p8O2r6O0j98K30K1J37k54
$$ -134 -132 -18 87 -198 122 -14 -58 31 -175 181 -61 -80 -53 43 59 -19 43 -53 7 -191 39 60 197 -57
4861e7J58j4k24K59k20J92o7ok56J57j28J38j20O3J55K51k16l27K30J81j69J31
$$ -57 101 87 -137 122 -98 94 27 21 -235 -78 -206 -68 -188 -125 30 281 65 -262 -32 149 -20 111
4883A11p6K5m9J19l93L86l3k99M02J58j89m7j48qJ23K25l76n2K43j08l2J35k07
$$ 111 35 60 11 130 -263 123 90 -209 193 351 162 115 -33 -41 82 307 -69 -121 122 14 -18 117 -90
4906i0J40r2J04n8k82L35k20J77j55K23j45J83mk76oK00J49k37K2J22k52M81l31
$$ -90 50 -42 62 4 -278 57 -163 14 -141 82 -63 120 116 -160 -166 34 183 -54 -32 90 -162 319 -12
4929a2J17j70L7N4J5k09l0o6J97jj9J22J3Q5q2Q4k58J11R6N1N7m05M78l09L8Q0
$$ -12 105 -65 -28 26 41 -168 -198 -264 -67 -68 -87 35 48 133 51 135 -123 -12 84 135 192 -213 265 -44 -6 74
4955G4M7k46p7J03J1J39o1kJ89O3j00k63L5L25l50p7J69k74L32K10j61k05K06
$$ 74 121 -125 -202 -99 -88 51 -10 -12 177 240 140 -123 -88 237 -113 -190 -21 -295 37 247 86 -119 87
4978H7K4m7l13R6O3j16K51j23J96j99J88j30L2R8P4k70K05j03k51J30J92l17K75
$$ 87 111 64 -249 -153 -90 -206 45 -78 118 -81 107 -23 9 107 181 -89 116 13 -238 -108 84 -233 42
5001D2q5K11k31J83m8k14J04k8J13j0m5L8J54l87J84K31N0k46k9q4L17k51K04
$$ 42 -43 168 -63 120 72 -142 -38 -66 47 37 -8 30 184 -203 -19 212 262 16 -13 -97 220 -31 173
5024A73j31K69k64J07Q2O7k83j0j50OL80k26p5J26o1j3j9J64m54K86n2j47L7K84
$$ 173 42 311 47 154 236 303 20 10 -140 -134 246 20 -55 71 10 -3 -22 142 -312 -26 -78 -225 -188 96
5048I6M3J05l51K7J9Q1KO6k6J10p9k79J22L5r0O7R5j04j46J23J5m2M56k25k69
$$ 96 139 244 -107 -80 -61 20 22 88 62 172 93 -186 -64 -29 -119 -52 43 -61 -207 -84 -69 -111 345 120 -149
5073a49L44m49K49rj48J94j07R3K08l32L00l27L20r3j59N1N56m49k73K38j70L22
$$ -149 195 -254 -5 -14 -162 32 -75 18 226 -106 194 -133 187 94 -65 -14 542 93 -180 58 -112 210
5095B10k15j58O1j56L82l03M63k96L6j60q8L32j46OJ17l5R6j78n2L15k64K57j63
$$ 210 -5 -163 -102 -258 124 -179 284 -12 24 -136 -224 108 -38 -32 85 50 146 -32 -84 231 -33 224 61
5118F1J3k10q9K84p2j52J9O5Q4k5Q4j06L3M5j72J0L59R1l11K63m14J76j39J68
$$ 61 74 -136 -225 59 -13 -165 -146 -81 3 -22 62 -44 -11 34 -138 -128 231 322 11 274 -140 36 -103 65
5142F5k02K68n8J87m09K30l39J15P6J6O3P7q8k66J70l3J07J1J71m60R8R3j5L45
$$ 65 -137 131 73 260 -149 81 -258 -143 -67 -51 12 89 1 -265 -95 -128 -21 -10 161 -299 -201 -108 -123 222
5166B22Ll47O6o1J66l2M1M0o8m3m9K2o8J1r6J88m7j3O1k4j24J81p2K67k26L2l04
$$ 222 225 -122 -56 -117 49 17 58 98 30 -13 -62 -40 -108 -97 -193 -5 -52 -65 -4 -28 -152 29 -43 224 -2 30 -274
5193b74K36o0K68J10k99q3K14n7r8M7o7N6O8k42J4K1J53j61K24J31k94j58J55
$$ -274 -38 -98 170 280 -19 -102 112 55 -43 4 -63 -7 61 -181 -167 -146 7 -154 70 201 -93 -251 -96
5216i6j01L4K1P6K45k21j10K6P3L25l80K01j96K77p0l57L27k12O8K77q4k8l89
$$ -96 -197 -163 -142 -66 179 -42 -152 -126 -53 272 -108 93 -103 174 104 -253 74 -138 -70 207 123 95 -294
5239b94K86K37k88p4L10k35M06k39n5M30m48j55L36l37L29l56J47J68j30k09J75
$$ -294 -8 229 -59 -133 177 -58 348 109 54 484 36 -119 217 -120 209 -147 0 168 38 -171 4
5260Dk5q9KQ8J24m6n3J8o3q4K0J52J03j06k13J6k1K69J72n38K58r3J16p0j20J23
$$ 4 -21 -110 -108 -20 104 58 5 23 -40 -124 -104 48 151 45 -168 -152 -173 96 268 -270 -12 -105 11 -59 -179 -56
5286e6J42j81n0J43l00J65J31K09m49K65k2j65K68k75L20j06m46P29l59JK68j52
$$ -56 86 -95 -145 -2 -302 -137 -6 203 -246 19 -3 -168 100 -175 145 39 -407 322 -37 -36 232 80
5308H0M0j41R8o4J65k65K69j41O4k25J02L09k39k8j0J28k33m8L78j82M0J32k16
$$ 80 120 -21 77 13 178 -87 182 41 105 -120 -18 291 52 24 14 142 -91 -139 239 57 97 229 13
5331A3Q4p1j34P9L3O5n5l7K85j13qj32l7N3K8k12k26L31q8J29o2K60j09j73J5
$$ 13 97 26 -108 -29 4 69 14 -23 262 149 141 9 -28 25 53 -159 -385 -54 -142 -13 -75 185 76 -97 -82
5356h2k14M82k34Q2kl7J47l26M19J10m38j60P3J85p3K19k54K97n25M99q8j78M
$$ -82 -296 186 -48 34 32 -5 142 -184 235 345 -93 -253 -180 5 -68 151 -103 194 -331 168 80 -98 -94
5379i4M1K2J29p3J11K0Kj48m6L4l0L19J0k63l09K10k80O16l46Q0k58M28j8K01
$$ -94 -53 -31 98 25 136 156 158 10 -36 -2 -32 287 297 34 -275 -65 -345 271 -75 5 -253 175 157 358
5403C58m53J26r2R5k66M32j26p9l2j46Ml3L22k66pj32M55j23J8P8q6J08j02J15
$$ 358 -95 31 -61 34 -232 200 74 -5 -37 -183 -179 -212 110 -156 -163 -295 160 37 55 133 47 155 53 168
5427A68l6m44N64m70L69p5K23l27N4k43J92Q8L3j02m1M20l93q4K17o9N7j34L84
$$ 168 132 -312 252 -218 151 76 299 -28 26 -217 -25 63 96 -6 -47 373 -20 -104 113 44 101 -33 351
5450C51k13J31r4K5k03k03L13K48k32j13R6m1M1j1l19L26J15qj35Q9L4k91J29
$$ 351 138 269 175 200 -3 -206 107 355 123 10 106 65 106 95 -224 102 217 209 74 163 197 -94 35
5473C5O8j42l4K10l1P3l13K67L4k69K06q7k98J71L15J2j63k23J48j3J72j22J42
$$ 35 103 -39 -73 137 106 179 -134 133 167 -102 104 17 -281 -110 205 217 54 -169 -21 -34 138 16 158
5496A58l45M76k40mr6J6K04l19k2N4K0J47K73o4m20K39q6j69L70k58K20n1Q9k21
$$ 158 -187 289 49 45 -51 -35 169 -150 -172 -118 -98 49 322 258 -162 77 -9 -178 192 -66 154 103 192 -29
5520b9q2J55k66J43j94M30l73J50l8P9K8Q4pj33J43p1J62j48j29K0O8J93k45Q6
$$ -29 -111 44 -222 -79 -273 157 -216 -66 -104 -25 3 87 80 -53 90 19 181 33 -96 -76 -8 185 -60 26
5544B6l26J07L27l58J70JRQ5J03J39l23o8K80K0j48pk76L90q9j15k68K97o6K17
$$ 26 -300 -193 134 -224 -54 -53 -44 41 144 283 -40 -108 172 192 44 37 -239 151 62 -53 -321 -24 -90 127
5568A27o2k16m9J73rJ06J04l7l1j29Oj09J43K2k7lj7k16L95j43M3k57J29j72J59
$$ 127 65 -151 -200 -27 -36 70 174 137 106 -23 -17 -126 17 39 12 9 -8 -224 171 28 71 -186 -57 -229 -70
5593g0O5m8j32K43Lp1oqq9K47mk83J15j68J44k0q7J14l8J46R8k95o5o1L98J43
$$ -70 -5 -53 -185 58 61 -10 -16 -24 -113 134 130 -153 -38 -206 -62 -82 -169 -55 -93 53 151 -144 -209 -270 128 271
5619B71l01N7l06M01j74J41Q9l20L38l90L52m04K29j6j01J30l22N34m70K64K05
$$ 271 -30 27 -279 122 -52 89 178 -142 196 -194 158 -246 -17 -33 -134 -4 -326 208 -262 2 207
5640B07k72J90R8j31j5j46J54Q7j71j23J80P9j99P4J01q2K20j28l15Q7N3j56N4
$$ 207 -65 125 223 92 77 -69 85 172 1 -122 58 137 -62 12 113 31 251 123 -192 -105 -52 -208 -154
5663a54K44k60J9J51nj83K20P3k32L45l13K16j79N5j17j8K09k88K77k45J58K33
$$ -154 90 -170 -151 0 -5 -188 32 105 -127 218 -95 121 -58 -3 -120 -138 71 -217 60 -185 -27 206
5685B06m88O96l46j36J95k10K2Rm3L1J83k05J17O0k90M87k25j90k09L19M2J55
$$ 206 -282 414 68 -68 127 -83 -61 -52 -95 -64 119 -86 31 91 -199 288 63 -127 -336 -17 25 180
5707A80l81L09L3l50Q0J71kk22jJ18J7j34J18J82k18l0M10k28q4P6m7L7J23J9
$$ 180 -201 108 141 -209 -129 42 40 -182 -183 -65 -48 -182 -64 118 -100 -130 280 52 -32 44 -3 34 157 176
5731A76k86k9m0J20r9K92k91lR1K55k40l4L15j82j66J89J72j69J86k99J0L0j59
$$ 176 -110 -139 -179 -59 -158 134 -157 -160 -69 186 -54 -88 227 45 -121 68 240 71 257 -42 -32 -2 -161
5754a61J81r0K56j17k12L52m82Q0M08l91K87r5j89L47k10K92L4m03L13P7j31j63
$$ -161 20 -70 186 69 -143 209 -273 -193 215 -176 111 16 -173 174 -36 256 290 -113 200 277 146 -17
5776a7j47M05k16P3k06R7k76K26J06q4q3K08j32q2N6J02r6J53J13qk90K80k09
$$ -17 -164 241 25 98 -108 -11 -287 -61 45 -39 -122 86 -46 -128 -72 30 -66 87 200 192 -98 182 -27
5799b7j00O8J59q2k20K58k09J34J09l21M24O5j79j17J15q0nM0o3j5J74J62J39
$$ -27 -127 -59 100 18 -202 56 -153 -19 90 -231 193 258 79 -38 77 -3 -8 32 -31 -46 128 290 429
5822D29l32L2k85O4K89j44l06L04j1j0J11k43R7J12l84O3q4N21J1p1k04M22o92
$$ 429 97 129 -156 -92 197 53 -253 51 40 30 141 -102 -5 107 -277 -214 -298 223 234 163 -41 381 -311
5845c11J26K32j49J11j32J31J6l75L03J56j55N7r0J39o7M2N9P1R2o2k16K72k07
$$ -311 -185 47 -102 9 -123 8 24 -351 -48 108 -47 10 -80 59 -8 34 93 164 256 194 -22 250 43
5868D3K0j11K06Lj76J39k92L57l20K03J14r5J10p4j91K75qk89L02l21K22j98k09
$$ 43 63 -48 158 161 -15 124 -168 189 -131 72 186 91 201 127 -64 211 203 -86 216 -105 117 -81 -290
5891b90N47k5l21J89k98jJ39%K15O6m13L22j95M0o0K34k54R9K9j99J76L07o11
$$ -290 257 232 -89 100 -198 -199 -60 -60 155 221 -192 130 -65 -25 -85 149 -105 -6 23 -176 0 307 -304
5914c04J72J59O1j01O3P6j17k12K99p5J9q1L15r5l26J36j2J12o5J62j39l00M85
$$ -304 -132 27 88 -13 50 126 9 -203 96 21 40 -41 274 179 -147 -11 -23 89 24 186 47 -253 232
5937B32l91R3L06j86q8K36m04K31l4j24J08j19j71K92j7Qj69M44o83L94Q3j44
$$ 232 -159 -66 240 54 -34 202 -202 29 -5 -129 -21 -140 -311 -19 -36 -28 -197 247 -436 -42 41 -103
5959a03Mj23K73j84L71n57J87K9L56j20j47l15M23k76R2Q0r8p8L61k66nL19l30
$$ -103 -99 -222 51 -133 238 -319 -132 -103 253 133 -14 -329 94 -182 -90 -10 -108 -186 175 -91 -96 223 -107
5982a07L2K8N5oj13P3J24J51j14l4L8j03J65m08Q4N5L56n56K91om8K6J6QL7k19
$$ -107 -75 -47 8 2 -111 -38 86 237 123 89 127 24 189 -219 -135 -80 276 -280 11 5 -43 -17 -1 7 44 -175
6008a75P2j76O8L00j4L8n4k25L59k23N0J60j18j92N9K13P1k77l3M44m04P7j36
$$ -175 -103 -279 -211 89 75 113 59 -166 193 -30 20 180 62 -130 -71 142 213 -64 -97 347 -57 20 -116
6031a16J55q3J12j37k9j01J91J88l49O3L8j7j7Q1j89M10k27k03J54L33m29M0K41
$$ -116 39 -44 68 -69 -98 -199 -8 180 -169 -106 -68 -85 -102 -21 -210 200 -27 -230 -76 257 -172 -132 109
6054A09j21N1j55M06m09N4J77m5j29J71k33K26J4J04l58j09L30j22P2p5K47j85
$$ 109 -12 39 -116 290 -119 -65 112 67 -62 109 -124 102 116 220 -138 -247 83 -39 33 -42 205 20
6076B0k63L95k44Q0J71lj32l04L60l27K73p4j6J91k26L10j08k02K75K9j23j30
$$ 20 -243 152 -92 -12 159 156 24 -280 80 -247 26 -48 -64 127 -99 211 103 -99 176 205 82 -48
6098d8J26j65R0J49j38l5j66K97j85J59k23K75j03l72K40M1j27K58K73k07o1l25
$$ -48 78 -87 3 152 14 -21 -187 110 -75 84 -139 136 33 -339 -99 -58 -185 73 346 139 78 -247
6120b47L18l10J62KK60l71L16k26K00j32K37k82j53K81k90K24J0Q3k84L71l37
$$ -247 71 -239 -77 -75 185 -186 130 -96 104 -28 209 -73 -226 55 -235 -11 -1 82 -202 169 -168
6141a68L08j75K69m46K2N0M78m81O2J0j52J48j61K52k66M4R7J26ll9k9l3J3L22
$$ -168 140 -35 234 -212 -190 -140 338 -143 -81 -71 -223 -75 -236 16 -250 -206 -109 17 14 -25 -54 -87 -74 248
6165B48l41O2Q7J26l52L66l12L62j04j54lk25J48J22J57m66L20r1l6j38K31jp0
$$ 248 -93 -31 56 182 -170 196 -116 246 142 -12 -15 -240 -92 30 187 -279 41 -50 -86 -224 7 6 -64
6188f4k09J79J06k7J65J05k72K04L9k45L6J77l24K50J08O3l05J6K81l86J93r4
$$ -64 -273 -94 12 -15 150 255 -17 187 226 -19 17 194 -130 120 228 291 -14 2 283 -103 90 -4
6210dOL14m07q9oK81k63N60k54k05L01l95L55l6m79N66M5n03L72j29Jj57M4j11
$$ -4 2 316 -91 -180 -186 95 -168 392 138 -67 234 -161 194 158 -321 245 290 -213 159 30 31 -126 -82 -193
6234a93L85j6l49M09j13l0k05J43K65k90j33P3r3J40J04l19R5J18J69k47J74J56
$$ -193 192 176 -173 236 123 93 -112 31 296 6 -127 -54 -147 -7 97 -222 -127 -9 160 -87 87 243
6256B43l48l0q0M96j69m22J66K88j21K07j26k94L66j59J59j81k13j46O16j60j75
$$ 243 -105 -135 -215 281 112 -310 -144 144 23 230 104 -190 176 17 176 -5 -218 -364 252 92 -83
6277h3O5J59Q7l19J33j55L75j58j75O5Q8j34J55j02P1J3J38k03K68M6m10K41j96
$$ -83 -18 141 228 -91 42 -113 262 104 -71 -6 82 -52 103 1 72 85 223 20 288 334 -76 165 -31
6300c1J3J55m31M84O5l87N3J8K5P7j09L00j8J04k23L2j46LL2k03J0M61k12P1j37
$$ -31 -18 137 -294 190 255 -132 -79 -61 -36 41 -68 232 214 318 95 127 -19 -16 16 -187 -177 284 72 143 6
6325Fj48K40j39r7J75m4j26l8K39j31J48q4K61k06j09L4K60m69j14M20N6k64j16
$$ 6 -142 98 -41 -138 37 -7 -133 -171 68 -63 85 1 262 56 -53 -19 241 -228 -342 78 134 -130 -246
6348b46r2J74L47j20p2j13J54p3j68J29J98l68L02N1k03L43k55J50m04K04K74
$$ -246 -338 -164 183 63 -9 -122 32 -41 -209 -80 118 -250 52 103 -100 243 -12 138 -266 -62 212
6369B12k45J56p6k21L37j21l28L40l8R6j87pK0J14j0l47K44j15K17k04j83L01
$$ 212 -33 123 47 -174 163 42 -286 54 16 112 -75 -82 -62 52 42 -305 -61 -176 41 -163 -346 -45
6391d5K02k65J02j91K18o8Q4N3l13L84k75L29k30m3N4J54j66m7O2k41M06k84L99
$$ -45 157 -108 -6 -197 21 -47 37 90 -223 161 -114 215 -15 -58 -4 150 -16 -63 -1 -242 164 -120 279
6414B79m22J14n6j02K27r3l41L51J40j04j57M60o53M67k67K8L34j94J00j40L11
$$ 279 -143 -29 -85 -187 40 -53 -394 -43 97 -7 -164 296 -357 110 -157 -129 205 11 111 -29 282
6435B82k69N2j77J96l48K53k19J68q6k82M85j25J20K59m41J44J62p7J41n20J86
$$ 282 13 65 -112 84 -264 -11 -230 -62 -148 -430 55 -70 50 309 -132 12 174 97 238 -282 -96
6456i6R5M8O8J4L1j93j54M63l69j39J00j73M06k41K96j49j42J43jj07q4M4K64
$$ -96 -1 47 115 129 160 -33 -187 276 -93 -232 -132 -305 101 -140 156 7 -135 8 7 -100 -184 -140 124
6479A24l3j63J58j93QJ44K2L0j87j36N04l04K14j60j67J95L7k1j4k83M08l22K55
$$ 124 91 -72 86 -107 -99 45 67 97 -90 -226 278 -26 188 28 -139 56 93 72 58 -225 183 -139 116
6502A16o6n5N9j25K35k39J09k38%K06J86o4m5j3M0j30Q5k99L32l29K4K57k74J66
$$ 116 50 -5 54 -71 164 -75 34 -204 -204 2 188 124 79 66 106 -24 61 -238 94 -235 -211 46 -228 -62
6526f2M2K16O9j93J31n54L86J55l16J07J22k04J4L27k25j68K8mK96q5QK8j37J68
$$ -62 -20 196 265 72 203 -351 35 190 -126 -19 103 -101 -87 240 15 -153 -125 -129 167 82 90 118 -19 149
6550A49m75M38kj63J77K39m99l4j41M15R6j44n6M4J18k29N3k60K34J23LJ0l64
$$ 149 -326 112 110 -53 124 363 -136 -170 -311 104 200 56 0 44 162 -67 -14 -274 -40 83 86 96 -268
6573b68J79p1qK95j14k35J23J17j04M4k75M18j98K49l58K84k64L85j85j26L31
$$ -268 -89 -160 -168 127 13 -222 -99 18 -86 -42 -317 101 -97 152 -206 78 -186 199 14 -112 219
6594B19k46L07m60J95Q0k41K34l55L78n25O54l65O2M0O7l9l6J2L54j76l79N60
$$ 219 -27 280 -180 15 95 -146 88 -267 111 -414 240 -125 -63 -23 44 5 -31 -19 335 159 -220 340
6616C40k49l08K14j01%K74J8l34L38j21m7O9o7J31l32K65l25L27P2l5j24P9p3
$$ 340 91 -217 -3 -104 -104 170 188 -146 192 71 24 93 26 157 -175 90 -235 92 164 129 5 84 11
6639A1l7J10j74n7j83L52K80q3j89L7m5pk80K74K6k7j19K5O5J53m35O72k41k46
$$ 11 -26 84 -90 -147 -330 22 302 219 30 67 22 15 -265 9 35 8 -111 -86 -21 132 -303 369 128 -118
6663a18K78j67K6n17K92L89j38l00M24k25P2m22L47J28k53K45N2O9J40k48j57
$$ -118 160 -7 19 -498 -206 183 45 -255 169 -56 16 -406 -59 69 -184 61 113 182 322 74 -83
6684h3J34k13J07O2J57n61M48n4j82J69L4Q8J03j25j37J47kl43q8L12l99L48K17
$$ -83 51 -162 -55 7 164 -397 51 -3 -185 -16 18 106 209 84 -53 94 92 -251 -339 -27 -426 -78 139
6707A39l0j87K08k04J5J38j06K07p6j43k46N88Q5O3l30j24n2L5J16j48J78j50
$$ 139 109 -78 130 -74 -59 79 -27 180 104 -39 -285 303 388 451 121 -3 -55 -20 96 -52 126 -24
6729b4j86r0K53j8j29J06J23j83J29J46j08j47Q1j7J65m6J55p0l58K6K71o0%j7
$$ -24 -210 -300 -47 -65 -194 -88 35 -148 -19 127 19 -128 -47 -64 101 55 210 140 -218 -192 79 19 19 2
6753BJ34j29J1N3l4k16J8L02j60K01m30L81K10n43K31j12J6J06o2O1j04l1J96
$$ 2 136 7 18 71 37 -179 -161 141 -19 182 -248 133 343 -200 31 -81 -65 41 -21 40 -64 -95 101
6776A01P6k43J04j56K53K7l67L72j24N0l1l20K23J37j56O3L4k01lK8J61J13j21
$$ 101 177 -66 38 -118 135 162 -205 167 43 93 62 -258 -35 102 -54 9 43 -158 -161 -133 28 141 20
6799B0j30M0k7J66j0m3J33j92K93k06J08j56J59R0n05J88m9J89R3j48m8L5j45
$$ 20 -110 -70 -97 69 59 16 149 -43 250 44 152 -4 155 245 -260 -72 -121 68 161 13 -35 0 -145
6822a45Jm5J17l64L31M9K46k01J5K13k22RJ69k83J43K22k28j08K52J22n23L33
$$ -145 -144 -189 -72 -436 -105 -56 190 -11 4 217 -5 4 173 -110 33 255 27 -81 171 293 -230 103
6844A03K8j18n84N82K9l5K9k31J70j92J6K23R6j25j1j61K32j0R5j36j4K75m5k71
$$ 103 131 13 -571 11 40 5 34 -197 -27 -219 -203 20 116 -9 -20 -181 51 41 136 0 -14 261 216 -55
6868e5L82m64K10j50p0N5n6P3o8K11jn9J77p6k71M6L13k25R9k8m4O5k00O4J56
$$ -55 327 -137 73 -77 -147 -92 -148 -75 -143 68 67 8 185 109 -162 -116 197 -28 71 43 -1 64 -136 -72 84
6893H4l08K88j65p5K11r5n8K02K40q8q6J5j72k90M22J5j62m1j07m2J87p4J32j51
$$ 84 -224 64 -101 -176 35 -60 -118 84 324 236 150 165 -7 -297 125 140 -22 -63 -170 -212 -25 -99 33 -118
6917a18P6k95L24J08k04oL20l75L31L8J71k66m3J82k23q1R4k11L22k82j88N46
$$ -118 -42 -337 -13 95 -109 -115 205 -170 161 199 370 104 61 243 20 -61 33 -178 144 -138 -326 220
6939B20m49pJ95J90j3n0k07J51J06r2M2k17J78m4j09K1j48N01m63K06J12j15k9
$$ 220 -229 -236 -41 149 136 86 -121 30 136 44 86 -131 47 3 -106 -85 -233 268 -195 11 123 8 -21
6962b1o8L80k52O3j74j15J75M5J0J7K34n38J39L82R1k53k47Rl1J21k67L53j80
$$ -21 -89 291 39 102 -72 -187 -12 33 43 60 294 -244 -105 277 368 115 -132 -123 -154 -33 -300 53 -127
6985a27N49k58k24nP3q4M6j89NJ95m99K12Q9K32R8k14Q7p6K4l7lK94j69J47J32
$$ -127 422 164 -60 -65 8 -76 -30 -219 -214 -19 -518 -306 -217 15 113 -101 -14 -90 -66 -103 -106 188 19 166 298
7010B98m14j03K82m4q1J39k39L63j00l10K82m01O2J59J8P5J96l51Q0J26ql26L70
$$ 298 -116 -219 63 19 -62 77 -162 201 101 -209 73 -328 -266 -107 -89 -14 182 -169 -89 37 29 -297 73
7033G3M4O4k48K58Q7j24l17l4L58j4p0j50K65Rj77L14m21L38l11J54M6K8R3j57
$$ 73 117 181 -67 191 278 154 -163 -197 161 147 77 -73 192 201 24 338 -83 255 -56 98 144 172 265 108
7057A08O1k45O7J34N8j21l20K88j72J75j20M1k31J85n4O6K28j78K79j27k2j34
$$ 108 169 -76 -9 125 183 62 -258 30 -142 33 -87 -46 -277 -92 -146 -80 148 -30 249 122 100 -34
7079c4k53M31l23o4J79q2j5R9J07j08k9j07L63l3j72Q1N7j20K15m91M06k68K04
$$ -34 -287 144 -179 -243 -64 -146 -161 -62 45 -63 -92 -199 164 131 -41 40 97 -23 192 -299 107 -161 43
7102D3J43l5k46K8j59j40L45j30K69K1l5P1j35Q2k33J27j01J51j5j47j19R6P7
$$ 43 186 151 -95 -67 -226 -366 -21 -151 118 139 104 175 40 122 -111 16 -85 66 51 -96 -215 -119 -42
7125d2j71J26o5L07M1k69K21o7j3K7K27k52k52L08N9j03j32P4Q7r1J04q7J73J82
$$ -42 -213 -87 -152 155 196 -73 148 81 68 95 322 70 -182 126 185 82 -50 24 111 20 124 37 210 392
7149C92k83M1j03K6J31k41K85k05L2k84K96J07j00j54K38k76P4j9j8L17l33K87
$$ 392 109 150 47 73 204 -37 248 43 75 -209 87 194 94 -60 178 -98 -24 -43 -61 256 -77 210
7171B10l06k02K60K0M16l96J68j2J32J03m58j94l3J93k09M4L24j08J44k5n9J20
$$ 210 -96 -298 -38 -18 398 2 170 158 290 393 -65 -259 -292 -99 -308 -264 60 -48 96 71 12 132
7193A32j70K4J50j36K54k05K58j67j34J82n8l22J36Kj45r6M11O9N2j19l8J16j89
$$ 132 -38 -14 136 0 254 49 307 140 6 188 130 -192 -56 -54 -199 -295 116 185 237 118 80 196 7
7216GJ87k1j43j79J13q9K23j89R3l8Nj36J31Mm1p9K4K69k24K87l10K75l28L0L29
$$ 7 194 173 30 -149 -36 -125 98 -91 2 -36 -31 -167 -36 -32 -73 -152 -128 141 -83 204 -106 169 -159 -129 200
7241B00l80K52r0j34J4O3j0J72l08M3J75k6J04j05j98J42P0j0J94j74J72k03J1
$$ 200 -180 72 -18 -152 -138 -75 -85 87 -221 -178 -3 -29 75 -30 -228 -86 -16 -26 168 -6 166 -37 -26
7264b6MML04k46J85k32j0k19K76LJ19O3l15Q0M2k85J39J96j22K77k61N3k77J84
$$ -26 -22 -18 286 40 225 -7 -17 -236 40 43 162 225 -90 -10 32 -253 -114 82 -40 237 -24 29 -248 -64
7288f4j75J65Q7J47j77J72nl51K09n5K72o5L3j11k18K71k74j10K25J00n6K9L11
$$ -64 -239 -74 13 160 -17 155 150 -201 8 -47 225 160 193 82 -136 135 -139 -249 -24 76 20 49 360
7311C60k24k50r6L71j10J9k2k86jK98O9r0Q6j09k2q6J61J69j37l81P6J40J4P5
$$ 360 136 -114 -210 161 51 70 48 -238 -239 59 128 38 124 15 -7 -93 68 237 100 -281 -205 -65 -51 24
7335B4j77L09J57l69K98m82K67Mq4j95L02N8l13J26J40l9j9K37Ll91K4NJ88P1
$$ 24 -153 156 313 -56 242 -240 27 31 -53 -248 54 112 -201 -75 65 26 7 244 247 -144 -120 -115 73 144
7359A44k7k5ql54M34k22J24j19J88R4l36J24l9J46l39J34J35j74K82j42R6K29
$$ 144 117 92 84 -270 164 -58 66 -53 135 229 -107 17 -22 124 -215 -81 54 -120 162 20 116 345
7381C45k83J6L0k27O0K08l28R2k35L02m2J96k95L30j13q8n4J28J29j46O9m2l33
$$ 345 62 78 108 -119 -59 149 -179 -87 -322 -20 -62 134 -161 169 56 -32 -86 42 171 25 94 52 -281
7404b81M62j52j88P4J43R1j71M8j23L26j59j60K70j44K06q0m07L59PK1M3k75K90
$$ -281 181 29 -159 -85 58 149 -22 26 -97 229 70 -90 180 36 242 162 -245 114 121 142 185 -90 200
7427B00j89J01k1P7l43or3P3K1K88j51q1K47k76L43k92J03K04j18j97nj96K20
$$ 200 11 112 91 168 -175 -181 -274 -201 -180 108 -43 -124 123 -153 190 -102 1 205 87 -110 -115 -311 -91
7450i1J24K5J0J17l76k3K87m4K4J7P5k83Q1J80j38r2J83j08j10j91K95J61k29
$$ -91 33 58 68 185 -191 -214 73 29 53 70 145 -138 -57 123 -15 -107 76 -32 -142 -333 -38 123 -106
7473a06J50k19L09L2l7j3j98J56N2k60J77j3j11K66k67k6M14n83L69L7k88j15
$$ -106 44 -175 134 166 129 116 -82 74 126 -134 43 30 -81 185 -82 -108 306 -277 92 129 -159 -274
7495b74K46J57q8P0m01K98m4K58k41j5K17m69M30j07k48K53j77K01p9j55M82j19
$$ -274 -28 129 41 111 -290 8 -36 222 -19 -34 183 -286 144 37 -211 42 -135 66 -13 -168 314 195
7517A95m34J17J66j5J4o1j17k8J25R7J38m87K73k5j88K21L18l64jk26L21p8J55
$$ 195 -239 -122 44 29 43 -18 -135 -163 -38 59 197 -290 -17 -42 -230 -9 309 -55 -56 -282 39 -39 116
7540A16m8N5k99K56P3j63N1Q1j54p6J24J60k60M0j49K61k5l3l03K60o6o8J73r0
$$ 116 68 123 -176 80 153 -10 41 122 -32 -108 16 176 -84 -44 -193 68 43 10 -293 -33 -99 -167 6 -84
7564h4K07K9k08k0K67p3j36L62l16j24J51l22M5J61o1M5j18J84j92P3J76j85M19
$$ -84 123 152 -56 -76 191 118 -18 344 28 -96 55 -267 -222 -61 -122 -77 -195 -11 -203 -130 46 -139 280
7587B80n37j22K75LJ23k40J35J74j14j9P4P3j7l7J12k71k9L4j07M64j62R0j30
$$ 280 -257 -379 -104 -101 22 -218 -83 91 -23 -42 32 105 88 51 163 -108 -137 -103 -210 254 92 182 52
7610E2L0K4k76L04Q6J9k50j22K60l73J82L1k96K94j19K01o7m2L57m15K80o2k35
$$ 52 82 106 -170 134 220 239 -11 -133 127 -246 -64 -33 -329 -35 -154 47 -20 -62 295 -120 160 98 -137
7633a37J93Q5k20K00k50M3J24k41L48k01k6K67j10k82K27j31K98j18rM5J73M1
$$ -137 56 141 -79 121 -129 -86 38 -203 145 -56 -82 185 75 -207 20 -111 187 69 60 105 278 319
7655C19m66J17j23K42j46J61j47mN7J35k11j14J10K75l24j87O06k43q3j05K8M3
$$ 319 -147 -30 -153 89 -57 104 -43 -47 10 145 -66 -180 -70 205 -119 -306 300 57 -26 -131 -103 -60
7677f0j4k3j48M17j77Q4j25P7m8J51k10K05M5k53K46k14O8M0j32J62J73n22L11
$$ -60 -74 -97 -245 172 -5 79 -46 31 -17 134 -76 129 174 -79 167 -47 21 61 -71 91 264 -258 53
7700E3K57n05J61J7J91m39N53k86q6K92l05J96R8k4Oq1J4k29K04L7n6Q6j39O6
$$ 53 310 -195 -34 -17 174 -265 288 2 -84 208 -97 99 197 173 179 98 112 -117 87 124 68 154 15 81
7724H1K8o9j00J78M7j77K73k57J48k49j75K80J72k98J65m5k7J01j64J68q0l08
$$ 81 109 40 -60 118 165 -12 261 4 152 -97 -272 8 180 -118 47 2 -25 76 -88 80 0 -308
7746c08L27O2j6l95M94k11q4J04j87M43k91j18L72k97N2k67M01J34l96J06m02
$$ -308 19 81 65 -330 164 -47 -131 -27 -214 229 -62 -180 192 -105 -53 -320 81 215 -181 -75 -477
7767d77M12R4J45j37k96J62k4J2Q8j51M39j16j05j19O0q1J71l37Q4J88oL5R7P7
$$ -477 -65 29 174 37 -259 -97 -121 -109 -21 -172 267 151 46 -73 -13 -94 77 -260 -176 12 6 41 138 215
7791B15k54P4k75K24k35K28L1N4l41L01J56n15M90P6j28j02l4k5j54P51n42q3
$$ 215 -39 35 -240 -16 -251 -23 8 62 -279 22 178 -337 153 229 101 -1 -35 -60 -214 537 -5 -88
7813h8J33O7L6%q9O6j51k62K05j21O2k8OJ1L30l40J91Ok7J33j93J22J39n06L72
$$ -88 45 112 148 148 59 125 -26 -288 -83 -204 -142 -170 -164 -153 177 -163 28 34 7 140 -53 69 208 -298 74
7838G4l7l32L34P8j70o3K65K4m31J39M11k43n4K27l88k5K70j23j8n3K2j95J80
$$ 74 37 -295 39 117 -53 -116 149 173 -258 -119 292 49 -5 222 -166 -191 79 -44 -62 -115 -93 -288 -108
7861a08K56k12P4J4M0j83L79p4kk40J18l20L33R3m27J48L43j88l73L96r8j11j1
$$ -108 148 -64 10 24 64 -119 260 186 184 -56 62 -258 75 168 -259 -111 232 44 -329 67 -31 -142 -153
7884a53K85P7Mk56J42n4K57m76J11j25J79j75M27k64R0j95J27J28j15k48K89j49
$$ -153 132 209 213 -43 99 45 302 -174 -63 -188 -9 -184 243 -21 69 -126 1 129 14 -234 55 -94
7906i4J54K47k15J9J06k15l02O36n43J65J35j29J83k04K52p6j17J89l94L08j13
$$ -94 60 307 92 111 217 2 -300 336 -207 -42 93 -36 147 -57 195 119 2 191 -203 105 -8
7927hJ31P3m11L09j5k65J4O7K44k12k9J84j37j51Q6J74j49K08R8k08K14j43M2
$$ -8 123 196 -215 94 79 -186 -172 -105 139 -73 -102 82 -55 -206 -120 54 -95 113 211 3 217 74 116
7950A16j51J33k35K57l82K56Q0k06J11m0J53j74J30j12j30K69k57J37K28j32l36
$$ 116 -35 98 -137 120 -262 -6 74 -132 -21 -61 92 -82 48 -64 -194 75 -182 -45 183 51 -285
7971b85M06K3j79m1J15mk55K78O0m04L00j36k3K24L4j43mj0k30J54M3r1Q7K42
$$ -285 121 144 -35 -76 39 35 -220 58 118 -286 14 -122 -145 79 113 -30 -34 -44 -274 -120 -77 -168 -81 161
7995A61l77J24k65K77J37j42O7J3K2J4l09L97j45j49J05J13j89K52J72l41k13
$$ 161 -216 -92 -357 -80 57 -85 -18 -5 17 31 -278 119 -26 -175 -70 43 -146 106 278 -63 -276
8016b76L74j62K21j03K53k43J4o3J83R7l19N5o2k8L4J30n9N2l89K79o4K7K79k11
$$ -276 98 -64 157 54 307 64 78 15 198 295 -24 31 -31 -59 -25 105 46 98 -291 -12 -76 -49 230 19
8040A9N2Ojj2p1J42k88L41k99K8K97k99J2M7J23L4j16n4k6j73K44J74K0k24j34
$$ 19 71 77 76 64 -7 135 -153 188 -111 -83 214 -85 -73 -26 97 131 15 -39 -65 -238 6 180 200 -24 -158
8065a58J53O9q4J2q6J59j49L87m47O1J57R2k92k1K16k22M7M2R2j07p6L2pL08R5
$$ -158 -5 64 -20 -8 -94 65 -84 303 -144 -83 74 166 -126 -147 69 -153 -106 -64 28 -79 -155 -123 -130 178 273
8090B73j93j57J72n2j33k0M0L20k12J83l78J56j86J10K59l01N1k3J62m9K44k97
$$ 273 80 -77 95 43 -90 -110 -70 250 38 221 -157 -1 -187 -77 182 -119 -68 -91 71 22 266 -31
8112c1J3M2o6J18l3m05N39l72j60L63m2j4J37o8j71k8j31K94k93K46K33k43J0
$$ -31 -18 24 -42 76 43 -362 177 -195 -355 8 -34 -48 89 21 -150 -178 -309 -15 -308 -62 171 -72 -62
8135f2K21k40k4J19n3j52J32j99K68Q7r9n8K55Pl92L78j92Q2j10r3J94K21l32
$$ -62 159 -81 -105 14 -39 -191 -59 -258 10 97 -2 -60 195 202 -190 188 -4 78 -32 -125 69 290 -42
8158d2j06J59q0J29n6j05K90k11l28K76J75J37j20l52M90k48K46j82k05L34m3
$$ -42 -148 11 -69 60 4 -101 189 -22 -350 -74 101 238 118 -234 256 8 254 72 -133 201 158
8179A58j15R4j65K9Op5M7j19L31r9q3L8
$$ 158 43 137 -28 1 7 -68 -21 -140 191 92 9 47
8191D7
$$ Imaginary data points
##PAGE= N=2
##DATA TABLE= (X++(I..I)), XYDATA
0@%%%%%%%%%%Qj6J6j6J6k4L2l2M0m8N6o7P5q8J04j20J36j52J72j96K21k49K80
$$ 0 0 0 0 0 0 0 0 0 0 0 8 -8 8 -8 8 -16 16 -16 24 -24 32 -35 40 -48 56 -64 72 -80 92 -104 117 -132 148
33A48l12L50l90M32m83N37n96O60p28Q04q92R90j097J217j355J512j691J904k156
$$ 148 -164 186 -204 228 -255 282 -314 346 -382 422 -470 520 -577 640 -715 797 -894 1010 -1146
52a146K462k842L329l983M909o329Q813j4452N2811o16n8322J2273j5233O710
$$ -1146 1316 -1526 1803 -2180 2729 -3600 5213 -9239 43572 42956 -15366 -3093 -18326 -11616
66a1616j2619n12K4046K0595l782j8876M14K6528j1502j5649j6225j06K6810o526
$$ -11616 -24235 -24747 -701 19894 16112 -2764 -2350 24178 12676 -2973 -19198 -19304 7506 980
80I80j2516J5893O299P213j8959k0497J7897J1386k979j2666n595K2533M542p923
$$ 980 -11536 4357 10656 17869 -1090 -21587 -3690 7696 4717 -7949 -13544 8989 13531 5608
94E608n511r25J4651j5607k5780Q636J3003K0279O34j6844J2056M806j2951j3578
$$ 5608 97 -828 13823 -1784 -27564 -18928 -5925 14354 14988 -1856 10200 15006 2055 -11523
108a1523p661J9175P888j1155m904J655K0182j311j9863M703M315N949l080j8844
$$ -11523 -19184 -9 7879 -3276 -8180 -6525 13657 12346 -7517 -2814 1501 7450 4370 -14474
122a4474J2565J2944q128r046r085J4117J2664r703m520l25J1751o09j8822M535
$$ -14474 -1909 11035 2907 -6139 -15224 -1107 11557 1854 -2666 -2991 8760 8151 -10671 -6136
136f136Q919N914j676k0623N170J3445m302k047m880R712J1265j3031p519qR505
$$ -6136 2783 8697 7021 -13602 -8432 5013 711 -1336 -6216 3496 14761 1730 -5789 -5797 3708
151C708M359j5979j026Q117N295K208j4406L623J3935n887m603o127M921J2684
$$ 3708 8067 -7912 -8938 -821 4474 6682 -7724 -4101 9834 3947 -656 -6783 -1862 10822
165A0822r912r252J181P146P591r793j650Q774J755r65j4449j422J4580j597k875
$$ 10822 910 -8342 -7161 -15 7576 -2217 -3867 4907 6662 5697 -8752 -10174 4406 2809 -66
180f6l592K199J2601p520r804J757L871N206r168m377J0067N797J971j0199m345
$$ -66 -3658 -1459 11142 3622 -6182 -4425 -554 4652 -4516 -8893 1174 6971 8942 -1257 -5602
195e602J1170l445o034l120N43J3112k912q492M247M589N312p721r610N683K828
$$ -5602 5568 2123 -3911 -7031 -6488 6624 3712 -4780 -533 4056 9368 1647 -7963 -2280 548
210E48N34n589k322J3255Q80o166l162k017R444k271j0118K413L530N585k140
$$ 548 1082 -4507 -6829 6426 7306 1140 -2022 -4039 5405 3134 -6984 -4571 -1041 4544 2404
225B404p729P064M320k334o148n930R196L129n174r04j350Q759J44j0332K077
$$ 2404 -5325 1739 6059 3725 -2423 -8353 843 3972 -1202 -2106 -3456 5303 5447 -4885 -2808
240b808L389L712j977q862N237N925j396m260n835O537L785n253o03O07P654J891
$$ -2808 581 4293 2316 -6546 -1309 4616 3220 -1040 -6875 -338 3447 -1806 -2409 -1802 5852 7743
256G743j0605j100K621K213L94p658L631P080j129k440m677N221N200o640l169
$$ 7743 -2862 -3962 -1341 872 1266 -6392 -2761 4319 3190 750 -3927 1294 6494 -146 -3315
271c315j119M932L644p320j49M834J976M86q412R76P014k678k397l812M025P738
$$ -3315 -4434 498 4142 -3178 -3327 1507 3483 3969 -4443 -3467 3547 869 -1528 -5340 -1315 6423
287F423l362l193r86J933K049q641j561O058L562L312n360j020N899k922l358
$$ 6423 3061 -132 -1118 815 2864 -5777 -7338 -1280 2282 5594 234 -786 5113 2191 -1167
302a167l955J415O605l258l302J739L294M768n333l599M206O92L44n324k062O699
$$ -1167 -5122 -3707 2898 -360 -3662 -1923 1371 6139 806 -2793 1413 2105 2449 -2875 -4937 1762
318A762n70k522j792J410P623k147n393j32R86L525l305l648N223J830j18m917
$$ 1762 1192 -1330 -3122 -1712 5911 3764 -1629 -1761 -775 2750 -555 -4203 1020 2850 2732 -2185
334b185l673O100J429j774o44LO314j745n856j7R17K884k414m394M073L368L23
$$ -2185 -5858 242 1671 -103 -747 -744 5570 3825 -2031 -2048 -1131 1753 -661 -5055 -982 2386 2709
351B709k106l870M980R09l199q99k56M472m70n208N26J625K837l07m211K561J839
$$ 2709 603 -3267 1713 2622 -577 -1476 -1732 2740 2270 -2938 -2412 -787 2050 1743 -2468 93 1932
368A932r09j695k650M267K758k562j889j286K506O37m548Q00K265K818P75m222
$$ 1932 1023 -672 -3322 945 3703 1141 -748 -2034 472 1109 -3439 -2639 -374 2444 3219 -1003
384a003J800K449j982k226l832K674L692k084l11M72K310J446m225q93K110J342
$$ -1003 797 3246 1264 -962 -4794 -2120 1572 -512 -823 -351 1959 3405 -820 -1713 397 1739
400A739km502M35K929n22K13j847J702L685k696k427k71J226K526l114j122K457
$$ 1739 1737 -2765 -2330 599 77 290 -1557 145 3830 1134 -1293 -1564 -338 2188 -926 -2048 409
417D09R61O83l659p52L532o61p89j239J050M192k228j929n04K63J825k379j195
$$ 409 1370 2053 -1606 -2358 1174 513 -276 -1515 -465 3727 1499 -430 -934 -671 1154 -1225 -2420
434b420K673O80Q87k789j063L339j35p48j145j37L048k098j925M32R85K234j867
$$ -2420 253 933 1820 -969 -2032 1307 1172 424 -721 -858 2190 92 -1833 -1401 -416 1818 -49
451d9k135K401J166J76k256j133K986k85j046j025l74K927p90k347N14J150K169
$$ -49 -2184 217 1383 1559 -697 -1830 1156 871 -175 -1200 -1574 1353 563 -1784 -1270 -120 2049
468B049q65k349J776K77l54j414j995L246R85j482o31o49L016J81k666M63K27
$$ 2049 1184 -1165 611 888 534 -880 -2875 371 1356 -126 -757 -1406 1610 1791 -875 -412 -185
485a85J178p65k770J795J520j2p61j541K105J251j362q76q56J623L42k044M12
$$ -185 993 228 -2542 -747 773 761 0 -1541 564 1815 453 -423 -1279 344 686 -1358 -946
502i46J279J314N9k655P10R87o93q22j653J949J812j163l29k04J872L41k659l05
$$ -946 333 1647 1706 -949 -239 748 55 -767 -2420 -471 1341 178 -151 -355 1517 1858 -801 -1106
520a106K77O54O67k123J438J784Q9p46j835N09J214j376j025J72J579J320j670
$$ -1106 -829 -175 492 -1631 -193 1591 1680 934 -901 -392 822 -554 -1579 -1407 172 1492 -178
537a78rJ175L09k84k718m46K131o0o3o37R14K209q09j866L2K78P59k125m58J314
$$ -178 -187 988 1297 1013 -1705 -2151 -20 -80 -143 -780 134 2343 1534 -332 -300 -22 737 -1388 -1846 -532
557e32J353P14j276m43J418r37p24j272K43K410n34p96K68L69J166j332j456J138
$$ -532 821 1535 259 -184 1234 297 -427 -1699 -1456 954 420 -376 -108 261 1427 95 -1361 -223
575b23K84L15q19l05K045L9j285r24m65J728l97r37L55O04J569q62j423J152L06
$$ -223 61 376 -443 -748 1297 1336 51 -873 -1338 390 -7 -944 -589 15 1584 722 -701 451 757
594G57k33j020j256J633O09k45l05l7J712m68k066l7L44J090m27j205J308P07
$$ 757 524 -496 -1752 -119 490 245 -60 -97 1615 1147 -919 -956 -612 478 51 -1154 154 861
612H61op33r36P30N35p77m11M9J870J90j968J07l5J097l37j115J44J262L45o69
$$ 861 855 122 -814 -84 451 -326 -737 -688 1182 1372 -596 -489 -524 573 236 -879 -735 527 872 203
632B03r10Q22J257r99n84p4M80L31j814M94M54J044M60j745J55J499r23j51r01
$$ 203 -707 115 1372 373 -211 -285 195 526 -1288 -794 -340 704 1164 -581 -426 1073 150 -1 -902
651i02O59J073j101k65J95J65R92j331Q6P44N45K63j393l26R67o30j14n00N25
$$ -902 -243 830 -271 -536 -341 -176 816 -515 -429 315 860 1123 -270 -596 371 -259 -373 -873 -348
670c48J743m63r72m63N06N89j029m23J111L08K98j115n47J279l06m66p26Q0J720
$$ -348 1395 932 -40 -503 3 592 -437 -860 251 559 857 -258 -805 474 168 -298 -1024 -944 776
689G76k21o29K71mO29n21j261Q21L04J19q31p93J291L56J7k69O4P42k95j330j82
$$ 776 555 -74 197 193 822 301 -960 -139 165 284 -547 -1340 -49 307 324 55 119 861 566 -764 -946
710i46J86J282l94o18L41O64J50o56m34M92N01n48j97k58P23J31j300L09N9J024
$$ -946 -760 522 128 -490 -149 515 665 9 -425 67 568 20 -177 -435 288 419 -881 -572 -513 511
730E11k04o47Q05O1R8j047m81O66O34j66n06L23K73K70j137L51L37O0R6j091M79
$$ 511 307 -340 465 526 624 -423 -904 -238 396 230 -276 47 320 590 -547 -196 141 201 297 -794 -315
751c15M70L53o1r30N70N60p30m77j11O84K69n72L10M16K26k58r05o8P05j41Q3
$$ -315 155 508 447 -483 87 647 -83 -560 -671 13 282 -290 20 436 662 404 -501 -569 136 -5 78
772G8q86P10P45l85k03m03L54L45o15j32K67J44P43j008N5P96k35m10k65J22O82
$$ 78 -808 -98 647 262 59 -344 10 355 -260 -392 -125 19 762 -246 -191 605 370 -40 -305 -183 499
793D99k37m56J15J65N41q64k73O19K26J91r74R4R03j51l12m51L3P21m16j75j58
$$ 499 262 -194 -79 86 627 -237 -510 109 335 526 -448 -354 549 398 86 -365 -332 389 -27 -202 -360
814c60O69L06n39l46O72j30l07Pp04Q63L51m14l1l1N74k15n61k18K62L07l10o2
$$ -360 309 615 76 -270 402 272 -35 -28 -732 131 482 68 37 6 580 365 -196 -414 -152 155 -155 -217
836b17K26O26p5o74k12M52j2j30j55k70O32J09l24J5m6N86m29o47P4N96j64N8
$$ -217 9 635 560 -114 -326 126 114 -16 -171 -441 191 300 -24 -9 -55 531 102 -545 -471 125 -39 19
858A9m14O97K4j25m46l41M41N27r72O91j99L69J41o69j2M35k28J76o97N58L22
$$ 19 -395 302 326 201 -245 -586 -145 382 -590 101 -98 271 412 -257 -269 166 -62 114 -583 -25 297
879B97k37j48q3N12K60n86MM4K11m1m29p0K00K45m6n39N01L46j49k35Po8L43o01
$$ 297 60 -88 -171 341 601 15 19 63 274 233 -196 -266 -66 179 133 -406 95 441 292 57 64 -4 339 -262
903b62j36J20M04J71o56K11L03o8k4l10J18K91K28l51j98K68J60m44r7J60J38
$$ -262 -398 -278 126 297 -359 -148 155 87 63 -247 -129 162 390 39 -159 109 269 -175 -272 -112 26
924B6J27j47l31O33j7l76k64j83N60M09o37j16K10M83m28m06M57J25L55n34k41
$$ 26 153 6 -325 308 291 -85 -349 -532 28 437 -200 -316 -106 377 -51 -457 0 125 480 -54 -295
945b95M15M58o53k63J14L89O8j83m7J19K93l89L3j29K32j18o2l84K10N8J42q2
$$ -295 120 578 -75 -338 -224 165 233 50 3 122 415 26 59 -70 162 44 -18 -402 -192 -134 8 -74
967g4k90P95J10m42k57l2J14O1m77L97L09j15k38j08O09L9m10L34p04L43P6J18
$$ -74 -364 431 541 99 -158 -190 -76 -15 -492 -95 214 99 -139 -247 362 401 -9 325 -379 -36 40 158
989A58j33k64M92j03j65K14p1Lk04k19J6O70m72O6j32R4L08m58q7J32L79q5j16
$$ 158 25 -239 253 150 -15 199 128 131 -73 -292 -276 394 -78 -12 -144 -50 258 -200 -287 -155 224 139 23
1012B3J04J61j21j52k85K24L50k02l4m93L94M62n33k0J95K0J06j12l84K15j05
$$ 23 127 288 167 15 -270 -46 304 102 68 -425 -31 431 -102 -122 73 93 199 87 -297 -82 -187
1033a87J2n9J48K95m04L75l41K44O7j52p2MJ83J59l48l00M39L07p0m52J74J06
$$ -187 -175 -234 -86 209 -195 180 -161 83 150 -2 -74 -70 113 272 -76 -376 63 370 300 -152 22 128
1055A28J22%k79o8L56o31J91J05K12L01j72o01O55n6m47l23M34K45k93L3j24j76
$$ 128 250 250 -29 -97 259 -372 -181 -76 136 437 265 -336 319 263 -184 -507 -73 172 -121 -88 -212 -388
1077c88M16q6j81L9P9K15p5k53N25j98j95o0L33J79m22J31M7j34L37j71k94K30
$$ -388 28 -58 -239 -200 -121 94 19 -234 291 93 -102 -162 171 350 -72 59 106 -28 309 138 -156 74
1099G4Q8j2O2j42j35K89l06j70K86j12K24k35M06k72J02q1m51K34R3j20K66l21
$$ 74 162 150 212 70 -65 224 -82 -252 34 -78 146 -89 317 45 147 66 -385 -151 -58 -178 88 -233
1121b33M52j40k73K91o4J2p8r6J81j6o6J48j04n7j18K70j18K71n78M22j97K4p3
$$ -233 219 79 -194 97 33 45 -33 -129 52 36 -30 118 14 -43 -161 109 -9 262 -316 106 -91 -67 -140
1144a40P9K88j96K11l93L77j79j25j97L90l39J94p7r4O46l25q5j32J71K35m31
$$ -140 -61 227 31 242 -151 226 47 -78 -275 115 -224 -30 -107 -201 445 120 35 -97 74 309 -122
1165a22o4m6N62k77N0Lk08qQ0n2J34K12n09J82Q7nj07j34k6N7K06R1P9k39J06
$$ -122 -186 -232 330 53 103 106 -102 -110 -30 -82 52 264 -245 -63 24 19 -88 -222 -248 -191 15 106 185 -54 52
1190E2j4l03J60J31j2m8n3J72m12N21Rq2k14k4K94q8k6j6p3j6J81k69J53r9j12
$$ 52 38 -265 -105 26 14 -34 -87 85 -327 194 203 121 -93 -117 177 89 63 47 -26 -42 139 -130 23 -76 -188
1215a88j48J95L76j16j45K8nJ01K23n90O2J75O4p8L34r8j26j22K23k70K78J75
$$ -188 -336 -141 235 119 -26 2 -3 98 321 -269 -207 -32 32 -46 288 190 64 -58 165 -105 173 348
1237C48o33J60M4J72r9k08M04K37m77m5L11k19Q6m5j65R0J62j3p5q8J13j27k66
$$ 348 -285 -125 -81 91 -8 -216 188 425 -52 -97 214 -5 81 36 -129 -39 123 110 35 -53 60 -67 -333
1260c33L19k39L15k19K68m03M19j0j87j9p3M13l38J80k88L83k53J61j75J04k4
$$ -333 -14 -253 62 -157 111 -292 127 117 -70 -89 -162 251 -87 93 -195 188 -65 96 -79 25 1
1281Aj35L16l55k2L25j04k26P9P2L73j61m18P7K08j00m1k05L56K71n04L09j74
$$ 1 -134 182 -173 -195 130 26 -200 -121 -49 324 163 -255 -178 30 -70 -111 -316 40 311 -193 116 -58
1303e8K29j27O0l3Q9r7J53n00L06K52k84R2l42R6O4K85k96M3K86l57J31J56p3
$$ -58 171 44 104 71 160 63 216 -284 22 274 -10 82 -260 -164 -100 185 -111 -68 218 -139 -8 148 75
1326G5M0n15J44K58pp8K26j12J39K9j05q9j45L53j73opJ40j21O1l5q2J98k10K76
$$ 75 115 -400 -256 2 -5 -83 143 31 170 199 94 5 -140 213 40 34 27 167 46 107 72 -10 188 -22 254
1351B54m38M56k97R8p4p5L79k27l3K28k91J56k20p3o4M39K5l56L42k48J14k03
$$ 254 -184 272 -25 73 -1 -76 303 76 43 271 -20 136 -84 -157 -221 218 243 -113 229 -19 95 -108
1373a08O8QK50k01m8Nj03J66n9k44P4J92k3N0M1K22q5l94qQL33J19k31p8l0K14
$$ -108 -40 -32 218 17 -31 -26 -129 37 -22 -266 -192 0 -23 27 68 290 205 -189 -197 -189 144 263 32 -46 -76 138
1399A38P4j12k17M02l51L6j75O1M31m96J44k84K58K60m30M09n11K56M56m02K15
$$ 138 212 100 -117 285 -66 -30 -205 -144 287 -209 -65 -349 -91 169 -261 148 -363 -107 349 -53 162
1420A62j74rJ1k33M8K31M5Q2j59j97R0j41J63P8j33J81j57K0J74k9J36j35R6J3
$$ 162 -12 -21 -10 -243 -195 36 81 163 4 -193 -103 -244 -81 -3 -136 45 -112 -92 82 53 189 54 150 163
1444A63O9j01j19J11J73k30P3Q7l98L45l55J16J52k39j54L79j58Q1K65l93n2L9
$$ 163 232 131 12 123 296 66 139 226 -172 173 -182 -66 86 -153 -307 72 -86 -5 260 -133 -185 -146
1466a46K79J00l83J13J54j77o4L93k27Mm7m18M06j32K38l70R0J08K59n1n01L81
$$ -146 133 233 -150 -37 117 -60 -124 269 42 46 -1 -419 -13 -145 93 -277 -187 -79 180 129 -372 9
1488IM4q0M26o02L59M1q9p9J91m22n6K13l8K46J61m65j13L13J46j8l48J70j13
$$ 9 53 -27 399 -203 156 197 108 29 220 -202 -258 -45 -83 163 324 -141 -254 59 205 187 -161 9 -104
1511a04K54k82J53j25J60j27l2J9l2J23J09r1j12L31l80M3M1k32P5N7L09j26J0
$$ -104 150 -132 21 -104 56 -71 -103 -84 -116 7 116 25 -87 244 -136 -93 -52 -284 -209 -152 157 31 41
1534D1j26j95J78L44l46j28N54k83L16l84N2lq1jq9J21m3M64k78L8l20N78o74
$$ 41 -85 -280 -102 242 -104 -232 322 39 355 -29 23 20 -61 -62 -151 -30 -73 391 113 151 -169 409 -265
1557b65M14l68K21J6j0P1k93J05j19m3J23O6j8k35N19l81j13M67m42O67k26m50
$$ -265 149 -219 2 18 8 79 -214 -109 -228 -271 -148 -82 -100 -335 184 -197 -310 157 -285 382 156 -294
1579b94M83k76K97n46O06k05j80K50M0j75r3m5J43k90K46M5K2j2p4j83J92J63
$$ -294 189 -87 210 -336 270 65 -115 135 175 0 -93 -138 5 -285 -39 6 28 16 -58 -241 -49 114
1601A14k69K38j78M38n11L26k23k49K07J16q3R3r6pK67l05J21N4Nk5j15J8j05
$$ 114 -155 83 -95 343 -168 158 -65 -314 -107 9 -74 19 -77 -84 183 -122 -1 53 58 33 -82 -64 -169
1624a69J60J99k16Q3r9mP0r1o1K49j60Q5l7j6R2Q4k25j86R2K21n0j42L30l48N6
$$ -169 -9 190 -26 57 -42 -46 24 -67 -128 121 -39 46 9 -7 85 169 -56 -242 -150 71 21 -121 209 -139 -83
1649h3J38q3J7j69K87j0K38j71k19k42K94j50K14J31J3o7k69K59l37J47J65n0
$$ -83 55 -28 -11 -180 107 97 335 164 -55 -297 -3 -153 61 192 205 138 -131 128 -209 -62 103 53
1671E3R3k92L82k65J55j20pJ16J6J17k58L1K27l44o1k41J71J99J71k61j07K21
$$ 53 146 -146 236 -29 126 6 -1 115 131 248 -10 21 248 -96 -157 -398 -227 -28 143 -118 -225 -4
1693dj03N3J80j87O3m8J03q5J57j56J73k14O0K5L9k26J77r3P1j29M0O9j05o9J80
$$ -4 -107 -54 126 -61 2 -46 57 -28 129 -27 146 -68 -8 17 56 -170 7 -86 -15 -144 -104 -35 -140 -209 -29
1718b9L23l01J51r1P2k33M6J0J24l48L38J16k92J6k4M01l99Q2M8J82r3l48J45
$$ -29 294 -7 144 53 125 -108 -62 -52 72 -276 62 178 -114 -98 -122 279 -120 -38 10 192 99 -249 -104
1741a04k34M09l02L54k92J28P5J67n9q7j9L36m68K65k3l09L61m58K65L03k74K46
$$ -104 -338 71 -231 123 -169 -41 34 201 142 55 36 372 -96 169 146 -163 198 -260 5 308 34 280
1763B80j83j02mj61J23Q2k40J72K56n27M25k52lK29l43J98J89l2j88N9l8J97q2
$$ 280 97 -5 -9 -170 -47 35 -205 -33 223 -304 121 -131 -134 95 -248 -50 139 107 -81 -22 -60 137 55
1786E5r7K02j86j35K8j63M59k43K62q2j27J49K2k47m9j9j6K45nN2j6K43k52L2
$$ 55 -42 160 -26 -161 -133 -296 163 -80 182 100 -27 122 144 -103 -152 -171 -187 58 53 105 89 332 80 112
1810A12j86J79k17J40k23L49j71K5q1K97L8l54J14l9J30j5j37K7jL4k3J99j84
$$ 112 -74 105 -112 28 -195 154 -17 8 -73 224 262 -92 22 -17 113 98 -39 -12 -13 21 -2 197 13
1833A3j58K10p3J98k74J47r8j24J92j27K93j39P5j27L6K09p6m3k43J26J08M9j73
$$ 13 -145 65 -8 190 -84 63 -35 -159 33 -94 199 60 135 8 44 253 177 134 -109 17 125 174 1
1856Aj80L45q2q3P2J47l14k41L96n5n9o0k3L44j02P5r6q2l1m19O64k71K21k81
$$ 1 -179 166 84 1 73 220 -94 -335 61 6 -53 -113 -136 208 106 181 85 3 -28 -447 217 -54 167 -114
1880a14j5L0J06O6K4k91QL50j17m9p6J62K2q9Rn0Q3M9j07K8j32p6K45M0J28l04
$$ -114 -129 -99 7 73 97 -194 -186 164 47 -2 -78 84 106 17 26 -24 59 108 1 29 -103 -179 66 106 234 -70
1906g0o6M4j1l1j15K96o9J0lm1K5q2l0J50j30K43k87J12L55j50K08j79M1l81L7
$$ -70 -136 -92 -103 -134 -249 47 -22 -12 -15 -56 -31 -113 -143 7 -123 120 -167 -55 300 150 358 179 220 -161 -124
1931a24J36Q2k26L32j67l10K82k96K81j79N90n54J34Q8n4P4k20Lo8J44j47p1J10
$$ -124 12 94 -132 200 33 -277 5 -291 -10 -189 401 -153 -19 69 15 89 -131 -128 -196 -52 -199 -270 -160
1954a60K68j31j68L14o6k2K0o1j28L01l02L79n44M19l41J71RJ16K78l70n0j23
$$ -160 108 -23 -191 123 57 35 55 -6 -134 167 -135 244 -300 119 -222 -51 -42 74 352 -18 -68 -191
1976a91J37k43M64m74L39j32J38K2l54J74K70J09m63N0m4K61l1j76L4L67j05q7
$$ -191 -54 -297 167 -307 32 -100 38 60 -294 -120 150 259 -204 -154 -198 63 32 -144 -110 257 152 65
1998F5n4R2m1L3k50K44J87j09k44K34k83K19k91J43Qj50N0L23j74j11J43k93L31
$$ 65 11 103 62 95 -155 89 276 167 -77 157 -126 93 -198 -55 -47 -197 -147 176 2 -109 34 -259 72
2021G2R2j9j08n4j92oJ41J57P4J44K1l39k7j7L11k12K81k56p5k2N6n0L2o4K3k0
$$ 72 164 145 37 -17 -209 -215 -74 83 157 301 322 -17 -44 -61 250 38 319 63 -12 -34 22 -28 4 -60 -37 -57
2047e7J36M3k32R8k72J94K4P3R4l9l18J94l48M83o8J57j19J04j22p4P5J27n0j38
$$ -57 79 122 -110 -12 -284 -90 -66 7 101 62 -256 -62 -410 73 5 162 43 147 25 -49 26 153 103 -35
2071c5J94k4j86J05J8k22K31j75j05K16j45j40K24J50k45K31j9j56J59J12k33
$$ -35 159 135 -51 54 72 -150 81 -94 -199 17 -128 -268 -44 106 -139 92 73 -83 76 188 -45
2092d5K08J76l13j87J29J2P3P2k88K14J07k58j4L8mj61R6K8J43o5l4M03m83K67
$$ -45 163 339 26 -161 -32 -20 53 125 -163 51 158 -100 -114 -76 -80 -241 -145 -117 26 -39 -73 330 -153 114
2116A14k47K2J33K29k78j95M20o3k82P2k01J73J15m8O3Q6j08J47k41J43%%k90
$$ 114 -133 -111 22 251 -27 -222 198 135 -147 -75 -276 -103 12 -36 27 113 5 152 -89 54 54 54 -236
2139b36K23r8j98L60M7o0k6m2n2j16M14k85J28J31j40QQ4j7j11P9K4k64j10K03
$$ -236 -13 -111 -309 51 98 38 12 -30 -82 -198 216 -69 59 190 50 58 142 125 14 93 117 -147 -257 -54
2163e4L2K12n9M2k10p1k18L94J22k23K14J02m10K65P0k92m6J84k72K40j69P8J02
$$ -54 -22 190 131 173 -37 -108 -326 68 190 -33 181 283 -127 138 208 -84 -130 54 -218 22 -147 -69 33
2186C3M7l12L86L5k33P4l2K30K8j99m4k19L08k54J03Jj5R0M5J06j45J35j75k34
$$ 33 80 -232 154 189 -44 30 -2 228 256 57 13 -206 102 -152 -49 -48 -63 27 72 178 33 168 -7 -241
2210b41M81l46J72M1l50L60p5r1p9J41q1m8r9o3N34M4l66J23q1r1J22m4M1m5n8
$$ -241 240 -106 66 107 -243 117 42 -49 -128 13 -68 -116 -215 -278 256 300 -66 57 -24 -115 7 -37 4 -41 -99
2235i9K26J6Q2l6l88J94j49q9L04N9j34J1N0k13J92j29K73K31j86j99k05J70k17
$$ -99 127 143 225 189 -199 -5 -154 -243 61 120 -14 -3 47 -166 26 -103 170 401 215 16 -189 -19 -236
2258b36K24k54L07j34p0J69k7K15k18k07J50J67l4N6J67n28O6K37J39j92j62n7
$$ -236 -12 -266 41 -93 -163 6 -21 194 -24 -231 -81 86 52 108 275 -253 -187 50 189 -3 -165 -222
2280b22K05j21p2o5K59L2o1j5k1K03j31J71l13j30J26M5J90j41m2l1M15k68p0
$$ -222 -17 -138 -210 -275 -16 16 -45 -60 -81 122 -9 162 -151 -281 -155 -110 80 -61 -103 -134 281 13 -57
2303e7L15k25m40L51K83k09l9r6K7J70n3N7K28n34K09M3j60q6R8J38N8k04J76
$$ -57 258 33 -407 -56 227 18 -21 -117 -90 80 27 84 312 -222 -13 30 -130 -216 -118 20 78 -126 50
2326E0Q4k46R0K14r3o8K94k43l61M00K9l99K22l46L54j0N8J04kQ5n0o6j67N62
$$ 50 134 -112 -22 192 99 31 325 82 -279 121 150 -249 -27 -373 -19 -29 29 133 131 216 166 100 -67 495
2350D95m99j7r0L10l69Q0R2K03l31j05L31l49J50K9j34J94P4r7j35K36q0L25l20
$$ 495 -4 -21 -111 199 -170 -90 2 205 -126 -231 100 -249 -99 -70 -204 -10 64 -33 -168 68 -12 313 -7
2373gj71J47m0O3K37k96l2J09Jr9K84n5j04p5k8J76j71L3p3k2J20K12m11K23N0
$$ -7 -178 -31 -71 -8 229 -67 -99 10 11 -88 196 141 37 -38 -66 110 -61 -28 -101 -123 -3 209 -202 21 71
2398G1K95n85J42J23R2j33J23M9k62J56R2l48K37q7j74K42m94K43K32M9K9p3K44
$$ 71 366 -219 -77 46 138 5 128 177 -85 71 163 -185 52 -35 -209 33 -461 -218 14 63 92 19 263
2421B63j56k46P3J25j33O5j23N6O8q9j2K8j22J29K34l85K74o8L6om09K19L55J62
$$ 263 107 -139 -66 59 -74 -9 -132 -76 -8 -97 -109 -81 -203 -74 160 -225 49 -19 17 11 -398 -179 176 338
2445C38m09k07J06P0K34k20J42M4j58j15K78o8jK68l22N5l0j93K19r2J17o1J14
$$ 338 -71 -278 -172 -102 132 -88 54 98 -60 -175 103 35 34 302 -20 35 5 -188 31 -61 56 -5 109
2468A09n8k28L1R3R5O3r7p2j42K38r5j75K03Ok5j48L41M3j48r5J47j57J37j14
$$ 109 51 -177 -146 -53 42 105 8 -64 -206 32 -63 -238 -35 -29 -54 -202 139 182 34 -61 86 -71 66 -48
2492d8NO6N9P9k40oJ70J15k30q6J03l4O4J17j70K8j95J3K17k60K91q4J44K55n4
$$ -48 -43 23 82 161 -79 -85 85 200 -30 -116 -13 -47 17 134 -36 -8 -203 -190 27 -233 58 -26 118 373 319
2517C19l40Q1k41K63K57k85k47K3j33K40J45Jl15L48l3j86k1K4K71l41l6j63N56
$$ 319 -21 60 -181 82 339 54 -193 -170 -303 -63 82 83 -232 116 83 -103 -124 -100 171 -170 -206 -369 187
2540A87j91J37j26j56r8J42J82m6J39j46r3k5J86r1J84n3k26K22m9pm6R1k62P8
$$ 187 -4 133 7 -149 -247 -105 77 31 170 24 -69 -94 92 1 185 132 -94 128 79 72 26 117 -145 -67
2564f7L41k01K49k58k16j38L06J40m32L02k03j9l5J47n4J14MJ11P0j04k49O4K26
$$ -67 274 73 322 64 -152 -290 16 156 -276 26 -177 -196 -231 -84 -138 -24 -20 91 161 57 -192 -128 98
2587I8n4k67K08O7K25j3l44N9n8O8O4p6lJ01k17K84j2jj84r2J42J03k22L23j27
$$ 98 44 -223 -15 52 277 264 -80 -21 -79 -11 53 -23 -26 75 -142 142 130 129 -55 -147 -5 98 -124 199 72
2612G2M7l4q0N5K08r9j09k50L83m7R6m82Q3K39k19J1K00l0j05M64l76k7k46K22
$$ 72 119 85 5 60 268 169 60 -190 193 146 242 -240 -157 82 -137 -126 74 44 -61 403 27 0 -246 -24
2636b4n0J60K23k91m7l7M39m23q4k18M01J78j89J09j09j44Q8J85k9m34L39m5J65
$$ -24 -74 86 309 18 -29 -66 373 -50 -134 -352 49 227 38 147 38 -106 -18 167 138 -296 43 -2 163
2659A63j78Q7j69P8P3M4N8j00j03k36O07m08J9N9K68Pl50P3K28l06L69m41j2J06
$$ 163 -15 72 -97 -19 54 98 156 56 -47 -283 324 -84 -65 -6 262 269 -81 -8 220 -86 283 -158 -170 -64
2683f4J53J06l56K1M16m08l9L3J20J29o8K74l78J49r0M37o26R5J51j52k7j80M54
$$ -64 89 195 -161 -140 276 -132 -171 -138 -18 111 43 317 -61 88 -2 435 -191 -96 55 -97 -124 -304 150
2706A50Mo4j5j57P2L2r2K53j5k09L78m02K24l14J55J13o6k47M5k7O5J84K44j65
$$ 150 154 90 75 -82 -10 22 -70 183 168 -41 337 -65 159 -155 0 113 47 -200 -155 -182 -117 67 311 146
2730A46q3o7R7K7o0j51J64j05N3m5K44n1j22m59N23j71K2M30j55l28O6M9j66J13
$$ 146 63 -4 93 120 60 -91 73 -32 21 -24 220 169 47 -412 111 -60 -38 392 237 -91 -25 24 -142 -29
2754b9r0N1l6N3j70M71k12r9J1K1j81K47j9Rk39O7K74j68j0j07K47Ll30K64m1
$$ -29 -119 -68 -104 -51 -221 250 38 -61 -50 -29 -210 37 18 27 -212 -145 129 -39 -49 -156 91 94 -236 28 -13
2779a3k66L00j25J35j66L08k41K1L99l92k23j0K34j27N5j01L64k19J1J02j79K96
$$ -13 -279 21 -104 31 -135 173 -68 -47 352 -40 -263 -273 -39 -166 -111 -212 152 -67 -56 46 -133 163
2801A63mj74n4J84k47J75J96l76j13N10j46k10o6RK34K74m47J23J20j31J25L19
$$ 163 159 -15 -69 115 -132 43 239 -137 -250 260 114 -96 -162 -153 81 355 -92 31 151 20 145 464
2823D64l49j44j3J04j73J4Q7l6J32n0O6j57J30O6k1j76K97n1O2j61k55J9O2J31
$$ 464 115 -29 -42 62 -111 -97 -10 -46 86 36 102 -55 75 141 120 -56 241 190 252 91 -164 -145 -83 48
2847D8j60n9J90L46l43q4J86l71L5M75k43k6K02k66j0K71M0k63K97k06n5J07l05
$$ 48 -112 -171 19 365 22 -62 124 -247 -212 263 20 -6 196 -70 -80 191 231 -32 265 59 4 111 -194
2870a94K10k07K59j64k69M43j64k42K85k17M68j66n9Lo8L21q1Pk75k6L46k34j28
$$ -194 16 -191 68 -96 -365 78 -86 -328 -43 -260 208 42 -17 -14 -82 239 158 165 -110 -136 210 -24 -152
2893a52J93J27j74j8q5L7m2O6k2m8M9q9L34j88M7m0J14j14k63L62l77M28j17l9
$$ -152 41 168 -6 -24 -109 -72 -114 -48 -70 -118 -69 -158 176 -12 35 -5 109 -5 -268 94 -283 145 28 -11
2917a1j48K22l29o1M09j44K18Jj84k00M04r0k71K87m88N35q5j97j75K08L19l0
$$ -11 -159 63 -266 -327 82 -62 156 157 -27 -227 177 87 -184 103 -385 150 65 -132 -307 -99 220 190
2939A90J16l35K23k68j22%K23J51l54J31J40l30J06J01J37j68J16L5j93K57k05
$$ 190 306 -29 194 -74 -196 -196 27 178 -176 -45 95 -235 -129 -28 109 -59 57 92 -101 156 -49
2960d9N0j91L31j83J4M6J5n2r3J92P4o3R6J0K03m43j32m6L57O9k61K59k01Nl63
$$ -49 1 -190 141 -42 -28 18 33 -19 -112 80 154 91 187 197 400 -43 -175 -221 136 205 -56 203 2 7 -356
2985c56K78r3K23k29M27l41J4j32K84J05j82l29L23k8J21j35O1P8k46o6K43J0
$$ -356 -78 -171 52 -177 250 -91 -77 -209 75 180 -2 -331 -8 -36 85 -50 11 89 -157 -223 20 30
3007C0j04m0J85k59K49L4k93L30K2l1j74J11J57j04j9q6O0P8m08L50l8j08j92
$$ 30 -74 -114 71 -188 61 95 -198 132 154 123 -51 60 217 113 94 8 68 146 -262 88 50 -58 -250
3030b50J27K98l54L45j5L0J12j13M2l00j40L34k28l8M96k55j51l71L60N05k19
$$ -250 -123 175 -179 166 151 181 293 180 222 -78 -218 116 -112 -150 346 91 -60 -431 -71 434 215
3051B15k92R9J10j62n8J21%j31PJ4K55l40L60k23j32J88o1J8l62J22M09m08J83
$$ 215 -77 22 132 -30 -88 33 33 -98 -91 -77 178 -162 198 -25 -157 31 -30 -12 -374 -252 157 -251 -68
3074f8l9oj24M11L2j11r6N1R9j85J77k19K39l51M11k45q0J40j42Q4J98j52l5J11
$$ -68 -107 -113 -237 174 206 95 -1 50 149 -36 141 -78 161 -190 221 -24 -104 36 -106 -22 176 24 -11 100
3098A00j18k6j39P9K45l10L89j35J5p9k54K53l25K97l4O63n10K3j64j92L29j3
$$ 100 -18 -44 -183 -104 141 -169 220 85 100 21 -233 20 -305 -8 -42 621 111 134 -30 -222 107 94
3120I4n2l3l9J86J37j03j94j17L47k63R2p7K82m20L16l15K10P6n5j5R2k70J72
$$ 94 42 9 -30 156 293 190 -4 -121 226 -37 55 -22 260 -160 156 -159 51 127 72 57 149 -121 51
3143E1j8J98j80J51K0K6m12J49J14l88L54j64l9K7K96j25K1j82K04o9J9K51k33
$$ 51 33 231 51 202 222 248 -164 -15 99 -289 65 -99 -138 -111 185 60 81 -101 103 34 53 304 71
3166G1j53k26L59j18M2K19j2j78N9l8n9r2M4J96n8J77ll37K9K38N0l9J2k55J51
$$ 71 -82 -308 51 -67 -25 194 182 4 63 25 -34 -126 -82 114 56 233 230 -107 -78 160 210 171 183 -72 79
3191G9K54k33l25M03k26K98k71L79j35k07n8J85k73L31l05q3J20r6K25j41p3L35
$$ 79 333 100 -225 178 -48 250 -21 358 223 16 -42 143 -130 201 -104 -187 -67 -163 62 -79 -152 183
3213A83j02o2k26J55Q9J55m70L53j3O2q4J02k40R3K33o1k57J35n0q1L2L47j74
$$ 183 81 19 -207 -52 37 192 -278 75 62 124 40 142 -98 -5 228 167 -90 45 -5 -86 -54 293 119
3236A19m18L22J15n3m4k77J93jk80K49J88J67l99J37J18J7m27L80m39n8M88k48
$$ 119 -299 23 138 85 41 -236 -43 -44 -324 -75 113 280 -119 18 136 153 -274 106 -333 -391 97 -151
3258a51OK87M1n14N46k09j84K21R7l18L53k39N9j80J74j51K56Q4l17Q5J85j8k48
$$ -151 -145 142 183 -331 215 6 -178 43 140 -178 175 -64 -5 -185 -11 -162 94 178 -139 -54 131 113 -135
3281a35K68o0k57M65m37J1L25k80K66N2l09R9J43l33L39k29j47M16l15J17j79
$$ -135 133 73 -184 281 -156 -145 180 -100 166 218 -91 8 151 -182 157 -72 -219 197 -118 -1 -180
3302a80K82j86K93k33j96L24l68J98Q2K0j9j0k2O3k8N6N5j64J67k74L2L95j48
$$ -180 102 -84 209 -24 -220 104 -264 -66 16 36 17 7 -15 48 20 76 131 -33 134 -140 -108 287 139
3325A39j18J5j23j8K68k43r6k3N1M7l5J92J76k27j54j01K74q1K16m07J99k9K57
$$ 139 21 36 -87 -105 163 -80 -176 -199 -148 -101 -136 56 232 5 -149 -250 24 -57 159 -248 -49 -78 179
3348A79o3j46P6l7J01o4l61K26r5M54k8R1m19J50l2J40j75r7k8L38j8m72K45K45
$$ 179 116 -30 46 9 110 46 -315 -89 -184 270 242 333 -86 64 32 172 -3 -100 -128 210 192 -280 -35 210
3372B10j83J5K35m20j4K14J9O9K9k25J84k95J99j19J24Mp1k80M67j41lj51J8l3
$$ 210 27 42 277 -143 -157 57 76 145 174 -51 133 -162 37 -82 42 46 -25 -305 162 21 18 -133 -115 -148
3396a48J74n5J7j62J95j76K81k54r6L70j71j93J2J75J47k04k0k75L49N7m2J99
$$ -148 26 -29 -12 -174 21 -155 126 -128 -224 146 -25 -218 -206 -31 116 -88 -108 -383 -34 23 -19 180
3418A80Q4m26J31r0j0Q1K93m25K21k33J62L01l82J63k9P2rM04l02k64l5J20p0
$$ 180 264 -162 -31 -121 -131 -50 243 -182 39 -194 -32 269 -113 50 21 93 84 488 186 -78 -113 7 -63
3441f3M0j43J65N5P0k77O9JJ10j06J82j81j98K56j33J60j06K2L69j27k52L30n
$$ -63 -23 -166 -1 54 124 -153 -84 -83 27 -79 103 -78 -276 -20 -153 7 -99 -77 292 165 -87 243 238
3464B38l29M5J85m4j21n3J25JO6ol43K94N4j01O9j84L4J86j04m14L61P2M8o8j5
$$ 238 -91 -46 139 95 -26 -79 46 47 113 107 -236 58 112 11 80 -104 -70 116 12 -402 -41 31 79 11 -4
3489dj98J96K05l56K46j3j23K26n0l23M12j95K16k17q2L60j19j55N6J33n04K72
$$ -4 -202 -6 199 -157 89 76 -47 179 129 -194 218 23 239 22 -60 300 181 26 82 215 -289 -17
3511a7r5J83k31R3N6L0j69M9j74L20J95k13K9l44L27j81K80l05K47l0Q7ml98J97
$$ -17 -112 71 -160 -67 -11 19 -150 -101 -275 45 240 27 56 -288 39 -142 138 -167 80 50 137 133 -265 -68
3535f8O7J27j88K37j90j2J57j64J82j78J5K68j75J58l1j31j65l3K67k1r1j26L30
$$ -68 -1 126 -62 175 -15 -27 130 -34 148 -30 -15 253 78 236 205 74 -91 -124 143 122 31 -95 235
3558B35m15L81j60Q5Q3j56j11J9Q5p8j17K5M6Kk54J85J44k3Q2J81k26r3J75j20
$$ 235 -180 201 41 126 209 53 -58 -39 46 -32 -149 -124 -78 -76 -330 -145 -1 -24 58 239 13 -80 95 -25
3582b5k4J97N4o7K0k14J72l54M63l04j07Q2J73k28Q4m4j46J86K19q2j82pK14l2
$$ -25 -49 148 202 135 155 -59 113 -241 222 -82 -189 -107 66 -162 -78 -122 -268 -82 137 55 -127 -134 80 48
3606D8k06Q0j8N2P2R2j50J08O2j90L7J48j66K22n4J11l61O6lN6k9K21k97J88K61
$$ 48 -158 -78 -96 -44 28 120 -30 78 140 -50 -13 135 -31 191 137 248 -113 -47 -50 6 -23 198 -99 89 350
3631C50k92k26M18l21K37J48m61P4j98N04j89k49M32m42L94j71q0P5P3j54K09
$$ 350 58 -168 250 -71 166 314 -147 -73 -271 233 44 -205 227 -215 179 8 -72 3 76 -78 131
3652A31j39j98N12l16j6K18p5j07L9L4j88K7K95k05k51K07j80K76j5K7R0j96J8
$$ 131 -8 -206 306 -10 -26 192 117 10 49 83 -105 -78 217 12 -239 -32 -212 64 49 76 166 -30 -12
3675a2J1r8Q4J73q8l68K91l06M74m7k44O9LJ25j0j57Nj68L75k38J24j04L62j43
$$ -12 -1 -99 -15 158 70 -298 -7 -313 161 114 -130 -61 -58 67 57 -100 -95 -263 112 -126 -2 -106 256 113
3699A13o0K32l94M7K35k88K20m1m7k3j67L08Ok03k1K17K87l45k1m0J98l63n3J58
$$ 113 53 285 -109 -62 173 -115 105 64 17 -6 -173 135 141 -62 -83 134 421 76 55 15 213 -150 -203 -45
3723d5o1J53l84L65j67L65l49M3q8K81K31l25k9j23o1K41j27N2K53J37m74k30
$$ -45 -106 47 -337 28 -139 226 -123 -80 -168 113 344 19 -10 -133 -194 47 -80 -28 225 362 -112 -342
3745c42K60Q2o0J09Oj00J91k63M30j91p3j1L01m19k5K25j98R8j06J20j16j40L59
$$ -342 -82 0 -60 49 55 -45 146 -117 313 122 49 38 339 -80 -105 120 -78 20 -86 34 -82 -222 137
3768A37p6j9l4O8J10l43M12k89j47L09r7Q0m5J8Pr7J21L51m47j13M1J84J37l84
$$ 137 61 42 8 76 186 -157 255 -34 -181 128 31 111 66 84 91 -6 115 466 19 -94 -53 131 268 -116
3792a16K05k22J24qL30m11j51N4k3K55p5j04R7o6L73k10r3q6J40L2n4OJJ88k96
$$ -116 89 -133 -9 -17 313 -98 -249 -195 -218 37 -38 -142 -45 -111 262 52 -41 -127 13 45 -9 -3 -2 186 -110
3817a10J57q5m1J36r1k23K39j88L76p2j66L3j2K5r6M13l97l6K58J9k35L02k77
$$ -110 47 -38 -79 57 -34 -257 -18 -206 170 98 -68 -35 -47 -22 -118 295 -102 -138 120 139 -96 206 -71
3840g1K35J40q7k03K36k93K29k3k4M9k5j83j83L02j89j5K7R6Q3P0m65J24J53K31
$$ -71 164 304 217 14 250 -43 186 163 139 188 163 -20 -203 99 -90 -105 -78 18 101 171 -294 -170 -17 214
3864B14K4l22k4J33l26N02j57k67J00n3J92m8J42p7k57J88K55k34n9K04j76J22
$$ 214 238 -84 -108 25 -301 201 44 -223 -123 -176 16 -32 110 33 -224 -36 219 -15 -74 130 -46 76
3886G6R2k47J53p2j84K44q9J83j37N1%o9k75K89m3j88K61nj77j8L38p5k35L23
$$ 76 168 -79 74 2 -182 62 -27 156 19 70 70 1 -274 15 -28 -216 45 40 -137 -155 183 108 -127 196
3910A96k85K31J28l72l5J85m31M98j80J34L6n9nk9j16P2j22Q2K71J9n0j23r7k17
$$ 196 -89 142 270 -102 -137 48 -383 115 -65 69 105 46 41 12 -104 -32 -154 -72 199 218 168 45 -52 -269
3934b69K49j06N4J10n0r5J77j44J4N1J38j07k54J14J62J68J2l15J01K67j85j52
$$ -269 -20 -126 -72 38 -12 -107 70 -74 -60 -9 129 22 -232 -118 44 212 224 -91 10 277 92 -60
3956f0j68K08O3j9o6l1K25j62r9J2K64j21j48J08m3K06k8j85O8r5J83j13Q9J46
$$ -60 -228 -20 43 24 -42 -73 152 -10 -109 -97 167 46 -102 6 -37 169 141 -44 24 -71 112 -1 88 234
3980B34k67Q8m0N7Mj22l3L56k77j94K87j6j84K54l21j15M01k44J57p1K10k02L06
$$ 234 -33 55 15 72 76 -46 -79 277 0 -194 93 77 -107 147 -174 -289 112 -132 25 -46 164 -38 268
4003B68l88J64K9m3k11M3J31L5O8j88M54l68j79J9p7J13k1K51L1k01Q1j91L11
$$ 268 -120 44 73 30 -181 -138 -7 28 96 -92 362 -6 -185 -166 -243 -130 -151 100 131 -70 11 -180 131
4026A31k29J76j62K29j32l23J03L14j94Q5n8k09L08q1J25l06L28j28r3k15M30
$$ 131 -98 78 -84 145 13 -310 -207 107 -87 -2 -60 -269 39 -42 83 -223 105 -23 -116 -331 99
4047I9j07J28Q5m05L19p7Kk16J68J95j45k7R5j5P7k95K79J19l77o5o6M17k74m8
$$ 99 -8 120 205 -200 119 42 44 -172 -4 191 46 19 114 99 176 -119 160 279 -98 -163 -229 188 -86 -134
4071a34J13J58q4l83J93L8J86j06K03k37K31k7qj27J42j1r9k4N5K34l10K5J15
$$ -134 -21 137 53 -330 -137 -99 87 -19 184 -53 178 151 143 16 158 147 48 24 79 313 3 28 143
4094A43l12Q1J24m8k21J66JL53l06r7p1N4L55k81j35j87J89J5M37j78K9n67N90
$$ 143 -169 -88 36 -12 -233 -67 -66 287 -19 -116 -187 -133 222 -59 -194 -381 -192 -177 260 82 111 -456 134
4117A34k82k19L92P3r3k0L02l90K56k42QO6l9J0P0l5k20N16j54j73J44Mj66J3
$$ 134 -148 -367 25 98 5 -15 287 -103 153 -89 -81 -15 -54 -44 26 -9 -229 287 133 -40 104 108 -58 -45
4141d5N04m48l8J60p8l3j99J57j68j8N0J46Q4k30K90j88K78j76k04J71J12N1j55
$$ -45 459 11 -27 133 55 22 -177 -20 -188 -206 -156 -10 74 -156 134 -54 224 48 -156 15 127 178 23
4164B3N0k70L30lk35J28K36l21m0K40r2j57R7M6j59o4K89m03K68J96m3J91l92
$$ 23 73 -197 133 130 -105 23 259 -62 -102 138 46 -111 -14 32 -127 -191 98 -305 -37 159 116 307 -85
4187h5L70k5k70j98J70L33l24n3J50k8k35n1K34j56M61Jj72M30m63L46l87j82
$$ -85 285 260 -10 -208 -38 295 -29 -82 68 40 -195 -246 -12 -168 293 294 122 552 89 435 48 -134
4209a34K42j69k1k07L09l54K94NJ31Pr0J15j19j09L9J75k03L04j20pj37r8K23
$$ -134 108 -61 -82 -289 20 -334 -40 -35 96 103 13 128 9 -100 -61 114 -89 215 95 88 -49 -147 76
$$ [...]
8191F
##END NTUPLES=NMR FID
##END=
