##TITLE=1H_IAMT-301
 pyr-d6
 8 sc, 
 4.7.2024
##JCAMPDX= 6.0         $$ Bruker NMR JCAMP-DX V2.0
##DATA TYPE= NMR FID
##DATA CLASS= NTUPLES
##ORIGIN= UXNMR, Bruker Analytische Messtechnik GmbH
##OWNER= root
$$ XWIN-NMR		Version 3.5
$$ Thu Jul  4 14:43:14 2024 Russian Standard Time (UT+4h)  she@DPX200
##.OBSERVE FREQUENCY= 200.1314
##.OBSERVE NUCLEUS= ^1H
##.DELAY= (6, 6)
##.ACQUISITION MODE= SIMULTANEOUS
##.ACQUISITION SCHEME= undefined
##.AVERAGES= 8
##.DIGITISER RES= 18
##SPECTROMETER/DATA SYSTEM= spect
##.PULSE SEQUENCE= zg30
##.SOLVENT NAME= DMSO
##.SHIFT REFERENCE= (INTERNAL, DMSO, 0, 15.7039)
##AUDIT TRAIL= $$ (NUMBER, WHEN, WHO, WHERE, WHAT)
$$ ##TITLE= Audit trail, XWIN-NMR		Version 3.5
$$ ##JCAMPDX= 5.01
$$ ##ORIGIN= Bruker BioSpin GmbH
$$ ##OWNER= she
$$ F:/spectra/data/she/nmr/H-F/1/audita.txt
$$ ##AUDIT TRAIL=  $$ (NUMBER, WHEN, WHO, WHERE, WHAT)
(   1,<2024-07-04 14:41:59.12 +0400>,<she>,<DPX200>,
      <created by zg, POWCHK disabled, PULCHK disabled
       configuration hash MD5:
       00 E9 B6 7A A2 85 ED C7 34 08 36 98 17 FE 4E 26
       data hash MD5: 16K
       8C FF 83 F7 CF 54 23 BA 9C 9D 6D 4C A3 C2 F5 3F>)
$$ ##END=
$$ 
$$ hash MD5
$$ E0 24 DD AB 69 DC 78 29 4F 5D D0 EC 7B DB 0A 5A
##$RELAX= 
##$RELAX= 
##$RELAX= 
##$RELAX= 
##$RELAX= 
##$RELAX= 
$$ Bruker specific parameters
$$ --------------------------
##$DU= <F:/spectra>
##$EXPNO= 1
##$NAME= <H-F>
##$PROCNO= 1
##$TYPE= <nmr>
##$USER= <she>
##$AMP= (0..31)
100 100 100 100 100 100 100 100 100 100 100 100 100 100 100 100 100 100 
100 100 100 100 100 100 100 100 100 100 100 100 100 100 
##$AQSEQ= 0
##$AQ_mod= 1
##$AUNM= <au_zg>
##$AUTOPOS= <>
##$BF1= 200.13
##$BF2= 200.13
##$BF3= 200.13
##$BF4= 200.13
##$BF5= 200.13
##$BF6= 200.13
##$BF7= 200.13
##$BF8= 200.13
##$BYTORDA= 1
##$CFDGTYP= 0
##$CFRGTYP= 5
##$CHEMSTR= <none>
##$CNST= (0..31)
1 1 145 1 1 1 1 1 1 1 1 1 1 1 1 1 1 1 1 1 1 1 1 1 1 1 1 1 1 1 1 1 
##$CPDPRG= <>
##$CPDPRG1= <>
##$CPDPRG2= <>
##$CPDPRG3= <>
##$CPDPRG4= <mlev>
##$CPDPRG5= <mlev>
##$CPDPRG6= <mlev>
##$CPDPRG7= <mlev>
##$CPDPRG8= <mlev>
##$CPDPRGB= <>
##$CPDPRGT= <>
##$D= (0..31)
0 1.2 0 0 0 0 0 0 0 0.06 0 0.03 0 0 0 0 0.0002 0 0 0 0 0 0 0 0 0 0 0 0 
0 0 0 
##$DATE= 1720089718
##$DBL= (0..7)
120 120 120 120 120 120 120 120 
##$DBP= (0..7)
150 150 150 150 150 150 150 150 
##$DBP07= 0
##$DBPNAM0= <>
##$DBPNAM1= <>
##$DBPNAM2= <>
##$DBPNAM3= <>
##$DBPNAM4= <>
##$DBPNAM5= <>
##$DBPNAM6= <>
##$DBPNAM7= <>
##$DBPOAL= (0..7)
0.5 0.5 0.5 0.5 0.5 0.5 0.5 0.5 
##$DBPOFFS= (0..7)
0 0 0 0 0 0 0 0 
##$DE= 6
##$DECBNUC= <off>
##$DECIM= 24
##$DECNUC= <off>
##$DECSTAT= 4
##$DIGMOD= 1
##$DIGTYP= 9
##$DL= (0..7)
0 120 120 120 120 120 120 120 
##$DP= (0..7)
150 150 150 150 150 150 150 150 
##$DP07= 0
##$DPNAME0= <>
##$DPNAME1= <>
##$DPNAME2= <>
##$DPNAME3= <>
##$DPNAME4= <>
##$DPNAME5= <>
##$DPNAME6= <>
##$DPNAME7= <>
##$DPOAL= (0..7)
0.5 0.5 0.5 0.5 0.5 0.5 0.5 0.5 
##$DPOFFS= (0..7)
0 0 0 0 0 0 0 0 
##$DQDMODE= 0
##$DR= 18
##$DS= 0
##$DSLIST= <SSSSSSSSSSSSSSS>
$$ [...]
##$SUBNAM2= <"">
##$SUBNAM3= <"">
##$SUBNAM4= <"">
##$SUBNAM5= <"">
##$SUBNAM6= <"">
##$SUBNAM7= <"">
##$SUBNAM8= <"">
##$SUBNAM9= <"">
##$SW= 24.0689651099613
##$SWIBOX= (0..15)
0 0 2 0 0 0 0 0 0 0 0 0 0 0 0 0 
##$SW_h= 4816.95568400771
##$TD= 16384
##$TD0= 1
##$TE= 0
##$TE2= 300
##$TE3= 300
##$TEG= 300
##$TL= (0..7)
0 120 120 120 120 120 120 120 
##$TP= (0..7)
150 150 150 150 150 150 150 150 
##$TP07= 0
##$TPNAME0= <>
##$TPNAME1= <>
##$TPNAME2= <>
##$TPNAME3= <>
##$TPNAME4= <>
##$TPNAME5= <>
##$TPNAME6= <>
##$TPNAME7= <>
##$TPOAL= (0..7)
0.5 0.5 0.5 0.5 0.5 0.5 0.5 0.5 
##$TPOFFS= (0..7)
0 0 0 0 0 0 0 0 
##$TUNHIN= 0
##$TUNHOUT= 0
##$TUNXOUT= 0
##$USERA1= <user>
##$USERA2= <user>
##$USERA3= <user>
##$USERA4= <user>
##$USERA5= <user>
##$V9= 5
##$VALIST= <valist>
##$VCLIST= <CCCCCCCCCCCCCCC>
##$VD= 0
##$VDLIST= <DDDDDDDDDDDDDDD>
##$VPLIST= <PPPPPPPPPPPPPPP>
##$VTLIST= <TTTTTTTTTTTTTTT>
##$WBST= 1024
##$WBSW= 4
##$XGAIN= (0..3)
0 0 0 0 
##$XL= 0
##$YL= 0
##$YMAX_a= 119249
##$YMIN_a= -203865
##$ZGOPTNS= <>
##$ZL1= 120
##$ZL2= 120
##$ZL3= 120
##$ZL4= 120
##$ABSF1= 10
##$ABSF2= 0
##$ABSG= 5
##$ABSL= 3
##$ALPHA= 0
##$AQORDER= 0
##$ASSFAC= 0
##$ASSFACI= 0
##$ASSFACX= 0
##$ASSWID= 0
##$AUNMP= <proc_1d>
##$AZFE= 0.1
##$AZFW= 0.1
##$BCFW= 1
##$BC_mod= 2
##$BYTORDP= 1
##$COROFFS= 0
##$CY= 11.3945322036743
##$DATMOD= 1
##$DC= 2
##$DFILT= <>
##$DTYPP= 0
##$F1P= 15.6554695791079
##$F2P= 12.8336369535428
##$FCOR= 0.5
##$FTSIZE= 0
##$FT_mod= 4
##$GAMMA= 1
##$GB= 0.15
##$INTBC= 1
##$INTSCL= 1
##$ISEN= 128
##$LB= 0.24
##$LEV0= 0
##$LPBIN= 0
##$MAXI= 10000
##$MC2= 0
##$MEAN= 0
##$ME_mod= 0
##$MI= 1.114404
##$NCOEF= 0
##$NC_proc= 0
##$NLEV= 6
##$NOISF1= 3.799351
##$NOISF2= 2.8
##$NSP= 1
##$NTH_PI= 0
##$NZP= 0
##$OFFSET= 15.70392
##$PC= 1
##$PHC0= -25503.63
##$PHC1= 10.38748
##$PH_mod= 1
##$PKNL= yes
##$PPARMOD= 0
##$PSCAL= 0
##$PSIGN= 0
##$REVERSE= no
##$SF= 200.130013532006
##$SI= 16384
##$SIGF1= 3
##$SIGF2= 2
##$SINO= 400
##$SIOLD= 16384
##$SREGLST= <1H.CDCl3>
##$SSB= 0
##$STSI= 0
##$STSR= 0
##$SW_p= 3612.71676300578
##$SYMM= 0
##$S_DEV= 0
##$TDeff= 0
##$TDoff= 0
##$TI= <>
##$TILT= no
##$TM1= 0
##$TM2= 0
##$TOPLEV= 0
##$USERP1= <user>
##$USERP2= <user>
##$USERP3= <user>
##$USERP4= <user>
##$USERP5= <user>
##$WDW= 1
##$XDIM= 8192
##$YMAX_p= 0
##$YMIN_p= 0
$$ End of Bruker specific parameters
$$ ---------------------------------
##NTUPLES= NMR FID
##VAR_NAME=  TIME,          FID/REAL,        FID/IMAG
##SYMBOL=    X,             R,               I
##VAR_TYPE=  INDEPENDENT,   DEPENDENT,       DEPENDENT
##VAR_FORM=  AFFN,          ASDF,            ASDF
##VAR_DIM=   8192,          8192,            8192
##UNITS=     SECONDS,       ARBITRARY UNITS, ARBITRARY UNITS
##FACTOR=    0.0002076,     1,               1
##FIRST=     0,             0,               0
##LAST=      1.7004516,     0,               0
##MIN=       0,             -203865,         0
##MAX=       1.7004516,     119249,          0
$$ Real data points
##PAGE= N=1
##DATA TABLE= (X++(R..R)), XYDATA
$$ [...]
$$ plain form
2341 -1223 1859 -1157 598 640 -1165 1524 -1423 122 1157 -1837 1084 -436 -376 874 -1505 1126
2357 1126 -68 -692 1480 -1597 866 88 -1117 1414 -1314 401 445 -1281 1505 -1144 108 844
2373 844 -1534 1626 -758 -147 879 -1499 1208 -427 -306 1461 -1532 640 -7 -1057 1555 -1534
2389 -1534 695 379 -1223 1699 -1228 335 1040 -1533 1681 -863 -95 1061 -1384 1173 -363 -636
2405 -636 1364 -1552 834 17 -1107 1694 -1532 1138 75 -1260 1925 -1248 281 656 -1269 1786
2421 1786 -1075 197 626 -1062 1310 -455 -626 1129 -1541 1108 -94 -789 1489 -1448 1018 40
2437 40 -1018 1509 -1450 720 458 -1279 1789 -876 36 1210 -1259 1522 -546 -207 1192 -1495
2453 -1495 712 -257 -812 1505 -1097 1034 -53 -1091 1642 -1401 409 483 -1386 1566 -1149 -21
$$ packed form
2341a223L082l016J755M2j805K689k947J545J035k994K921j520O0J250k379K631
2357A126j194o24K172l077K463p78j205K531k728J715M4j726K786k649J252P36
2373H44k378L160k384O11J026k378K707j635J21J767k993K172o47j050K612l089
2389a534K229l16j602K922k927J563P05k573L214k544P68J156k445K557j536k73
2405f36K000k916K386q17j124K801l226K670j063j335L185l173J529L75j925L055
2421A786k861J272M29j688K372j765j71J755k670K649j202o95K278k937K466r78
2437D0j058K527k959K170k62j737L068k665R12J174k469K781k068L39J399k687
2453a495K207r69n55K317k602K131j087j038K733l043J810P4j869K952k715J128
$$ plain form
2469 -21 889 -1090 1524 -670 76 1079 -1471 876 -832 -670 1036 -1553 858 41 -770 1332 -1226
2486 -1226 833 419 -1186 1350 -967 468 604 -1371 1506 -1038 267 1046 -1356 1304 -621 -345
2502 -345 973 -1572 948 -89 -772 1428 -1292 808 -188 -1150 1290 -937 447 390 -1063 1445
2518 1445 -1031 35 819 -1483 1017 -847 -717 1148 -1438 1088 -335 -502 1426 -1545 946 -140
2534 -140 -1229 1087 -1172 660 673 -1491 1377 -1150 181 1018 -1328 1583 -625 -293 1221 -1285
2550 -1285 1210 -227 -355 980 -1314 938 -66 -1256 1359 -1419 675 193 -1087 1684 -672
2565 -672 434 594 -1375 1338 -1136 -45 862 -1229 1426 -564 -433 1320 -1415 800 -252 -906
2581 -906 1246 -1141 693 8 -951 1279 -1120 390 563 -1285 1288 -751 38 877 -1309 1447
$$ packed form
2469b1R10j979K614k194P46J003k550K347j708J62J706k589K411q17q11K102k558
2486a226K059m14j605K536k317J435J36j975K877k544J305P79k402K660j925K76
2502c45J318k545K520j037o83K200k720K100r96r62K440k227J384n7j453K508
2518A445k476J066P84k302K500j864J30J865k586K526j423j67J928k971K491j086
2534a40j089K316k259J832J3k164K868k527J331Q37k346K911k208L32J514k506
2550a285K495j437j28J335k294K252j004j190K615k778K094m82j280K771k356
2565f72J106J60j969K713k474J091R07k091K655j990J31J753k735K215j052o54
2581i06K152k387J834o85r59K230k399J510J73j848K573k039P89Q39k186K756
$$ plain form
2597 1447 -394 -237 1019 -1143 864 -91 -620 1298 -1140 876 250 -836 1203 -1223 602 543
2613 543 -1403 1466 -762 -74 931 -1352 1391 -409 -232 1092 -1422 1108 -463 -592 1356 -921
2629 -921 673 -6 -692 1286 -992 586 190 -1001 1172 -959 436 460 -1182 1134 -631 -185 747
2646 747 -1128 892 -665 -481 1152 -1458 1140 19 -903 1380 -804 379 315 -614 1224 -942
2662 -942 273 295 -972 1339 -652 51 846 -1405 1300 -208 -391 1018 -1150 1000 -347 -677 1504
2679 1504 -1212 929 331 -1202 1407 -962 592 452 -1236 1148 -1101 151 473 -1459 869 -835
2695 -835 -344 950 -1328 846 -218 -298 1165 -1076 750 141 -730 1339 -1076 87 73 -930 1483
2712 1483 -608 336 759 -1392 1239 -716 -75 1219 -1450 1062 -198 -586 1148 -1478 940 -236
$$ packed form
2597A447j841J57J256k162K007r55n29J918k438K016o26j086K039k426J825n9
2613E43j946K869k228O88J005k283K743j800J77J324k514K530j571j29J948k277
2629i21J594o79o86J978k278J578l96j191K173k131J395K4j642K316j765M46R32
2646G47j875K020j557J84J633k610K598j121r22K283k184J183o4r29J838k166
2662i42J215K2j267K311j991P03P95k251K705j508j83J409k168K150j347l30K181
2679A504k716K141n98j533K609k369J554j40j688K384k249J252L22j932K328j704
2695h35M91J294k278K174j064q0J463k241J826o09q71K069k415J163j4j003K413
2712A483k091R44M23k151K631j955O41J294k669K512j260l88J734k626K418j176
$$ plain form
2728 -236 -694 1538 -1103 679 89 -980 1539 -784 251 682 -1272 1205 -558 -44 495 -1468
2744 -1468 1086 -491 -549 709 -1500 1100 156 -721 1240 -1059 794 221 -922 1305 -1229 332
2760 332 428 -1058 1140 -644 -26 900 -1167 968 -369 -43 716 -1310 1037 -93 -685 1025 -1059
2777 -1059 687 -228 -710 1396 -1347 491 371 -919 1107 -1058 137 332 -1397 1150 -529 -125
2793 -125 1211 -931 814 -194 -714 1089 -935 510 -76 -645 1144 -1152 296 409 -920 1457
2809 1457 -1106 81 597 -1244 1123 -524 -109 332 -1198 799 -451 -704 1091 -1153 677 -44
2825 -44 -657 1155 -977 498 342 -874 1438 -668 429 729 -1256 1118 -553 -25 590 -1171 1023
2842 1023 -579 -262 915 -1305 1004 -136 -480 957 -1410 707 -113 -701 1047 -1074 197 601
$$ packed form
2728b36m58K232k641J782n90j069K519k323J035M31j954K477j763N14N39j963
2744a468K554j577n8J258k209K600r44q77J961k299J853n73j143K227k534J561
2760C32R6j486K198j784O18R26k067K135j337L26P59k026K347j130n92J710k084
2777a059J746r15m82K106k743J838j20j290K026k165J195J95j729K547j679M04
2793a25J336k142J745j008n20J803k024J445n86n69J789k296J448J13j329K377
2809A457k563J187N16j841K367j647M15M41j530J997j250k53J795k244J830p21
2825d4o13J812k132J475j56j216K312k106J097L00j985K374j671N28O15j761K194
2842A023j602L17J177k220K309j140l44J437k367K117q20n88J748k121J271M04
$$ plain form
2858 601 -1109 1088 -844 263 795 -1024 1132 -552 -129 926 -1167 755 -286 -447 859 -1034
2874 -1034 562 133 -720 796 -1010 411 60 -891 1182 -698 195 945 -1023 1044 -694 -248 642
2891 642 -1155 795 -298 -380 848 -1207 531 -357 -705 983 -1177 535 195 -1276 1093 -761
2907 -761 173 611 -1377 1140 -678 188 620 -983 980 -486 -481 758 -1012 609 -130 -798 1055
2924 1055 -853 834 590 -373 1047 -834 287 659 -815 1205 -874 -104 591 -933 1205 -300
2940 -300 -342 719 -1080 899 87 -395 1196 -997 603 63 -900 935 -984 499 143 -907 931
2957 931 -718 121 466 -1247 1090 -610 -63 1165 -1075 737 -385 -522 1008 -837 689 -53
2973 -53 -705 1226 -668 268 109 -687 1158 -620 149 591 -711 1267 -701 60 671 -851 920
$$ packed form
2858F01j710K197j932J107N32j819K156j684M23J055k093J922j041j61J306j893
2874a034J596m29q53J516j806J421l51r51K073j880Q93P50j968K067j738M46Q90
2891F42j797J950j093q2J228k055J738q88l48J688k160J712l40j471K369j854
2907g61R34M38j988K517j818Q66M32j603J963j466NJ239j770J621p39o68J853
2924A055j908J687k44r63J420j881J121L72j474K020k079P70O95j524K138j505
2940c00m2J061j799J979q12m82J591k193J600n40r63J835j919J483l56j050J838
2957I31j649Q39L45j713K337j700N47J228k240J812j122j37J530j845J526p42
2973e3o52J931j894R36j59p96J845j778P69M42j302J978j968P61O11j522J771
$$ plain form
2990 920 -215 -275 890 -931 835 174 -666 1128 -801 616 200 -775 960 -909 196 426 -926
3007 -926 876 -335 -83 692 -984 1063 -508 -399 894 -1183 678 -340 -487 1197 -1019 642
3023 642 -46 -580 839 -848 664 363 -974 1123 -705 31 344 -751 762 -597 -266 570 -885
3040 -885 829 -79 -627 747 -884 623 -104 -482 1173 -675 352 283 -939 889 -606 338 388
3057 388 -716 758 -662 -92 559 -947 906 -125 -320 697 -794 670 -10 -400 981 -819
3073 -819 317 293 -583 1185 -774 289 399 -728 930 -552 -11 586 -1416 814 -448 -231 455
3090 455 -1062 512 -12 -583 879 -855 350 142 -556 987 -969 420 416 -1138 741 -727 170
3107 170 362 -1044 824 -503 -55 821 -900 513 -324 -413 640 -839 801 -13 -529 986 -847
$$ packed form
2990I20j135o0J165j821J766o61q40J794j929J417m16r75J735j869J105K30j352
3007i26J802j211K52P75j676K047j571J09J293k077J861j018j47J684k216J661
3023F42o88n34J419j687J512l01j337K097j828P36L13j095J513j359L31Q36j455
3040h85J714r08n48J374j631J507p27l78J655j848J027o9j222J828j495R44N0
3057C88j104J474j420N70O51j506J853j031j95J017j491J464o80l90J381j800
3073h19J136k4q76J768j959J063J10j127J658j482N41N97k002K230j262K17O86
3090D55j517J574n24n71J462j734J205k08o98J543j956J389mj554J879j468Q97
3107A70J92j406J868j327M48Q76j721J413q37q9J053j479J640q14n16J515j833
$$ plain form
3124 -847 145 342 -903 1173 -398 134 725 -893 727 -452 -160 828 -928 859 -303 -257 560
3141 560 -837 489 203 -575 606 -909 422 268 -993 895 -762 -172 381 -821 812 -487
3157 -487 420 583 -954 576 -494 -255 857 -912 593 205 -461 900 -1068 895 156 -728 1115
3174 1115 -805 96 337 -598 1008 -438 -42 445 -942 779 -364 -213 982 -803 853 105 -549
3191 -549 887 -833 381 -198 -491 671 -916 154 361 -802 1089 -694 18 415 -1037 717
3207 717 -367 -107 729 -1245 730 172 -486 678 -1371 370 -34 -498 664 -759 52 139 -511 710
3225 710 -675 -69 100 -835 890 -680 -20 194 -879 556 -525 -531 811 -910 419 135 -526 997
3243 997 -561 331 189 -704 701 -598 345 595 -1032 886 -364 -130 378 -896 589 -152 -701
$$ packed form
3124h47R92J97j245K076j571N32N91j618J620j179K92R88j756J787j162M6Q17
3141E60j397J326k86p78J181j515J331j54j261J888j657N90N53j202J633j299
3157d87R07J63j537J530j070K39J112j769J505l88o66J361j968J963p39q84J843
3174A115j920R01K41r35J606j446L96M87j387J721j143J51J195j785J656p48o54
3191e49J436j720J214n79k93J162j587J070K07j163J891j783P12L97j452J754
3207G17j084K60Q36j974J975n58o58J164k049J741m04m64J162j423Q11Q7o50J221
3225G10j385O06J69r35J725j570O60K14j073J435j081oJ342j721J329k84o61J523
3243I97j558Q92j42q93J405j299R43K50j627J918j250K34N08j274J485p41n49
$$ plain form
3260 -701 606 -758 660 56 -450 789 -529 318 93 -621 760 -834 208 139 -849 729 -476
3277 -476 85 576 -911 961 -464 -389 693 -996 515 -72 -415 504 -510 419 -86 -524 970 -611
3295 -611 284 172 -212 816 -905 -118 332 -798 780 -252 131 593 -791 598 -357 -134 620 -782
3313 -782 433 106 -751 880 -565 203 302 -750 506 -692 -11 452 -894 707 -434 -125 663
3330 663 -906 423 -230 -95 796 -706 578 -197 -387 872 -900 220 243 -813 675 -887 402
3347 402 102 -534 539 -312 150 374 -1023 591 -298 82 603 -603 488 10 -235 520 -697 172
3365 172 116 -241 615 -476 139 358 -794 560 -285 153 604 -742 714 -452 -52 554 -960 409
3383 409 -26 -37 600 -605 369 -108 -531 726 -587 337 249 -439 452 -415 246 318 -994 400 -377
$$ packed form
3260g01J307j364J418o04n06J239j318Q47k25p14J381j594J042o9r88J578j205
3277d76N61M91j487J872j425P5J082j689J511n87l43R19j014R29n05m38J494j581
3295f11Q95j12l84J028j721P87M50j130J578j032L83M62j384J389r55K23P54j402
3313g82J215l27q57J631j445P68R9j052J256j198O81M63j346J601j141L09P88
3330F63j569J329o53J35Q91j502J284p75j90J259j772J120K3j056J488j562J289
3347D02l00o36J073q51M62K24j397J614q89L80N21j206J091m78k45P55j217Q69
3365A72n6l57Q56j091O15K19j152J354q45M38M51j346J456j166M00O06j514J369
3383D09m35j1O37j205R74m77m23J257j313R24q8o88Q91q67O61P2j312J394p77
$$ plain form
3402 -377 -332 495 -438 665 -228 -560 338 -808 736 302 -234 583 -688 290 127 -154 521 -638 322
3421 322 250 -643 837 -345 15 564 -556 577 -248 -136 442 -822 -13 119 -235 743 -675 460
3439 460 97 -427 591 -534 373 364 -564 613 -428 -3 825 -628 378 -8 -137 459 -499 589
3457 589 -203 -506 627 -940 415 144 -279 592 -368 461 247 -469 572 -135 -25 404 -781 641
3475 641 -135 -183 676 -772 421 -284 -382 273 -495 538 421 -367 683 -718 249 376 -671 719
3493 719 -555 -32 458 -587 431 -371 168 425 -813 604 -20 -221 772 -570 395 104 -306 788
3511 788 -498 116 306 -520 429 -497 -60 226 -466 444 -109 154 455 -460 542 -321 -215 458 -318
3530 -318 280 -123 -251 576 -397 432 79 -506 757 -486 297 600 -746 715 -416 -61 568 -499
$$ packed form
3402c77M5Q27r33J103q93l32Q98j146J544m34n36Q17j271R78j63k81O75j159R60
3421C22p2q93J480j182L60N49j120J133q25J12N78j264Q09J32l54R78j418J135
3439D60l63n24J018j125R07rr28J177j041M25Q28j453J006l86j29N96r58J088
3457E89p92l03J133j567J355k71m23Q71r60Q29k14p16J041p07J10M29j185J422
3475F41p76m8Q59j448J193p05r8O55p68J033j17p88J050j401R67J27j047J390
3493G19j274N23M90j045J018q02N39K57j238J417o24k01R93j342R65k91m10J094
3511G88j286O14J90q26R49r26M37K86o92R10n53K63L01r15J002q63J06O73p76
3530c18N98m03j28Q27r73Q29l53n85J263j243P83L03j346J461j131L55O29j067
$$ plain form
3548 -499 449 -230 -41 219 -754 682 30 -328 501 -812 392 -66 -616 385 -609 -38 337 -336 675
3567 675 -269 339 469 -662 339 -336 -155 353 -734 769 -104 -204 771 -480 133 -84 -418 538
3585 538 -663 232 109 -643 650 -519 40 508 -372 690 -255 6 663 -603 296 -205 -315 820
3603 820 -591 535 -339 -450 396 -494 377 304 -405 550 -184 86 -106 -753 711 17 22 671 -368 531
3623 531 -117 -28 373 -589 402 -56 -411 779 -329 462 341 -451 773 -592 74 258 -628 693 -461
3642 -461 214 746 -637 332 -450 -314 583 -541 305 -211 -524 546 -756 52 -377 -475 646 -546
3660 -546 118 61 -424 608 -236 -40 625 -359 489 -192 -120 387 -936 157 -115 -234 694 -508 599
3679 599 173 -404 603 -408 215 39 -355 448 -262 -40 173 -242 453 -323 -269 213 -524 261 -153 -259
$$ packed form
3548d99R48o79J89K60r73J436o52l58Q29j313J204m58n50J001r94N71L75o73J011
3567F75r44O08J30j131J001o75J81N08j087J503q73j00R75j251O13k17l34R56
3585E38j201Q95j23p52J293j169N59M68q80J062r45K61O57j266Q99n01j10J135
3603H20j411J126q74j11Q46q90Q71p3p09R55p34K70j92o47J464o94NO49j039Q99
3623E31o48Q9M01r62R91m58l55J190j108P91j21p92J224j365O66J84q86J321j154
3642d61O75N32j383R69p82J36Q97j124Q46n16l13J070j302Q08m29r8J121j192
3660e46O64n7m85J032q44J96O65r84Q48o81P2N07j323J093k72j19R28j202J107
3679E99m26n77J007j011O23j76l94Q03p10K22K13m15O95p76N4M82p37P85m14j06
$$ plain form
3699 -259 497 -362 485 -9 -435 456 -669 350 403 -483 398 -301 237 649 -587 690 -100 179 322
3718 322 -511 456 -242 -204 387 -652 605 -183 -272 664 -369 413 -15 -591 877 -702 -103 208 -205
3737 -205 758 -185 -31 466 -554 304 -8 -67 388 -303 632 -234 -327 390 -531 381 215 -359 479 -680
3757 -680 -113 217 -271 473 -290 -16 401 -389 441 -199 140 310 -162 168 -69 -96 277 -474 374 -194
3777 -194 -408 910 -630 63 -57 -245 130 -578 109 364 -716 445 -2 89 432 -593 558 0
3795 0 -183 369 -459 271 138 -264 565 -422 138 -132 -637 406 -161 118 317 -530 512 -579 -178 337
3815 337 -590 689 -117 -55 232 -247 414 -177 -419 603 -931 268 25 -186 371 -342 -17 326 -466
3834 -466 342 -517 -55 -110 -428 323 -110 -165 321 -752 315 -242 -366 379 -225 177 224 -70 361 -207
$$ packed form
3699b59P56q59Q47m94m26Q91j125J019N3q86Q81o99N38M12j236J277p90K79J43
3718C22q33R67o98L8N91j039J257p88q9R36j033P82m28n76J468j579N99L11m13
3737b05R63r43J54M97j020Q58l12n9M55o91R35q66r3P17r21R12j66n74Q38j159
3757f80N67L30m88P44p63K74M17p90Q30o40L39J70m72L30k37k7L73p51Q48n68
3777a94k14J318j540O93j20j88L75p08O87K55j080J161m47R1L43j025J151n58
3795@j83N52q28P30j33m02Q29r87N60k70n05J043n67K79J99q47J042j091M01N15
3815C37r27J279q06O2K87m79O61n91k42J022j534J199k43k11N57p13L25L43p92
3834d66Q08q59M62n5l18P51m33n5M86j073J067n57j24P45o04M02M7k94M31n68
$$ plain form
3854 -207 69 -90 -431 676 -424 -162 248 -386 160 -289 -156 471 -334 490 -248 -178 567 -481 410
3873 410 -102 -254 473 -589 382 -202 -297 393 37 36 671 -459 253 -146 -304 533 -299 498 -147 -207 275
3894 275 -438 391 129 -437 513 -385 124 10 -267 378 -320 201 231 -378 585 -264 282 242 -610 631
3914 631 -204 -188 262 -479 466 263 -122 229 -695 262 67 -237 465 -318 -178 -3 -186 475 -218 -99
3934 -99 489 -207 238 -98 -252 78 -356 361 178 -48 365 -378 396 220 -344 552 -598 319 -73 -358
3954 -358 462 -490 31 148 -249 547 -450 -210 238 -153 716 -265 -15 558 -327 325 246 -173 660 -348
3974 -348 262 329 -362 468 -581 249 313 -396 519 -357 -149 200 -404 329 52 -233 99 -659 145 265
3994 265 -124 382 -375 167 -50 -187 320 -491 98 17 -827 531 -516 -179 161 -591 183 -7 -166 589
$$ packed form
3854b07K76j59l41J107j100K62M10o34N46m49J33O27q05Q24p38P0P45j048Q91
3873D10n12j52P27j062R71n84r5O90l56jO35j130P12l99j58Q37q32P97o45o0M82
3894B75p13Q29k62n66R50q98N09j14k77O45o98N21L0o09R63q49N46m0q52J241
3914F31q35J6M50p41R45k03l85L51r24R57j95l04P02p83J40J75j83O61o93J19
3934i9N88o96M45l36j54L30m34P17j83k26M13p43P74j76n64Q96j150R17l92k85
3954c58Q20r52N21J17l97P96r97K40M48l91Q69r81K50N73q85O52p9m19Q33j008
3974c48O10O7o91Q30j049Q30O4p09R15q76K08L49o04P33k77k85L32p58Q04J20
3994B65l89N06p57N42k17j37N07q11N89q1q44J358j047L37L40p52P74j90j59P55
$$ plain form
4014 589 -383 219 -14 -459 498 -580 427 34 -374 126 -149 82 255 -218 480 -222 -84 16 -761
4033 -761 574 -124 -329 505 -308 594 7 -221 617 -429 173 13 -101 418 -287 -25 84 -322 549
4052 549 -133 60 218 -571 385 -294 -12 359 -530 382 -405 -71 468 -499 30 -23 -232 539 -200 179
4072 179 5 -561 235 -426 56 126 -433 768 -381 44 447 -356 354 -136 -174 11 -462 250 -71 10
4092 10 421 -521 149 134 -238 378 -206 321 402 -115 482 -292 130 538 -181 457 -202 -117 378 -558 259
4113 259 -212 -138 540 -356 141 38 -226 284 -98 110 317 -288 266 -253 56 -135 -446 548 -257 -103
4133 -103 278 -376 360 218 -69 337 -465 384 224 81 218 -432 214 -20 -159 250 -615 30 52 -341
4153 -341 420 -286 7 218 -323 526 55 -103 303 -584 448 -75 -187 204 -364 88 56 -392 554 -162
$$ packed form
4014E89r72O02k33m45R57j078J007l93m08N00k75K31J73m73O98p02J38J00p77
4033g61J335o98k05Q34q13R02n87k28Q38j046O02j60j14N19p05K62J09m06Q71
4052E49o82J93J58p89R56o79K82L71q89R12p87L34N39r67N29n3k09P71p39L79
4072A79j74n66P96o61M82P0n59J201j149M25M03q03P10m90l8J85m73P12l21Q1
4092A0M11r42O70j5l72O16n84N27Q1n17N97p74M22M08p19O38o59Q5M95r36Q17
4113B59m71P4O78q96M97j03k64N10l82K08K07o05N54n19L09j91l11R94q05J54
4133a03L81o54P36j42k87M06q02Q49j60j43J37o50O46k34j39M09q65O45K2l93
4153c41P61p06K93K11n41Q49m71j58M06q87J032n23j12L91n68M52l2m48R46p16
$$ plain form
4173 -162 -262 -41 -346 347 -129 -84 240 -139 450 -185 -50 372 -358 425 -125 -322 487 -420 510 217
4193 217 -386 620 -363 192 344 -432 441 9 -196 226 -331 397 -119 19 444 -356 483 -156 -327 297
4213 297 -435 60 -136 -441 574 -209 -110 172 -254 422 -127 34 64 -470 360 -68 -127 -166 -241 265 -141
4234 -141 -488 345 -418 318 -122 -261 296 -244 329 252 -293 340 -324 -70 435 -421 241 -434 -81 302
4254 302 -679 118 -135 127 512 -372 709 121 -335 312 -140 192 109 -157 381 -210 210 215 -532 248 -229
4275 -229 -12 409 -411 87 -264 -102 475 -360 -31 -44 -123 363 -447 297 -34 -282 452 -406 108 398 -245
4296 -245 660 102 -129 529 -364 449 -417 -357 171 -519 155 -245 122 487 -443 229 257 -29 292 -204 305
4317 305 -25 -151 422 -246 166 -122 -586 344 -458 -265 276 -257 312 -281 -263 431 -278 468 -144 169
$$ packed form
4173a62j00K21l05O93m76M5L24l79N89o35J35M22p30P83n50j97Q09r07R30k93
4193B17o03J006r83N55J52p76Q73m32k05M22n57P28n16J38M25q00Q39o39j71O24
4213B97p32M95j96l05J015p83R9K82m26O76n49J61L0n34Q30m28n9l9p5N06m06
4234a41l47Q33p63P36m40j39N57n40N73p7n45O33o64K54N05q56O62o75L53L83
4254C02r81P97k53K62L85q84J081n88m56O47m52L32q3k66N38n91M20Np47P80m77
4275b29K17M21q20M98l51J62N77q35L29j3p9M86q10P44l31k48P34q58N14K90o43
4296b45R05n58k31O58q93Q13q66O0N28o90O74m00L67L65r30O72K8k86L21m96N09
4317C05l30j26N73o68M12k88m64R30q02J93N41n33N69n93J8O94p09P46o12L13
$$ plain form
4337 169 193 -361 147 -152 -34 571 -268 94 261 -260 237 -449 -207 257 -158 617 -75 -197 130 -491
4357 -491 91 -180 -207 376 -455 221 -7 -388 161 -112 -109 -21 -324 206 -331 -64 302 -409 504 -295 -196 255
4379 255 -397 279 13 -324 347 -320 190 76 -474 88 -209 95 181 -239 380 -616 -53 370 -226 131
4399 131 -212 90 454 -505 454 73 -383 309 -353 474 3 -151 769 -373 179 -147 -185 634 -230 136
4419 136 56 -256 593 -38 -97 476 -387 507 -120 -295 204 -305 543 -247 -232 468 -446 -173 212 -193 403
4440 403 -264 229 -155 -221 28 -339 -304 41 -475 133 -97 97 447 -294 -219 123 -480 117 39 247 -51
4461 -51 -112 170 -440 -33 360 -234 50 -375 30 304 -313 44 -199 -360 309 -256 29 -133 58 112 -296
4482 -296 258 -422 -428 417 -132 76 -41 -511 310 -289 -32 134 -331 785 23 -97 139 -409 340 -195
$$ packed form
4337A69K4n54N08k99J18O05q39L62J67n21M97o86K42M64m15P75o92j22L27o21
4357d91N82k71k7N83q31O76k28l81N49k73LQ8l03N30n37K67L66p11R13p99R9M51
4379B55o52O76k66l37O71o67N10j14n50N62k97L04Q6m20O19r96N63M23n96L57
4399A31l43L02L64r59R59l81m56O92o62Q27m71j54R20j142N52l26l8Q19q64L66
4419A36q0l12Q49o31n9N73q63Q94o27j75M99n09Q48p90J5P00r14K73L85m05N96
4440D03o67M93l84o6K49l67L5L45n16O08k30J94L50p41P5L42o03N97p8K08k98
4461e1o1K82o10M07L93n94K84m25M05K74o17L57k43j61O69n65K85j62J91N4m08
4482b96N54o80oQ45n49K08j17m70Q21n99K57J66m65J116p62j20K36n48P49n35
$$ plain form
4502 -195 -17 259 -154 256 31 -327 519 -416 240 206 -178 289 -280 -43 158 -119 295 -162 100 313
4522 313 -206 145 -258 -156 272 -596 260 128 -433 384 -449 -154 0 -447 332 11 -173 264 -59 373
4542 373 -150 -297 272 -185 651 303 -193 -17 -224 267 -214 19 108 -312 60 150 -129 2 -466 -42 -310
4563 -310 -175 300 -310 65 423 -270 189 -225 -209 10 -309 148 -114 -358 349 -353 132 163 -273 263 -210
4584 -210 146 108 -231 230 161 -112 -100 -200 67 33 -243 313 -314 95 -287 -141 218 -31 298 42 -151
4605 -151 382 -304 211 22 -307 37 -18 -123 -207 47 139 -130 -69 -51 -94 316 -246 -93 355 -139 343 119
4627 119 -158 475 -413 -113 22 -265 136 -262 -43 271 117 206 -190 58 1 -310 369 23 -205 133 -117
4648 -117 162 2 -97 177 -111 180 118 -333 221 -76 420 49 -131 -79 -264 -5 -327 -257 363 -391 -121
$$ packed form
4502a95J78K76m13M10k25l58Q46r35O56l4l84M67n69K37K01k77M14m57K62K13
4522C13n19L51m03J02M28q68Q56j32n61Q17q33K95J54m47P79l21j84M37l23M32
4542C73n23j47N69m57Q36l48m96J76k07M91m81K33Q9m20L72R0k79J31m68M24k68
4563c10J35M75o10L75L58o93M59m14J6K19l19M57k62k44P07p02M85L1m36N36m73
4584b10L56l8l39M61o9k73J2j00K67l4k76N56o27M09l82J46L59k49L29k56j93
4605a51N33o86N15j89l29L44n5j05q4K54R2k69O1J8m3M10n62J53M48m94M82k24
4627A19k77O33q88L00J35k87M01l98K19L14j54Q9l96K48n7l11O79l46k28L38k50
4648a17K79j60r9K74k88K91o2m51N54k97M96l71j80N2j85K59l22P0O20p54K70
$$ plain form
4669 -121 326 -275 321 -377 -396 220 -154 162 -189 -115 196 -223 317 35 -219 364 -293 189 -82 -421 205
4690 205 -158 223 176 -191 252 132 45 267 143 144 -307 -126 167 -200 225 160 -218 419 -82 -105 48 -146
4712 -146 155 -129 97 204 -64 180 -127 -85 279 -442 -94 -113 -224 413 -205 248 153 14 340 -101 168
4733 168 -126 -345 309 -94 -72 248 -493 193 -25 -226 267 87 56 -123 -135 152 -71 115 94 -256 412
4754 412 -157 153 263 -534 4 -87 -27 206 -172 322 -213 14 58 -550 395 -182 66 303 -439 192 246
4775 246 174 292 -153 191 194 -1 113 -59 150 95 -367 326 -89 58 370 -229 212 -258 -40 460 -490
4796 -490 397 -38 -203 45 -201 153 30 -384 238 -190 -374 293 -70 -48 -91 77 235 -100 38 -80 -238
4817 -238 64 -464 91 -220 -239 215 -208 -19 47 -11 312 91 -10 310 -199 -21 198 -20 378 -325 502
$$ packed form
4669a21M47o01N96o98j9O16l74L16l51P4L11m19N40k82k54N83o57M82k71l39O26
4690B05l63L81m7l67M43j20q7K22j24Jm51J81K93l67M25o5l78O37n01k3J53j94
4712a46L01k84K26J07k68K44l07M2L64p21L48j9j11O37o18M53r5j39L26m41K69
4733A68k94k19O54m03K2L20p41O86k18k01M93j80l1j79j2K87k23J86k1l50O68
4754D12n69L10J10p97N38r1O0K33l78M94n35K27M4o08R45n77K48K37p42O31N4
4775B46p2J18m45L44Lj95J14j72K09n5m62O93m15J47L12n99M41m70K18N00r50
4796d90Q87m35j65K48k46L54j23m14O22m28j84O67l63K2m3J68J58l35J38j18j58
4817b38L02n28N55l11j9M54m23J89O6n8L23k21j01L20n09J78K19k18L98p03Q27
$$ plain form
4838 502 -106 -164 151 -225 195 -2 195 51 -11 168 52 -255 73 -321 384 440 -174 109 41 11 206 -230
4860 -230 78 -163 -26 375 -280 84 2 -183 200 156 50 229 -420 54 -137 248 100 33 182 24 -64
4881 -64 350 -76 356 59 -43 -63 -291 32 -258 21 333 -25 138 -4 77 28 -166 149 -105 -314 402
4902 402 -71 164 41 70 292 -5 186 257 -213 255 96 70 464 -117 -93 -94 -293 73 -69 205 -164 149
4924 149 396 -496 -197 -148 -199 -13 -212 -80 41 -381 377 -196 88 74 -201 120 -285 -213 332 -2 -202
4945 -202 -209 -179 82 -185 147 6 -72 -111 60 164 84 -184 24 -68 148 -147 -78 31 154 14 328 -390 262
4968 262 68 49 330 -376 254 282 -240 247 -406 378 366 -105 218 0 -119 268 -254 8 -327 -304 204
4989 204 -114 260 18 -87 154 -69 138 23 -286 115 -96 215 101 -57 352 -141 -6 212 -47 231
$$ packed form
4838E02o08n8L15l76M20j97J97j44o2J79j16l07L28l94P05N6o14K83o8l0J95m36
4860b30L08k41J37M01o55L64q2j85L83m4j06J79o49M74j91L85j48o7J49j58q8
4881f4M14m26M32k97j02k0k28L23k90K79L12l58J63j42Q1m9j94L15k54k09P16
4902D02m73K35j23K9K22k97J91P1m70M68j59k6L94n81K4jj99L66j42K74l69L13
4924A49K47q92K99M9n1J86j99J32J21m22P58n73K84j4k75L21m05P2N45l34k00
4945b02pL0K61k67L32j41p8l9J71J04q0k68K08r2K16k95O9J09J23j40L14p18O52
4968B62j94j9K81p06O30K8n22M87o53P84j2m71L23k18j19L87n22K62l35K3N08
4989B04l18L74k42j05K41k23K07j15l09M01k11L11j14j58M09m93J35K18k59K78
$$ plain form
5009 231 190 -166 236 -187 236 -239 -36 287 -69 -80 95 254 165 28 219 -154 -296 199 208 119 325 -370
5031 -370 264 185 32 515 -350 186 56 6 -40 -239 -165 33 55 227 -166 202 25 -478 -9 -118 105 96
5053 96 -43 329 217 87 -61 -304 142 82 -145 40 -332 29 37 118 -104 -382 -75 42 -82 330 -50 165
5075 165 -97 -228 265 -79 251 14 -213 213 -216 -126 -34 -213 400 -89 -215 96 -288 -122 -124 -180 247 109
5097 109 -211 93 -318 -12 189 -136 -105 -334 95 -309 152 67 -44 56 -411 16 45 -254 -290 -84 -301
5118 -301 194 260 -196 231 47 291 52 -95 136 -71 10 -98 246 -29 -276 451 9 -102 408 -207 309
5139 309 16 11 343 -354 161 -304 -48 5 -20 133 -37 -422 -101 55 64 163 208 57 42 -173 -136 110 361
5162 361 94 -174 406 -516 51 -230 -227 -104 -173 -114 -103 21 102 -375 50 3 -526 427 246 -78 -306 -260 153
$$ packed form
5009B31m1l56M02m23M23m75K03L23l56j1J75J59q9j37J91l73j42M95Rq9K06o95
5031c70O34p9j53M83q65N36j30n0m6j99P4J98K2J72l93L68j77n03M69j09K23r
5053I6j39L72j12j30j48k43M46o0k27J85l72L61QQ1k22k78L07J17j24M12l80K15
5075A65k62j31M93l44L30k37k27M26m29R0R2j79O13m89j26L11l84J66kn6M27j38
5097A09l20L04m11L06K01l25L1k29M29m04M61q5j11J00m67M27K9k99l6K06k17
5118c01M95O6m56M27j84K44k39j47K31k07Q1j08L44k75k47P27m42j11N10o15N16
5139C09k93nL32o97N15m65K56N3k5J53j70l85L21J56RR9M5j51j5k15L7K46K51
5162C61k67k68N80r22N67k81LJ23o9N9J1J24Q1m77M25m7n29R53j81l24k28M6M13
$$ plain form
5185 153 42 -293 437 30 -57 97 39 -120 -35 277 -194 -176 382 -2 108 196 -60 -73 -350 -293 175 -113
5207 -113 104 -58 -284 301 -35 48 141 -333 356 -68 28 257 93 204 -203 177 132 -282 149 -129 -371
5228 -371 74 -384 -34 23 -32 161 53 251 -309 -58 13 -341 -18 111 -88 -99 -67 -88 25 -79 117 -75
5250 -75 -171 26 -401 222 -136 54 57 -90 97 -111 -144 138 -64 -26 218 -216 156 -294 -6 -53 -343 127
5272 127 -258 -109 72 -153 138 -130 -129 71 46 269 -182 -122 294 67 365 98 115 -131 -120 1 112 -124
5294 -124 331 -128 48 283 -257 100 -55 -157 118 -14 156 222 -5 95 -247 -91 -269 -249 87 -144 83
5315 83 -37 119 294 -374 12 106 -151 426 -18 -6 -143 -130 -89 76 26 -93 -54 -303 -168 -298 300 -42
5337 -42 215 -24 221 30 -184 466 -109 76 23 -243 -89 45 -181 -59 -199 31 -257 -200 336 3 129
$$ packed form
5185A53j11l35P30m07q7J54n8j59Q5L12m71J8N58l84J10Q8k56j3k77N7M68k88
5207a13K17j62k26N85l36Q3R3m74O89m24R6K29j64J11m07L80m5m14M31k78k42
5228c71M45m58L50N7n5J93j08J98n60K51P1l54L23J29j99j1L2k1J13j04J96j92
5250g5r6J97m27O23l58J90Lj47J87k08l3K82k02L8K44m34L72m50K88m7k90M70
5272A27l85J49J81k25K91k68JK00k5K23m51O0M16k27K98k67J7k46J1J21J11k36
5294a24M55m59J76K35n40L57j55j02K75j32J70O6k27J00l42J56j78K0L36k31K27
5315H3j20J56J75o68L86R4k57N77m44J2j37J3M1J65n0j19L9k49J35j30N98l42
5337d2K57k39K45j91k14O50n75J85n3k66J54J34k26J22j40K30k88N7N36l33J26
$$ plain form
5358 129 22 -56 45 195 -265 303 -149 43 69 19 136 -274 -90 -185 -246 49 -26 160 139 -340 198 76
5380 76 232 161 -194 -37 159 -144 157 -381 116 91 -223 302 -141 176 385 4 71 216 34 54 -5 333
5402 333 -383 161 26 -496 -91 -2 -51 161 -40 19 105 -14 363 -8 -89 -31 -145 -193 -389 -313 -24 -253 75
5425 75 138 267 94 -396 20 302 -397 111 -241 1 69 -6 65 -148 -247 -34 -317 263 182 59 242 147 227
5448 227 -62 -303 212 17 179 -313 -212 95 -407 -57 -112 11 210 -135 57 -15 -188 129 152 159 131 -192
5470 -192 250 -250 -326 236 -113 -44 -79 -65 223 -76 -57 -61 -156 -2 -246 46 -170 -285 197 7 189 133 -234
5493 -234 -75 -449 124 221 -101 80 -102 201 144 -317 -55 -28 -119 -85 -294 -156 163 -2 -208 -50 218 111
5515 111 -193 190 -141 6 -17 49 251 -245 -278 -29 -153 42 45 16 -45 -166 86 36 47 352 63 -94 105
$$ packed form
5358A29j07p8J01J50m60N68m52J92K6n0J17m10J84r5o1K95p5J86k1m79N38j22
5380G6J56p1l55J57J96l03L01n38M97k5l14N25m43L17K09l81O7J45j82K0n9L38
5402C33p16N44j35n22M05Q9m9K12k01N9Q6j19L77l71q1N8j14m8j96P6K89k29L28
5425G5O3J29j73m90M16K82o99N08l52K42O8p5P1k13r9K13k83N80q1j23J83r5Q0
5448B27k89k41N15j95J62m92J01L07n02L50n5J23J99l45J92p2j73L17K3Pk8l23
5470a92M42n00p6N62l49O9l5J4K88k99J9mr5J54k44K92k16j15M82j90J82n6l67
5493b34J59l74N73R7l22J81j82L03n7m61K62K7r1L4k09J38L19j65k06J58K68j07
5515A11l04L83l31J47k3O6K02m96l3K49j24J95Lk9o1j21K52n0J1L05k89j57J99
$$ plain form
5538 105 -78 49 129 -115 -23 217 158 88 28 502 -321 177 -19 185 151 -382 193 -27 -19 -163 -476 100 -28
5561 -28 -325 89 338 122 195 -81 130 -88 -98 91 -281 133 -278 -249 223 -128 16 -192 149 452 -246
5582 -246 84 92 -75 91 -207 -140 13 -10 330 -81 -142 -200 -237 120 -77 39 -248 -375 -53 -388 86 23 -219
5605 -219 -123 53 -151 123 -197 125 -131 -267 -81 238 -137 264 -589 -105 117 -229 168 170 -2 149 -38
5626 -38 244 -139 -69 140 -80 153 -202 106 164 -19 382 -255 -6 -78 -239 287 120 168 227 -402 89 148
5648 148 131 200 -132 6 -110 -287 336 65 126 163 -96 127 -118 -223 105 -460 -11 83 106 -13 -50 -14 164
5671 164 -47 257 -87 156 13 -203 134 -28 338 -184 -79 -104 71 89 -24 -210 80 -16 -23 301 58 75
5693 75 167 -401 187 -143 77 3 -62 230 -65 11 178 -168 176 -125 146 29 -40 257 -240 -34 320 -431
$$ packed form
5538A05j83J27Q0k44R2K40n9p0o0M74q23M98j96K04l4n33N75k20Qj44l13N76j28
5561b8k97M14K49k16P3k76K11k18j0J89l72M14m11K9M72l51J44k08L41L03o98
5582b46L30Qj67J66k98O7J53k3L40m11o1n8l7L57j97J16k87j27L22l35M74o3k42
5605b19R6J76k04K74l20L22k56j36J86L19l75M01q53M84K22l46L97Kj72J51j87
5626c8K82l83P0K09k20K33l55L08N8j83M01o37K49p2j61N26j67M8N9o29M91N9
5648A48j7O9l32J38j16j77O23k71O1L7k59K23k45j05L28n65M49R4K3j19l7L6J78
5671A64k11L04l44K43j43k16L37j62L66n22J05k5J75J8j13j86K90r6pL24k43J7
5693G5R2n68N88l30K20p4o5K92k95P6J67l46L44l01K71j17o9K97m97K06L54p51
$$ plain form
5715 -431 428 -47 -1 -25 -310 79 -93 -67 183 27 368 184 -21 224 -186 -208 338 -92 -376 -85 -61 122
5737 122 91 -14 28 -120 24 140 29 -144 -195 23 -49 198 28 -19 110 161 30 148 -92 43 -153 298
5759 298 480 -105 345 -111 217 115 -246 13 71 230 409 -232 203 -99 10 154 45 1 10 -341 122
5780 122 -161 -265 -3 -363 215 -45 217 298 152 83 -211 -263 260 -194 172 -299 -262 -357 13 70 109 -175
5802 -175 -198 235 -121 108 -298 -203 -446 -249 72 -73 78 -211 -48 76 -268 166 -77 -163 42 -465 110
5823 110 -207 -80 265 13 -186 68 -218 392 -39 177 206 -95 290 -218 38 132 -189 241 39 19 138
5844 138 -69 469 13 12 145 148 -226 -66 96 257 -258 -319 514 -21 133 199 -213 62 -164 -323 -95 -58
5866 -58 357 -368 124 192 -122 297 -54 -165 36 22 47 -26 -150 41 -76 309 -10 31 180 -186 -56 -157
$$ packed form
5715d31Q59m75M6k4k85L89j72K6K50j56L41j84k05K45m10k2N46m30k84K91K4J83
5737A22l1j05M2j48J44J16j11j73n1K18p2K47j70m7J29N1j31J18k40J35j96M51
5759B98J82n85M50m56L28j02l61K59N8J59J79o41M35l02J09J44j09m4Rl51M63
5780A22k83j04K62l60N78k60K62Q1j46o9k94n2N23m54L66m71L7r5L70N7L9k84
5802a75k3M33l56K29m06R5k43J97L21j45J51k89J63J24l44M34k43q6K05n07N75
5823A10l17J27L45k52j99K54k86O10m31K16K9l01L85n08K56R4l21M30k02k0J19
5844A38k07N38m56jJ33Ll74J60J62J61n15o1Q33n35J54O6m12K75k26j59K28L7
5866e8M15p25M92O8l14M19l51j11K01j4K5p3j24J91j17L85l19M1J49l66J30j01
$$ plain form
5888 -157 215 61 -214 -146 -127 -190 72 51 -127 -29 -452 118 90 -256 63 -225 164 -38 -72 288 -162 77
5910 77 50 -282 14 257 -29 -392 -266 52 -438 115 -128 -86 6 26 187 -41 28 -23 82 -76 16 -204 0
5933 0 -92 -149 267 -160 140 -100 -8 -444 -85 81 215 35 -214 53 142 487 -133 510 58 -27 175 -340
5955 -340 82 -430 37 203 184 227 -20 110 228 79 89 306 -34 346 160 202 -120 125 109 -273 333 51
5977 51 -226 428 -120 -149 22 85 -264 94 -4 97 -156 381 -71 -236 159 135 142 131 -188 214 -9 -290 1
6000 1 -68 138 -296 129 -210 52 -108 176 134 -106 72 39 20 20 254 -56 -59 43 -129 33 -154 209 119 -220
6024 -220 3 -320 -138 -113 -201 99 361 129 8 -69 -143 20 -103 172 -157 -8 45 60 189 -271 333 37
6046 37 -130 31 57 310 -103 -68 175 83 140 170 -59 37 253 -32 295 -78 -32 -46 -134 266 -115 -40 173 -123
$$ packed form
5888a57L72j54k75O8J9o3K62k1j78R8m23N70k8l46L19k88L89k02l4L60m50K39
5910G7k7l32K96K43k86l63J26L18m90N53k43M2R2K0J61k28O9n1J05j58R2k20K04
5933@r2n7M16m27L00k40R2m36L59J66J34j80k49K67Q9L45o20O43m52q5K02n15
5955c40M22n12M67J66j9M3k47J30J18j49J0K17l40L80j86M2l22K45j6l82O06k82
5977E1k77O54n48k9J71O3l49L58r8J01k53N37m52j65L95k4Pj1l19M02k23k81K91
6000Ao9K06m34M25l39K62j60K84m2k40J78l3j9%K34l10lJ02j72J62j87L63r0l39
6024b20K23l23J82K5q8L00K62k32j21p7p4J63j23K75l29J49N3J5J29m60O04k96
6046C7j67J61K6K53m13L5K43r2N7L0k29R6K16k85L27l73M6j4q8M00l81P5K13k96
$$ plain form
6070 -123 103 45 -89 34 -236 76 -321 47 -99 209 34 -85 -98 197 -133 -112 128 -340 165 -23 47
6091 47 49 -183 -58 -285 -191 -184 -284 168 152 -31 40 -59 -315 129 -160 470 -156 61 -54 -73 110 -143 80
6114 80 -23 37 315 82 473 381 -49 237 -94 212 70 -100 80 82 -44 106 26 98 240 -52 106 -46
6136 -46 -113 107 189 329 26 62 -199 16 -168 242 86 270 -103 8 75 -184 65 295 322 62 97 397
6158 397 21 74 181 -202 -26 -66 -18 -53 -93 86 201 146 160 -243 222 270 -48 -63 -97 169 -29 12 101 -73
6182 -73 319 -30 64 207 -151 -140 259 -181 132 95 -398 118 -146 438 74 73 -109 31 95 -133 238 -53
6204 -53 180 345 -22 165 331 -213 -196 -83 -103 130 -85 175 69 -2 79 76 146 -76 -49 183 351 -5 272
6227 272 -298 -46 0 -205 -122 -179 -73 -78 10 142 51 120 -46 -63 65 -186 184 -71 -118 -37 -118 22 -205 60
$$ packed form
6070a23K26n8j34J23k70L12l97L68j46L08j75j19j3K95l30K1K40m68N05j88P0
6091D7Kk32J25k27R4Pj00M52j6j83P1r9k56M44k89O30o26K17j15j9J83k53K23
6114H0j03O0K78k33L91r2m30K86l31L06j42j70J80Kj26J50q0P2J42k92J58j52
6136d6o7K20Q2J40l03L6k61K15j84M10j56J84l73J11O7k59K49K30K7k60L5L00
6158C97l76N3J07l83J76m0M8l5m0J79J15n5J4m03M65M8l18j5l4K66j98M1Q9j74
6182g3L92l49R4J43l58J1L99m40L13l7m93N16k64N84l64jj82J40O4k28L71k91
6204e3K33J65l67J87J66n44J7J13k0K33k15K60j06p1Q1lP0k22K7K32J68l56K77
6227B72n70K52M6k05Q3n7J06nQ8J32r1O9j66j7J28k51L70k55m7Q1q1J40k27K65
$$ plain form
6251 60 -109 -7 -95 122 -166 39 205 149 221 -274 -55 -73 -71 15 342 222 -4 -115 30 361 -255 242 -177
6274 -177 -71 -212 -117 244 -67 272 -353 100 144 246 -134 64 -177 65 -63 -213 72 -175 102 -228 127
6295 127 -61 -51 130 38 -140 -11 -79 -207 -35 -215 -77 -432 -101 107 -122 23 -108 147 -103 -167 76
6316 76 -276 250 -142 22 195 -77 166 -147 -186 -67 -27 -177 300 -122 38 267 35 -20 -279 46 -210
6337 -210 138 490 -225 91 -8 -230 -71 -110 -163 142 -231 -233 155 -291 345 -48 109 131 265 244 121 175 -1
6360 -1 14 149 157 9 -181 -85 122 167 66 129 -19 148 165 -134 242 -89 -195 -6 -32 2 -30 102 213 -103
6384 -103 260 124 59 -52 118 -175 -290 -66 207 -309 329 145 320 -272 57 94 -52 -69 -29 -210 -60
6405 -60 -12 144 -62 143 -328 -77 193 -77 -8 -81 106 0 167 -195 -121 -58 -93 123 144 -128 -47 -189 64
$$ packed form
6251F0j69J02q8K17k88K05J66n6P2m95K19j8KQ6L27j20k26j11J45L31o16M97m19
6274a77J06j41R5L61l11L39o25M53M4J02l80J98k41K42j28j50K85k47K77l30L55
6295A27j88J0J81r2j78J29o8j28J72j80J38l55L31K08k29J45j31K55k50o4K43
6316G6l52N26l92J64J73k72K43l13l9J19M0j50M77m22J60K29k32n5k59L25k56
6337b10L48L52p15L16r9k22J59l9n3L05l73kL88m46O36l93J57K2J34k1j23N4j76
6360aJ5J35Qj48j90R6K07M5j01O3j48J67J7k99L76l31j06J89k6L4l2J32J11l16
6384a03L63j36o5j11J70k93j15K24K73n16O38j84J75n92L29L7j46j7M0j81J50
6405f0M8J56k06K05m71K51K70k70O9p3J87j06J67l62P4O3l5K16K1k72Q1j42K53
$$ plain form
6428 64 108 -146 31 240 -79 -230 -8 -74 -299 26 26 47 68 114 128 55 14 -145 355 -46 288 92 -68 -116
6452 -116 -176 39 -186 -129 -148 40 75 -141 248 539 -66 221 -25 -13 69 -204 -326 -32 -45 -178 -31 -191
6474 -191 -19 -78 21 -177 175 -410 239 -199 -31 -96 29 -58 15 -18 19 375 250 137 61 -237 2 70 35
6497 35 134 -18 -36 41 42 -204 -66 -3 -104 -130 247 38 -25 -136 96 197 13 -78 -133 172 252 -193 -11 104
6521 104 250 159 -314 -137 -114 -195 -179 16 -68 124 32 -85 -78 -239 122 -208 110 -19 -82 120 114 -214 233 148
6545 148 34 172 -93 25 -120 173 -113 -61 141 -180 23 38 -45 158 -94 179 213 4 38 79 -324 -153
6567 -153 -122 -183 -208 -89 290 341 21 -57 87 -24 -380 134 92 152 -164 -28 159 -297 17 44 -137 19 -90
6590 -90 -212 -120 -301 -79 -246 -37 21 -69 89 -28 30 -319 -46 115 112 -194 -221 -28 -314 133 19 -55 17
$$ packed form
6428F4M4k54J77K09l19j51K22o6k25L25%K1K1M6J4p3m1j59N00m01L34j96j60m8
6452a16o0K15k25N7j9J88L5k16L89K91o05K87k46J2Q2k73j22K94j3j33J47j60
6474a91J72n9R9j98L52n85O49m38J68o5J25q7P3l3L7L56j25j13p6k98K39O8l5
6497C5R9j52j8P7Jk46J38O3j01k6L77k09o3j11K32J01j84r1n5L05Q0m45J82J15
6521A04J46r1m73J77K3q1J6J95q4J92r2j17Pj61L61l30L18j29o3K02ol28M47q5
6545A48j14J38k65J18j45K93k86N2K02l21K03J5q3K03k52K73L4k09L4M1m03J71
6567a53L1o1k5J19L79N1l20p8J44j11l56N14m2O0l16J36J87m56L14K7j81J56j09
6590i0j22R2j81K22j67K09N8r0J58j17N8l49K73J61ll06k7J93k86M47j14p4P2
$$ plain form
6613 17 226 -91 -141 -57 16 98 23 -148 84 -184 3 292 -49 1 -230 91 372 31 -88 -90 -259 132 250
6636 250 -140 -36 33 -227 -192 -129 -134 -6 43 -120 94 25 152 83 -200 -316 -86 171 60 48 14 -135 156
6659 156 -14 -151 -242 282 368 -58 225 123 502 151 -358 25 225 -131 28 -92 249 -132 -19 -159 178
6680 178 362 -28 -19 150 -275 -10 75 -50 -268 -170 3 349 -71 319 19 -17 -145 -46 -206 -105 -27 -48 14
6703 14 209 66 245 -159 -193 -1 223 -31 35 56 -120 -88 -271 106 -110 58 -192 22 110 -200 -46 58
6725 58 55 -47 -222 -113 -113 208 135 99 133 -324 -216 -261 -32 50 84 -339 -145 90 218 26 -8 41 -10 -273 220
6750 220 -108 53 351 137 176 -97 -4 -60 -170 99 64 22 187 -13 -272 386 71 250 166 5 -178 -132
6772 -132 175 42 -127 -70 -382 150 5 36 33 -17 -284 113 -49 -260 -294 -127 99 -5 132 -261 23 -166
$$ packed form
6613A7K09l17n0Q4P3Q2p5j71K32k68J87K89l41N0k31L21K81l41j19kj69L91J18
6636B50l90J04O9k60L5O3nJ28M9j63K14o9J27o9k83j16K30K57j11j2l4j49K91
6659A56j70j37r1N24Q6m26K83j02L79l51n09L83K00l56J59j20L41l81J13j40L37
6680A78J84l90RJ69m25K65Q5j25k18R8J73L46m20L90l00l6j28R9j60J01P8k1O2
6703A4J95j43J79m04l4J92K24k54O6K1j76L2j83L77k16J68k50K14Q8l10J54J04
6725E8lj02j75J09%L21p3l6L4m57J08m5K29Q2L4m23J94K35J28j92l4M9n1k63M93
6750B20l28J61K98k14L9k73R3n6j10K69l5m2J65k00k59O58l15J79q4j61j83M6
6772a32L07j33j69N7l12N32j45L1ln0k67L97j62k11l4J67K26j04J37l93K84j89
$$ plain form
6794 -166 79 46 105 31 -210 218 296 -226 144 -231 27 133 -50 103 -107 -101 82 -158 36 221 117 28
6816 28 -90 42 125 -215 99 275 -69 182 -155 -134 212 96 -43 97 -97 7 49 -37 -67 85 -231 143
6838 143 49 59 105 216 40 -186 153 -43 63 -66 143 -78 -290 65 263 310 307 -71 244 -16 101 278
6860 278 -121 5 -102 -25 81 101 -56 -42 -123 -94 -27 76 -141 -111 -253 -68 -17 42 -80 -100 -237 -165 247 412
6884 412 5 72 86 206 -190 218 19 60 107 28 277 133 -54 -25 10 -147 127 -32 321 -250 0 65 24
6907 24 -40 -101 -128 58 -72 69 242 103 -2 35 -296 91 -4 319 116 -188 109 50 106 34 -79 165 -31
6930 -31 158 -26 -442 82 -209 -109 4 -298 20 -9 -67 126 -75 315 133 -271 60 30 -25 -139 37 285
6952 285 -111 -19 -83 -247 64 -152 -87 89 -105 280 -68 73 37 -147 418 -131 30 114 -78 198 194 74
$$ packed form
6794a66K45l3N9p4k41M28P8n22L70l75K58J06j83J53k10OJ83k40J94J85j04q9
6816B8j18J32Q3l40L14J76l44K51l37K1L46j16j39J40j94J04M2q6l0J52l16L74
6838A43r4J0M6J11j76k26L39j96J06j29K09k21k12L55J98M7ll78L15k60J17J77
6860B78l99J26j07P7J06K0j57J4q1K9O7J03k17L0j42J85N1N9j22k0j37P2M12J65
6884D12m07O7J4J20l96M08j99M1M7p9K49j44j87K9L5j57K74j59L53n71K50O5m1
6907B4o4o1k7J86j30J41J73j39j05L7l31L87r5L23k03l04K97n9N6p2j13K44j96
6930c1J89j84m16N24k91J00J13l02L18k9n8J93k01L90j82m04L31l0n5j14J76K48
6952B85l96R2o4j64L11k16O5J76j94L85l48J41l6j84N65n49J61Q4j92K76mj20
$$ plain form
6974 74 -8 -146 155 -157 30 189 -308 36 118 -39 23 110 21 -34 19 209 -37 -214 366 116 83 57 -49
6997 -49 5 -88 -226 208 -180 417 -88 -296 -284 12 47 -267 -1 127 -61 80 30 18 7 169 137 -135 -229
7020 -229 -179 83 -49 13 -90 90 -9 130 -73 -194 65 -66 -18 313 -67 556 30 82 351 -258 107 306
7042 306 -82 18 -120 -45 137 -230 146 130 -43 -252 -182 178 171 137 -54 -133 -69 -18 -108 -38 -84 24 -77 -243
7066 -243 -66 18 134 -28 -186 196 -73 3 295 -22 211 -42 294 218 -310 1 -11 43 183 -196 101 -296
7088 -296 140 -326 -416 108 2 -219 12 -137 -52 245 183 208 290 -107 331 -19 162 -37 -330 -15 4 -126
7110 -126 53 49 154 -199 57 45 -154 1 -446 206 290 5 -34 -71 -105 -57 211 -62 -305 -121 -49 -129 -230
7133 -230 144 149 32 14 -141 72 133 99 170 65 8 84 -150 -160 -116 12 -118 165 -160 -139 -94 -180 207 109 255
$$ packed form
6974G4q2j38L01l12J87J59m97L44Q2j57O2Q7q9n5N3J90k46j77N80k50l3k6j06
6997d9N4r3j38M34l88N97n05k08J2K96L5l14K66J28j88J41n0j2j1J62l2k72r4
7020b29N0K62j32O2j03J80r9J39k03j21K59j31M8L31l80O23n26N2K69o09L65J99
7042C06l88J00j38P5J82l67L76j6j73k09P0L60pl4j91p9O4N1r0P0m6J08j01j66
7066b43J77Q4J16j62j58L82k69P6K92l17K33k53L36p6n28L11j2N4J40l79K97l97
7088b96M36m66r0N24j06k21K31j49Q5K97o2K5Q2l97M38l50J81j99k93L15J9j30
7110a26J79mJ05l53K56j2j99J55m47O52Q4k85l9l7l4M8K68k73k43J84P2q0j01
7133b30L74Nj17j8j55K13O1l4P1j05n7P6k34j0M4J28j30K83l25K1M5q6L87r8J46
$$ plain form
7158 255 201 -32 156 -23 25 -37 -103 -22 -39 44 77 109 -90 -34 -288 62 -220 130 89 299 87 171 171 -84 113
7183 113 86 123 242 102 -103 142 -276 -195 22 -224 84 -102 -38 -29 362 -251 66 123 64 39 11 266 101
7206 101 24 -45 90 115 -139 -67 13 -297 203 -41 25 42 73 329 -88 20 90 -154 141 -203 -146 43 -45 -78
7230 -78 140 43 -153 166 283 -27 16 277 -12 -12 -75 -260 -431 -73 80 -38 79 300 -125 70 -70 -8
7252 -8 319 110 -254 20 -93 -106 -16 -138 227 25 116 -80 -322 44 -347 -90 -232 -94 179 -354 -171 -182
7274 -182 -130 92 -197 140 351 -46 47 173 47 -174 238 65 89 -118 102 114 -4 20 -239 99 74 28
7296 28 174 171 -187 183 -52 -266 -8 9 -150 -222 248 -110 -22 525 -92 -100 -86 181 20 -55 124 -252 -85
7319 -85 -154 -30 -85 17 33 36 -206 -72 63 174 -145 -224 -43 -16 -77 -48 -62 195 9 39 -95 216 -258 -17
$$ packed form
7158B55n4k33J88j79M8o2o6Q1j7Q3L3L2j99N6k54L50k82L50m1K10k12Q4%k55J97
7183A13k7L7J19j40k05K45m18Q1K17k46L08j86O4RL91o13L17N7n9k5k8K55j65
7206A01p7o9J35K5k54P2Q0l10N00k44O6J7L1K56m17J08P0k44K95l44N7J89q8l3
7230g8K18r7j96L19J17l10M3K61k89%o3j85j71L58J53j18J17K21m25J95j40O2
7252hL27k09l64K74j13j3R0j22L65k02R1j96k42L66l91K57j42J38K73n33J83j1
7274a82N2K22k89L37K11l97R3J26j26k21M12j73K4k07K20J2j18K4k59L38k5m6
7296B8J46ll58L70k35k14K58J7j59p2M70l58Q8N47o17qJ4K67j61p5J79l76J67
7319h5o9J24n5J02J6Lk42J34J35J11l19p9J81K7o1K9j4K57j86L0j34L11m74K41
$$ plain form
7343 -17 19 -2 -140 -81 73 -13 253 -198 137 -14 44 -4 -98 164 111 -114 178 265 -240 209 34 155 -283
7366 -283 34 269 -199 -69 -42 -89 118 0 59 -26 -114 -22 -314 -75 564 -111 -7 70 -71 94 173 -118 58
7389 58 -23 48 -106 -83 31 -76 161 119 -200 101 69 -121 0 -197 111 -176 66 -139 -365 130 -32 104
7411 104 54 -190 269 57 -235 -96 -120 143 169 191 91 88 -278 -144 146 -203 156 -49 -374 -184 281 -76
7433 -76 -7 252 -620 68 -35 75 31 -119 229 -2 -209 62 47 100 49 10 -32 -260 -20 15 100 30 42 96
7457 96 288 -23 122 49 10 161 197 128 -27 215 445 -128 34 97 155 77 -288 178 -171 122 219 51 -185
7480 -185 -64 -152 128 -289 188 70 -178 191 -102 -197 215 26 -47 74 217 -28 -34 83 129 -224 -47 204
7502 204 54 194 172 132 -117 65 -445 -403 -63 -188 -59 58 26 51 -179 77 19 79 173 -50 -133 278 -309
$$ packed form
7343a7L6k1j38N9J54q6K66m51L35j51N8m8r4K62n3k25K92Q7n05M49j75J21m38
7366b83L17K35m68J30K7m7K07j18N9q5q8R2k92K39O39o75J04P7j41J65P9k91J76
7389E8q1P1j54K3J14j07K37m2l19L01l2j90J21j97L08k87K42k05k26M95j62J36
7411A04n0k44M59k12k92J39k4K63K6K2j00ll66J34K90l49L59k05l25J90M65l57
7433g6O9K59q72O88j03J10m4j50L48k31k07K71j5N3n1l9m2k28K40L5Q5p0J2N4
7457I6J92l11J45p3l9J51L6o9j55K42K30n73J62O3N8p8l65M66l49K93R7j68k36
7480a85J21q8K80m17M77j18k48L69k93r5M12j89p3J21J43k45oJ17M6l53J77K51
7502B04j50J40k2m0k49J82n10M2L40j25J29J17l2K5k30K56n8O0R4k23q3M11n87
$$ plain form
7525 -309 585 342 -33 165 -118 138 -83 -36 -212 205 -29 -189 -326 34 -225 -219 202 -55 19 -114 -44 15
7547 15 65 54 233 -177 -160 87 -240 56 127 6 121 -375 180 -326 69 175 27 -122 -83 -148 -123 -256 -157
7570 -157 -181 317 -99 158 12 -421 -198 -130 -73 74 -92 74 120 120 65 -35 -19 -240 -62 127 238 105 219
7593 219 123 114 -139 93 -58 -152 -44 -65 32 -71 173 337 -221 260 -81 -142 -38 -109 2 -121 135 210 207 -163
7617 -163 91 207 -26 190 13 -73 338 -150 51 172 -113 165 56 272 50 131 27 -16 20 -256 257
7638 257 -157 -161 167 -51 27 309 82 -270 117 -50 -244 -254 122 63 -140 118 -59 7 -83 -90 -68 113 -32
7661 -32 258 181 202 77 38 266 84 163 -64 -6 -40 -40 228 104 18 201 -82 -169 -9 -74 219 268 81 78 -41
7686 -41 82 -98 162 114 -6 -113 229 37 87 122 60 93 -64 -32 69 20 467 -58 116 25 -96 102 -57
$$ packed form
7525c09Q94k43l75J98k83K56k21M7j76M17k34j60j37L60k59OM21k57P4j33P0N9
7547A5N0j1J79m10J7K47l27K96P1j21J15m96N55n06L95J06j48j49L9o5K5j33R9
7570a57k4M98m16K57j46m33K23O8N7J47j66J66M6%n5j00J6k21J78J89J11j33J14
7593B19r6rk53K32j51r4J08k1R7j03K44J64n58M81l41o1J04p1J11j23K56P5ll70
7617a63K54J16k33K16j77q6M11m88K01J21k85K78j09K16k22Q1j04m3L6k76N13
7638B57m14mL28k18P8K82k27l52L87j67j94j0L76n9k03K58j77O6r0pK2J81j45
7661c2K90p7K1j25l9K28j82P9k27N8l4%K68j24q6J83k83q7J60o5K93M9j87lj19
7686d1J23j80K60m8j20j07L42j92N0L5o2L3j57L2J01m9M47n25J74r1j21J98j59
$$ plain form
7709 -57 121 2 144 -170 -162 25 28 240 -280 -289 180 60 -91 139 -125 -217 -19 -67 85 -288 -28 199 -13
7732 -13 261 -331 -99 78 -223 -83 47 -144 -33 -145 89 110 -19 200 -135 -17 238 -71 121 -7 103
7753 103 -231 -6 24 42 -190 -98 -126 75 9 32 130 -109 110 -71 69 -26 49 86 114 -153 -16 175 -149 10
7777 10 21 49 -40 -123 -78 49 158 -217 58 205 13 245 -19 -432 178 -45 53 101 30 246 130 -239 22
7800 22 -67 144 -109 79 -16 -239 59 -359 12 250 -424 94 -98 -10 124 -215 111 -308 123 -124 -23
7821 -23 97 77 299 22 257 -210 -54 -67 -20 -31 -225 256 132 124 -220 272 -21 -142 -5 -166 -19 241
7843 241 -156 -60 3 -66 -21 67 219 -172 124 97 -320 -154 -7 415 -113 108 188 91 -271 53 -6 -145 97
7866 97 -119 61 53 41 -100 30 122 130 -311 159 240 -11 50 -246 76 163 -96 -124 -256 35 296 66 89 -243
$$ packed form
7709e7J78j19J42l14QJ87LK12n20rM69j20j51K30k64r2J98m8J52l73K60K27k12
7732a3K74n92K32J77l01J40J30j91J11j12K34K1j29K19l35J18K55l09J92j28J10
7753A03l34K25L0J8k32R2k8K01o6K3R8k39K19j81J40r5P5L7K8k67J37J91l24J59
7777A0J1K8q9q3M5J27J09l75K75J47j92K32k64m13O10k23R8M8p1K16j16l69K61
7800B2q9K11k53J88r5k23K98m18L71K38o74N18j92Q8J34l39L26m19M31k47J01
7821b3J20k0K22k77K35m67J56j3M7j1j94M81j24ql44M92k93j21J37j61J47K60
7843B41l97R6O3o9M5Q8J52l91K96k7m17J66J47M22n28K21Q0r7l62L24n9j39K42
7866I7k16J80qj2j41J30R2Qm41M70Q1k51O1k96L22Q7k59k8j32K91K61k30K3l32
$$ plain form
7890 -243 -159 57 200 296 -289 -90 -7 -83 -37 67 -41 -3 110 -96 263 -79 -119 -68 -145 -6 -116 -84 62
7913 62 -39 49 -60 -171 -422 77 -234 -349 109 311 -53 224 -291 -339 171 -46 4 -110 224 288 -1 -142
7935 -142 142 139 259 -219 16 29 28 201 -79 362 -289 -238 -161 -168 51 10 -155 124 -23 150 205 91 -272 39
7959 39 -66 72 340 172 -295 100 203 91 122 -14 300 -70 14 -98 -54 -148 48 319 -73 -166 -78 -349
7981 -349 21 -226 46 -332 5 55 147 127 308 -44 26 -125 -177 62 63 153 -269 255 34 365 -145 58 319
8004 319 -121 36 -66 24 -20 -73 130 -10 -173 -229 445 -126 -94 -151 -9 137 -123 217 -38 207 126 117 -118
8027 -118 -217 67 -138 -161 106 65 169 106 -37 49 7 -171 167 -8 -27 -55 -92 241 -109 211 56 148 278
8050 278 -130 -72 57 -247 2 57 -33 16 240 377 -245 146 -18 92 345 38 29 -4 -79 53 -71 248 -43
$$ packed form
7890b43Q4K16J43R6n85J99Q3p6M6J04j08L8J13k06L59l42m0N1p7J39j10L2J46
7913F2j01Q8j09j11k51M99l11j15M58K02l64K77n15m8N10k17N0j14L34O4k89j41
7935a42K84lJ20m78K35J3jJ73k80M41o51N1P7pK19m1j65K79j47J73N5j14l63L11
7959C9j05J38K68j68m67L95J03j12L1j36L14l70Q4j12M4r4J96K71l92r3Q8k71
7981c49L70k47K72l78L37N0R2k0J81l52P0j51n2K39JR0m22N24k21L31n10K03K61
8004C19m40J57j02R0m4n3K03j40j63n6O74n71L2n7J42J46k60L40k55K45q1rk35
8027a18r9K84k05k3K67m1J04o3j43Q6m2j78L38j75j9k8l7L33l50L20j55R2J30
8050B78m08N8J29l04K49N5r0M9K24J37o22L91j64J10K53l07rl3p5J32j24L19k91
$$ plain form
8073 -43 130 203 -98 292 137 -137 -54 -277 32 -224 -375 12 -16 -64 -42 -37 27 36 158 175 -19 26 194 -357
8097 -357 49 -168 -330 247 -66 178 -170 272 146 -302 -266 19 32 30 -37 -266 90 -145 -213 -87 -35 148
8119 148 62 200 -61 -256 -155 -118 21 -157 52 -37 72 231 -32 3 45 158 92 -48 55 -1 106 -188
8141 -188 174 71 -99 55 -48 -13 -15 122 -145 30 81 -314 -15 -159 -215 32 136 26 198 -315 15 -129
8163 -129 -128 93 314 -113 -4 204 171 -354 97 109 21 283 -97 108 -66 -4 -125 -10 33 59 -98 130 -21
8186 -21 180 109 0 26 -27
$$ packed form
8073d3J73P3l01L90j55k74Q3k23L09k56j51L87k8m8K2NO4RJ22J7j94M5J68n51
8097c57M06k17j62N77l13K44l48M42j26m48L6K85J3ko7k29L56k35o8J26N2J83
8119A48q6J38k61j95J01L7J39j78K09q9J09J59k63L5M2J13o6j40J03n6J07k94
8141a88L62j03j70J54j03L5kJ37k67J75N1l95K99j44n6K47J04j10J72n13L30j44
8163a29JK21K21m27J09K08l3n25M51J2q8K62l80K05j74O2j21J15M3K6j57K28j51
8186b1K01p1j09K6n3
8191b7
$$ Imaginary data points
##PAGE= N=2
##DATA TABLE= (X++(I..I)), XYDATA
$$ plain form
0 0 0 0 0 0 0 0 -8 8 -8 8 -16 16 -24 24 -32 40 -48 56 -65 80 -94 109 -126 145 -167 191 -221 248 -282 319
30 319 -360 405 -455 510 -569 635 -707 784 -871 965 -1069 1184 -1311 1451 -1608 1782 -1979
47 -1979 2201 -2455 2749 -3097 3509 -4009 4633 -5437 6516 -8048 10417 -14614 24378 -96449
61 -96449 -9312 76758 16665 68752 -87814 -5718 91181 83372 33889 -66726 -70734 -25756
73 -25756 55018 100897 -20010 -17277 -26445 13964 108818 13885 -34184 -70022 -65329 79460
85 79460 43963 18130 -30846 -101568 36460 51572 14243 -12399 -122148 -33399 42486 48810
97 48810 39473 -77622 -55316 864 35622 63457 -48230 -53891 -17332 31872 119249 24913
109 24913 -18145 -26819 -34501 77904 27530 -28487 -34198 -68399 55222 78531 30331 4979
$$ packed form
0@%%%%%%qJ6j6J6k4L2m0M8n6P2q8J04j21J45j74K03k35K71l12L58m12M69n30O01
30C19o79P65q60R65j079J204j342J491j655J836k034K253k495K762l059L390l761
47a979M180m656N204n846O606p518Q642j0070J1953j4564J8465k5031L8992j20827
61i6449Q7137Q6070o0093N2087j56566Q2096R6899p809m9483j00615m008M4978
73b5756Q0774M5879j20907K733r168M0409R4854r4933m8069l5838M693J44789
85G9460l5497k5833m8976p0722J38028J5112l7329k6642j09749Q8749P5885O324
97D8810r337j17095K2306N6180L4758K7835j11687n661L6559M9204Q7377r4336
109B4913m3058q674p682J12405n0374n6017n711l4201J23621K3309m8200k5352
$$ plain form
121 4979 -79682 -13592 27927 6012 -4679 -98809 -51803 18633 40582 70893 -34885 -47686
133 -47686 -8710 943 63116 -22927 -63425 -27820 -15182 87102 53886 -8771 -9962 -38128
145 -38128 51269 52371 -5904 -15085 -70695 12220 62127 26355 21512 -62567 -31433 29799 16167
158 16167 29822 -54029 -57169 4061 11894 55796 -19039 -63050 -25244 -22447 50241 16947 -37617
171 -37617 -12463 -22029 58921 60787 -8085 -11223 -56281 5002 50139 6077 9285 -40240 -2544
184 -2544 62282 37814 36140 -40851 -52327 4304 -1425 29766 -26566 -55821 1611 6414 57670
197 57670 18502 -49173 -24116 -37064 20989 25808 -38128 -18877 -33121 22918 64638 9082
209 9082 4442 -37431 -10351 45423 13184 17405 -31471 -28590 38305 23895 38746 -12615 -49278
$$ packed form
121D979q4661O6090M1519k1915j0691r4130M7006P0436K1949L0311j05778j2801
133d7686L8976R653O2173q6043m0498L5605J2638J02284l3216o2657j191k8166
145c8128Q9397J102n8275r181n5610Q2915M9907l5772m843q4079L1134O1232j3632
158A6167J3655q3851l140O1230P833M3902p4835m4011L7806K797P2688l3294n4564
171c7617K5154r566Q0950J866o8872l138m5058O1283M5137m4062L208m9525L7696
184b544O4826k4468j674p6991j1476N6631n729L1191n6332k9255N7432M803N1256
197E7670l9168o7675K5057j2948N8053M819o3936J9251j4244N6039M1720n5556
209I082m640m1873K7080N5774l2239M221m8876K881O6895j4410J4851n1361l6663
$$ plain form
222 -49278 6491 3511 36414 8561 -48876 -9088 -11348 27681 25634 -44431 -28484 -36785 6099
235 6099 42322 -11841 -5867 -26763 -1418 49228 4489 -850 -36994 -35645 32486 18034 29409
248 29409 -473 -26737 32146 23727 34048 5237 -52978 -11957 -7803 20993 26934 -31520 -6677
261 -6677 -6040 19472 40245 -24935 -25813 -38500 -19223 32063 -7851 -7712 -21933 -19286 41940 16549
275 16549 9536 -14876 -40970 18952 15438 20919 8372 -35216 11305 17208 27498 25798 -34475
288 -34475 -8725 -1101 16143 38894 -19832 -14197 -14146 -5546 34436 -14145 -21543 -25420 -24848 34281
302 34281 10153 238 -11002 -33746 19509 8718 122 -8568 -46018 6144 18824 23853 30081
315 30081 -22106 3709 13810 13555 28053 -28769 -21244 -5904 2538 42876 875 -6720 -2761
$$ packed form
222d9278N5769k980L2903k7853n7437L9788k260L9029k047p0065J5947q301M2884
235F099L6223n4163N974k0896K5345N0646m4739n339l6144J349O8131j4452J1375
248B9409k9882k6264N8883q419J0321k8811n8215M1021M154K8796N941n8454K4843
261f677O37K5512K0773o5180q78j2687J9277N1286l9914J39j4221K647O1226k5391
275A6549p013k4412k6094N9922l514N481j2547m3588M6521N903J0290j700o0273
288c4475K5750P624J7244K2751n8726N635N1Q600L9982m8581p398l877N72N9129
302C4281k4128r915j1240k2744N3255j0791q596q690l7450N2162J2680N029O228
315C0081n2187K5815J0101k55J4498n6822P525J5340Q442M0338m2001p595L959
$$ plain form
328 -2761 -9814 33417 -83 -20519 -22456 -38946 15620 11393 -1164 -374 -32561 9916 17008
341 17008 3532 6229 -39134 -10592 10699 9740 28714 -18025 -9401 10068 7114 35992 -6587
354 -6587 -16467 -205 -4400 37270 10344 -11527 -4993 -22621 20051 10414 -13254 -6934 -31906
367 -31906 9893 20922 1509 6662 -33856 -10948 7976 -6316 8700 -29670 -17470 13196
379 13196 9356 36150 -1337 -14449 5592 -5876 25230 -643 -21453 -1123 -10163 31875
391 31875 26747 -1839 6810 -19446 9801 15915 -13513 -4897 -33362 -7398 19275 1922 14771
404 14771 -19800 -15978 11095 -4940 12346 -18521 -27706 3854 -2827 25720 6155 -17672 3999
417 3999 -7126 21391 15803 -14649 2051 -12044 16836 27565 -3783 4601 -19783 -3013 20522
$$ packed form
328b761p053M3231l3500k0436j937j6490N4566m227j2557P90l2187M2477P092
341A7008j3476K697m5363K8542K1291r59J8974m6739Q624J9469k954K8878m2579
354f587r880J6262m195M1670k6926k1871O534j7628M2672r637k3668O320k4972
367c1906M1799J1029j9413N153m0518K2908J8924j4292J5016l8370J2200L0666
379A3196l840K6794l7487j3112K0041j1468L1106k5873k0810K0330r040M2038
391C1875n128k8586Q649k6256K9247O114k9428Q616k8465K5964K6673j7353J2849
404A4771l4571L822K7073j6035J7286l0867r185L1560o681K8547j9565k3827K1671
417C999j1125K8517n588l0452J6700j4095K8880J0729l1348Q384k4384J6770K3535
$$ plain form
430 20522 -4338 6641 -17790 -11765 20062 2152 12891 -14609 -28520 1077 -10400 8515
442 8515 -4152 -25040 5413 -402 21837 17103 -17913 -1801 -15092 4746 16987 -13752 2191
455 2191 -7837 9357 34839 5211 10466 -11303 -13129 16216 -4859 3586 -11363 -20119 16016
468 16016 5121 15179 1536 -25423 1278 -8948 4225 3257 -27263 -3142 -7080 8670 20592
481 20592 -13654 -1815 -10148 -1387 22795 -5800 2506 -5424 -5181 26377 4382 6160 -5270
494 -5270 -18159 15508 3614 9688 4208 -17896 11364 4065 7908 5809 -27799 -7493 -9103
507 -9103 -892 13645 -16352 -1550 -1452 1570 21581 -10632 -9074 -12693 -15204 16817 -1549 2410
521 2410 2450 -7210 25524 10786 6639 1959 -22580 5986 2324 3335 9962 -16742 6980 8419
$$ packed form
430B0522k4860J0979k4431O025L1827j7910J0739k7500j3911K9597j1477J8915
442H515j2667k0888L0453n815K2239m734l5016J6112j3291J9838J2241l0739J5943
455B191j0028J7194K5482k9628N255k1769j826K9345k1075Q445j4949q756L6135
468A6016j0895J0058j3643k6959K6701j0226J3173r68l0520K4121l938J5750J1922
481B0592l4246J1839q333Q761K4182k8595Q306p930K43L1558k1995J778j1430
494e270j2889L3667j1894O074n480k2104K9260p299L843k099l3608K0306j610
507i103Q211J4537k9997J4802R8L022K0011l2213J558l619k511L2021j8366L959
521B410M0r660L2734j4738m147m680k4539K8566l662J011O627k6704K3722J439
$$ plain form
535 8419 6570 15946 -18163 -9070 -6393 -7783 14152 -13104 -7871 -2934 -7856 19258 -3312 -7208
549 -7208 -5440 -17497 14493 4519 -751 4841 -14732 12907 10034 2119 7409 -18527 3209 9171
563 9171 5147 18074 -10276 131 6273 -1632 14322 -14046 -13147 -3337 -9127 17716 -718 -5765
577 -5765 2151 -12029 12368 -660 -13056 -5463 -21720 5330 8261 396 10851 -10513 7417
590 7417 12535 -183 9384 -16820 -7047 6978 -105 18883 -2954 -2629 10610 -2190 16106
603 16106 -3548 -13879 -1237 -12826 10881 3680 -9036 2161 -13838 6391 5848 -9885 359
616 359 -18315 -607 9947 -3207 9688 -11541 -4287 10005 -3397 11205 -7319 -8005 11181
629 11181 841 18547 4189 -7846 6788 -7234 9410 2350 -13133 1981 -9151 10145
$$ packed form
535H419j849R376l4109R093K677j390K1935k7256N233M937m922K7114k2570l896
549g208J768j2057L1990r974n270N592j9573K7639k873p915N290k5936K1736N962
563I171m024J2927k8350J0407O142p905J5954k8368Q99R810n790K6843j8434n047
577e765P916j4180K4397j3028j2396P593j6257K7050K931p865J0455k1364J7930
590G417N118j2718R567k6204R773J4025p083J8988k1837L25J3239j2800J8296
603A6106j9654j0331J2642j1589K3707p201j2716J1197j5999K0229n43j5733J0244
616C59j8674J7708J0554j3154J2895k1229P254J4292j3402J4602j8524o86J9186
629A1181j0340J7706j4358j2035J4634j4022J6644p060j5483J5114j1132J9296
$$ plain form
641 10145 12843 -5649 5061 -13149 -2932 6077 -13198 -870 -15278 -7658 12166 -901 11280
654 11280 -3584 -9033 8721 -4955 6836 -3198 -13547 7331 -1353 14461 10976 -6593 8261
667 8261 -4454 6408 9754 -11214 1669 -8625 1148 14391 -5370 3953 -8616 -7664 9191
680 9191 -7681 1693 -7876 -12107 9115 -3022 6101 -1522 -14321 5111 -5037 5311 4967 -11888
694 -11888 7674 246 8613 14391 -8287 3233 -4899 -1108 12074 -7044 3851 -2021 -943
707 -943 17318 -1651 3549 -5104 -13987 5836 -7376 -1170 -2631 -13789 8524 143 5113 5361
721 5361 -14671 1525 -5306 -1908 6962 -12116 2682 901 3375 16548 -3838 2908 -1056 -4655
735 -4655 12837 -3972 1086 667 -6920 13850 619 1881 1136 -13448 5586 -1739 -1266 3154
$$ packed form
641A0145K698j8492J0710j8210J0217R009j9275J2328j4408P620J9824j3067J2181
654A1280j4864n449J7754j3676J1791j0034j0349K0878q684J5814l485j7569J4854
667H261j2715J0862L346k0968J2883j0294R773J3243j9761R323j2569R52J6855
680I191j6872R374r569m231K1222j2137R123p623j2799J9432j0148J0348l44j6855
694a1888J9562p428Q367N778k2678J1520q132L791J3182j9118J0895n872J078
707i43J8261j8969N200q653q883J9823j3212O206j461j1158K2313q381M970K48
721E361k0032J6196o831L398Q870j9078J4798j781K474J3173k0386O746l964l599
735d655J7492j6809N058m19p587K0770j3231J262p45j4584J9034p325M73M420
$$ plain form
749 3154 -13582 2987 -301 -1092 6562 -14328 -2280 -2485 -3624 11037 -7188 492 2429 -2570
763 -2570 14540 -3174 -2219 -133 -8772 11302 1776 1651 6599 -6292 11952 4162 -643 3668
777 3668 -14513 1054 -375 -3161 7304 -10234 1654 3347 -2754 9426 -10579 -6559 -1285
790 -1285 -9048 8675 -4628 -3346 4181 -5005 12027 2147 -2835 3273 -9685 7567 4001 -1293
804 -1293 7184 -7766 6670 6832 -1303 7404 -9875 -1279 4191 -4392 8376 -7015 -4143 3604
818 3604 -6133 7178 -6028 -8122 870 -8374 7755 838 -4863 4587 -7943 6249 2986 -5957
832 -5957 3960 -9231 3668 7904 -1091 9965 -4113 2051 8323 -3444 6637 -7037 -5318
845 -5318 5001 -4349 9030 -660 -4847 5241 -6114 5519 -1686 -10363 547 -9888 3298
$$ packed form
749C154j6736J6569l288p91P654k0890J2048k05j139J4661j8225P680J937m999
763b570J7110j7714R55K086q639K0074r526j25M948j2891J8244p790m805M311
777C668j8181J5567j429k786J0465j7538J1888J693o101J2180k0005M020N274
790a285p763J7723j3303J282P527r186J7032r880m982O108j2958J7252l566n294
804a293Q477j4950J4436J62q135Q707j7279Q596N470q583J2768j5391K872P747
818C604r737J3311j3206k094Q992r244J6129o917n701R450j2530J4192l263q943
832e957R917j3191J2899M236q995J1056j4078O164O272j1767J0081j3674J719
845e318J0319r350J3379r690m187J0088j1355J1633p205q677J0910j0435J3186
$$ plain form
858 3298 3626 -6480 5244 -6114 2445 6722 -6087 3960 -7338 -1362 7988 -2966 8278
871 8278 -1859 -1954 8919 -2629 7348 -677 -6661 6225 -3879 6466 2544 -7409 4823 -6186
885 -6186 2351 2910 -9778 2016 -6722 497 6494 -6610 3600 -5870 -3631 6202 -6857 2959
899 2959 -3526 -4522 9452 -1532 6913 2063 -5280 7678 -3194 3770 2319 -8209 5440 -2210
913 -2210 4667 7282 -6246 4482 -3770 -956 5327 -9176 619 -5135 -4143 7626 -5109 2643
927 2643 -2067 -6120 6690 -4672 920 -1048 -7981 6954 -1318 3667 4455 -6554 6414 -762
941 -762 2500 6139 -7187 4365 -183 841 8734 -5700 2803 -1604 -4026 7162 -6549 339
955 339 -971 -6047 7772 -3605 150 -425 -9425 4629 -3664 -1129 2524 -8191 5492 357
$$ packed form
858C298L28j0106J1724j1358Q559M277j2809J0047j1298N976R350j0954J1244
871H278j0137r5J0873j1548R977q025n984J2886j0104J0345l922r953J2232j1009
885f186Q537N59j2688J1794q738P219N997j3104J0210r470K239R833j3059R816
899B959o485r96J3974j0984Q445m850p343J2958j0872O964j451j0528J3649p650
913b210O877K615j3528J0728q252K814O283j4503R795n754R92J1769j2735P752
927B643m710m053J2810j1362N592j968o933J4935q272M985P88j1009J2968p176
941g62L262L639j3326J1552m548J024P893j4434Q503m407k422J1188j3711O888
955C39j310n076J3819j1377L755n75r000J4054q293K535L653j0715J3683n135
$$ plain form
969 357 1213 6989 -7337 3351 -98 -1771 7458 -6176 2812 2560 -1009 10349 -2614 1202 1192
984 1192 -6244 6643 -4071 -2106 1556 -7629 6292 -723 -1311 2897 -9215 2236 -1290 -3736
998 -3736 4042 -8588 2193 1856 -2130 7861 -5602 392 2231 -3588 7618 -2919 -73 3869
1012 3869 -3736 8864 -500 -1285 3581 -6519 5771 136 -2548 4276 -7050 4139 1295 -3784
1026 -3784 3866 -8860 -330 533 -5260 5474 -5549 -316 3699 -3741 6850 -3700 -3042 3083
1040 3083 -5745 6628 -398 -1427 5848 -4048 7262 2619 -2691 4413 -6859 2623 2446 -3622
1054 -3622 5548 -5634 1508 4342 -4290 4430 -6202 -3242 2420 -6126 4197 -3696 -3732 4111 -4612
1069 -4612 5319 -1208 -4579 3972 -5274 4159 2513 -3501 5588 -3742 3860 4534 -3922 5025 -4669
$$ packed form
969C57Q56N776j4326J0688l449j673R229j3634Q988k52l569J1358j2963L816j0
984A192p436J2887j0714J965L662r185J3921p015n88M208j2112J1451l526k446
998c736P778j2630J0781l37l986R991j3463N994J839n819J1206j0537K846L942
1012C869p605J2600r364p85M866j0100J2290n635k684O824j1326J1189k844n079
1026c784P650j2726Q530Q63n793J0734j1023N233M015p440J0591j0550O58O125
1040C083q828J2373p026j029P275r896J1310m643n310P104j1272R482j77o068
1054c622R170j1182P142K834q632Q720j0632K960N662q546J0323p893l6P843q723
1069d612R931o527l371Q551r246R433j646o014R089r330P602O74q456Q947r694
$$ plain form
1084 -4669 620 5216 -3812 5534 -3019 -1654 5099 -4859 3724 -3476 -5495 3786 -5403 3294 173
1099 173 -5080 4621 -4915 2120 1372 -6829 3173 -4799 1326 4805 -4128 5784 -2138 616 6364
1114 6364 -4346 4117 -2388 -2621 6324 -3604 4682 472 -3524 6058 -3681 2661 322 -6673 3726
1129 3726 -4427 967 2614 -6223 3965 -3535 -554 3889 -6759 2769 -3044 -1793 5922 -4722
1143 -4722 3725 -118 -2617 6645 -3581 2882 310 -3984 6348 -1878 2744 2337 -4527 4401 -2262
1158 -2262 305 2621 -6068 2870 -1724 -565 4228 -5232 1980 -1800 -3069 3844 -5295 758 -861
1173 -861 -3424 5707 -2645 1972 1647 -3916 5249 -2003 495 2114 -4527 4819 -285 787 4571
1188 4571 -4362 3376 -236 -1231 4312 -5377 1380 135 -2482 4851 -4057 400 -15 -4355 4150
$$ packed form
1084d669N289M596r028R346q553J365O753r958Q583p200k019R281r189Q697l121
1099A73n253R701r536P035p48q201J0002p972O125L479q933R912p922K754N748
1114F364j0710Q463o505k33Q945r928Q286m210l996R582r739O342k339o995J0399
1129C726q153N394J647q837J0188p500K981M443j0648R528n813J251P715j0644
1143d722Q447l843k499R262j0226O463k572m294J0332q226M622m07o864Q928o663
1158b262K567K316q689Q938m594J159M793r460P212l780j269O913r139O053j619
1173h61k563R131q352M617l25n563R165p252K498J619o641R346n104J072L784
1188D571q933P738l612r95N543r689O757j245k617P333q908M457m15m340Q505
$$ plain form
1203 4150 -3821 -807 611 -5045 4676 -1712 -614 2607 -4908 3989 -368 -1263 3758 -4352 3448
1218 3448 1271 -857 5404 -3928 1562 1393 -2959 4867 -3376 107 1920 -3556 4716 -2250 -1261
1233 -1261 1870 -5275 3314 -1666 -2515 2063 -4929 3054 160 -2378 3617 -4766 1207 1014 -2335
1248 -2335 4363 -3565 1310 2645 -2217 5450 -2228 -436 2667 -3506 4421 -1193 -1304 3134 -3799
1263 -3799 3892 -355 -2429 2895 -4905 1861 336 -3303 3142 -4668 1197 1334 -3418 3728 -3952
1278 -3952 -317 2198 -3307 4163 -1745 -681 3866 -3225 4575 -312 -1921 3577 -3545 3319 843
1293 843 -2256 4034 -3464 2345 1518 -3625 3339 -4081 403 2080 -4134 3287 -2776 -1170 2586
1308 2586 -3966 2993 -2259 -2533 3355 -3658 3125 -97 -2460 4208 -2900 2643 1282 -2897 3607
$$ packed form
1203D150p971L014J418n656R721o388J098L221p515Q897m357q95N021q110P800
1218C448k177k128O261r332N490j69m352P826q243L483J813n476Q272o966R89
1233a261L131p145Q589m980q49M578o992P983k894k538N995q383N973j93l349
1248b335O698p928M875J335m862P667p678J792L103o173P927n614j11M438o933
1263c799P691m247k074N324p800O766j525l639O445p810N865J37m752P146p680
1278c952L635K515n505P470n908J064M547p091P800m887j609N498p122O864k476
1293H43l099O290p498N809q27n143O964p420M484J677o214P421o063J606L756
1308B586o552O959n252k74N888p013O783l222k363O668p108N543j361m179O504
$$ plain form
1323 3607 -2890 1777 2895 -3157 3855 -2205 127 3071 -3883 2834 -2449 -1752 3181 -4001 2207
1338 2207 -1023 -2714 3245 -3385 1765 12 -4168 3564 -3258 1211 1501 -3782 3748 -2266 631
1353 631 2873 -3694 3082 -1475 -337 4056 -3418 3389 -398 -1456 4020 -3303 2207 -425 -3192
1368 -3192 4047 -3348 1435 740 -4127 3598 -3128 378 1636 -4593 2690 -1879 -499 2935 -3929
1383 -3929 2865 -781 -1077 3705 -3540 2348 259 -1825 4515 -3078 1850 1032 -2834 4392 -2284
1398 -2284 765 1501 -3987 3446 -1735 -370 2618 -4306 2710 -1614 -1331 2720 -4333 2042 -621
1413 -621 -2146 3815 -3571 1396 190 -2734 4169 -2439 1140 1337 -3410 4208 -1562 589 2318
1428 2318 -3157 3443 -692 -539 2995 -3756 2747 -156 -1298 3571 -3996 1657 187 -2530 3238
$$ packed form
1323C607o497M667J118o052P012o060K332K944o954O717n283O97M933p182O208
1338B207l230j691N959o630N150j753m180P732o822M469K90n283P530o014K897
1353F31K242o567O776m557J138M393p474O807l787j058N476p323N510k632k767
1368c192P239p395M783o95m867P725o726L506J258o229P283m569J380L434o864
1383c929O794l646k96M782p245N888k089k084O340p593M928q18l866P226o676
1398b284L049P36n488P433n181J365K988o924P016m324K83M051p053O375k663
1413f21j525N961p386M967j206k924O903o608L579J97m747P618n770K151J729
1428B318n475O600m135J53L534o751O503k903j142M869p567N653j470k717N768
$$ plain form
1443 3238 -3591 482 991 -3525 3548 -2488 -310 1759 -3661 3378 -1790 -751 2704 -3482 3413
1458 3413 -237 -1273 3262 -3357 2141 658 -1909 3660 -2979 1475 1547 -2728 3887 -2497 162
1473 162 1666 -3264 3306 -2257 -970 1946 -3797 2761 -1334 -1844 2760 -3605 2160 196 -2120
1488 -2120 3137 -3289 1372 1394 -2455 3577 -2572 740 2052 -2495 3774 -1859 -392 2556 -2939
1503 -2939 3379 -1141 -1397 2869 -3708 2415 -840 -2711 2873 -3421 1686 288 -2723 2955 -3187
1518 -3187 872 1347 -2777 2824 -2659 142 2273 -2975 3266 -1503 -453 3440 -2804 3524 -358
1533 -358 -1446 3214 -2854 2331 260 -2178 3317 -2754 1258 959 -3029 2877 -2376 469 1831
1548 1831 -3476 2597 -2183 -957 2270 -3307 2264 -952 -1440 2923 -2642 2188 79 -2107 3463
$$ packed form
1443C238o829M073N09m516P073o036K178K069n420P039n168J039L455o186O895
1458C413l650j036M535o619N498j483k567N569o639M454P2m275O615o384K659
1473A62J504m930O570n563J287K916n743O558m095n10M604o365N765j964k316
1488b120N257o426M661K2l849O032o149L312J312m547O269n633J467K948n495
1503b939O318m520k56M266o577O123l255j871N584o294N107j398l011N678o142
1518c187M059M75m124N601n483K801K131n248O241m769J050L893o244O328l882
1533c58j088M660o068N185k071k438N495o071M012k99l988N906n253K845J362
1548A831n307O073m780J226L227n577N571l216m88M363n565M830k109k186N570
$$ plain form
1563 3463 -2432 1501 1207 -2369 3196 -2219 1039 2083 -2913 3145 -2079 -185 2319 -3372 2561
1578 2561 -1556 -1186 2688 -3404 1737 -666 -2170 2814 -2846 1540 116 -2559 3334 -2250 1038
1593 1038 1317 -2949 2893 -1840 600 2374 -3030 3276 -1131 -665 3217 -2796 2397 -670 -1272 3190
1609 3190 -3039 1562 -59 -2447 3111 -2572 911 779 -2902 2821 -2225 189 1542 -3198 2559
1624 2559 -1621 -318 2443 -3508 2260 -582 -793 2937 -2930 1941 207 -1878 3305 -2243 1456
1639 1456 1006 -2498 3249 -2093 616 1163 -3314 2632 -1764 -746 1844 -3241 2340 -1035 -1149 2396
1655 2396 -3141 1673 -379 -1568 2782 -2847 1007 906 -2330 3299 -2075 751 1579 -2480 3560
1670 3560 -1300 128 2322 -2491 2775 -893 -847 2192 -3394 1991 -384 -1353 2810 -2802 1331 -5
$$ packed form
1563C463n895L933k94l576N565n415L258J044m996O058n224J894K504n691N933
1578B561m117L70L874o092N141k403j504M984n660M386j424k675N893n584L288
1593A038K79m266N842m733K440J774n404O306m407M66L882o013N193l067o02M462
1609C190o229M601j621k388N558n683L483j32l681N723n046K414J353m740N757
1624B559m180J303K761n951N768k842k11L730n867M871j734k085N183n548L699
1639A456m50l504N747n342K709N47m477N946m396J018K590n085N581l375j14L545
1655B396n537M814k052j189M350n629L854j01l236N629n374K826Q28m059O040
1670C560m860J428K194m813N266l668M6L039n586N385k375r69M163n612M133j336
$$ plain form
1686 -5 -2368 2329 -2841 873 804 -2459 2931 -1837 17 1339 -2762 2690 -1409 -247 2319 -2612
1702 -2612 2503 -151 -1347 2394 -2877 1950 247 -1625 2821 -2465 939 637 -2125 2650 -1934
1717 -1934 56 1381 -2674 2592 -1902 -764 1795 -2931 2144 -653 -1399 2438 -2970 1943 212
1732 212 -1836 2507 -2381 1415 1007 -2098 2622 -2034 769 1451 -2004 2845 -1664 -407 2169 -2610
1748 -2610 2369 -1029 -988 2095 -2735 1535 -388 -1789 2353 -2473 1195 178 -2311 2720 -2413
1763 -2413 636 1118 -2679 2641 -1870 159 1694 -2409 2507 -1313 -429 2460 -2279 2189 -384
1778 -384 -1129 2632 -2352 1807 409 -1799 2405 -2574 765 1017 -2598 2181 -1887 -17 1525 -2847
1794 -2847 2025 -1301 -642 1693 -2419 1885 -734 -1154 2521 -2653 1721 -219 -1828 2580 -1953
$$ packed form
1686ek363M697n170L714o9l263N390m768J854J322m101N452m099J162K566m931
1702b612N115k654j196L741n271M827j703j872M446n286L404l02k762M775m584
1717a934J990J325m055N266m494J138K559m726N075k797p46L837n408M913j731
1732B12k048M343m888L796m08l105M720m656K803O82l455M849m509J257K576m779
1748b610M979l398M1L083m830M270j923j401M142m826L668j017k489N031n133
1763b413L049M82l797N320m511K029J535m103M916l820Q84K889m739M468k573
1778c84p45L761m984M159j398k208M204m979L339K52l615M779m068J870J542m372
1794b847M872l326O59K335m112M304k619m20L675n174M374j940j609M408m533
$$ plain form
1809 -1953 1001 799 -2255 2684 -1579 484 1367 -2283 2323 -1215 -488 1915 -2799 2075 -661 -1449
1825 -1449 2302 -2695 1736 -514 -1467 2510 -2278 1126 505 -1867 2772 -1729 716 1247 -2200 2252
1841 2252 -1218 77 1746 -2453 2046 -766 -679 2225 -2607 1580 -258 -1234 2219 -2481 1218 137
1857 137 -1806 2599 -2060 860 669 -2338 2128 -1801 83 1381 -2804 2202 -667 -634 1999 -2555
1873 -2555 1900 -183 -719 2181 -1997 1325 57 -1333 2331 -1923 966 737 -2039 2339 -1658
1888 -1658 164 1143 -2486 2371 -1211 -774 1559 -2609 1790 -427 -913 1829 -2379 1385 -298 -1118
1904 -1118 2330 -1981 1049 343 -1957 2561 -1626 483 1413 -1943 2375 -1222 -22 1338 -1958
1919 -1958 1945 -579 -1078 1697 -2137 1395 -279 -1382 2370 -2093 811 196 -1757 2186 -1891
$$ packed form
1809a953K954k02l054M939m263K063Q83l650M606l538P27K403m714M874k736p88
1825a449L751m997M431k250r53L977m788L404o21k372M639m501K445N31l447M452
1841B252l470J295J669m199M499k812Q7K904m832M187j838r76L453m700L699j081
1857A37j943M405m659K920j91l007M466l929J884J298m185N006k869L3K633m554
1873b555M455k083n36K900m178L322j268j390L664m254K889k29k776M378l997
1888a658J822R79l629M857l582M37K333m168M399k217m86K742m208L764j683q20
1904a118L448m311L030p06k300M518m187K109R30l356M318l597J200J360l296
1919a958L903k524m99K775l834L532j674j103L752m463K904o15j953L943m077
$$ plain form
1934 -1891 631 909 -2017 2078 -1327 -265 1622 -2132 1974 -832 -608 1764 -1960 1761 -208
1949 -208 -981 1983 -2064 1102 578 -1758 2031 -2014 740 572 -1946 2392 -1647 -59 1147 -1867
1965 -1867 2270 -1048 -523 1671 -2194 1870 -429 -953 2012 -2145 1580 445 -1352 2175 -1899
1980 -1899 866 656 -1825 2075 -1470 760 1180 -1838 2023 -1066 -207 1557 -1697 1582 -647 -827
1996 -827 1678 -2272 1611 -157 -1262 1912 -1995 963 298 -1717 1915 -1549 426 975 -1933 2423
2012 2423 -1299 116 1433 -1864 1887 -745 -704 1683 -1927 1490 -177 -1097 1851 -2258 1299 276
2028 276 -1578 2010 -1533 755 802 -1674 1933 -1591 128 1196 -2032 1667 -992 -465 1637 -2169
2044 -2169 1558 -392 -832 1728 -1832 1277 311 -1468 2085 -1758 785 858 -1549 2091 -1524 105
$$ packed form
1934a891K522K78k926M095l405J062J887l754M106k806K24K372l724L721j969
1949b08p73K964m047L166n24k336L789m045K754j68k518M338m039J588J206l014
1965a867M137l318N25K194l865M064k299n24K965m157L725j135j797L527m074
1980a899K765k10k481L900l545K230M20l018L861l089Q59J764l254L279k229j80
1996h27K505l950L883j768j105L174l907K958o65k015L632l464J975N49k908M356
2012B423l722J415J317l297L751k632M1K387l610L417j667r20K948m109L557j023
2028B76j854L588l543K288M7k476L607l524J719J068l228L699k659N27K102l806
2044b169L727j950m40K560l560L109r66j779L553l843K543P3k407L640l615J629
$$ plain form
2060 105 862 -1868 1578 -1087 -550 1356 -2378 1368 -483 -1013 1800 -2152 1107 -54 -1192 1867
2076 1867 -1801 778 546 -1539 1784 -1533 316 996 -1705 2019 -1176 -16 1484 -1947 1587
2091 1587 -438 -478 1858 -1864 1327 -347 -1279 2183 -1922 809 -82 -1521 2008 -1711 537 676
2107 676 -1934 1867 -1132 -292 1215 -1664 1592 -1047 -292 1770 -1935 1745 -289 -770 1724 -1826
2123 -1826 943 445 -1038 1886 -1774 418 452 -1489 1987 -1082 227 901 -1509 1809 -1008 -481
2139 -481 1252 -1736 1550 -468 -723 1635 -1726 1277 181 -1259 1681 -1622 754 656 -1137 1978
2155 1978 -1580 454 1130 -1515 1726 -766 -352 1567 -1648 1360 -872 -868 1788 -1990 1206 -343
2171 -343 -1040 1818 -1629 786 447 -1423 1860 -1475 332 765 -1493 1553 -1522 -53 1182 -1480
$$ packed form
2060A05P57k730L446k665N37J906l734L746j851n30K813l952L259j161j138L059
2076A867l668K579k32k085L323l317J849O80k701L724l195J160J500l431L534
2091A587k025m0K336l722L191j674r32L462m105K731q91j439L529l719K248J39
2107F76k610L801k999Q40J507k879L256k639P55K062l705L680k034m81K494l550
2123a826K769m98j483K924l660K192L4j941L476l069J309O74k410L318k817N27
2139d81J733k988L286k018k55K358l361L003j096j440K940l303K376r8j793L115
2155A978l558K034O76k645L241k492M14J919l215L008k232MK656l778L196j549
2171c43o97K858l447K415l39j870L283l335J807M33k258L046l075J469J235k662
$$ plain form
2187 -1480 1793 -684 -641 1576 -1827 1507 -265 -834 1942 -1742 933 302 -1418 1892 -1403 449
2203 449 692 -1488 1529 -1170 -324 991 -1577 1578 -733 -595 1633 -1934 1569 -305 -720 1543
2219 1543 -1740 1249 231 -1087 1676 -1706 828 542 -1224 1600 -1221 -54 940 -2034 1565
2234 1565 -882 -98 1166 -1613 1650 -786 -845 1388 -1898 943 -214 -1210 1821 -1524 819 449
2250 449 -1663 1670 -1269 303 597 -1483 1623 -1261 8 1154 -1607 1287 -357 -544 1838 -1764
2266 -1764 898 -370 -835 1729 -1633 1145 199 -1312 1646 -1121 469 470 -1532 1684 -1315 43
2282 43 1003 -1609 1450 -1180 -417 1433 -1733 1123 -89 -686 1301 -1383 789 528 -1202 1667
2298 1667 -1600 475 427 -1417 1644 -1307 133 987 -1569 1338 -773 -232 1191 -1636 1340 -693
$$ packed form
2187a480L273k477M3K217l403L334j772n69K776l684K675o31j720L310l295J852
2203D49K43k180L017k699Q46J315k568L155k311J38K228l567L503j874m15K263
2219A543l283K989j018j318K763l382K534k86j766K824k821J167R94k974L599
2234A565k447P84J264k779L263k436n9K233l286K841j157r96L031l345K343l70
2250D49k112L333k939J572K94k080L106k884J269J146k761K894j644j87K382l602
2266a764K662j268m65K564l362K778r46j511K958k767J590Jk002L216k999J358
2282D3R60k612L059k630P63J850l166K856j212n97J987k684K172k61j730K869
2298A667l267K075m8j844L061k951J440Q54k556K907k111N41J423k827K976k033
$$ plain form
2314 -693 -904 1609 -1535 1142 -181 -890 1455 -1539 306 182 -1211 1750 -1373 257 916 -1591
2330 -1591 1684 -962 -206 1193 -1585 1512 -331 -493 1272 -1617 921 -163 -682 1352 -1599 705
2346 705 56 -1181 1792 -1311 589 726 -1565 1389 -809 -87 910 -1507 1594 -620 -591 1100 -1717
2363 -1717 1507 -394 -772 1591 -1410 868 34 -1193 1630 -1382 393 423 -1399 1577 -1101 218
2379 218 887 -1484 1284 -876 101 1167 -1508 1336 -407 -733 1367 -1205 963 45 -860 1692
2395 1692 -1403 513 462 -1320 1345 -1292 439 856 -1416 1537 -979 -141 982 -1701 751 -216
2411 -216 -959 1181 -1252 1186 164 -724 1548 -1437 950 169 -1160 1279 -1361 172 588 -1305
2427 -1305 1616 -682 -234 1232 -1662 1581 -511 -419 1112 -1581 1256 -240 -1019 1438 -1334 653
$$ packed form
2314f93k11K513l144K677j323p09K345k994J845j24j393K961l123J630O59k507
2330a591L275k646P56J399k778L097j843j62J765k889K538j084n19K034k951K304
2346G05o49j237K973l103J900J37k291K954k198P22R97k417L101k214K9J691k817
2363a717L224j901l78K363l001K278q34j227K823l012J775L0j822K976k678J319
2379B18O69k371K768k160R77J066k675K844j743l26K100k572K168r18r05K552
2395A692l095J916n1j782K665k637J731M17k272K953k516Q38J123k683K452r67
2411b16p43K140k433K438j022q88K272k985K387p81j329K439k640J533M16j893
2427a305K921k298M48J466k894L243k092R2J531k693K837j496p79K457k772J987
$$ plain form
2443 653 79 -1190 1470 -1208 420 410 -1798 1350 -1077 229 970 -1305 1220 -714 -341 1049
2459 1049 -1320 1465 -258 -674 1144 -1183 1046 122 -960 1476 -1080 361 381 -1107 1373 -1128
2475 -1128 337 1059 -1281 1231 -864 -40 930 -1606 1314 -356 -492 1331 -1404 679 -153 -1001
2491 -1001 1589 -1546 729 572 -1272 1498 -846 220 806 -1388 1077 -1018 37 1126 -1291
2506 -1291 1030 -261 -537 1223 -1389 1050 -163 -1108 1081 -1052 669 114 -988 1481 -1127 477
2522 477 607 -1285 1337 -548 117 1091 -1137 1325 -565 -712 1099 -1326 1019 18 -854 1147
2538 1147 -1232 840 155 -887 1343 -1228 244 605 -1062 1370 -972 97 938 -1357 1047 -758
2554 -758 -683 1085 -1337 1149 -279 -744 1745 -1404 762 53 -1164 1266 -1139 606 452 -1017
$$ packed form
2443F53n74j269K660k678J628j0k208L148k427J306P41k275K525j934L73J390
2459A049k369K785j723m16J818k327K229r24j082K436k556J441K0j488K480k501
2475a128J465P22k340K512k095Q24R70k536K920j670j36J823k735K083q32q48
2491a001K590l135K275j57j844K770k344J066N86k194K465k095J055J089k417
2506a291K321j291k76J760k612K439j213r45K189k133J721n55j102K469k608J604
2522D77J30j892K622j885O65R74k228K462j890j47J811k425K345j001q72K001
2538A147k379K072o85j042K230k571J472L61j667K432k342J069Q41k295K404j805
2554g58P5J768k422K486j428m65K489l149K166p09j217K430k405J745j54j469
$$ plain form
2570 -1017 1554 -1507 55 879 -1205 1458 -884 -267 1207 -1176 1195 -447 -410 1306 -1779 1016
2586 1016 9 -547 1167 -1197 659 379 -794 1326 -1124 335 682 -1248 1192 -684 -44 925
2602 925 -1241 1044 -287 -718 1193 -1508 771 -11 -602 1195 -1303 785 329 -1258 1410 -839
2618 -839 546 536 -1111 1038 -857 -97 767 -1097 1151 -709 -23 854 -1318 1331 -231 -511 1052
2635 1052 -1345 740 393 -1111 1294 -1167 626 388 -990 1126 -788 391 623 -958 1101 -427
2651 -427 -247 1013 -1320 1171 -523 -562 1265 -1475 772 31 -908 1001 -930 612 661 -692 1515
2668 1515 -890 336 666 -1140 1276 -662 -293 671 -1085 1291 -210 -516 823 -1393 716 172
2684 172 -677 1440 -1188 522 197 -900 1321 -679 337 629 -1297 1247 -871 9 506 -1206
$$ packed form
2570a017K571l061J562Q24k084K663k342O17J474k383K371j642L7J716l085K795
2586A016j007n56J714k364J856k80j173K120k450J459L47j930K440j876O40R69
2602I25k166K285j331m31J911k701K279p82n91J797k498K088m56j587K668k249
2618h39J385j0j647K149j895P60Q64j864K248j860O86Q77k172K649j562k80J563
2635A052k397K085l47j504K405k461J793k38j378K116j914J179K32j581K059j528
2651d27J80J260k333K491j694l9J827k740K247p41r39J909j931J542M9j353K207
2668A515k405J226L30j806K416j938L69R64j756K376j501l06J339k216K109n44
2684A72q49K117k628J710l25j097K221k000J016K92j926K544k118Q80M97j712
$$ plain form
2700 -1206 1029 -396 -208 759 -1393 1032 -54 -286 1083 -1105 957 -175 -710 1430 -1047 489
2716 489 343 -1181 1173 -905 83 923 -995 928 -599 -474 1121 -1315 1229 -243 -652 1023
2732 1023 -1256 903 -222 -668 825 -867 664 558 -1006 1078 -858 174 467 -1456 1588 -649
2748 -649 -122 778 -1141 823 -584 -530 992 -1116 868 16 -939 1435 -1129 286 351 -800 1142
2765 1142 -964 293 838 -1328 1170 -499 86 766 -1030 693 -619 -345 964 -1128 984 -145
2781 -145 -711 1437 -1068 510 -108 -1239 1123 -1018 300 487 -1157 1264 -1166 66 601 -1376
2797 -1376 1060 -590 -179 917 -1144 1050 -90 -340 794 -1241 531 223 -904 918 -1091 678
2813 678 453 -1065 1274 -727 119 526 -979 1016 -528 -164 981 -1132 1143 -223 -92 917
$$ packed form
2700a206K235j425J88R67k152K425j086k32J369k188K062j132n35K140k477J536
2716D89j46j524K354k078R88Q40j918J923j527J25J595k436K544j472m09J675
2732A023k279K159j125m46J493j692J531j06j564K084j936J032K93j923L044k237
2748f49N27R00j919J964j407N4J522k108J984q52r55K374k564J415O5j151J942
2765A142k106J257N45k166K498j669N85O80j796J723j312K74J309k092K112j129
2781a45n66K148k505J578o18j131K362k141J318J87j644K421k430J232N35j977
2797a376K436j650M11J096k061K194j140k50J134k035J772l08j127J822k009J769
2813F78k25j518K339k001Q46M07j505J995j544L64J145k113K275j366J31J009
$$ plain form
2829 917 -942 683 -32 -706 1219 -1034 623 80 -831 1424 -955 134 638 -1085 1242 -717
2845 -717 -32 910 -1086 997 -396 -511 984 -1457 715 148 -755 1069 -1124 421 245 -796 1233
2862 1233 -841 353 535 -1010 978 -799 -174 958 -891 920 -90 -322 820 -1187 643 -284
2878 -284 -586 770 -1205 658 170 -922 1093 -1017 192 333 -1052 1078 -465 25 534 -1015
2894 -1015 1297 -694 -429 1138 -912 1050 -155 -927 1030 -1243 737 85 -844 922 -983 609
2910 609 273 -970 892 -923 354 411 -755 1153 -672 218 949 -798 1118 -306 -389 828 -958
2927 -958 835 190 -494 942 -1180 354 113 -936 929 -798 349 595 -1082 898 -584 -130
2943 -130 756 -1145 819 -526 -369 928 -937 692 -259 -674 856 -884 629 315 -778 1324
$$ packed form
2829I17j859J625p15o74J925k253J657n43r11K255k379J089N04j723K327j959
2845g17O85R42j996K083j393j15J495k441K172n67r03J824k193J545j76j041K029
2862A233k074J194J82j545J988j777O25J132j849J811j010k32J142k007J830r27
2878b84l02J356j975J863m88j092K015k110J209J41j385K130j543M90N09j549
2894a015K312j991K65J567k050J962j205p72J957k273J980o52r29J766j905J592
2910F09l36j243J862j815J277N7j166J908j825Q90P31j747J916j424q3J217j786
2927i58J793o45o84J436k122J534k41j049J865j727J147K46j677J980j482M54
2943a30Q86j901J964j345J57J297j865J629r51m15J530j740J513l14j093K102
$$ plain form
2959 1324 -911 180 259 -1218 1181 -526 73 755 -1058 1043 -530 -441 842 -967 501 -6 -573
2976 -573 1160 -864 568 -90 -758 1038 -1161 290 389 -740 886 -867 -12 475 -883 972 -727
2993 -727 -206 840 -1057 661 -409 -482 1131 -684 909 260 -796 1240 -1015 494 334 -746
3009 -746 1114 -701 354 196 -989 1206 -738 107 708 -1382 881 -389 -343 727 -1172 627
3025 627 -20 -520 919 -1004 663 275 -731 1146 -912 513 545 -1188 783 -857 -73 412 -1077
3042 -1077 929 -330 -238 516 -1310 761 -196 -581 605 -1112 805 146 -747 746 -649 399 487
3059 487 -1033 949 -651 55 575 -1078 1068 -539 -94 494 -948 760 -205 -253 881 -1013 575
3076 575 193 -881 854 -807 488 401 -702 751 -692 -30 201 -982 760 -598 -85 894 -770
$$ packed form
2959A324k235J091P9j477K399j707N99O82j813K101j573Q9J283j809J468n07n67
2976e73J733k024J432o58o68J796k199J451R9j129J626j753Q55M87j358J855j699
2993g27N21J046j897J718j070p3J613j815J593o49j056K036k255J509j60j080
3009g46J860j815J055j58j185K195j944Q45O01k090K263j270M6J070j899J799
3025F27o47n00J439j923J667l88j006J877k058J425L2j733J971j640P84M85j489
3042a077K006j259R2P54j826K071r57l85J186j717J917o59q93J493j395J048Q8
3059D87j520J982j600P06N20j653K146j607M45N88j442J708r65m8J134j894J588
3076E75l82j074J735j661J295q7j103J453j443O62K31j183J742j358N13R79j664
$$ plain form
3093 -770 715 -373 -461 1066 -847 524 -228 -658 1041 -1024 387 483 -679 1021 -386 357 537
3110 537 -785 810 -717 -243 565 -1064 461 -226 -17 822 -796 788 -37 -531 592 -971 338
3127 338 60 -567 707 -965 203 263 -732 1023 -687 264 370 -1123 677 -591 -141 726 -638
3144 -638 702 -152 -400 639 -847 609 113 -716 1022 -637 354 -9 -1023 1163 -722 -142 611
3161 611 -913 698 -495 70 403 -863 929 -271 -211 667 -895 611 -201 -454 956 -696 269
3178 269 304 -672 1057 -574 171 494 -1012 803 -454 -98 708 -954 757 -287 -440 778 -971
3195 -971 562 84 -460 1016 -1024 396 336 -805 745 -626 42 164 -565 602 -443 -176 396
3212 396 -1024 1060 -294 -32 417 -922 447 -237 -249 900 -694 402 181 -577 846 -1087 131
$$ packed form
3093g70J485j088q8J527j913J371p52m30J699k065J411R6j162J700j407P43J80
3110E37j322J595j527M74Q08j629J525o87K09Q39j618J584q25m94J123j563J309
3127C38k78o27J274j672J168O0r95J755j710R51J06j493J800j268M50Q67j364
3144f38J340q54k48J039j486J456m96q29J738j659R91l63j014K186j885N80P53
3161F11j524J611j193N65L33j266J792j200O0Q78j562J506q12k53J410j652R65
3178B69L5r76J729j631P45L23j506J815j257L56Q06j662J711j044j53J218j749
3195i71J533m78n44J476k040J420o0j141J550j371O68J22p29J167j045K67N72
3212C96j420K084j354K62M49j339J369o84j2J149j594J096k21p58J423j933J218
$$ plain form
3229 131 244 -549 994 -773 -20 312 -615 909 -83 -179 847 -740 633 -77 -442 677 -506 499
3247 499 -59 -426 948 -607 224 -100 -805 901 -730 55 803 -820 841 -341 -306 626 -932 736
3265 736 -273 -596 784 -612 859 -205 -544 811 -700 381 298 -463 915 -769 78 183 -553
3282 -553 569 -777 -24 595 -965 585 -137 -163 566 -776 571 -162 -436 653 -445 482 72 -615
3300 -615 857 -650 341 32 -582 705 -248 3 654 -651 680 -390 -295 742 -743 900 -28
3317 -28 -379 812 -647 618 68 -513 675 -965 221 157 -624 878 -438 -187 428 -756 778
3334 778 -464 -309 601 -667 317 -316 -716 844 -756 346 373 -538 618 -597 222 242 -779 1081
3352 1081 -783 75 457 -733 933 -386 -231 675 -725 606 -368 -225 843 -937 569 -209 -414
$$ packed form
3229A31J13p93J543j767P53L32r27J524r92r6J026j587J373p10l65J119j183J005
3247D99n58l67J374j555Q31l24p05J706j631P85P48j623J661j182L5R32j558J668
3265G36j009l23J380j396J471j064l39J355j511J081q3p61J378j684Q47J05p36
3282e53J122j346P53O19j560J550p22k6P29j342J347p33k74J089j098R27m10o87
3300f15J472j507R91l09o14J287r53K51O51j305J331j070R5J037j485J643r28
3317b8l51J191j459J265n50n81J188j640J186o4p81J502j316K51O15j184J534
3334G78j242J55R10j268R84o33m00J560j600J102K7r11J156j215Q19K0j021J860
3352A081j864Q58L82j190J666j319J55R06j400J331r74J43J068j780J506p78k05
$$ plain form
3369 -414 758 -417 450 204 -469 490 -608 196 295 -520 776 -439 -297 281 -570 685 -244 -351
3387 -351 458 -831 533 -152 -272 543 -960 265 -44 -457 845 -634 -137 490 -680 640 -192
3404 -192 86 243 -753 909 -327 24 646 -891 333 -276 -134 590 -822 706 71 -630 688 -656
3422 -656 360 276 -518 784 -361 213 469 -538 682 -256 -130 276 -590 763 -369 -638 727 -469
3440 -469 462 39 -428 677 -459 300 428 -491 677 -585 144 544 -786 474 -667 163 382 -615
3458 -615 603 -32 -377 589 -476 344 -107 -478 714 -708 430 205 -535 622 -177 -2 309 -807
3476 -807 581 -264 -296 467 -618 651 160 -149 410 -591 455 -247 -245 608 -639 205 46 -590 526
3495 526 -232 329 283 -373 595 -707 -74 278 -663 466 -68 -136 562 -682 615 -172 -217 666 -655
$$ packed form
3369d14J172j175Q67k46o73R59j098Q04R9q15J296j215J42N78q51J255r29j07
3387c51Q09j289J364o85j20Q15j503J225l09m13J302j479M97O27j170J320q32
3404a92K78J57r96J662j236L51O22j537J224o09J42P24j412J528o35p01J318j344
3422f56J016q4p94J302j145N74K56j007J220r38J26M06q66J353j132k69J365j196
3440d69R31m23m67J105j136P59J28r19J168j262P29M00j330J260j141Q30K19r97
3458f15J218o35l45R66j065Q20m51l71J192j422J138k25p40J157p99J75L11j116
3476h07J388q45l2P63j085J269m91l09N59j001J046p02KQ53j247Q44j59o36J116
3495E26p58N61m6o56R68j302O33L52r41J129n34o8O98j244J297p87m5Q83j321
$$ plain form
3514 -655 445 4 -184 636 -544 187 381 -246 561 -388 -117 486 -668 577 -265 -369 411 -786
3532 -786 539 -238 -159 489 -704 342 -151 -408 615 -604 92 339 -301 611 -117 95 437 -544 822
3551 822 -242 -95 423 -534 404 -397 -27 319 -634 163 -188 -256 743 -412 454 314 -606 698 -303
3570 -303 -32 219 -503 727 -698 -21 55 -447 505 -244 37 567 -555 601 -345 -61 436 -661 338
3589 338 -87 -239 671 -211 145 75 -692 764 -208 62 68 -338 548 -435 433 617 -434 436 131 -216
3609 -216 354 -620 159 192 -428 510 -329 133 11 -505 678 -182 381 114 -433 699 -139 -344 306 -518
3629 -518 189 -165 -118 814 -654 297 -220 -345 370 -469 220 296 -600 530 -255 345 361 -621 472 -515
3649 -515 -211 470 -533 552 -56 -69 159 -422 662 -362 -164 316 -513 364 217 -364 597 -575 -36
$$ packed form
3514f55J100m41j88Q20j180P31J94o27Q07r49K71O03j154J245q42j04P80j197
3532g86J325p77P9O48j193J046m93k57J023j219O96K47o40R12p28K12L42r81J366
3551H22j064J47N18r57R38q01L70L46r53P97l51o8R99j155Q66j40r20J304j001
3570c03K71K51p22J230j425O77P6n02R52p49K81N30j122J156r46K84M97j097R99
3589C38m25j52R10q82L56p0p67J456r72K70Om06Q86r83Q68J84j051Q70l05l47
3609b16N70r74P79L3o20R38q39M62j22n16J183q60N63k67n47J132q38k05O50q24
3629e18P07l54M7R32j468R51n17j25P15q39O89P6q96J130p85O00J6r82J093r87
3649e15L04O81j003J085o08j3K28n81J084j024J98M80q29Q77j47n81R61j172N39
$$ plain form
3668 -36 473 -684 645 -235 -150 733 -303 361 -256 -51 373 -353 318 -334 -53 347 -473 101 42 -327
3688 -327 481 -375 239 70 -569 311 -326 163 301 -528 422 -158 -146 430 -605 478 -119 -382 644
3707 644 -403 218 19 -460 328 -598 187 253 -632 419 -272 10 610 -389 422 -385 -182 218 -433 299
3727 299 -352 -266 690 -177 382 61 -293 591 -642 442 -166 -585 462 -194 404 166 -357 606 -432
3746 -432 -314 347 -667 585 -59 -274 689 -558 712 -286 -270 205 -621 196 355 -469 509 -551 104
3765 104 -151 -694 675 -274 190 193 -618 238 -438 -115 385 -239 369 -178 -306 702 -245 264 -52 -158
3785 -158 222 -497 347 198 -455 400 -370 218 308 -405 349 -223 92 215 -695 633 -366 -202 678 -239
3805 -239 547 -32 -155 651 -230 214 194 -468 454 -567 148 45 -328 490 -319 39 281 -686 491 10
$$ packed form
3668c6N09j157J329q80Q5Q83j036O64o17K05M24p26O71o52K81M00q20N74n9l69
3688c27Q08q56O14j69o39Q80o37M89J38q29R50n80J2N76j035J083n97k63J026
3707F44j047O21j99m79P88r26P85O6q85J051o91K82O00r99Q11q07K03M00o51P32
3727B99o51Q6R56q67N59l21l54Q84j233J084o08m19J047o56N98k38n23R63j038
3746d32J18O61j014J252o44k15R63j247J270r98J6M75q26Q17J59q24R78j060O55
3765A04k55n43J369r49M64Lq11Q56o76L23N00o24O08n47j28J008r47N09l16j06
3785a58L80p19Q44j49o53Q55p70N88R0p13P54n72L15J23r10J328r99J64Q80r17
3805b39P86n79j23Q06q81M44k0o62R22j021P15j03l73Q18q09L58K42r67J177m81
$$ plain form
3825 10 -170 292 -460 181 -14 -235 304 -509 64 120 -577 571 -347 -171 152 -500 467 -311 93 356
3845 356 -282 417 -85 -28 376 -549 470 -68 -355 484 -664 -67 -63 -180 544 -409 -107 514 -240 588
3865 588 -442 201 317 -424 587 -279 -186 452 -390 136 -338 -189 317 -389 211 93 -254 408 -416 244
3885 244 583 -414 205 -446 81 376 -525 902 -134 64 678 -483 625 -173 -191 508 -110 461 -7
3904 -7 -151 641 -536 214 222 55 518 -196 99 424 -361 773 -524 -119 275 -242 728 -242 -142 261
3924 261 -391 40 19 -517 154 -421 256 242 -652 600 -387 354 195 -697 17 -33 -130 585 -414 553 135
3945 135 -212 534 -864 615 92 -441 476 -408 119 242 -448 465 -623 175 338 -509 348 -422 -216
3964 -216 223 -293 53 -151 -167 170 -439 382 93 -107 248 -613 418 0 -178 514 -456 268 229 -46
$$ packed form
3825A0j80M62p52O41j95k21N39q13N73N6o97J148r18J76L23o52R67p78M04K63
3845C56o38O99n02N7M04r25J019n38k87Q39j148N97Mj17P24r53L02O21p54Q28
3865E88j030O43J16p41J011q66R3O38q42N26m74J49N06p06O00j18l47O62q24O60
3885B44L39r97O19o51N27K95r01J427j036J98O14j161J108p98j8O99o18N71m68
3904gj44P92j177P50Qj67M63p14K95L25p85J134j297M05L94n17R70r70J00M03
3924B61o52M31k1n36O71n75O77j4q94J252r87P41j59q92P14n0r7P15r99R67m18
3945A35l47P46j398J479n23n33R17q84N27J23o90R13j088P98J63q47Q57p70K06
3964b16M39n16L46k04j6L37o09Q21k89k00L55q61J031m18j78O92r70P24l9k75
$$ plain form
3984 -46 522 10 -91 131 -394 354 -372 -57 345 -472 211 84 -66 445 -511 94 103 -336 344 -558 44
4005 44 -252 -326 493 -349 113 76 -182 346 -463 -4 293 -227 227 -84 121 647 -704 232 -39 72 4
4026 4 -267 137 36 -172 318 -386 190 79 -536 374 -213 112 207 -356 462 -524 -198 279 -255 65 -96
4047 -96 247 399 -332 403 246 -295 203 -475 293 191 -287 448 -341 -248 194 -418 149 -101 37 579 -185
4068 -185 136 53 -177 487 -505 295 53 -275 398 -303 -6 273 -320 628 -337 76 50 -434 311 -448 127
4089 127 691 -461 334 101 -105 311 -489 74 -2 -339 379 -471 240 377 -301 589 -464 150 76 -475
4109 -475 175 -521 210 357 -456 301 -121 -202 363 -333 211 161 -118 404 -324 1 -114 -345 410 -278 94
4130 94 110 -250 503 -241 23 129 -187 -74 29 -43 133 -236 335 -50 -397 220 -522 138 63 -94 176
$$ packed form
3984d6N68n12j01K22n25P48p26L15M02q17O83j27j50N11r56O05Rm39O80r02O02
4005D4k96p4Q19q42M62l7k58N28q09M59K97n20M54l11K05N26j351R36k71J11o8
4026Dk71M04j01k08M90p04N76j11o15R10n87L25R5n63Q18r86L26M77n34L20j61
4047i6L43J52p31P35j57n41M98o78P68j02m78P35p89R3M42o12N67k50J38N42p64
4068a85L21q3k30O64r92Q00k42l28O73p01K97K79n93R48r65M13k6m84P45p59N75
4089A27N64j152P95k33k06M16q00N63p6l37P18q50P11J37o78Q90j053O14p4n51
4109d75O50o96P31J47q13P57m22q1N65o96N44n0k79N22p28L25j15k31P55o88L72
4130I4J6l60P53p44K64J06l16J13J03p2J76l69N71l85l47O17p42O60p5j57K70
$$ plain form
4151 176 -281 158 -89 -428 234 -142 243 276 -504 271 -69 -134 359 -418 330 -120 -122 401 -116 226 226 -206
4173 -206 466 -301 225 -262 -296 73 -476 -27 339 -627 353 -44 51 317 -181 439 -208 258 425 -264 72
4194 72 92 -45 494 -484 211 -197 -273 424 -225 34 243 -254 309 -317 173 507 -511 450 54 20 91
4215 91 -435 204 105 -47 483 -665 315 -17 -454 64 -507 166 122 -318 420 -99 -323 20 -211 529 -97
4236 -97 88 28 -587 261 -162 -43 535 -470 336 335 -252 435 -185 37 310 -105 601 -210 -85 289 -330
4257 -330 338 -109 -442 369 -222 359 -187 -304 492 -229 593 -15 -263 421 -274 346 309 -86 149 -469
4277 -469 -157 174 -169 325 -112 -71 511 -187 150 -263 -264 537 -414 -246 134 57 453 -247 89 -61 -370
4298 -370 237 -393 153 118 -499 419 -292 115 347 -419 493 -64 -46 143 -333 151 -78 -109 350 -391 222
$$ packed form
4151A76m57M39k47l39O62l76L85L3p80P75l40o5M93p77P48m50kN23n17L42%m32
4173b06O72p67N26m87l4L69n49M49L66r66R80l97R5K66m98O20o47M66J67o89L36
4194G2K0j37N39r78O95m08p6O97o49K59K09m97N63o26M90L34j018R61l96l4P1
4215I1n26O39r9j52N30j148R80l32m37N18n71O73m4m40P38n19k24L43k31P40o26
4236i7J85o0o15Q48m23J19N78j005Q06jn87O87o20K22K73m15P06q11J25L74o19
4257c30O68m47l33Q11n91N81n46j17P96p21Q22o08k48O84o95O20l7l95K35o18
4277d69L12L31l43M94m37M1N82o98L37m13jQ01r51J68L80p7L96p00L36j50l09
4298c70O07o30N46l5o17R18p11M07K32p66R12n57J8J89m76M84k29l1M59p41O13
$$ plain form
4319 222 209 -162 714 -191 44 374 -105 278 -344 230 295 -206 215 69 10 138 40 176 -181 -295 380
4340 380 -319 213 -150 -291 507 -248 177 348 -94 630 178 164 75 -304 186 90 -115 330 -266 292 -354
4361 -354 -55 460 -385 204 -273 -129 208 -241 -71 264 -58 217 -342 140 410 -84 644 -61 260 332
4381 332 -158 198 -175 -247 273 -282 300 119 -45 60 -157 -26 137 -388 180 -3 272 -26 -228 212
4401 212 -58 96 244 -633 310 -53 -111 199 -385 75 142 -227 388 -286 232 -63 -219 459 -367 345 260
4422 260 -766 609 -205 79 150 -496 370 -348 58 521 -175 467 -71 5 165 -256 150 44 -66 515
4442 515 -518 130 356 -520 315 -235 87 0 -333 348 -359 -209 229 -256 231 50 -109 375 -156 373
4462 373 85 -355 254 -118 352 -203 -445 444 -275 -27 16 -263 439 -278 -113 264 -220 -111 -14 -36 81
$$ packed form
4319B22j3l71Q76r05K35L30m79L83o22N74O5n01M21j46n9J28r8J36l57j14O75
4340C80o99N32l63j41P98p55M25J71m42P24m52j4q9l79M90r6k05M45n96N58o46
4361c54K99N15q45N89m77J44L37m49J70L35l22K75n59M82K70m94P28p05L21P2
4381C32m90L56l73p2N20n55N82j81j64J05k17J31J63n25N68j83K75k98k02M40
4401B12k70J54J48q77R43l63n8L10n84M60O7l69O15o74N18k95j56O78q26P12q5
4422B60j026J375q14K84P1o46Q66p18M06M63o96O42n38P6J60m21M06j06j10N81
4442E15j033O48K26q76Q35n50L22q7l33O81p07J50M38m85M87j81j59M84n31N29
4462C73k88m40O09l72M70n55k42Q89p19K48M3k79P02p17J65L77m84J09R7k2J17
$$ plain form
4483 81 -309 166 153 -163 275 -385 275 291 -194 173 -294 36 104 -377 287 -44 0 85 -410 270 -181 9
4505 9 331 -445 355 145 -434 416 -558 199 -223 -122 134 -143 119 295 -300 95 -289 332 259 -400 313
4526 313 -209 -168 -4 39 506 -37 -220 171 -436 174 -75 -127 475 -99 128 84 -348 1 -335 215 123 -122
4548 -122 426 35 108 325 -366 469 28 -150 328 -437 184 -97 -371 239 -187 348 185 -224 412 -293
4568 -293 223 289 -206 411 -460 -218 332 -267 385 -299 287 162 -321 215 -216 -38 124 -221 160 -124
4588 -124 -437 48 -318 57 37 -154 26 -339 -85 185 -111 388 -191 -106 63 -108 95 -85 -268 258 -6
4609 -6 235 -273 -175 423 -353 278 450 -243 102 -294 226 250 -104 307 -402 254 319 -404 184 -312 -7 447
4631 447 49 346 84 -361 542 -52 475 -21 -11 243 -87 132 160 -369 267 -176 116 239 -220 128 -215
$$ packed form
4483H1l90M75j3l16M38o60O60J6m85L67m67L30O8m81O64l31M4Q5m95O80m51J90
4505IL22p76Q00k10n79Q50r74P57m22J01K56k77K62J76n95L95l84O21p3o59P13
4526C13n22M1J64M3M67n43j83L91o07O10k49n2O02n74K27m4m32L49l36N50r2k45
4548a22N48l91P3K17o91Q35m41j78M78p65O21k81k74O10m26N35j63m09O36p05
4568b93N16O6m95O17q71K42N50n99O52o84N86j25m83N36m31J78J62l45L81k84
4588a24l13M85l66L75k0j91J80l65K54K70k96M99n79Q5J69j71K03j80j83N26k64
4609fK41n08R8N98p76O31J72o93L45l96N20K4l54M11p09O56O5p23N88m96L05M54
4631D47l98K97k62m45R03n94N27m96J0K54l30K19K8n29O36m43K92J23m59L48l43
$$ plain form
4652 -215 -239 499 -482 518 50 -59 676 -145 127 91 -217 187 -516 51 125 -177 209 -207 -13 168 -222
4673 -222 143 -319 -47 299 -287 96 -168 -6 504 -148 191 -39 -289 476 -301 260 -81 -666 331 -355
4693 -355 -272 204 -110 -99 -204 138 194 -287 385 -69 -61 539 -570 253 236 -284 -11 -405 123 318 19 439
4715 439 -295 266 306 -83 201 -419 -358 93 -36 131 34 -385 -193 -168 70 45 32 293 -387 -32 -12 -465
4737 -465 69 45 411 -122 -258 445 38 -121 207 -82 102 -57 20 357 -490 235 -231 -311 409 -60 335
4758 335 127 -86 233 -170 -115 107 -299 314 -23 -207 -185 93 254 124 -91 279 5 61 73 -173 335
4779 335 -222 288 22 -318 208 -215 454 265 -182 257 -332 -212 -38 -197 276 -352 -118 -72 -256 286
4799 286 218 9 196 -83 415 230 -161 292 56 125 308 25 307 -218 169 181 -529 182 -103 -11 126
$$ packed form
4652b15k4P38r81J000m68j09P35q21K72l6l08M04p03N67P4l02L86m16J94J81l90
4673b22L65m62K72L46n86L83k64J62N10o52L39k30k50P65p77N61l41n85R97o86
4693c55Q3M76l14J1j05L42N6m81O72m54QO00j109Q23j7n20K73l94N28J95k99M20
4715D39p34N61M0l89K84o20O1M51j29J67r7m19J92K5K38k5j3K61o80L55K0m53
4737d65N34k4L66n33j36P03m07j59L28k89J84j59P7L37q47P25m66q0P20m69L95
4758C35k08k13L19m03N5K22m06O13l37j84K2K78J61j30k15L70k74N6J2k46N08
4779C35n57N10k66l40N26m23O69j89m47M39n89J20J74j59M73o28K34M6j84N42
4799B86o8k09J87k79M98j85l91M53k36O9J83k83K82n25L87J2p10P11k85R2J37
$$ plain form
4820 126 -96 586 -35 184 312 51 283 -165 -110 443 -274 174 27 -142 138 -570 224 43 -121 -23 -152
4841 -152 347 89 -159 425 85 -241 81 -365 2 -260 -107 -97 -294 210 -154 -132 295 73 15 -402 -268
$$ packed form
4820A26k22O82o21K19J28k61K32m48N5N53p17M48j47j69K80p08P94j81j64R8j29
4841a52M99k58k48N84l40l26L22m46L67k62J53J0j97N04l64K2M27k22n8m17J34
$$ [...]
8191A07
##END NTUPLES=NMR FID
##END=
