##TITLE=1H_IAMT-300
 DMSO-d6
 24 sc, 
 3.7.2024
##JCAMPDX= 6.0         $$ Bruker NMR JCAMP-DX V2.0
##DATA TYPE= NMR FID
##DATA CLASS= NTUPLES
##ORIGIN= UXNMR, Bruker Analytische Messtechnik GmbH
##OWNER= root
$$ XWIN-NMR		Version 3.5
$$ Wed Jul  3 14:08:07 2024 Russian Standard Time (UT+4h)  she@DPX200
##.OBSERVE FREQUENCY= 200.1314
##.OBSERVE NUCLEUS= ^1H
##.DELAY= (6, 6)
##.ACQUISITION MODE= SIMULTANEOUS
##.ACQUISITION SCHEME= undefined
##.AVERAGES= 8
##.DIGITISER RES= 18
##SPECTROMETER/DATA SYSTEM= spect
##.PULSE SEQUENCE= zg30
##.SOLVENT NAME= DMSO
##.SHIFT REFERENCE= (INTERNAL, DMSO, 0, 15.7039)
##AUDIT TRAIL= $$ (NUMBER, WHEN, WHO, WHERE, WHAT)
$$ ##TITLE= Audit trail, XWIN-NMR		Version 3.5
$$ ##JCAMPDX= 5.01
$$ ##ORIGIN= Bruker BioSpin GmbH
$$ ##OWNER= she
$$ F:/spectra/data/she/nmr/H-F/1/audita.txt
$$ ##AUDIT TRAIL=  $$ (NUMBER, WHEN, WHO, WHERE, WHAT)
(   1,<2024-07-03 14:07:02.35 +0400>,<she>,<DPX200>,
      <created by zg, POWCHK disabled, PULCHK disabled
       configuration hash MD5:
       00 E9 B6 7A A2 85 ED C7 34 08 36 98 17 FE 4E 26
       data hash MD5: 16K
       46 A8 29 AE 8C 37 E4 3D 4E 92 33 7A 87 30 48 1A>)
$$ ##END=
$$ 
$$ hash MD5
$$ 16 CC D4 64 DB 28 4C DF EB 85 6C 55 BA C9 3D 50
##$RELAX= 
##$RELAX= 
##$RELAX= 
##$RELAX= 
##$RELAX= 
##$RELAX= 
$$ Bruker specific parameters
$$ --------------------------
##$DU= <F:/spectra>
##$EXPNO= 1
##$NAME= <H-F>
##$PROCNO= 1
##$TYPE= <nmr>
##$USER= <she>
##$AMP= (0..31)
100 100 100 100 100 100 100 100 100 100 100 100 100 100 100 100 100 100 
100 100 100 100 100 100 100 100 100 100 100 100 100 100 
##$AQSEQ= 0
##$AQ_mod= 1
##$AUNM= <au_zg>
##$AUTOPOS= <>
##$BF1= 200.13
##$BF2= 200.13
##$BF3= 200.13
##$BF4= 200.13
##$BF5= 200.13
##$BF6= 200.13
##$BF7= 200.13
##$BF8= 200.13
##$BYTORDA= 1
##$CFDGTYP= 0
##$CFRGTYP= 5
##$CHEMSTR= <none>
##$CNST= (0..31)
1 1 145 1 1 1 1 1 1 1 1 1 1 1 1 1 1 1 1 1 1 1 1 1 1 1 1 1 1 1 1 1 
##$CPDPRG= <>
##$CPDPRG1= <>
##$CPDPRG2= <>
##$CPDPRG3= <>
##$CPDPRG4= <mlev>
##$CPDPRG5= <mlev>
##$CPDPRG6= <mlev>
##$CPDPRG7= <mlev>
##$CPDPRG8= <mlev>
##$CPDPRGB= <>
##$CPDPRGT= <>
##$D= (0..31)
0 1.2 0 0 0 0 0 0 0 0.06 0 0.03 0 0 0 0 0.0002 0 0 0 0 0 0 0 0 0 0 0 0 
0 0 0 
##$DATE= 1720001221
##$DBL= (0..7)
120 120 120 120 120 120 120 120 
##$DBP= (0..7)
150 150 150 150 150 150 150 150 
##$DBP07= 0
##$DBPNAM0= <>
##$DBPNAM1= <>
##$DBPNAM2= <>
##$DBPNAM3= <>
##$DBPNAM4= <>
##$DBPNAM5= <>
##$DBPNAM6= <>
##$DBPNAM7= <>
##$DBPOAL= (0..7)
0.5 0.5 0.5 0.5 0.5 0.5 0.5 0.5 
##$DBPOFFS= (0..7)
0 0 0 0 0 0 0 0 
##$DE= 6
##$DECBNUC= <off>
##$DECIM= 24
##$DECNUC= <off>
##$DECSTAT= 4
##$DIGMOD= 1
##$DIGTYP= 9
##$DL= (0..7)
0 120 120 120 120 120 120 120 
##$DP= (0..7)
150 150 150 150 150 150 150 150 
##$DP07= 0
##$DPNAME0= <>
##$DPNAME1= <>
##$DPNAME2= <>
##$DPNAME3= <>
##$DPNAME4= <>
##$DPNAME5= <>
##$DPNAME6= <>
##$DPNAME7= <>
##$DPOAL= (0..7)
0.5 0.5 0.5 0.5 0.5 0.5 0.5 0.5 
##$DPOFFS= (0..7)
0 0 0 0 0 0 0 0 
##$DQDMODE= 0
##$DR= 18
##$DS= 0
##$DSLIST= <SSSSSSSSSSSSSSS>
$$ [...]
##$SUBNAM2= <"">
##$SUBNAM3= <"">
##$SUBNAM4= <"">
##$SUBNAM5= <"">
##$SUBNAM6= <"">
##$SUBNAM7= <"">
##$SUBNAM8= <"">
##$SUBNAM9= <"">
##$SW= 24.0689651099613
##$SWIBOX= (0..15)
0 0 2 0 0 0 0 0 0 0 0 0 0 0 0 0 
##$SW_h= 4816.95568400771
##$TD= 16384
##$TD0= 1
##$TE= 0
##$TE2= 300
##$TE3= 300
##$TEG= 300
##$TL= (0..7)
0 120 120 120 120 120 120 120 
##$TP= (0..7)
150 150 150 150 150 150 150 150 
##$TP07= 0
##$TPNAME0= <>
##$TPNAME1= <>
##$TPNAME2= <>
##$TPNAME3= <>
##$TPNAME4= <>
##$TPNAME5= <>
##$TPNAME6= <>
##$TPNAME7= <>
##$TPOAL= (0..7)
0.5 0.5 0.5 0.5 0.5 0.5 0.5 0.5 
##$TPOFFS= (0..7)
0 0 0 0 0 0 0 0 
##$TUNHIN= 0
##$TUNHOUT= 0
##$TUNXOUT= 0
##$USERA1= <user>
##$USERA2= <user>
##$USERA3= <user>
##$USERA4= <user>
##$USERA5= <user>
##$V9= 5
##$VALIST= <valist>
##$VCLIST= <CCCCCCCCCCCCCCC>
##$VD= 0
##$VDLIST= <DDDDDDDDDDDDDDD>
##$VPLIST= <PPPPPPPPPPPPPPP>
##$VTLIST= <TTTTTTTTTTTTTTT>
##$WBST= 1024
##$WBSW= 4
##$XGAIN= (0..3)
0 0 0 0 
##$XL= 0
##$YL= 0
##$YMAX_a= 304582
##$YMIN_a= -317430
##$ZGOPTNS= <>
##$ZL1= 120
##$ZL2= 120
##$ZL3= 120
##$ZL4= 120
##$ABSF1= 10
##$ABSF2= 0
##$ABSG= 5
##$ABSL= 3
##$ALPHA= 0
##$AQORDER= 0
##$ASSFAC= 0
##$ASSFACI= 0
##$ASSFACX= 0
##$ASSWID= 0
##$AUNMP= <proc_1d>
##$AZFE= 0.1
##$AZFW= 0.1
##$BCFW= 1
##$BC_mod= 2
##$BYTORDP= 1
##$COROFFS= 0
##$CY= 11.3945322036743
##$DATMOD= 1
##$DC= 2
##$DFILT= <>
##$DTYPP= 0
##$F1P= 15.6554695791079
##$F2P= 12.8336369535428
##$FCOR= 0.5
##$FTSIZE= 0
##$FT_mod= 4
##$GAMMA= 1
##$GB= 0.15
##$INTBC= 1
##$INTSCL= 1
##$ISEN= 128
##$LB= 0.24
##$LEV0= 0
##$LPBIN= 0
##$MAXI= 10000
##$MC2= 0
##$MEAN= 0
##$ME_mod= 0
##$MI= 1.114404
##$NCOEF= 0
##$NC_proc= 0
##$NLEV= 6
##$NOISF1= 3.799351
##$NOISF2= 2.8
##$NSP= 1
##$NTH_PI= 0
##$NZP= 0
##$OFFSET= 15.70392
##$PC= 1
##$PHC0= -25528.82
##$PHC1= 45.98748
##$PH_mod= 1
##$PKNL= yes
##$PPARMOD= 0
##$PSCAL= 0
##$PSIGN= 0
##$REVERSE= no
##$SF= 200.130013532006
##$SI= 16384
##$SIGF1= 3
##$SIGF2= 2
##$SINO= 400
##$SIOLD= 16384
##$SREGLST= <1H.CDCl3>
##$SSB= 0
##$STSI= 0
##$STSR= 0
##$SW_p= 3612.71676300578
##$SYMM= 0
##$S_DEV= 0
##$TDeff= 0
##$TDoff= 0
##$TI= <>
##$TILT= no
##$TM1= 0
##$TM2= 0
##$TOPLEV= 0
##$USERP1= <user>
##$USERP2= <user>
##$USERP3= <user>
##$USERP4= <user>
##$USERP5= <user>
##$WDW= 1
##$XDIM= 8192
##$YMAX_p= 0
##$YMIN_p= 0
$$ End of Bruker specific parameters
$$ ---------------------------------
##NTUPLES= NMR FID
##VAR_NAME=  TIME,          FID/REAL,        FID/IMAG
##SYMBOL=    X,             R,               I
##VAR_TYPE=  INDEPENDENT,   DEPENDENT,       DEPENDENT
##VAR_FORM=  AFFN,          ASDF,            ASDF
##VAR_DIM=   8192,          8192,            8192
##UNITS=     SECONDS,       ARBITRARY UNITS, ARBITRARY UNITS
##FACTOR=    0.0002076,     1,               1
##FIRST=     0,             0,               0
##LAST=      1.7004516,     0,               0
##MIN=       0,             -317430,         0
##MAX=       1.7004516,     304582,          0
$$ Real data points
##PAGE= N=1
##DATA TABLE= (X++(R..R)), XYDATA
$$ [...]
2013C35j28o95M07Q29o52q74O86J085j011j011J267P03j246n82P85R67r96o29
2031g60J063K76r29J3N95j85n26M51M75p57k46J019K80j458qJ522r0j477K53J331
2051H42k47j527M16J476n76j253N62J176p49q66J080L03j084J33R24j89j213O27
2069a65J277r29j439J264J009j259r16J300J063j425q88J251P75j225m36J291
2085E48j70j047K39J235q17p56J072M91j252n59J470Q06j948j92J906K0k056l3
2103a043K224l69j876L90J629q42j179J037J026j372m82J308K04j483Q7J739l37
2120F61k304J163K043j267j829J469J578j815j352J974J174j990q30J818P05k124
2136i26J04J564m8j895Q06J499j097j310J470J316k080j022K466O44k631k16K625
$$ plain form
2013 335 207 -488 -81 748 96 -778 -92 993 -18 -1029 238 941 -305 -887 -102 865 -131 -760
2031 -760 303 579 -350 -337 258 73 -453 -2 473 -284 -530 489 769 -689 -697 825 735 -742 -489 842
2051 842 595 -932 -516 960 384 -869 -307 869 120 -746 334 637 -447 -314 610 421 -792 -165
2069 -165 1112 183 -1256 8 1017 -242 -1158 142 1205 -220 -1108 143 918 -307 -743 548
2085 548 378 -669 -430 805 -12 -768 304 795 -457 -1016 454 1260 -688 -880 1026 1046 -1010 -1043
2103 -1043 1181 812 -1064 -674 955 113 -1066 -29 997 -375 -857 451 655 -828 -741 998 661
2120 661 -1643 -480 1563 296 -1533 -64 1514 -301 -1653 321 1495 -495 -1325 493 1198 -926
2136 -926 -822 742 694 -1201 -395 1104 7 -1303 167 1483 -597 -1619 847 1491 -1140 -1356 1269
2153A269l4k609L52K549p61k268R67J963j251j503J567J219k079o75K151L22k681
2170a502M78K658p25k728J193K325j401k255J890K113k215j842K410J389k399
2185f11r42K595L99k510M9K358o53k165J174K195j941j867K194J571k639j212
2201b005L165N71k902n46L099K45l605Q09L028j050k443J254K288j819j809K421
2217G01J281k724r03K954K37l224K95L247q65l262J543L096j678l144K200K416
2233B170k514k017L106J654l283q25K907L30l324N67L300j352k895J857K929k680
2249g0k442K988J871l379j242L563R88l870l76L895k76l669M59L718j326l085
2265b253J713K640k255k145K964J600l367r86L545M48l868K55M055j094l868J840
$$ plain form
2153 1269 1235 -1374 -1022 1527 766 -1502 -535 1428 177 -1326 241 1460 -619 -1294 857 1179 -1502
2170 -1502 -1024 1634 909 -1819 -626 1699 298 -1957 -67 2046 -169 -2011 399 1788 -611
2185 -611 -1553 1042 1441 -1069 -1020 1338 685 -1480 -306 1889 -52 -1919 275 1846 -793 -2005
2201 -2005 1160 1731 -1171 -1717 1382 1627 -1978 -1169 1859 809 -1634 -380 1908 89 -1720 701
2217 701 1982 -742 -1645 1309 1546 -1678 -1383 1864 999 -2263 -720 2376 698 -2446 -246 2170
2233 2170 -344 -2361 745 2399 -884 -1709 1198 1528 -1796 -1229 2071 719 -2176 -319 2610 -70
2249 -70 -2512 476 2347 -1032 -2274 1289 2277 -1593 -1969 1926 1650 -2019 -1560 2158 832 -2253
2265 -2253 -540 2100 -155 -2300 664 2264 -1103 -2089 1456 1904 -1964 -1709 2346 1252 -2616 -776
2281g76L491k118l301K595K763k913k423L513J495l507r37L872ml890O56M002
2297B518j645l576K361L060k830k778L431K443m130j814M371J099m293m23M418
2312B212m08m190J023L832j541l641K393L070l040k516L666J791m147j057M492
2327A939L61m542L74M418q87m491J598M277k340l996K938L601l439k740L900J972
2343B943m551j027M540J3m328P73M503j934m183K793L840l175l453L714K865m304
2359i71k222M653J501m998l06M690k06m718R94M546k205l828K541L760l680k777
2375c226L959K244m486j438N279J26n141M48N296j361m916K079M612k927l955
2390c407L408L347l865k852M558J827m749r02M937J73n203R48M940j751m775K658
$$ plain form
2281 -776 2715 597 -2704 -109 2654 -259 -2682 831 2326 -1181 -2118 1754 1750 -2140 -1484 2518
2297 2518 873 -2703 -342 2718 -112 -2890 541 2984 -1146 -2960 1411 2510 -1783 -2206 2212
2312 2212 1804 -2386 -1363 2469 928 -2713 -320 2750 -290 -2806 860 2651 -1496 -2553 1939
2327 1939 2300 -2242 -1868 2550 1663 -2828 -1230 3047 707 -3289 -351 3250 -189 -2929 971 2943
2343 2943 -1608 -2635 1905 1918 -2410 -1637 2866 932 -3251 -458 3382 207 -3246 468 3333 -971
2359 -971 -3193 1460 2961 -2037 -2343 2347 2141 -2577 -1583 2963 758 -3070 -529 3231 -449 -3226
2375 -3226 733 2977 -1509 -2947 2332 2458 -2683 -2235 3061 1700 -3216 -1137 3475 548 -3407
2390 -3407 1 3348 -517 -3369 1189 3016 -1733 -2635 2302 2475 -2728 -1780 3160 1409 -3366 -708
2406g08M422l650l785M144L100m523k661N039J814n240o91N133k34m972J187M996
2422C371k392m383L063L821l969l099M594K372m935j618N579N49n781K91N617
2437C080j108n384K055M944k833m590L698L758m294k660M572K031n163p11N186
2452B581j94n375J029N257j688n284K931M739l756m187M416L514m939k668N151
2467A527J761n596n84N742m24n653J434N295k432m864L437M219m016l640M582
2482G88K923n442j777N458J299o081kN964p45n813J873N201k690m781L763L824
2498C762m120l273M812K207n266j275N606J71n672Q25N786k028n384K791N132
2513D074l541m474M137L902n072k856N636J777n749o36N496l71n309J034N505
$$ plain form
2406 -708 3714 64 -3721 423 3523 -1000 -3661 1378 3192 -2048 -2739 2394 2160 -2812 -1625 3371
2422 3371 979 -3404 -341 3480 -489 -3588 1006 3378 -1557 -3175 2404 2953 -2828 -2537 3080
2437 3080 1972 -3412 -1357 3587 754 -3836 -138 3620 -674 -3334 1238 3269 -1894 -2605 2581
2452 2581 2387 -2988 -1959 3298 1610 -3674 -743 3996 240 -3947 469 3983 -956 -3624 1527
2467 1527 3288 -2308 -2892 2850 2426 -3227 -1793 3502 1070 -3794 -357 3862 -154 -3794 788
2482 788 3711 -1731 -3508 1950 3249 -2832 -2834 3130 2385 -3428 -1555 3646 956 -3825 -62 3762
2498 3762 -358 -3631 1181 3388 -1878 -3153 2453 2624 -3048 -2223 3563 1535 -3849 -1058 4074
2513 4074 533 -3941 196 4098 -974 -3830 1806 3583 -2166 -2802 2694 2323 -2986 -1952 3553
2528C553k405n033L307M485m107l882M945L013n444k085N914J158n986l13O047
2543C167q11n935J807N466k648m825L308M352m289l514M992K539n294j737N713
2558B291O98n829L30O015j485n907K592N540l673m804M311L971m727l279N608
2573A652J896n730j077N965o1n808J043N486k112n072L166M592l802m279M975
2588H34L282n640k208N874J267n952k41N920p75n787J537N507k488m919L349M276
2604C836m375l343N041K384n298j632N794P66o115L69N917j322n752K375N184
2619C829k886m894L904M101m602l159M829K327n211j367N585J56n704R24N624
2634C456j848n393L119M546l667m140M513L383m916k750N596J457n693o63N821
$$ plain form
2528 3553 1148 -3885 -578 3907 -200 -4082 863 3876 -1568 -3653 2261 3419 -2567 -2880 3167
2543 3167 2356 -3579 -1772 3694 1046 -3779 -471 3881 -408 -3922 1070 3609 -1685 -3422 2291
2558 2291 2989 -2840 -2510 3505 2020 -3887 -1295 4245 572 -4232 79 4050 -677 -3956 1652
2573 1652 3548 -2182 -3259 2706 2645 -3163 -2120 3366 1254 -3818 -652 3940 138 -4141 834
2588 834 4116 -1524 -3732 2142 3409 -2543 -2784 3136 2361 -3426 -1889 3618 1130 -3789 -440 3836
2604 3836 -539 -3882 1159 3543 -1755 -3387 2407 3173 -2942 -2573 3344 2022 -3730 -1355 3829
2619 3829 943 -3951 -47 4054 -548 -3707 1122 3449 -1762 -3129 2456 2612 -3092 -2168 3456
2634 3456 1608 -3785 -666 3880 213 -3927 586 3969 -947 -3697 1899 3356 -2337 -3000 2821
2649B821j72n802J458N359k618m838L282M491m133l654M792K705n472j349N274
2664B144J093n953J41N768j247n567K208N237k971m696L754L832m285l040M692
2679A110K239n211j197N485K10n404P76N242j897m758K527M628l447m065M062
2694C00L569m725k693N134J656n429n71N174j41n067R19M947j793m525K680L993
2710C428l553l430M260K755m666j883N000Q29n179j57N483q39n057J575M988k603
2726I51m469L281L873m134k909M157K446m598j214M642O45n318O15N147j541m795
2742c221K363M263l151l782L558L362l937k827M742J802n023q05M855L7m797Q13
2758a748M616j686m154K230L720l014l251L846K476m307j687M611J272n034l03
$$ plain form
2649 2821 2649 -3153 -1695 3664 1046 -3792 -510 3981 -152 -3806 986 3691 -1781 -3130 2144
2664 2144 3237 -2716 -2575 3193 1946 -3621 -1413 3824 853 -3843 -89 3743 -542 -3582 1110
2679 1110 3349 -1862 -3059 2426 2636 -2768 -1992 3250 1353 -3405 -878 3750 303 -3762 300
2694 300 3869 -856 -3549 1585 3241 -2188 -2759 2415 2274 -2793 -1874 3073 1280 -3245 -565 3428
2710 3428 -125 -3555 705 3460 -1206 -3089 1911 2740 -2439 -2596 2887 2048 -3009 -1434 3554 951
2726 951 -3518 -237 3636 -498 -3407 750 3196 -1402 -2616 2026 2671 -2647 -2032 3115 1574 -3221
2742 -3221 -858 3405 254 -3528 30 3392 -545 -3372 1370 3172 -1851 -2656 2199 2236 -2561 -1748
2758 -1748 2868 1182 -2972 -742 2978 -36 -3287 559 3035 -1272 -2959 1652 2924 -2110 -2413
2773b413M745k02m904J224M535k167l888K629L238k778l019L766K054m285j120
2788b585M471M71m529L12M472j123m496K084L913k501l555L076K977l608k390
2803c011L784J846m075q70M236q9m215P25M246j543l770K041L594k786k942L266
2819D37K295l719j746M059J043m089m42M079j42l978P53M076j752l486K234K883
2835B505k503k499L088J853l527j140L672O12l905J77L767q50l680J244L895k115
2851E94l036K280K777k963k197L333J450l360j002L811Ql551N93L479j297l258
2867b339J788L023k344k425K685K220l222j672L380J104l697k70L617k75l658
2882b085J072L005j138l083J689K835k190k369K720J914l115j282L246N81l326
$$ plain form
2773 -2413 2332 2130 -2774 -1550 2985 818 -3070 -441 2797 19 -3000 766 2820 -1465 -2585
2788 -2585 1886 2357 -2172 -1860 2612 1489 -3007 -923 2990 489 -3066 10 2987 -621 -3011
2803 -3011 773 2619 -1456 -2326 1910 1821 -2394 -1669 2577 1034 -2736 -695 2899 113 -2829 437
2819 437 2732 -987 -2733 1326 2369 -1720 -2162 1917 1775 -2203 -1450 2626 874 -2612 -378 2505
2835 2505 2 -2497 591 2444 -1083 -2223 1449 2061 -1844 -1667 2100 1250 -2430 -1186 2709 594
2851 594 -2442 -162 2615 -348 -2545 788 2238 -1122 -2124 1687 1695 -1856 -1263 2216 919 -2339
2867 -2339 -551 2472 128 -2297 388 2608 -614 -2286 1094 2198 -1499 -1769 1848 1573 -2085
2882 -2085 -1013 1992 854 -2229 -540 2295 105 -2264 456 2370 -745 -2027 1219 1800 -1526
2897a526P5L231l22l630J297K965j534k777K056K202k134k242K856J496k788j073
2913a848L037N30l238K22K937n83l045J405K663j822k327K189J947k538j691K796
2929F34J015k706o30L012L5k881L14K877j017k260J114K248j626k005K267J391
2945A782k676p33K605N06k883J32K736k81k833P97K513j127k380J564K069j949
2961a58j557K113J426k646m56K103N44k467k8K466n26k265Q75J959j131j990J749
2978A1J609j984j295K231J068k406p06K375L09k547K87K258n91j971J124J643
2994A415j347j734K014R59j687q70K022O27k589O0K062j14k114N15K155j019j867
3011a512J228J800j370j509J778P74j662n54J632L63j831j41J889j59k045R12
$$ plain form
2897 -1526 -1451 1780 1458 -2172 -875 2090 556 -2221 -165 2037 -97 -2339 517 2013 -775 -1848
2913 -1848 1189 1719 -1519 -1297 1640 1057 -1988 -583 2080 258 -2069 120 2067 -471 -2162 634
2929 634 1649 -1057 -1687 1325 1360 -1521 -1207 1670 653 -1607 -493 1755 129 -1876 391 1782
2945 1782 -894 -1627 978 1484 -1399 -1267 1469 1188 -1645 -848 1665 538 -1842 -278 1791 -158
2961 -158 -1715 398 1824 -822 -1278 825 1369 -1098 -1126 1340 814 -1451 -576 1383 252 -1738 11
2978 11 1620 -364 -1659 572 1640 -766 -1472 903 1212 -1335 -1048 1210 619 -1352 -228 1415
2994 1415 68 -1666 348 1307 -380 -1250 772 1399 -1190 -1130 932 818 -1296 -781 1374 355 -1512
3011 -1512 -284 1516 146 -1363 415 1189 -473 -1027 605 968 -863 -1004 885 726 -1319 -407
3027d07J849j326j312J216J241j399j152J647P73j868k19J380M65j955M89J483
3043I05m66j586P25J605j202j068J093J151j469q02J590O40j806k39J906l27j669
3060a019M94J521o01j354O35J396j104r36J138R62j450m49J310K43j307j67J450
3077G62k16j661P22J455r39j105R37J104j057j116J413M17j140l46J235J92j304
3094f47Q1J408m99j026N18R92o38j006P93R06j233n64J338K19j113j55J201m7
3112E28j169J41J303n90q82M91Q53o27o54P01Q51j339j50Q91J41r58n4R81j19
3131C39p52K09Q17m10j011O79P48o44n86P86M70r24n17J052K62r62Q1R60n55m54
3151d12L19O44l91p62P39L88p86j97P33K74j012j12Q73J37p86k2Q93l17p84M77
$$ plain form
3027 -407 1442 116 -1196 20 1261 -138 -1290 357 1130 -738 -957 423 888 -1067 -578 905
3043 905 439 -1147 -422 1183 -19 -1087 6 1157 -312 -1114 476 1116 -690 -929 977 650 -1019
3060 -1019 -525 996 395 -959 -324 1072 -32 -968 170 1132 -318 -767 543 786 -521 -688 762
3077 762 546 -1115 -393 1062 123 -982 -45 1059 2 -1114 299 716 -424 -770 465 657 -647
3094 -647 -566 842 343 -683 -165 827 189 -817 -24 882 -351 -915 423 642 -471 -626 575 528
3112 528 -641 -500 803 213 -669 -178 675 48 -606 95 946 -393 -543 348 489 -469 -523 458 339
3131 339 -413 -204 613 203 -808 -129 619 -25 -611 175 645 -279 -796 256 518 -444 -363 597 42 -412
3151 -412 -93 551 160 -602 137 525 -261 -458 275 549 -463 -575 298 435 -351 -373 520 203 -581 -104
3171a04O00l74o47M99M79o49j07N43R1p64J36O82j60o09L2R86l46p70L02O75l98
3192I7m93M30M75m97l11K63K56l99k52Q66k38o11L49L40k83m05M77J89n48l42
3212f37P62K38o75p6N84J37p15O2N81k03m31N44P2k92k60K46L73l30m35N74Jj32
3234a2k03L25K51n90J34L27r2k07P7K07k91j61P9L99k17k14K54J24q2k07K54l7
3256A18l64K15J65l78j26L30K69l65p9L07J81l48J6J28M41p74J70L02r3k46J27
3277dK74k52N6p8J19j31j21L10J05k91r8J02K56n65J69K92j48k86J63L60l05n0
3299a23O6M3L6j09J72l9j50J0J10n3J1J66k1j14j71m9K03J43k52L82J39l84k19
3322b03K73R5k66P1q6J40j89J86L1Nj32Q1J58j66j1m4J54k74J85J81o3k99RK96
$$ plain form
3171 -104 496 122 -525 -26 453 -196 -303 240 331 -433 -297 385 225 -384 -352 634 288 -482 -180 495 97
3192 97 -396 34 509 12 -299 -36 220 -179 -431 435 197 -414 -65 275 -8 -413 64 253 -295 -637
3212 -637 125 363 -312 -388 196 333 -382 -320 261 58 -373 171 243 -49 -309 -63 310 -20 -455 119 120 -12
3234 -12 -215 110 361 -229 -95 232 140 -67 10 217 -74 -235 -156 243 26 -188 66 190 108 -99 155 118
3256 118 -246 -31 134 -244 -370 -40 229 -136 -215 92 273 -75 -59 69 510 -264 -94 208 115 -131 -4
3277 -4 270 18 74 -4 115 -16 -137 173 278 -13 -111 -9 247 -318 -149 143 -5 -291 -128 232 -73 -123
3299 -123 -57 -14 22 -87 85 46 -104 -94 16 -37 -26 140 119 5 -166 -215 -12 131 -121 261 400 16 -203
3322 -203 70 165 -101 -30 -116 24 -165 21 52 57 -75 6 164 -2 -13 -57 97 -177 8 189 126 -173 -164 132
3346A32p2k89l8K42J15j13J8j51J95O1p7L9m17N21n4k98N0Q8K57k82j45K41L14
3369C37l70n7R6R5j17j94K6K91Nl91J61J04Lj7L3qj00J28j05K1J25r3P0j50R2
3394a5m8K18m35J73K55j69J69r2K14l23K6p8p3K93j32l2K06k46j5J97j0l75L27
3417C5J18n6o5j12Q5o7J04R4p9n9J00o0k6k05P7R1j65J18MO6j45K06J11j39k9
3442BL4LL2k5M5%o5p6O7n6j03K52j50J37j69J87k03Q7n3J28J66k98MR8l4rj99
3469a98K0K50l5l48J28K47P4r9j45J92j2k02P4N4R9q2J69k60N3RJ4j31o6K91k31
3494a35P8j6K29o2n3j27n0J41r4J11Q1j30J37k84J74q4J25k09Q5J76Qo7j17P2
3518a1K4n7L9j17J56R2j04J56k10J08j42L0P9o0J03j42p6J50M2j30J14o0J13L7
$$ plain form
3346 132 60 -229 -267 -25 90 -23 -5 -156 39 100 23 62 -355 166 112 -186 -136 -48 209 -73 -218 23 337
3369 337 -33 -90 6 101 -16 -210 -184 107 112 -279 -118 -14 -11 -28 5 -3 -103 25 -80 -59 66 -27 43 -107 -15
3394 -15 -63 155 -280 -107 148 -21 148 56 270 -53 -27 -105 -178 115 -17 -49 157 -89 -104 93 83 -292 35
3417 35 153 97 32 -80 5 -62 42 136 57 -2 98 38 12 -193 -116 -25 -190 -72 -68 -2 -147 59 170 31 2
3442 2 36 39 71 46 91 91 26 -50 17 -39 -142 110 -40 97 -72 115 -88 -1 -54 74 240 -58 -54 44 10 1 -198
3469 -198 -178 72 37 -311 -183 64 138 39 -106 86 74 -128 -54 0 99 17 186 -74 -21 -12 2 -129 -195 96 -135
3494 -135 -57 -73 156 94 41 -86 -136 5 -89 22 103 -27 110 -174 0 -84 41 -168 -83 93 101 34 -83 -11
3518 -11 13 -44 -5 -122 34 126 22 178 -32 76 -66 -36 43 -17 86 -56 -132 18 60 -70 44 -16 97 134
3542A34k86M9j1J63o8L8K6j39J18n5J6K7M6j68J9Q4o7R4r5lJ65JPj17j18K04j12
3569d8K31m6l3j2j48j29J72q4m9L08r5k3lj78K13j73l5R2N4j14K20j05Q9m8k92
3594b36K53K1m3j75mL21J5j56L5j12J57j71J65p6o6k1j47K52m9R5q2J65n7j59
3618g5kJ23j18J69j33r9J26k1K32j56j02J09o4J33j73jLn0J76j63O2j05K59k36
3642a06O4J27J2k59Q4J46k6n0q5J64k73K62k8r7q6K24j06k44L42P8p1k38P5J29
3666C8r5O5PKm0Q5N7l5Jk6k26J30j13O8O8o8J40q4kL3n8J04j80J24L2J63j25j12
3694d7J2J08o6j66J87j44L04j91q7J43J34p9j04m0j25M8L6O0j32J90o8r7J39j23
3718a08O4O8j9O1j37J49j25K85k22N2L4l11K86Pj01r3K65j84P0j34J01N1J46j73
$$ plain form
3542 134 -152 -103 -114 49 -19 19 45 -94 24 -31 -15 12 58 -110 -91 -7 -74 20 -75 -78 87 88 95 -22 -140 64 -48
3569 -48 183 137 104 92 -56 -185 -13 -97 -146 162 67 44 41 -137 76 -97 -132 -40 14 -100 120 15 104 56 -236
3594 -236 17 38 -5 -180 -184 137 152 -4 31 -81 76 -95 70 -6 -72 -93 -240 12 -37 58 -24 141 84 -75
3618 -75 -77 46 -72 97 -36 -135 -9 -30 202 46 -56 53 -11 122 -51 -52 -49 -99 77 -86 -24 -129 130 -106
3642 -106 -42 85 97 -162 -78 68 42 -8 -93 71 -202 60 32 -65 -151 73 -33 -277 65 143 72 -166 -91 38
3666 38 -57 8 15 17 -23 62 119 84 85 59 -167 -37 -150 -82 -14 -82 58 -26 -28 5 -53 51 -129 -5 27 190 65 -47
3694 -47 -35 73 7 -159 28 -116 188 -3 -90 53 187 108 4 -36 -161 -113 -77 -17 -149 41 -27 -124 15 -108
3718 -108 -44 24 5 66 -71 78 -47 238 16 68 102 -209 77 84 -17 -110 155 -29 41 -93 8 59 205 32
3742C2l0K3L2q0k4J87j87N6j49m5J72Q5q0k2n9p2N8N7m7J28k25J53J8m5K2p1R0
3769b3N0nj14nJ4K67j15j80J53j13O7J36P6j65m8J86j17J3J2O3k5j71Mm4J29N6
3795A01k21K45N0J4j89J3k2K02j34o5k3k13J55J88r2j61L06j23O9k81M2J70n7
3818b6L4J4K2N5o6J57k33j05K91k16j0O4R7k26K63j60J42j22m5J23j29q9K42j95
3842a18M2J67n8j07J3OO3l3r6Qj4J49j95J98L9J04r8o4j13L3L7K7k51K43j19K28
3868I1o1m8j97J27J39k9r5K18R1l12k6J71J8j34Oq0J01k9n2J45K1k12K08%k42
3893a81K51k24J23J11j1j27P9R5Kj54n4KJ22q9N7L0k2J07j76J19kp0N9J5J62k95
3919g1j33K00k19J64Q8j34J48o5O4j84K53k4j01J7o6j2p3J33j11J71j08J89m42
$$ plain form
3742 32 2 25 57 -23 -47 140 -47 9 -140 -185 -13 72 -8 -30 -89 -161 -103 -46 -93 35 -190 -37 -19 -64 -42 -113 -23
3769 -23 27 22 -92 -97 -83 184 69 -111 42 -71 -4 132 208 43 -5 181 64 77 89 152 127 -44 -40 -84 45 101
3795 101 -120 125 175 189 0 13 -9 193 59 -6 -29 -242 -87 101 9 -152 154 31 100 -181 -139 31 -26
3818 -26 8 22 44 99 33 190 -43 -148 143 -73 -83 -19 78 -148 115 -45 97 -25 -70 53 -76 -165 77 -118
3842 -118 -76 91 33 -74 -61 -55 8 -25 -121 -113 -127 22 -173 25 64 168 70 6 -107 -74 -37 -10 -261 -18 -137 91
3868 91 30 -18 -215 -88 51 22 -73 145 236 -76 -102 69 87 -47 -41 -121 -20 -49 -101 44 65 -147 61 61 -181
3893 -181 70 -154 -31 80 69 -58 21 116 118 -36 -90 -88 34 -55 2 32 10 117 -59 60 58 -12 47 62 224 -71
3919 -71 -204 -4 -223 -59 29 -105 43 -22 42 -142 111 87 -14 3 -63 -75 -148 -15 -126 45 -63 126 -316
3942c16K73L25k18k13J27j3j1k2K26k22O5L4N5j88J19K2j1q1j82K26k07K89P4
3965A51l5k08K40j55m5J99q7m4j43J42J23j10R0k60P1l8p0K52k36J39J76l24J39
3988c3K5J16o9o4P9k51L40k29k3L11k40Jp2nj27K53m6R6k11L50j73Q4L7j46o5
4013f2P0K05k30J20k8O1n7j10P5j38q9J81N6M8j14p1Q4n3K0l6Q9N9k77K75p9P3
4039G2L5l32J33r3K02m9O5M7M8o2j22l8J91o7q6l8J46M2p3k28K85l6J56k62m1
4064a05k5K68j29j0OR3j65R2j41Q8k9l0J74j57K75j58l6n2l3K36kk30M8k4K5J53
4090A32k11J29O9k92L5K35j41r5P8Q9J22q4j48M1l5J19n9k0N6o6K3oJ59j47j23
4115a40mR6P4l2j2k5p3K92J9Kj00n5K03k25j38J26O6O3k11P6L2j1p7J20M4r4k00
$$ plain form
3942 -316 -43 282 64 -149 -22 -35 -46 -68 158 -64 1 35 90 -98 21 43 32 -49 -231 -5 -212 77 151
3965 151 116 -92 148 -7 -52 147 60 16 -127 15 138 28 118 -142 -71 -109 -179 73 -163 -24 152 -172 -33
3988 -33 -8 108 39 -25 54 -197 143 -86 -109 202 -38 -37 -109 -114 -241 12 -34 62 -149 201 28 112 149 3 -62
4013 -62 8 213 -17 103 75 136 79 -31 44 -94 -183 -2 54 102 -12 -83 1 -52 -32 -68 21 80 -197 78 -1 72
4039 72 107 -225 -92 -185 17 -32 33 80 128 66 -56 -94 97 30 -56 -94 52 94 21 -207 78 42 198 -64 -105
4064 -105 -130 138 9 -1 5 98 -67 25 -116 -28 -57 -87 87 -70 205 47 11 -41 -74 162 160 -70 -22 -46 -21 132
4090 132 -79 50 119 -173 -138 97 -44 -139 -61 28 150 66 -82 -41 -76 43 -16 -36 20 -46 -23 -29 130 -17 -140
4115 -140 -144 -48 26 -6 -18 -43 -116 176 195 197 97 42 245 20 -118 8 74 137 -74 2 34 23 -54 66 110 16 -184
4142a84K11j4M6q6q1m6Q8J17j9m3O6j13l2P9O9r0KQ7OLj58R9q0J71r6m0k8M3J14
4171I1q1P0m7k6J25k8J0L1j10N6J5j89J69j0j27pJ05J22k44N9Q0j07L4K20n8j36
4197A7Lp7J31n7j58K94k24K7l6K25j40j13J80q0j7k7n7J09l0J93j91J75k29K43
4221A61p5Lj14l9P0K19k67K42j05k61K79p4P2k00m2K54k41Q3J20k41K06o9J1Q0
4245G2j09m0K2QL4K5j7K20k05m4M9p6Q0k00J20m7J28N5k00n3J19J03j70K01l1
4270D4J10l94L20o2k07J03R8%L4N9q4Q4J08m36K27J33j88K33k5n3j02J6J79k97
4294a00J51j04qo6J05n9J71j9MlJ45k21p9K60k22Q7Oj23p7J83KPnq5J22Rk4o3
4322fK1r3o0K46j09o6J39r2J28k23J80J19j46q7Q3j88J8J23RJ55r9m5k27K41p1
$$ plain form
4142 -184 27 13 59 -27 -108 -154 -66 51 32 -11 55 -58 -90 -11 58 -32 -30 57 63 66 -92 7 -73 98 2 -38 -66 -23 91
4171 91 10 80 33 7 132 104 114 145 35 91 106 -83 86 76 -51 -58 47 169 -75 -16 64 -43 -9 211 153 17
4197 17 20 -57 74 17 -141 153 -71 -44 -80 145 5 -108 72 -8 -25 -52 -109 0 -30 163 -28 147 -82 161
4221 161 86 89 -25 -64 6 225 -42 200 95 -166 113 39 111 -89 -131 123 -118 -35 85 -156 50 -19 -8 72
4245 72 -37 -77 -55 -47 -13 12 -5 215 10 -34 15 -61 19 -181 -61 -108 20 75 -125 -178 -59 44 -126 75 44
4270 44 154 -240 80 18 -189 -86 12 12 46 105 21 105 213 -223 4 137 -51 182 157 104 2 18 197 -100
4294 -100 51 -53 -61 -127 -22 -81 90 71 75 72 217 -4 -83 177 -45 42 48 -75 -152 31 33 40 35 -50 72 81 57 -6
4322 -6 15 -78 -138 108 -1 -67 72 -20 108 -115 65 184 38 -49 34 -154 -136 -13 -4 151 52 7 -220 21 -50
4347e0J11K1j41J93l67J84Q9J16j36L2j95K08j20J46O6l14N6K39j01j30J95j5
4369H7k20J83J10r5q3J44k56K36j21r6J68J27k11o0J9L8L5j38J83j18J07N1K72
4392C62k56j34K9J3J6N1j51p4J51Q8M4j51j28J70M7k12N4lO4Q5o1p3J13k98K27
4417b7J44j53N1m9Pqj32M36k43kJ68j61J68k70KP6j59J37j00K97q3j7j32K12k83
4442a21m0Q3O0J03j07O6l01K30MJ88k00J80j09j69O0J10j73J58p9j3l1J36J44
4465A79l51J88p6L4l0j11R6j78M40k67l3K56j17r3k2R6j75K09j90L0K67k63J94
4488H3q7l5O0r8P6n5r3L9L9N7j27J50l3Q1k2J53l19J12j5J11Q1j52j4M7j35K38
4514A42j48N2J7J9M5j20L0j75J09j25J36j49K96q9Nj59J4K64j48q3Q9o0j75K36
$$ plain form
4347 -50 61 82 -59 134 -233 -49 40 156 20 52 -143 65 -55 91 157 -157 -101 138 37 -93 102 87
4369 87 -133 50 160 65 -18 126 -130 106 -15 -111 57 184 -27 -87 -68 -30 5 -133 50 -68 39 90 362
4392 362 106 -28 1 14 30 81 -70 -144 7 95 139 -12 -140 30 77 -135 -81 -84 -20 65 4 -69 44 -254 -27
4417 -27 117 -36 15 -34 -27 -35 -167 269 26 24 192 31 199 -71 -69 7 -152 -15 -115 182 99 82 -50 162 -121
4442 -121 -161 -78 -18 85 -22 44 -257 -27 -23 165 -35 145 36 -133 -73 37 -136 22 -57 -70 -101 35 179
4465 179 -172 16 -60 -26 -56 -167 -71 -249 191 -76 -109 147 30 -63 -85 11 -164 45 -145 -115 152 -111 83
4488 83 -4 -39 21 -77 -1 -56 -149 -110 -71 -14 -141 9 -24 57 35 188 -131 -19 -34 77 158 6 -8 39 -96 142
4514 142 -6 46 63 82 127 7 37 -138 -29 -154 -18 -167 129 40 45 -114 -100 164 16 -67 22 -38 -213 23
4538B3j21J46j99O8l6K7J30J01j20j72J14j23J27j2OP9o2j6J64P8m0j54J52j69
4562iJ12k74K54j95K00r9O1m4j69L14k04P3r0n3M02j50o5n0j47M23l74p7K37L2
4586A08j82R0Nj27j0M4k7N9P3J43p9n7K9O1j62N6R1j62k0rKl9J34O2m2j23J77
4613I5q8M2k21j8J71N9k8J73l10J75l6k6k8L5J48j62J56k40k9K16k39K1M5L50
4637B61j94M4o5K9oO7k4l7q7j51N1J76o4l9J85j82p4J90M3k32o0K05j33L0N7k7
4663c7O8M4j06n4K49l69K52o5L9o1q3P6K84k69P1k4j21J61N8n2j36K95k44J47
4687A23q2q4J33j47K2j1L57k88j62J36m0Q0j2L2p8j3p5K91L6m79K29k5J9j28K4
4712a42K82j62R6l1q3k3K56j44J01j62P9j93J07o5J31J05j76j29J03K83l15R5
$$ plain form
4538 23 -98 48 -151 -83 -119 -92 38 139 19 -153 -39 -162 -35 -47 -41 38 -24 -40 124 202 162 8 160 -9
4562 -9 103 -171 83 -112 88 -11 50 6 -163 151 -53 20 -70 -123 279 129 64 14 -133 290 -84 -161 76 108
4586 108 -74 16 21 -106 -116 -72 -99 -40 33 176 97 40 69 130 -32 24 115 -47 -67 -76 -74 -113 21 83 41 -82 95
4613 95 7 49 -172 -190 -19 40 12 185 -125 50 14 -12 -40 -5 143 -19 137 -103 -132 84 -155 -134 -89 261
4637 261 67 111 46 75 69 136 112 75 -12 -163 -112 64 0 -39 146 -36 -110 80 123 -109 -169 36 -97 -67 -10 -37
4663 -37 31 75 -31 -85 164 -205 47 -18 21 -40 -123 -47 237 -32 39 15 -106 55 113 61 -75 220 -24 123
4687 123 41 -43 90 -57 -35 -46 311 23 -139 -3 -43 37 25 57 -21 -34 -109 182 218 -261 -32 -57 -38 -166 -142
4712 -142 140 -22 74 43 -40 -63 193 49 150 -12 67 -126 -19 -84 47 152 -24 -153 -50 233 -82 13
4734A3J10p8k44N5K63k9k62J60Q1k64K02j76M27l04O2J44J2k98m6K55o7O0j15
4757c9J50q4P1r3J88k61J45k43K82j00j69K26j24l9n1k8J18l3R8J85k16k20J2
4780b25K03j9j35L8J96O8k48K47n7l67J84L8J52l41K54N8j84rK47l5j59J48qP5
4804A21j18Qj27J90j63K09J2j29j7J00Q1k46n2K90j16j10J77P4j44j73K2K38q7
4827D0k17K6K40k60P7M9J65K0K1j61J71k57R7o9j85J04N8J88o0o4q5K66k09k8
4851g3K59j56j20J1O7j4N2L9Q6l2j75j4K17k46J41jJ40p5l08K66Q0j91K5K38j64
4876E2m7j17K78m4k21J10ln9j81L83j50j57J2J91o3O8k42J01J86n9k42L17K7k72
4900a32J17K15j23k95J08K03r2j6J51l54J90J55k34J77k35L9J60J1k20R3K58k31
$$ plain form
4734 13 123 45 -199 -144 119 90 -172 -12 69 -195 7 -169 258 -46 16 160 172 -126 -172 83 16 76 -39
4757 -39 111 27 98 5 193 -68 77 -166 116 16 -153 73 -51 -90 -141 -169 -51 -84 14 199 -17 -237 -225
4780 -225 -22 -41 -176 -138 58 126 -122 125 68 -299 -115 -77 75 -266 -12 46 -138 -147 100 65 -94 54 46 121
4804 121 3 11 -116 74 -89 120 132 3 -14 86 167 -79 -131 159 43 -67 110 184 40 -133 -111 127 40
4827 40 -177 -151 89 -171 -94 -45 120 140 161 0 171 -86 11 -58 -243 -139 -81 107 47 -17 -102 164 -45 -73
4851 -73 186 30 -90 -79 -12 -26 26 65 151 119 -56 -70 147 -99 42 41 181 106 -202 64 144 -47 -22 216 52
4876 52 5 -112 166 122 -99 11 8 -51 -232 151 1 -156 -144 47 -16 52 -190 -89 97 38 -204 113 140 -132
4900 -132 -15 200 77 -218 -110 93 1 -15 136 -218 -28 127 -107 70 -165 -126 34 45 -175 -82 176 -55
4922e5rR6l5j53J01l2Q9p7J39R1k05j92K12J08j08j12J13p4j79K80N6Q2k59j29
4946b52M0J58M2m2J61j6l30K95J54l86NK24j36K0j96L13m1k20J31P7j48LQ3M2
4970a9J51k57J64J37l33J66J25n6j27jJ64k00q2J32J64j78j74K81o1r7J88k3J24
4993A88m06Q2L40k27l60M37k5J38k79n0K75o6j57K27P5k94j55L05nj36J02K13
5015B22k34k13L28%P2l77l4M53o8k64Q2K14j51k68K31N9j41J2J66J23l41K55q
5038A18j3k47J72K69n00J20J74j1J71m39L35O1k16J84j83R6k50Q1K82l27l2L4
5060a21M7K5j54K83l7j89jK70j36j55n7K30P9k47J00J31J00n46N15oj99N2N9L6
5084G9k20LJ47J63l82J74j2J02j09j16L76q1m74N31q5q7p7J83J5m59J13M74j71
$$ plain form
4922 -55 -64 32 -3 -156 -55 -87 2 -75 64 155 -50 -242 -30 78 -30 -142 -29 -103 -282 -2 54 136 -123 -252
4946 -252 -212 -54 -12 -54 107 91 -239 56 210 -176 -171 53 -83 -63 -259 54 13 -207 -76 1 -147 -144 -61 -19
4970 -19 132 -125 39 176 -157 9 134 78 -49 -50 114 -86 -168 -36 128 -50 -224 57 -4 -101 87 64 188
4993 188 -218 -136 204 -23 -383 54 29 167 -112 -162 113 47 -110 117 192 -102 -257 48 43 -93 9 222
5015 222 -12 -225 103 103 175 -202 -236 217 149 -115 -33 181 30 -238 -7 52 -89 -77 89 212 -129 126 118
5038 118 105 -142 30 299 -201 -81 93 82 253 -186 149 210 -6 178 -5 91 -159 -78 204 -123 -155 -121
5060 -121 -74 -49 -203 80 43 -146 -147 123 -13 -168 -225 5 84 -163 -63 68 168 -378 137 131 -68 -16 43 79
5084 79 -141 -138 9 172 -210 -36 -48 54 -55 -171 205 124 -350 181 96 9 -68 115 130 -329 -216 258 87
5107H7l86K47J54o4p3j01K91k02j59L41N8k27m5J61O8j31P6K45l05oL9J88j88
5130F8k00O9J72j71P5Q5M1l48q4N59k23j03J19Kj55L4K32j08j26MK21r5q8r2J84
5155G2M3k03M1K61l15J08q0L08k34j13Q9O8N6k85K22j6J6j10J54j63j7k6J94J38
5179B08l83K34K6l2l32K67K09p5k30K16R5k64M2R7R0l50l3K38k17J23l3K58Oj54
5203FN8M1l36j09M29j4j60m3M20k92k28K26L18k66k30J76K2p5j40L62K1k03j48
5226a65O6P0R5k14K39k4j44J10K11k84q9J97K1J04l65J63K15k22r3J65N1j62j61
5249b16L87j88k05J78J77j97j5N9J35k36j79N09j13M6k03K74p7l98K34J34j28
5270b2o2p0K20j46l9K2J15o0k31L53O5k13j82K53J01j36j76J80L4j59J62L1k8
$$ plain form
5107 87 -299 -52 102 38 -35 -136 155 -47 -206 135 193 -34 -79 82 150 19 95 340 35 29 68 256 68
5130 68 -132 -63 109 -62 13 98 139 -209 -293 266 43 -60 59 61 -94 -60 172 64 -62 -58 163 68 -20 -112 72
5155 72 115 -88 -47 214 -101 7 -73 235 1 -112 -23 45 101 -184 38 22 38 -72 82 -81 -98 -124 70 208
5179 208 -175 59 85 53 -279 -12 197 122 -108 108 203 -61 -19 78 168 -182 -215 23 -194 -71 -104 154 160 6
5203 6 64 105 -231 -340 89 75 -85 -128 292 0 -228 -2 316 50 -180 -4 18 -57 -197 165 186 -17 -165
5226 -165 -99 -29 66 -148 91 67 -77 33 244 -40 -129 68 89 193 -172 -9 206 -16 -109 56 107 -55 -216
5249 -216 171 -17 -222 -44 133 -64 -79 -20 115 -121 -300 209 96 142 -61 213 136 -262 -28 106 -22
5270 -22 -84 -154 66 -80 -119 -97 18 -42 -273 80 145 -68 -250 3 104 -32 -208 -28 6 -153 9 40 12
5293A2O9l3r6K7N4oj60N9R8J14j54o9J07L5J43k63Q2O8J4j89J22J2q8p3K11J20
5319B16k37j21Q1J35k32R6J07ok1O2J77k67j10K24j80J44j47J47Q5k32L9M6j0
5342dj0j21L30k33j12K39R2m37J23Q0J10j05k19L41J09m85J55L85k76o5L04j30
5364G1j10M9n0J50j38PL01k84j46J08L4K47m25P2L43l21k07L01J72p6o1l7R7j84
5388h7oJ07J58j52j8j00J80k58K54j26j71K85L1o6p0j59K83L09n94L8J91n6n3
5411h0K01m1J21l23jK96j57Km6J81r7j65J73rj54J11J69n2j97m2L66k96N5J4q
5436B1k09R1L04k15J0l6k7K56l89J15J89q1j57J53K4Jo5J00q8O6n5K4m4R0j41
5461f3L18k79k09L06Jj62K0J87K8j45j35K40q4q3J36k6M1n1q6k6J82l56J98K11
$$ plain form
5293 12 81 48 -48 -21 33 27 -133 -74 24 138 -16 -85 22 57 200 -63 19 87 101 -88 34 46 -42 -115 96 216
5319 216 -21 -142 -61 74 -158 -62 45 39 18 80 257 -10 -120 104 -76 68 -79 68 153 -79 -40 6 -4
5342 -4 -14 -135 195 -38 -150 89 181 -256 -133 -53 57 -48 -267 74 183 -302 -147 238 -38 -103 201 71
5364 71 -39 10 -40 110 -28 -21 280 -4 -150 -42 -8 239 -186 -114 229 -92 -299 2 174 98 37 0 97 -87
5388 -87 -93 14 172 20 2 -98 82 -176 78 -48 -219 66 97 31 -39 -198 85 394 -200 -162 29 -27 -80
5411 -80 121 80 201 -122 -123 173 16 18 -28 153 56 -109 64 55 -99 12 181 129 -68 -110 256 -40 15 29 21
5436 21 -188 -97 207 -8 2 -34 -61 195 -194 -79 110 29 -128 25 49 50 -15 85 -3 63 8 32 -12 78 -63
5461 -63 255 -24 -233 73 74 -88 -68 119 147 2 -133 107 23 -60 76 50 91 40 -46 -72 110 -246 -48 163
5485A63p9j33L5J07o1j71J59o1J1KJ42j5l45J11J95o9l2p9K20j60j91L21k3j17
5509g0J03k23Q9q6J38j6R0j66L7P2KQ6j17J01N2j77K19mk43J20R4p0n3J20j23
5534b5L6o4j83L08k08J30r0M0J8M0M7M4n5k8pJ03k33J44j8P4q1r2J46k9j36m0
5560a59J77n7m8J24J96k18k3P5J51k40K9k71L13r9N3j3o8L5J12p7J0n0j10J59
5584AO3m1J62o0j48j29J53Pr3N0j64J88j50l2K28k5j96K70j9%k01Q0J69k75OJ83
5610B7j9j35J80q3l4K28o9q2k9O8j57R7Q0k16J28K49l92J56J04O2k59Q2r0J01
5634cq4J03J5l2J57Pj36J04l56J03J27l8M9M5j19l4K19j64j7o6J10r3J8L2K56
5659B03j72rj04J58p0K4M1j53J01l9J18m5J27l33K16RJ1P6l0j39j96K55j21J36
$$ plain form
5485 163 84 -49 -14 93 32 -139 20 -41 -30 -28 114 99 -246 -135 60 -9 -41 -120 100 -60 -251 70 47 -70
5509 -70 33 -190 -101 -187 -49 -65 25 -141 -104 -32 -30 56 -61 40 92 -85 134 130 -113 7 101 31 -22 98 -25
5534 -25 11 -53 -236 72 -136 -6 -96 -56 -38 2 49 93 38 10 3 106 -127 17 -1 73 -8 -100 46 17 -119 -159
5560 -159 18 -39 -87 37 233 15 -8 67 218 -22 7 -264 49 -50 3 -10 -78 -43 69 -8 2 -48 -158 1
5584 1 64 23 185 125 -23 -152 1 8 -85 -35 -199 -11 -161 -193 35 10 -186 84 65 65 -136 -56 113 -162 -156 27
5610 27 8 -127 53 -30 -64 164 95 13 -16 52 -105 -8 72 -144 -16 233 -159 -3 101 163 -96 -14 -104 -3
5634 -3 -87 16 31 -1 156 163 27 131 -225 -122 5 -33 16 61 -58 -92 127 -37 -54 -120 -10 -103 -85 -53 203
5659 203 31 22 -82 76 6 30 71 -82 19 -20 98 53 180 -153 63 72 83 159 129 -10 -206 49 -72 64
5683F4l91N16k17p0J42P3j46R7j65J45J58k57Q7n3J9J48j18K26j83j80O2J38j4
5706H1L7N8j9j88Q6l9Q4p5Q7Qk20P6o4J26k99L74j70l9K66k35J90j20R2j6p3l5
5732b7l3j12N6K26K0m5p2O4n9k09J43P1m0K12k69o2J56L2p4Q9r2J5K55l65p4J06
5758h8J73j23J58J08j57k66j3L32r3l1l4o2J31m9j25J72j71J92Kqmj61K83k21
5782e5N7J04j89L2Q5M2l5P6j31%J01j76P2%P7j82J93M2o5j07K0q2J27ljp8m4J94
5810G4o5r2m2K01n0m7M2l9J8j76M2J64k7j03LJ24j22j13L41k97J55M4M5o6Or9
5836g9Q0L8k35K26p2m5K00j38J24l66J52J28J00r9o1j08R2O0j8k9j38J36OK7Q5
5861F6K4k18J44n5L4o2K22j03k37K90j90p8L24p4j11L2p4N7O0l1K01k14Pm9O2
$$ plain form
5683 64 -327 189 -28 -98 44 117 -29 68 -97 48 206 -51 36 -17 2 150 32 258 75 -105 -43 95 81
5706 81 118 176 157 -31 55 16 100 25 112 120 -100 -24 -88 38 -261 113 -57 -96 170 -65 125 5 97 81 8 -27
5732 -27 -60 -172 -116 110 130 85 13 77 18 -191 -48 23 -17 195 -74 -136 20 52 -22 67 -25 -10 245 -120 -194 -88
5758 -88 85 -38 120 228 71 -195 -208 124 31 0 -34 -96 35 -14 -139 33 -138 54 56 48 44 -117 166 -55
5782 -55 2 106 -83 -51 34 76 41 117 -14 -14 87 -89 -17 -17 60 -122 71 113 48 -59 -39 -121 6 3 2 -76 -120 74
5810 74 9 -83 -125 76 26 -21 21 -18 0 -176 -134 30 3 -100 -97 27 -95 -208 133 -164 -9 35 80 14 20 -79
5836 -79 1 39 -196 30 -42 -87 113 -25 99 -267 -115 13 113 14 -47 -155 -63 -3 -21 -50 -188 -52 -46 -19 66
5861 66 90 -128 16 -39 -5 -67 155 52 -185 105 -85 -163 161 87 -24 8 -66 -9 51 20 221 7 14 -35 27
5886B7M8P8j27m5j6J95k74K70l30K6K61k9k34J44J31k25l7j96K05J94j98J37k6
5909b1j08m6j0J42R8m5O4j23R6j20R5j0O6M4j40ko1J68j34oJ56j98K18P0j09k4
5935F0j14j09Q3K24j82o7O6J52p0j1K29j58p2Q2k28Q2p4Q5o1r0N4K34l51O8J74
5960Fj08J93r5Q2j04R2j95J06N5o0q1J40L3j81J1P2j2Nk8J40Q1k93J17J42k79
5985a61K34M3P3j27j75L15j81l0O3j94J13j81J89M4j07J58r5K27k54p4K16k19
6007a23R6q8J04n6l6n3J92l4j3pm6M1J43j72J44o8j3n4J10L2k25L13j32Pj62J64
6033F4l2o0L1q1L2M1j59L16l28J51o8J1j19J14J61k05J36J85j54J4PJ32l18K44
6057A15n5mj46K1K47l41K21o6j32k1M5J78p7r2o0K06j12J13o2J35j24Q8j21J8
$$ plain form
5886 27 75 153 26 -19 -35 160 -114 156 -174 -148 113 84 -150 -6 125 -100 -137 -333 -128 66 -132 5 -21
5909 -21 -129 -175 -185 -43 55 10 74 -49 47 -73 22 12 78 122 -18 -20 -81 87 -47 -53 103 -95 123 193 84 60
5935 60 -54 -163 -80 144 -38 -105 -39 113 43 32 261 103 31 113 -115 -33 -107 -22 -83 -173 -119 115 -236 -168 6
5960 6 -102 91 -4 78 -26 66 -129 -23 32 -28 -109 31 64 -117 -106 -34 -46 -41 -69 71 152 -141 -24 118 -161
5985 -161 73 116 189 62 -113 202 21 -9 54 -140 -27 -208 -19 25 -82 76 -19 208 -46 -120 96 -123
6007 -123 -27 -115 -11 -67 -103 -156 36 2 -11 -18 -64 -23 120 -52 92 24 11 -43 67 99 -126 187 55 62 -100 64
6033 64 32 -28 3 -78 -46 -5 -164 152 -176 -25 -93 -82 -201 -87 74 -131 5 190 36 50 57 189 -129 115
6057 115 60 56 -90 -69 178 -163 58 -8 -140 -161 -116 62 -15 -107 -167 39 -73 40 -22 113 -11 77 -44 -26
6081b6j5M3m6q4J33P3n0k23P6J54p3J29j69J6Jq9J83p2J55Km6K0q1J07j94J47
6107G1j20J03J36k83Q7M3R9k06K07p5r1J04R7j52M3j3k3%l6k3j18J13j06J48l
6132BL2q5k1O0o1K50K9q1k6l11J87k46J34J09r9J64N4j50L8O4m0k5P1j77K1P5
6158c2J61J91l74J69j96K26k17O0p7j17K23R3r7J32O3k49j7n5q8M7J67j47J76
6181D2j84J72m6J99k68J19j2N5OK6pj09r3j05L44j18L1O1j75K1rL8m4L8Q9j87
6207a16K21l0P4j42J95k47J6o3J58O7mK2j5q0O0q3n9J14l1j15n9J84kj1l9j53
6233a38K69J9k16J11j45K80k70J50j42J0J2j15L46j05p4M5pm6j4l4lJ3r1K51o6
6258D0j12K49m9q1L4j03L8Q0j09R0j22J39j17J90j62n9J03j13j7K8qM1L7j21L03
$$ plain form
6081 -26 -41 2 -44 -128 5 78 28 -195 -119 35 -38 91 -78 -62 -61 -150 33 -39 116 118 72 92 11 118 -76 71
6107 71 -49 54 190 -93 -6 37 136 -70 137 62 -29 75 172 20 63 50 27 27 -9 -32 -150 -37 -143 5 2
6132 2 34 -51 -72 -12 -73 177 206 125 99 -212 -25 -271 -137 -28 -127 37 91 -59 -21 43 3 -22 49 -128 -107 -32
6158 -32 129 320 -54 115 -81 145 -72 -12 -89 -206 17 110 13 145 208 -41 -58 -113 -201 -154 13 -134 42
6181 42 -142 30 -16 183 -85 34 22 77 83 109 102 -7 -100 -205 139 21 52 113 -62 -41 -50 -12 -56 -18 71 -116
6207 -116 105 75 149 7 202 -45 -29 -92 66 133 129 151 136 56 116 33 -26 88 57 -58 -117 67 65 54 15 -138
6233 -138 131 150 -66 45 -100 180 -90 60 -82 -72 -60 -175 171 66 -8 37 30 -16 -30 -64 -67 -54 -145 106 40
6258 40 -72 177 128 47 81 -22 16 96 -13 77 -45 94 -23 167 5 -54 49 -64 -81 -53 -61 -20 17 -104 199
6283A99j70q4J44l2K6o8J0m3k8j46J87Qj20J17k1Q4Pk69K99j60J2n7O5Q3j56N3
6309f0J04J02j06k6J09j14J1P3j71J49j15p0J63q6O5k7ko8k1J32m8k4N5J19r8
6334D6K3M4j20K29k27o5O9j00K03N2k9j56J42l12K42k01L47k83R4qM6j22K33n1
6358I6k02K50r1q5o8J36j30nO3J20j61L47m42K99k91J51r6M4J57o8O0n4j55N2
6382g3R4lj78K38j69n1J71q9m3NJ89k06K7K79j89P4j39L4O2m9l7J06mj44j8J28
6408A5j05J39p7J27j02K0m7K4J04j69l2o3K28j9QJ1M2p5p6O8J55p4o9j68K25r5
6434eQ6j95J38J9M3k21O4M0J60Mj54J61j30j49n6M08k00O4n6Qn9qJ31p3L1M2l85
6461b92K33m06M14J09j18N9l1l6Q0O1l6o6l3M6J1P0j66J6R6r0J5J23K6r9rp1N4
$$ plain form
6283 199 29 -55 89 57 83 15 25 -18 -46 -192 -5 3 -117 0 -21 63 70 -199 100 -60 -48 -105 -40 43 -113 -60
6309 -60 44 146 40 14 123 9 20 93 -78 71 -44 -114 49 -37 28 1 -1 -69 -90 42 -6 -30 25 144 46
6334 46 69 113 -7 222 -5 -70 -1 -101 102 154 125 -31 111 -201 41 -160 187 -96 -2 -10 36 -86 147 96
6358 96 -106 144 53 -32 -100 36 -94 -99 -36 84 -77 270 -172 127 -164 -13 -109 -65 92 24 84 30 -125 -73
6382 -73 21 18 -160 78 -91 -142 29 -60 -103 -98 91 -115 -88 191 2 76 -63 -29 33 -16 -53 53 49 -95 -113 15
6408 15 -90 49 -28 99 -3 17 -30 -6 98 -71 -103 -166 62 43 51 62 104 29 -47 21 176 102 33 -135 90 -5
6434 -5 81 -114 24 43 86 -135 -71 -31 129 133 -21 140 10 -139 -195 213 13 77 21 29 -30 -38 93 20 51 93 -292
6461 -292 -59 -465 -51 58 -60 -1 -32 -68 12 73 37 -29 -62 -16 -5 65 -101 -85 11 -79 -64 59 85 -14 -23 -94 -40
6488d0j0P7p6L7r3M5J16l2p9K27k06O9q6P8J32k39J26j0o6k09J08J77Q3l6k24
6513a31J77k36J66m3P0j07kN1J9l8J48k46J25n5M5K14qk02o7J21kQ4k5Qr4J5n7
6540g0l4J4J64l5Rm3M6N2r8R6p9L1j38R1J3L5j11lJ8K80k58J41j42K39j54n8J51
6567A57j1k40j84K66J26o5O5j53q5K34j09K7J4n1l2K09j9k16jpJ08j22J08mR7
6592A12O2k40J08r3L5J49j91n7J00O3K4n1n2J57j0j09j09Q5K2j79O5J42n7n8J07
6617B5k7PK6J4p8Mj9j25J51J8N6j0k2r2J97j27n8J87k11J82l53K07L9r7P2MM2
6644A2P6k7k15L66k08K33j20j24mM0p2MQ9j12M5j24J44j35R2M4J26j04K30l63
6668a07J11J31j08J37j27p8M7l7O5K6k3r5J20o4O5J38j59lp5J56q9Q5k97P4K04
$$ plain form
6488 -40 -50 27 -49 -12 -105 -60 56 24 -55 172 -34 35 -51 27 159 -80 46 36 -30 -239 -131 46 129 93 -131
6513 -131 46 -190 -24 -67 3 -104 -106 -55 -36 -74 74 -172 -47 -102 -57 157 149 -53 -120 1 -1 83 58 66 -28 -13 -70
6540 -70 -104 -90 74 39 48 5 51 103 5 101 22 53 -85 6 19 54 -57 -60 -42 238 -20 121 -21 218 64 6 157
6567 157 146 -94 -278 -12 114 49 114 -39 -124 110 1 28 42 -9 -41 168 149 -67 -68 -75 33 -89 19 15 112
6592 112 174 -66 42 -51 -16 133 -58 -115 -15 48 72 21 -31 126 116 7 -102 -17 5 -174 -109 33 -24 -82 25
6617 25 -2 5 31 45 -33 -29 -48 -173 -22 -4 52 42 20 -72 125 -2 -60 127 -84 98 -255 -48 -9 -106 -34 -30 12
6644 12 88 61 -154 212 4 237 117 -7 -11 29 -43 -39 50 -62 -17 -141 3 -132 -40 4 130 26 256 -107
6668 -107 4 135 27 164 37 -41 6 -31 34 60 37 -58 62 -2 63 201 42 39 -36 120 31 116 -181 -107 97
6693I7Lk38K58o7j3l0J05j15LJ73k43P3J23j32j50L01j93R2M1k14J73j1j17J53
6717G2m2p7K18j41r8J10M3j57K23j77N1K8Q8k8k87J13R5k21K58k06R6M8P4L5j00
6742A8j26K9q3J74k70K60J11p4kl5j37J30j04J52m9K50k73q7J22j12j6J30J8l6
6766a0k11K16nj0O4ok2j68J95J5J3N2k6j2j06J14n1r6m8J89j57L9rq8R0R8P0k35
6794a05j67K77M8Jo9j27L23j53LN8k83J27J3m9J06R9k78m7K35o0J52k43J87P8
6818A26k14M1oJ8K67k44L2J15j44J32j87k3J09j99J70j61L22j85Q2P2j57q6J81
6841F1J57j59q2K04k22M3K61r2j54n2K09j34QJ50p3K3j05p6j3K66j44j96J42j66
6865a44J09l0P9p5j00J57J00k40J19j95K85j97L05o6q5j57J33l4P2q6J38M3j42
$$ plain form
6693 97 100 -138 120 53 40 10 115 0 3 176 -67 6 129 -3 -153 148 -45 47 88 -126 47 36 -81 72
6717 72 30 -47 171 30 -68 42 85 -72 151 -26 25 53 141 113 -174 -61 34 -187 71 -135 -39 9 83 118 18
6742 18 -108 -79 -162 12 -258 2 113 39 37 2 -135 -5 -109 43 -6 244 -29 -116 6 -106 -122 8 26 -10
6766 -10 -221 -5 -10 -20 44 38 16 -152 43 58 71 123 97 85 -21 93 42 -54 -102 87 -70 -31 -40 -128 -38 60 130 -105
6794 -105 -272 5 53 54 -15 -142 181 28 31 89 -194 -67 -54 -103 3 102 -176 -223 12 -48 104 -139 48 126
6818 126 -88 -47 -53 -35 232 -12 20 135 -9 123 -64 -87 22 -177 -7 -168 154 -31 51 123 -34 -120 61
6841 61 218 59 -23 181 -41 2 263 171 17 -35 174 40 48 198 125 148 43 -33 -46 220 76 -120 22 -144
6865 -144 -35 -65 14 -61 -161 -4 96 -144 -25 -220 65 -132 173 107 22 -135 -2 -36 36 -50 88 131 -11
6888a1P7o8K68k60j46J4j16J13O4j16K99r1J39j30j04O9Q6k47K83m2K0j22K34
6911B13o2j66R1R8j10k00J27K15l08J41j17k7J88j87R7j7j07l1J58j23rK21k54
6934a69J29J59l32L45k73L58k66M6j05j24J44N5N7l5j7O7J49k5k48L9n4J80Kj38
6958e6J39j8Q7j09l2oJ07j41J01j6j69J55o5J03p1k08J93J9R9k11J10J18q9p6
6982c6Q0lJ6o9l4K17j36M0j07J58q3qJ19p7n2q1j6J18R9j38q9J21J12j98o4qP0
7009d9J8m2K3l0J12o0J37j27J98k61M1q8R8o1P9o0oL21j93j11R7k1R9N1j21J00
7035A44j58j33Q6j0J0M0k1o9P7J7j84K28l4O3j66L7J02J28j30K08l26K78m13K56
7059C0j42k7J06J00q2j27J67j24L11k31J80j70r5J5J57k25J30qj33k2M5K64j64
$$ plain form
6888 -11 66 -2 266 6 -140 -126 -242 -129 -65 -181 118 27 166 36 -68 1 87 -160 123 81 101 -21 213
6911 213 151 -15 76 174 64 -136 -9 206 -102 39 -78 -105 83 -104 -7 -24 -131 -162 -4 -127 -136 85 -169
6934 -169 -40 119 -213 132 -141 217 -49 -3 -108 -232 -88 -33 24 -11 -28 39 188 163 -85 -46 -100 80 82 -56
6958 -56 83 65 152 43 11 5 112 -29 72 56 -113 42 -23 80 9 -199 -6 13 112 -99 11 129 40 -36
6982 -36 44 41 57 -12 -46 171 35 75 -32 126 43 35 154 77 25 -56 -72 46 145 7 -82 39 151 -47 -111 -119 -49
7009 -49 -31 -73 -50 -80 32 -28 109 -18 180 -81 -40 -128 -30 -91 -12 -72 -78 243 50 -61 36 15 114 165 44 144
7035 144 -14 -147 -61 -71 -61 -21 -42 -111 -34 -17 -201 27 -7 56 -110 -73 29 157 27 235 -91 187 -226 30
7059 30 -112 -139 -33 67 -15 -142 25 -99 212 -19 161 -9 -104 -89 68 -157 -27 -35 -168 -190 -145 119 -45
7082d5K76j30J49k12j54K0m5k5J83m5N3j49J96r8l4J97j38K1J19K1q8k6l3K0j56
7107a23qm0K31j4q4j08K34k33oj47K83J9k24K24JR9m3K5J12k35l0J74j66J08J32
7132A81j09j46K09j98O8l4r0J91kj10P1k48L48k47J51p0J43p4m6m1j7L7l7L7L39
7157C06l08J88j23Oj66Q8j84J09J13j19J29j97N6J47j5j88J75O2o7j47M03k53
7179A5k13J02J19j54K72J4j67K4Q1l03K99J1j06J8oKN7p2L9M8q3J00Q5k82j4Q5
7205b9J35l4l2j79J47j45J29P8m9j05N1RJ35l55R4K36p3K22j94p9J45q6Q8k4k32
7230a47K5J32Qr0P0j0K6J6N0p1nmq9P2K99j84j2j44J86k73J14k2o4O6K1L5K5M
7258C4pL2P2J12k18k46L51rj07J9J03j07j39j00L08j03L0J8J0K4j28j1j5J4J80
$$ plain form
7082 -45 231 101 250 38 -116 -96 -141 -166 17 -28 25 -124 72 -26 -60 137 -1 20 139 160 72 46 13 33 -123
7107 -123 -131 -171 60 46 -38 -146 88 -145 -151 -298 -15 4 -220 4 5 104 61 86 198 -37 -67 107 -59 49 181
7132 181 72 -74 135 -63 5 -29 -119 72 70 -40 31 -217 131 -116 35 -35 108 34 -12 -53 -70 -33 -70 -33 306
7157 306 -2 186 63 69 -97 -9 -193 -84 29 -90 39 -158 -102 45 30 -158 17 79 12 -135 268 15
7179 15 -198 -96 23 -131 141 155 -12 12 93 -210 89 100 -6 12 6 8 65 -7 32 80 -3 97 182 -100 -114 -29
7205 -29 106 72 40 -139 8 -137 -8 70 21 -84 -33 -24 111 -244 -150 86 13 235 41 -38 107 21 109 85 -147
7230 -147 -122 10 18 -72 -2 -12 14 30 80 9 4 0 -89 -17 282 98 86 -58 128 -145 -31 -53 -117 -51 -30 5 30 34
7258 34 27 59 131 243 25 -221 130 121 14 33 136 29 -110 -210 98 -5 25 43 53 77 -51 -62 -77 -63 117
7283A17k51J03Nk1N3P9j10R5l02L73l23J27J31K5k2qk3k02J83k4j53K19j01J75
7307A45r7k17J72k13KJ85P7p3J89k82j7K39o4o8L74l41j2N3o4j26KJ77M7N0j58
7332b0P1m0o5J8K26j63K4p0J12j56J09L6J6o1L0j64l8L95k52J43j05j18R8O5j80
7357h9J67k36k4K26j38P5R3k22R7J03o2J9j68L02o8k48L25o9L6o3j59k4l7RK49
7382I4j20nm3Q7N5l2O6j76J82N7n4j26k7J07n4N9k1j71K64j16j22q3L14m8m5N2
7408I4j12R3L8j60N5p6j45L06J1l46L48j09J30k60%K51j3j37k02K31J23l03P0
7431a13L25l62P9J83j30J15p7j41J25R2r2J38k61J88j91J48Lk44K97k12J56J06
7453A32q9k1m1j29J55j67J33mLn4J57j44oJ74k3j52q6J82O7k5P0k35Q4J18j54
$$ plain form
7283 117 -134 -31 -26 -47 6 85 -25 70 -232 141 -182 -55 76 101 79 71 48 -154 29 5 -148 71 -30 145
7307 145 48 -169 3 -210 -208 -23 54 -19 170 -112 -129 110 46 -22 352 11 -1 52 -12 -138 -136 41 88 138 -20
7332 -20 51 11 -54 -36 190 27 51 -19 93 -63 46 82 98 37 67 -97 -135 260 8 151 46 -72 26 91 -89
7357 -89 78 -158 -182 44 -94 -19 74 -148 -51 52 -10 9 -159 143 75 -173 152 83 119 56 -103 -127 -164 -155 94
7382 94 -26 -31 -74 13 68 36 102 -74 108 165 111 -15 -42 65 11 70 49 -122 142 26 -96 -179 135 87 42 94
7408 94 -18 75 113 -47 8 -68 -213 93 104 -242 106 -3 127 -133 -133 118 105 -32 -234 -3 120 -183 -113
7431 -113 212 -150 -71 112 -18 97 20 -121 4 96 4 142 -119 69 -122 26 29 -215 82 -130 26 132
7453 132 43 22 -19 -148 7 -160 -27 -31 -28 -82 75 -69 -75 99 76 -76 -162 20 87 62 132 -103 -19 99 -55
7478e5J50j61J45j97R5k1m4J77j43j9J78m9n5J11j88L9j34J93l7j73L29r0rj27
7502h5N6l0O3J4M4j75K5O3J44O3k12O3Rm1m3J00J9k08N0K67k07j68K12m0R0j98
7528a25J51o4J37N5N4k25n8Q1k4Mo2K09k4r2L0n1r0R9K1Kj11L32m23K02j64J38
7554BK3j7R9j45JJ42l0P8k8j21R2j36q5K3K0jK0J94j59M9J58k86J75J57m9k24
7580d8K76j26o4r0o0J44RL6m2Q9K55m49J6J76l6o1O3j41P8n3J59k47J58J5j31
7605g4N8j30K70J9j30j52R2J0j8J37o6J13j16l7Q6R3R3p7q7n0n1L7k12J33J0K60
7631B11j43q6K6J38l22M9J70J33j34o0j3QJ45l00J83j4N7r9j01J35O3q1J11k9
7655D7j61O3J01j92O0pm0K76j61n8K30k82n9l6L91k66J18o4J55o1N5l3J10l96
$$ plain form
7478 -55 95 -66 79 -118 -23 -44 -88 89 -54 -73 105 56 1 112 -76 -37 -171 22 -15 -188 141 51 42 -85
7502 -85 -29 -59 4 18 62 -113 -88 -25 119 182 -30 33 42 1 -42 58 77 -131 -81 186 -21 -189 23 -17 73 -125
7528 -125 26 -38 99 154 208 -17 -75 6 -18 -14 -76 133 109 17 47 -4 -94 5 26 28 -83 249 -174 28 -136 2
7554 2 25 8 107 -38 -37 105 75 153 125 4 96 -40 -125 -102 -82 -83 -63 131 -28 21 179 -107 68 225 176 -48
7580 -48 228 102 38 -52 -112 32 41 77 35 124 379 -70 -54 122 86 25 88 -53 25 -28 131 -116 42 57 -74
7605 -74 -16 -146 124 143 13 -139 -47 -37 -55 82 16 129 13 -24 62 155 248 171 84 34 -17 20 -192 -59 -49 211
7631 211 68 -18 8 146 -176 -127 43 176 42 -18 -31 -23 122 -178 5 -9 48 -51 -152 -17 46 -35 76 47
7655 47 -114 -51 50 -142 -82 -89 -129 147 -14 -72 158 -124 -183 -219 172 -94 24 -40 115 54 109 76 186 -210
7679b10J20P5j62K93k16J59qm5O8k92K39L4k5j05Q4J12p1K17m00J80Pj25j53K88
7703F4N9j59O0P3k29m0M33m33J94o4J69j71J9J9j12J0J16J8j79L4K16p8k09J11
7727g9J32l7j55J99j60O4J31j58Q0K9o6J10j86L78m31L82j44rk04J61k8J81l65
7750a75J46J4l0n0%k5L54l0j92Q6l5j05p2L12k8k5k61J40k3ro1J33j9J42Kn7q7
7777D5n0L2QlQ1o5j04Q2j42J41j8J43r3q6L02j98j51K03j46L4k8j50K62n6R8k21
7803h0j5J89j13M1M3M7K0m7j01l3J09k32J27J39o0r7J49k0J36j6j73Pr6RJ19P3
7829A25j23jj27K04J2j84K28n2N9l08K00Jp3J81j23O0j28j6J73J13q7k85J21R2
7853F2Nj48nJ89o0o7jmJ62j21J2j21o6J96o9J41j26J50k88J49P0r1K64k77J11
$$ plain form
7679 -210 -90 -15 -177 116 -100 59 51 6 74 -218 21 55 30 -75 9 121 50 267 -133 47 54 -71 -224 64
7703 64 123 -36 24 97 -132 -172 261 -172 22 -42 127 -44 -25 -6 -118 -108 8 26 -153 -119 97 19 -190 -79
7727 -79 53 16 -139 60 -100 -36 95 -63 17 46 -20 90 -96 282 -149 233 89 80 -124 37 9 190 -175
7750 -175 -29 -15 -45 -95 -95 -120 234 204 12 98 63 -42 -114 198 170 145 -116 24 1 -8 -69 64 45 187 189 132 45
7777 45 -5 27 35 32 113 48 -56 26 -116 25 7 150 57 -29 273 75 -76 127 -19 15 -13 -163 99 43 141 -80
7803 -80 -95 94 -19 22 65 112 132 85 -16 -49 60 -172 -45 94 34 -63 86 66 202 186 13 20 -76 -67 52 125
7829 125 2 1 -126 78 90 -94 134 82 141 -167 33 34 -39 142 19 79 -49 -65 108 221 134 -151 -30 62
7853 62 67 -81 -86 103 43 -24 -25 -29 133 12 24 -97 -163 33 -36 105 -21 129 -159 -10 60 -31 233 -44 67
7878F7r0r4L8Q0J91r0j30p8K20j73j07J61K7k57J82r3l0J51J82j0k03J64Ln6L8
7903I3j37Q2J17k12J83J4l27J37j04K53j90J14Q8N9k08O7l02M84j85j2k1o7Q2
7926HJ07m6q7j16K11J2j01L7N4j42Q3j14L70l00K9r2J03ol08L35N7n3lj9q9Mk1
7953h7K06k6%R0n9l13K42l9Q3j58n5P8K1j1j34L15k49J62J08k02O2l4l0J04j13
7978c9j54Q3O8j5qJ28K5p5k3J07j39o1P1Q7j95K06k6k6l0mQ0k18J77k1J6j59J13
8005c2N0m3r9J35L6p7R1k79K01j5P2j05J22J7Kj87k7J58k08K57j09nj03K62j54
8030d0R5m5j04J90j17J1p6J22R6q4p5K3K1l2m3n0O7P2j19J38j69K91j8j63M1L2
8056F4j13J02n9N1o5R6M7q9k2J49r0k5j39o1J50q8K3K06k8j73K4K03k54N1K6N6
$$ plain form
7878 67 -23 -117 -79 1 192 102 -28 -106 114 -59 -166 -5 22 -235 -53 -146 -176 -25 157 147 -56 108 111 55 93
7903 93 -44 38 155 -57 126 140 -187 -50 -154 99 -91 23 111 170 -38 29 -273 211 26 14 -7 -74 8
7926 8 115 69 -18 -134 77 89 -12 25 79 -63 20 -94 276 -24 5 -87 16 10 -298 37 94 41 38 19 -70 -66 -87
7953 -87 119 93 93 183 124 -189 53 14 97 -61 -116 -38 -17 -28 -162 153 -96 66 174 -28 34 0 -30 74 -39
7978 -39 -193 -110 -42 -57 -65 63 88 13 -10 97 -42 -103 -32 55 -140 66 40 14 -16 -20 60 -158 19 -2 14 -145 -32
8005 -32 18 -25 -124 11 47 -30 61 -218 -17 -32 40 -65 57 74 76 -111 -138 20 -188 69 -40 -45 -148 114 -40
8030 -40 55 10 -94 96 -21 -10 -86 36 132 48 -27 -4 17 -15 -58 -108 -41 31 -88 50 -119 172 154 -9 32 64
8056 64 -49 53 -6 45 -20 76 123 34 12 161 71 46 -93 -154 -4 -92 -69 137 109 -64 -40 163 -91 -40 -14 42
8082D2j13J30N3j70N3j58K61o8O8j72P5J19l28K6J04j3jR4j09J51Nj42K90k34
8106c7j8J15j70Q7j19J16Oj94P2K79m9j14mj21K76l61J70J24r6q4K63j55j0J08
8130H4j42m9k1K00Qj68O5L1k6J47j50J1o8KP4o0L8K91l18R3J32k8o7j35K30j31
8156D3n7J61j33OJ0J28m3l57J58J96q5n7J11L4R3k83J87j84K68j87k28J10J76
8179F7j01m0O7r1K62j64J26o3j1P9J22k42
$$ plain form
8082 42 -71 59 112 -58 -5 -163 98 30 98 -74 1 120 -208 -182 -78 -91 -92 2 -107 44 49 -93 197 -37
8106 -37 -55 60 -110 -23 -142 -26 -20 -214 -142 137 88 -26 -30 -151 125 -236 -66 58 -38 -122 141 -14 -24 84
8130 84 -58 -107 -128 72 80 -88 -23 8 -18 129 -21 -10 -78 -76 -2 -62 -24 267 -51 42 174 146 79 -56 174 43
8156 43 -14 147 14 20 30 158 115 -242 -84 112 27 -30 81 115 208 -75 112 -72 196 9 -219 -109 67
8179 67 -34 -74 -7 -98 164 0 126 63 52 131 253 11
8191A1
$$ Imaginary data points
##PAGE= N=2
##DATA TABLE= (X++(I..I)), XYDATA
0@%%%%pJ4j4J4k1K8l0L7m9O4p9R3j11J35j62J90k22K61l03L47l99M60n27N99o77
29c59P67q72R81j096J228j376J536j707J898k110K341k592K868l177L519l896
45b047M316m790N329n941O645p470Q450r634J1096j2964J5443j8906K4127l2993
59a9339N1890j58342K07320K23053m90720m3633M18032J5619m17690P5348L68863
70B30401j12683l64214J90697L18790k46281k85818L13814K12907l51819j52641
80b46847L85906P8333l97008j9828M09472m4173m03209J02122L90347j62473l53373
91b60731K14570L06599k59979k44985K92273J82172l18297j17982L34823N4061
101A82524l47231J1025L48931p7459l41478J42810L20853k01572k89478K50928
$$ plain form
0 0 0 0 0 0 -7 7 -7 7 -14 14 -16 21 -28 36 -43 50 -61 74 -88 102 -120 141 -162 185 -214 246 -281 318 -359
29 -359 408 -464 517 -579 649 -727 809 -898 1000 -1110 1231 -1361 1507 -1670 1849 -2047
45 -2047 2269 -2521 2808 -3133 3512 -3958 4492 -5142 5954 -7010 8433 -10473 13654 -19339
59 -19339 32551 -125791 81529 304582 -186138 -229771 188261 203880 -213810 -138462 230401
70 230401 117718 -246496 -55799 262991 16710 -269108 44706 257613 -94206 -246847
80 -246847 139059 217392 -179616 -199444 210028 165855 -237354 -135232 255115 92642 -260731
91 -260731 -46161 260438 459 -244526 47747 229919 -88378 -206360 128463 182524
101 182524 -164707 -153682 195249 117790 -223688 -80878 239975 38403 -251075 -147
111a47K51211k87906k06658L14953J57893l31605j03684L39703M3527l37700J9236
122a41177L25588q3691l03211J43535K71684j97167k33491K43445J90124k80752
132f5113j42519L09319R2298l27694m0132L35086j1565l30267O1313L14106j08186
143H6646k87794J50387K52631j89022k10051K22038J61651k48971j09623K68773
153I6665N5952k80838j655K84359n0470k79468R9839K66068j44253k44407J82203
164a6005K15533k13210j79795K36240J38732k51271r3743K58663M5671k59194
174a18379M403K52313n4818k38130J02892K17873j47070j91341J85266J60424
184A73433k16372j26452K40636Q9234k56490n0120K63572R295k61687L1627K50573
$$ plain form
111 -147 251064 -36842 -243500 71453 229346 -102259 -205943 133760 177287 -160413 -141177
122 -141177 184411 100720 -202491 -58956 212728 15561 -217930 25515 215639 -65113
132 -65113 -207632 101687 193985 -133709 -173841 161245 149680 -180587 -119274 194832 86646
143 86646 -201148 -50761 201870 12848 -197203 24835 186486 -62485 -172108 96665
153 96665 152617 -128221 -129876 154483 104013 -175455 -75616 190452 46199 -198208 -16005
164 -16005 199528 -13682 -193477 42763 181495 -69776 -163519 95144 140815 -118379
174 -118379 -113976 138337 83519 -154611 -51719 166154 19084 -172257 13009 173433
184 173433 -42939 -169391 71245 160479 -96011 -146131 117441 126736 -134951 -103324 147249
195A47249p1329k30689J08646K03523j42129j70780J71363J33438j95449r3443
205a39600K14424N1484k26504r886K32496l1766k30307P0414K20773j05739k03434
216a57645J35727J79860j59962j51196J78794J18081j92078q1405J99908M2116
226A12200k02318j187J98637l9327j89408P8073J74568j12917j55407J42939J33067
237A38920j67691j07646J86570P9235j98830m8834K04380J6471k02291J6215J93351
248A09850m7860j78552P7943J58525j06244j33968J31241J06225j52682p6029
258a11551J70332M3867j81966j1450J87414k0355j86486N0612J79088p7418j66620
269a24533J01672J48009j21846j25137J38676R7474j51026o6532J58078L4102
$$ plain form
195 147249 75920 -154769 -46123 157400 15271 -155509 15854 149292 -46157 -139600
205 -139600 74824 126308 -100196 -110082 122414 90648 -139659 -69245 151528 45789 -157645
216 -157645 -21918 157942 -2020 -153216 25578 143659 -48419 -129824 70084 112200
226 112200 -90118 -91305 107332 68005 -121403 -43330 131238 18321 -137086 5853 138920
237 138920 -28771 -136417 50153 129388 -69442 -118276 86104 102575 -99716 -83501 109850
248 109850 61990 -116562 -38619 119906 13662 -120306 10935 117160 -35522 -111551
258 -111551 58781 102648 -79318 -90768 96646 76291 -110195 -59583 119505 42087 -124533
269 -124533 -22861 125148 3302 -121835 16841 114315 -36711 -103243 54835 88937
279H8937j61085o03J59164l1739j53015O2417J43119r0596j28999J14501J12230
290A14331j34450r1732J48648O8855j57353m4335J60753J8542j58720P772J51238
301H3549l3789j39303N8695J23944q2257j04829J03105Q3337j20735o0107J34672
312D6282L5881j43831j1944J48730j1902j48469L4403J43404n5479j33407P4483
323b1849J18532r0821j00009J04676P7883j15262n3101J22335K7170j26110p60
334e7316J26331k5180j23039M9609J16651p1715j07153R0943R3908j06002p8179
345i1142J17395N9624j23998l9787J26414J8613j24478L260J18654k4797j09551
356f9793M5834R7110o4984q2790Q2309O6527r7034m8647J07714L0733j15384j2083
$$ plain form
279 88937 -72148 -72751 86413 54674 -98341 -35924 107195 16599 -112400 2101 114331
290 114331 -20119 -111851 36797 105652 -51701 -96036 64717 83259 -75461 -67689 83549
301 83549 49760 -89543 -30848 93096 10839 -93990 9115 92452 -28283 -88390 46282
312 46282 82163 -61668 -73612 75118 63216 -85253 -50850 92554 37075 -96332 -21849
323 -21849 96683 5862 -94147 10529 88412 -26850 -79951 42384 69554 -56556 -57316
334 -57316 69015 43835 -79204 -29595 87056 15341 -91812 -869 93039 -12963 -91142
345 -91142 26253 85877 -38121 -77908 48506 67119 -57359 -54099 64555 39758 -69793
356 -69793 -23959 73151 8167 -74623 7686 74213 -22821 -71468 36246 66979 -48405 -60488
368f0488J18268n455j17522K2336J13252l8758j04221N2771R2552o5843p7428
379g0536P6736N9941q5163m0898R1911K0695r6077j67R6989j9224r5849L7643
391b3999R1720n3961q4985O7928P5710p9508o3715Q7756M9796r2684l4281R4663
403C4440J7320r3395m4Q9738j8050q2850L4893P4174n0613o3874O4768N1862p6402
416a8033l8985Q5236K5722r1158j1869R3077j233r2038J3903Q8153k6387q0496
428e4108L7405P0545m7506n8350N6253M4670o3423k9908O8830J4831p2529M48
440c2842P3772j4630p3580K7975P0834l9477o5916M9216N8943n6863n0224O2587
452I795L9722o5930k7819O7312J4475o6164j276O3559j2431n9282K5619N3393
$$ plain form
368 -60488 57780 52325 -65197 -42861 70391 31633 -72588 -19817 72735 6892 -70536
379 -70536 6200 66141 -19022 -59920 31991 52686 -43391 -43558 53431 34207 -61642 -23999
391 -23999 67721 13760 -71225 -3297 72413 -7095 -70810 16946 66742 -25942 -60223 34440
403 34440 51760 -41635 -41679 48059 30009 -52841 -17948 56226 5613 -58261 6507 58369 -18033
416 -18033 -57018 28218 53940 -37218 -49087 43990 42757 -49281 -35378 52775 26388 -54108
428 -54108 -16703 53842 6336 -52014 4239 48909 -14514 -44422 24408 39239 -33290 -32842
440 -32842 40930 26300 -47280 -19305 51529 12052 -53864 -4648 54295 -2568 -52792 9795
452 9795 49517 -16413 -44232 23080 37555 -28609 -29885 33674 21243 -38039 -12420 40973
464D0973l7632m6513M8379L8791n7377l0216O4028K1050o7966j1765O9753K009
476C3514o8585P588O4740j6595n8920K5044N1456l3369m1961M0201L1768m6310
488a1429k0740N1093R758n4425J374N5721j1282n5876K0732N3997k8714n0432
500d0223L5217M5023m0182l8133M3449L0146m5524k1028M6513J0805m5657n10
512b0104M3497r345m0840J9042L7182k7762l3011L5510K8114m1768k2489M6079
524A4105J6580m8799j0039M9119L741m7870K912M4809r319m0515J5768L4574k1719
537C347k7803K7184K0735l2332j2987L6174N601l9206J880M0797q713m0871J4584
550a1610L9823j9857l7123K3772L3304k6849k8260K9042K1891l0214j4877L0977
$$ plain form
464 40973 3341 -43172 5207 43998 -13379 -43595 20433 41483 -26483 -38248 31505 33514
476 33514 -35071 -27483 37257 20662 -38258 -13214 38242 4873 -37088 3113 34881 -11429
488 -11429 -32169 18924 28682 -25743 -24369 31352 20070 -35806 -15074 38923 10209 -40223
500 -40223 -5006 40017 -165 -38298 5151 35297 -10227 -31255 15258 26063 -19594 -20104
512 -20104 23393 14048 -26792 -7750 29432 1670 -31341 4169 32283 -9485 -31974 14105
524 14105 30685 -18114 -28153 20966 24707 -23163 -20251 24558 15239 -25276 -9508 25066 3347
537 3347 -24456 2728 23463 -8869 -21856 14318 19919 -19287 -17407 23390 14677 -26194 -11610
550 -11610 28213 8356 -28767 -4995 28309 1460 -26800 2242 24133 -6081 -20958 10019
562A0019O885l0175M54K9465q365k7632J5124K5619k1240k3126K6507K0101l0357
575f721j6747L2948J2871l4180q686L4045L972l2080K85K9504m932k5870R635
588e956K1586j4202j6747J8247J2079k2346o765K5190J847k7114K574K8311o365
601A0339k8525R575K7712j2172k5961J4407K3211j6470j9120J7803J4213j8580
613c568q870J8503L744j8586J852J8321o989j7892J2072J6809j6163j5707J9488
626C014J4106k1919j1877K2883R465k2843o778K1751M109k0276q85J8041k423
639F368j5514O125J2274r445r005J2618N512j5133k666J7344j08j8700K476J9133
653A1279m114j9384N725J8813o964j7283Q118J4881q945j1590R155Q224r425m583
$$ plain form
562 10019 16904 -13271 -12817 16648 8283 -19349 -4225 21394 154 -22972 3535 23636 -6721
575 -6721 -23468 9480 22351 -11829 -20515 13530 17502 -14578 -14293 15211 10279 -15591 -5956
588 -5956 15630 1428 -15319 2928 15007 -7339 -14104 11086 12933 -14181 -11607 16704 10339
601 10339 -18186 -8611 19101 6929 -19032 -4625 18586 2116 -17004 799 15012 -3568
613 -3568 -12438 6065 9809 -8777 -6925 11396 4407 -13485 -1413 15396 -767 -16474 3014
626 3014 17120 -4799 -16676 6207 15672 -7171 -13949 7802 11911 -8365 -9250 8791 6368
639 6368 -9146 -3021 9253 -192 -9197 3421 8933 -6200 -8866 8478 8370 -10330 -7854 11279
653 11279 7165 -12219 -6494 12319 5355 -11928 -3810 11071 2126 -9464 -309 7915 -1510 -6093
667f093R760J037j0249K495J0570o064j0701R050J0431j1420j0103J3224R417
680A1354j4021q323J4344O886j3825n367J2692L520j1361j172R517j174p683L983
694f30N373o416l330Q391J853j0541k27J1978j016j2761J931J3131k758j2704
708g726L125J1968l506j0299L236Q628l570o143L583L889m291j032M529j293n079
723c981L586N687n650o070P433O017q152o360Q776O033q355n765P636N361p055
738h59m187N893K709m617j263L488p92k084K761R58m215q7O013j021o850P69Q245
755D861j176q650J296Q393r26q126Q81P019q68n403M36M032l62k464P36L94q41
772g68J082J915k996k408M198K803m968l169N222L741n345m157N196M073m164
$$ plain form
667 -6093 3667 4704 -5545 -3050 7520 1456 -9245 -195 10236 -1184 -11287 1937 11354
680 11354 -2667 -10990 3354 10240 -3585 -8952 3740 7260 -4101 -5273 4244 3070 -4613 -630
694 -630 4743 -1673 -5003 3388 5241 -5300 -5527 6451 5435 -7326 -5395 7736 4978 -7726
708 -7726 -4601 7367 3861 -6438 -3202 5426 1856 -4287 -704 3185 -1106 -2138 2391 1098 -3981
723 -3981 -395 5292 -358 -6428 1005 7022 -1130 -7490 1286 7319 -1036 -6801 835 6196 -859
738 -859 -5046 847 3556 -1061 -2324 1164 372 -1712 1049 2007 -2208 -2295 3718 2697 -4153 -3384 4861
755 4861 3685 -4965 -3669 4724 3798 -4328 -3447 3572 2704 -2699 -2263 1769 1407 -1057 -321 73 -768
772 -768 314 2229 -767 -3175 1023 3826 -1142 -4311 911 4652 -693 -4850 346 4419 255
787B55m288L487L842k604l098J666J953o69m87m33p47Q57K289j550l063J533M217
804C160j579n021J228N464p24n494L22N307l1m259q72L602P77j931j608J000J279
821F20M50r74j746M86K688K93l417q24L805J659m223k010L864K504l106l157K522
838e66L250j695l332J141K428J59j789r13P19J778J19k298r28K380J771k128k699
855b603J880L460j442l838R36L775j41l565o03K953J148j839j812J191J933j82
871A251k086o45J674J709j477k368P01L334k83l511l50L097J326k782k088K557
887E9K068j478k527O67K387L40k175j148J654J861r16k600M63K746N60k820j354
904b213K474J946j982k295J294K755o62k872kK235J198k032j641J399J964o29
$$ plain form
787 255 -4033 -546 3296 692 -2406 -740 1213 544 57 -376 -1123 -266 2023 473 -2590 -1057 3160
804 3160 1581 -3440 -2212 3252 2528 -2966 -2644 2663 2632 -1627 -2499 1103 1880 -51 -1659 -659 620
821 620 1070 96 -1650 -1164 1524 1817 -1600 -2424 1381 3040 -1183 -3193 671 3175 69 -3088 -566
838 -566 2684 989 -2343 -1202 1226 1385 -404 -1317 -598 1180 1299 -999 -1927 453 2224 96 -2603
855 -2603 -723 2737 1295 -2543 -1607 2168 2027 -1538 -2141 812 1960 121 -1691 -500 1433 1251
871 1251 -835 -1480 194 1903 426 -1942 -1241 2093 1810 -1701 -2051 1046 2372 -410 -2498 59
887 59 2127 649 -1878 -1211 1176 1516 -659 -1807 -153 1708 792 -1808 -1345 1401 1961 -859 -2213
904 -2213 261 2207 225 -2070 -776 1979 1317 -1555 -1557 678 1876 -156 -1797 -398 1566 937
920I37k257j29K175J099k227j620J768K352j115k970O36K968K5k698p20K350J525
937B099k007j823J188K055k26k187o56K047J176j339k137Q17K656n37k701j33
953a708K513J061k316j372J777J780j099j951J65K278L84k084j135J852J522j058
969F09k205K43K603K21k312j057K227J531j700k234J348K437o25k320k90K340
985H16P30j734j233J034J993r79j707p9J842R78k024j394J559K058r70k587P16
1002i81K267J09k266o00K033R17j298j619Q11J814j47j881p40K116J271j533j876
1019a603R12K380o03k286j12K315Q82k440j296J989J323r54j872N74J710J63j591
1036e09p38J339J421q55k014K86K125L91k236r66K234J441j671k191J276K326
$$ plain form
920 937 -1320 -1449 726 1825 -402 -2022 -254 2098 983 -1987 -1351 1617 1642 -1056 -1776 574 2099
937 2099 92 -1731 -543 1512 1286 -901 -1557 490 1666 327 -1810 -993 1663 1126 -1575 -1708
953 -1708 805 1866 -450 -1822 -45 1735 636 -1315 -1150 1128 1512 -572 -1707 145 1667 609
969 609 -1596 -1353 1250 1471 -841 -1898 329 1860 160 -2074 -726 1711 1086 -1234 -1524 816
985 816 1546 -188 -1421 -387 1606 627 -1080 -1159 683 1661 -363 -1757 -198 1860 890 -1697 -981
1002 -981 1286 1395 -871 -1471 562 1479 181 -1438 -627 1187 1040 -841 -1581 535 1806 273 -1603
1019 -1603 -691 1689 1086 -1200 -1312 1003 1885 -555 -1851 138 1461 507 -1365 -791 919 1082 -509
1036 -509 -1247 92 1513 658 -1356 -1070 1055 1446 -790 -1756 478 1919 248 -1943 -667 1659
1052A659p59k205K56J829L82j498j131J329J267m64j509m02J848P72j290j707
1068a623J269K134q16k687O02K479L9k565l37K366P42j969j036J286J095l28j334
1085f83k56J193J090q62j766N57J994j3k420m18K275R74k095j582K127J724j610
1102B29j696Q94J838n75j378l20J267M74m31j060J38J316L50j316j333J352J777
1119A526j028k175P61K633n41k711K01K366L02k010p37K049O47j311r37M64R03
1136D02L02n43j031K28J736j73j768m73K144R34k327j468K292J723j973j717J529
1153a83J763j190j740Q46J225k67p65l48L94Q59K14j186n79R76J437j155k009
1170a708J059K375n49k900P92K418j13k577j16K103M29j846l01J353J61o33j91
$$ plain form
1052 1659 900 -1305 -1049 780 1162 -336 -1467 -138 1129 665 -844 -1246 602 1374 84 -1623
1068 -1623 -354 1780 964 -1723 -1121 1358 1397 -1168 -1505 861 1603 -366 -1402 -116 979 651 -683
1085 -683 -939 254 1344 482 -1284 -727 1267 1254 -1166 -1584 691 1665 -430 -2012 115 1839 229
1102 229 -1467 -573 1265 690 -688 -1008 259 733 302 -758 -620 696 1046 -270 -1603 -251 1526
1119 1526 498 -1677 -916 1717 1176 -1535 -1334 1032 1334 -676 -1413 636 1283 -28 -965 -501 402
1136 402 704 161 -870 -642 1094 921 -847 -1320 824 1758 -569 -2037 255 1978 5 -1712 -183
1153 -183 1580 390 -1350 -504 721 454 -311 -659 -265 594 808 -378 -957 19 1456 301 -1708
1170 -1708 -649 1726 1177 -1723 -931 1487 1374 -1203 -1319 784 1213 -633 -934 419 580 -53 -244
1187b44j58J60R54n9j503m17K063P97k477r18K341J482k529j426K023J641j599
1204A31j847J612J341j075q64K01O90K99k98l98n40Q56R49q63j631R26K206j076
1222F19k241O12K639l64k671J29K505n0k208j98J923L94j197m04N54P4J57J85
1240D58q86l47J480O48j861r95J991J128k027j589K321J737k214j846J998J792
1256A788j701j072P58R99l94o32K85l20M64O18o35j323R51J537o67k098O27K553
1274A738r94k163J61K559k7k506J30J979J20j676k60J207M46o23k05j00q7P59
1292D58K57j416m27J728R83j916j211J946J462j895j750J778J818j639j507J060
1308b71J706j286r33O38L85K4k78o0n01L84J195o30j514N53K000o29k204L41K411
$$ plain form
1187 -244 -402 -242 712 653 -850 -1267 796 1593 -884 -1802 539 2021 -508 -1934 89 1730 131
1204 131 -1716 -104 1237 162 -702 -501 189 488 190 -208 -748 108 1057 194 -1437 -511 1695 619
1222 619 -1622 -1010 1629 1265 -1406 -1277 1228 1178 -1030 -1228 695 1089 -108 -512 42 116 273 458
1240 458 -428 -775 705 1353 -508 -1503 488 1616 -411 -2000 321 2058 -156 -2002 -4 1788
1256 1788 87 -985 -227 772 378 -254 31 -289 175 793 158 -1165 -214 1323 656 -1442 -815 1738
1274 1738 744 -1419 -1258 1301 1274 -1232 -1102 877 997 -679 -939 268 714 91 -114 -214 -301 458
1292 458 715 -701 -1128 600 1583 -333 -1544 402 1864 -31 -1781 -3 1815 176 -1331 -271
1308 -271 1435 149 -784 -146 239 263 -15 -75 -576 -192 1003 373 -1141 -588 1412 783 -1421 -1080 1331
1327A331j63k487J39K349l1j872k17J471J11r01l05N84o8K91J53o39o22J291O48
1346A063j429r45J845J018j738j562J664J683j657j297J337J616j590j013Q91
1361a14O89l05n54m8L39o8N88l49j119O56J390n65j779L87K211l41k467M10K303
1380A264p1k091p3J701J86j327j69P39L66n00O5j59l46O54K86r56n76J338R23
1399A254j447j171J541J052j250j406J258J594j189j437J052J245r45p72L74O36
1415C89j52k36l6l09J5J039m41j204K55J646k73j680j2K089j90j928J7J894P4
1434I57j641k56J321M03j034r3K81K31j43J94n15k55J046K54j085p84J269J097
1452A247j408j147J393J274j481j250J495R09q70j128R61L19j80m19J02J38K30
$$ plain form
1327 1331 1168 -1319 -1180 1169 1138 -734 -951 520 631 -270 -575 9 -59 232 385 -254 -876 415 1063
1346 1063 -366 -1311 534 1552 -186 -1748 -84 1599 -58 -1355 -18 1598 8 -1005 -114
1361 -114 575 270 -284 -332 7 -61 527 178 -941 -285 1105 540 -1239 -852 1359 1018 -1449 -1039 1264
1380 1264 1193 -898 -971 730 916 -411 -580 159 525 25 90 -69 -415 239 525 -431 -1007 331 1254
1399 1254 -193 -1364 177 1229 -21 -1427 -169 1425 236 -1201 -149 1096 151 -621 -247 389
1415 389 237 1 -35 -344 -329 710 269 -935 -680 966 693 -987 -999 1090 900 -1028 -1011 883 957
1434 957 -684 -940 381 784 -250 -343 -62 169 26 220 -295 -550 496 750 -335 -1119 150 1247
1452 1247 -161 -1308 85 1359 -122 -1372 123 1032 162 -966 -5 314 134 -285 -183 -45 185
1469A85M31m25r26L23J178k42j490L33J760j39k006J40J640N4j531k49J475j9
1487D92p30l80O89J35n5l64k6j47N17M12r12m01J161P73j408o44J112Q58j148
1506f6j298J329J183j049j019O83R03n72n09K03K37l1M0j92k05K22P78k97j064
1525g24L37J038k12j255K07J405J40j517k2J297n0r79l34P57M28m80n06L31K45
1544A06J85K7o24j16P03L70r61m73J015Q68j207q88R97R48r94p90Q31O46l89q36
1564e82M47O71k80l78P9r4K13K17k69m98L17Q31l41j003J74J272l64j202J60J214
1584E84J06j203k00Q09O92q62m12L78M73k10k56k04P3P08j84m73m17P47N77q21
1604i5q70J073P35p53j002P42Q46n98o69N52L51q3l93j10L91J63L6n77Q3K30N13
$$ plain form
1469 185 616 191 -735 -412 766 524 -966 -633 1127 988 -1018 -878 762 816 -715 -964 511 492
1487 492 -238 -618 71 206 151 -213 -239 -386 131 543 -369 -770 391 1164 -244 -888 224 1082 -66
1506 -66 -1364 -35 1148 99 -920 -237 666 94 -415 -212 25 -6 34 -158 -363 -141 637 340 -724
1525 -724 -387 651 439 -816 -609 796 936 -581 -603 694 644 -335 -669 88 516 36 -470 -139 106
1544 106 291 318 -306 -422 281 651 -310 -783 232 1100 -107 -995 2 950 -44 -834 -3 643 254 -582
1564 -582 -135 536 256 -122 -43 -137 76 293 24 -474 -157 674 333 -670 -496 776 412 -790 -630 584
1584 584 690 -513 -713 96 788 -74 -486 -108 365 155 -101 -305 -232 476 292 -181 -598 149 726 -95
1604 -95 -965 108 843 90 -912 -170 676 78 -591 -39 312 229 -164 -274 117 280 316 -261 -178 52 565
1625E65m00q15L15J024m21r70K69J084k42q20k13Q91J84n25l57L93O29l74l26
1644a09j59J46M64j41o48P6O57K05q40j33Q47J19o49m35P72M49n20o81L12O51
1664C83r0n21o6N40J83m51k66Q2L64K35m35n17P31N14n23p33J64J043n60l99n4
1685c76Q05O9p37k82L87O26k46m91K7J38L53m16k84M34L56j01p37J60P26O3p57
1706b83m71Q63M75n71o09M60P08k89m58j73N62K90n97k47K24M96J9n23m45O11
1726D2K63m98j65J82P07n70m92K82M76M6n65o6N65L5k75k72K15K02K01l57j44
1747a88L21L05l95l75J54N72j14o21j30O63K2k49m33L86N42m04m56K14L12K56
1767C82l97k81M26L22m14n54M10M94k22m41k47P06L92n50m64L49O27k85m83r6
$$ plain form
1625 565 165 -650 -335 689 268 -702 -433 651 409 -411 -624 267 451 -74 -431 -38 591 217 -109
1644 -109 -268 -122 342 201 -447 -371 286 491 -349 -482 365 484 -165 -600 172 621 101 -580 -268 383
1664 383 293 -228 -294 246 429 -22 -288 -206 158 393 -42 -559 172 686 163 -570 -406 637 77 -322 -376
1685 -376 429 498 -239 -521 -134 492 246 -245 -218 -80 273 -143 -427 7 363 262 -475 -315 411 474 -283
1706 -283 -754 109 584 13 -596 -136 572 283 -175 -348 214 504 -93 -340 -116 380 399 -124 -569 42
1726 42 305 -193 -358 -176 531 -39 -531 -249 227 273 -292 -358 207 242 -33 -305 -90 112 313 -44 -188
1747 -188 133 438 43 -332 -178 394 280 -341 -471 192 214 -35 -468 -82 460 56 -400 -186 126 382
1767 382 -15 -296 130 452 38 -516 -106 388 166 -275 -522 184 576 26 -438 -89 538 253 -230 -326
1787c26M70K45m30l17K39L57j41m19L3M87R1k66m71L86O19n45n32L10K53L25n69
1808b01j19M96L51l20o51K54N03M7n26k44M62N03n64l85N25K04l10k97O0N31J8
1829C37n01l60N71L29l30l32J39K65K20l84m69M76L41j71o41LQ72q2n88p1M53
1850G7K37k95m09M57K68l3o28J90J82L46l58l36K96J23O4m51M1L56L03m21l58
1871c49K77L90k71p17L62P67l88l88J09K21K06l18k68K95K09J55j53m71L61L23
1891C52k89n66L54O83r0q76J7P78J64o34l54P22J51n20o0J35L42l80J29k24j3
1912a79K76J15k85k99M28K98o71j93N94M21o22m79N22O74m60m40N4O51j14l42
1932e1p5K27J13j61p6k96J03O22j05p47K39O93o2j269L40Q75J42j026J22Q08O8
$$ plain form
1787 -326 144 389 -41 -358 -119 238 97 -322 -289 198 289 23 -448 -62 557 12 -520 -210 43 368 -201
1808 -201 -320 176 527 207 -444 -190 313 360 -166 -410 52 555 -9 -394 131 335 25 -272 -212 319 337
1829 337 -164 -524 47 376 46 -286 -147 118 338 -46 -515 -39 302 131 -510 -507 365 283 -305 -376 77
1850 77 314 19 -390 67 335 302 -326 -136 46 392 34 -302 -6 117 181 -270 -229 127 430 9 -349
1871 -349 -72 318 47 -670 -308 459 71 -317 -208 13 219 -99 -367 -72 137 292 139 -332 29 352
1891 352 63 -503 -149 534 444 -432 -415 363 527 -107 -461 261 412 -108 -168 -33 309 -71 58 -166 -179
1912 -179 97 212 -73 -372 56 354 -317 -510 84 505 -117 -596 -74 600 140 -300 -246 405 291 -51
1932 -51 -126 101 214 53 -23 -319 -216 406 301 -446 -207 486 424 -845 -505 370 512 -514 -392 416 484
1953D84p49j27N59J54m83K0K77l03P6L16k59k68K66Q07p96o61Q60O44q76n49N89
1974a9P41o44p26O92O53p30o20Q11K71n47J85K01k48k72K83K74p51O7R47k56p53
1995d41JR55j37j105K10J220j7j313L15Q10k34r06M76N03m53k71N85K4o97L03
2015a72Q28o66o33P42O22p77r13J070Q67j275n03J098M73j000q43J281K20p41
2033c22p9P91r5q13M60M28o68l45J067L8j094j42J348J38j401o8J708k80j643
2052i72M03J399k81j481N71J256r85p83R37M50p48k61R89j9j327N11J142m95j305
2071i99R75J295j305j276J437J357j475j242J385J028j521o09J288L81j180p6
2087e37J295n72j079Q07J064j244r78J766N89j920j15J556M11k147K80J935k52
$$ plain form
1953 484 -265 -392 167 321 -162 -142 135 -168 -92 224 -35 -303 -37 770 -26 -687 173 817 -59 -608 -19
1974 -19 722 78 -648 44 697 -33 -653 158 429 -118 67 268 20 -252 31 305 -446 -379 568 312 -441
1995 -441 -440 515 378 -727 -517 703 686 -627 -312 498 264 -642 -166 337 -116 -387 198 222 -475 -172
2015 -172 656 -10 -643 99 721 -56 -969 101 968 -307 -810 288 761 -239 -1082 199 419 -322
2033 -322 -401 390 295 -518 -58 370 -298 -643 424 462 -632 -774 574 712 -689 -757 951 671 -972
2052 -972 -569 830 549 -932 -361 895 -90 -873 64 514 -234 -495 494 475 -852 -341 801 306 -999
2071 -999 -24 1271 -34 -1310 127 1484 9 -1233 152 1180 -341 -950 338 719 -461 -537
2087 -537 758 186 -893 -86 978 -266 -1244 522 1111 -809 -924 632 1043 -1104 -824 1111 859
2104H59k015N10J787o04j626Q70J320j253r05J365N14j546R1J594k10j868Q10
2121c07J602j075j805J205J918j616j520J718J456k013j071J932R06j901l66J919
2137I82K5j984N77J615j081j429J538J302j697j419K269P82k511m74K483K62k389
2154a149m7K578o49k248P59K261j192j791J528J518j961r85K114O35k534j44K826
2171A519o06k508P64K581j376k301J988K011k016j913K014J744k417j239K438
2186F83O23k376o4K560p48k346J153K334j673k286K547J650k662j432K868J129
2202A960l083n97L182n8k972M3L455q09l013J359K328j620k047K130J490k488
2218g40j165L048L30l020K9L292o00l146R41L393j736l122K293K556k395k324
$$ plain form
2104 859 -1156 -646 1141 537 -1089 -219 1101 -152 -1057 308 822 -724 -633 961 751 -1117 -307
2121 -307 1295 220 -1585 -380 1538 -78 -1598 120 1576 -437 -1508 424 1330 -571 -937 982
2137 982 1007 -977 -400 1215 134 -1295 243 1545 -152 -1571 698 1480 -1031 -1505 978 1240 -1149
2154 -1149 -1196 1382 733 -1515 -756 1505 313 -1478 50 1568 -393 -1378 736 1371 -1163 -1307 1519
2171 1519 913 -1595 -831 1750 374 -1927 61 2072 56 -1857 157 1901 -516 -1755 683
2186 683 1306 -1070 -1134 1426 678 -1668 -515 1819 146 -2140 407 2057 -605 -2037 831 1960
2202 1960 -1123 -1720 1462 1404 -1568 -1525 1930 1121 -1892 -533 1795 175 -1872 258 1748 -740
2218 -740 -1905 1143 1473 -1547 -1518 1774 1174 -1972 -1031 2362 626 -2496 -203 2353 -42 -2366
2234b366K710J815l055j047L207K15k939K81L010q09k923J264L040k173k730K795
2250B95K184l171j752L649J189l829p50L880ll539K75L585r00l318J637K866k148
2267A50k335K525J882l054j378L551N65l662PL943o45l889J224L778j796l651
2283b785K327L244l073k431L286K050l909j196M264J15l833K82L999j275l638
2298b573J826L535k755k989L238K558l677k165M177J494m153r63M511j0m182O75
2314a453L846j244l879K098L506k984k529L279J986l801j437M046Q92m532K8M655
2330B477p61m536J500M470k109m271K902L548l188k969L666K168l942j460M260
2345A755L99m400N68M363j431m176K374L507k761l714L800L070m131k528M471
$$ plain form
2234 -2366 344 2159 -896 -1943 1264 1479 -1460 -1179 1831 1022 -1901 -637 2403 230 -2500 295
2250 295 2479 -692 -2444 1205 2394 -1435 -2185 1695 1692 -1847 -1572 2013 1113 -2205 -568 2298 150
2267 150 -2185 340 2222 -832 -2210 1341 1906 -1756 -1749 2194 1549 -2340 -1116 2662 866 -2785
2283 -2785 -458 2786 -287 -2718 568 2618 -1291 -2487 1777 1892 -1941 -1659 2340 1065 -2573
2298 -2573 -747 2788 33 -2956 282 2840 -837 -3002 1175 2669 -1484 -2447 2064 2054 -2128 -1453
2314 -1453 2393 1149 -2730 -632 2874 -110 -2639 640 2626 -1175 -2612 1434 2326 -2206 -2178 2477
2330 2477 1716 -2820 -1320 3150 1041 -3230 -328 3220 32 -2937 729 2897 -1045 -2505 1755
2345 1755 2154 -2246 -1678 2685 1254 -2922 -548 2959 198 -3516 284 3354 -777 -3305 1166
2360A166J869m786j105N137K40n083Q49M669j819m060K261L696l375k889M141
2375I11K322m506j853M919J011n231mN279o87n159J535M742k284m466L032M008
2391C569l880l217M409K286m576j425M786N13n110N62N078j355m931K117M833
2406C659l286m040L912L498m485k917M923K157n338j242N589N6n117O35N300j758
2422A546n040K941M234l578l657M263K718m842k003N477J089n582l76N869q14
2437B245n556J643N090k290m681L285M094m115l171M380K479m995j645N572L53
2452B688n385M70N459j417n413K523N038l473m317L878L882m692k943M935K308
2467C541n548j253N551K61n583J051N410j901m938K463M774l852l497M172L247
$$ plain form
2360 1166 3035 -1751 -2856 2281 2521 -2562 -1713 2956 1137 -2923 -662 3034 -341 -3230 911
2375 911 3233 -1273 -3126 1793 2804 -2427 -2431 2848 2161 -2998 -1463 3279 995 -3471 -439 3569
2391 3569 -311 -3528 881 3167 -1409 -2834 1952 2465 -2645 -2083 2995 1640 -3291 -1174 3659
2406 3659 373 -3667 245 3743 -742 -3659 1264 3421 -1917 -3159 2430 2486 -2631 -1996 3304 1546
2422 1546 -3494 -553 3681 103 -3554 709 3427 -1415 -3418 2059 3148 -2434 -2810 3059 2245
2437 2245 -3311 -1668 3422 1132 -3549 -264 3830 -285 -3456 924 3403 -1592 -3237 2335 2688
2452 2688 -2697 -2227 3232 1815 -3598 -1075 3963 490 -3827 51 3933 -759 -3702 1233 3541
2467 3541 -2007 -3260 2291 2552 -3031 -1980 3430 1529 -3409 -946 3828 -24 -3521 651 3898
2482C898n218k362N608J675n945q46O096o26n678J638N519k509n032L221M589
2497D028m065l633M519K658n128j934N643Q58n706L65N725j206n771K184N397
2512C934l409m633M073M191m751l315N239K371n754j380O072K50o000Q45N646
2527C379j763n396K857M807l517m388M534L609n388k419N480J748o050o19O012
2542B886k24o032J453N513k218n132L016M669m037l663M642K879n163k083N681
2557B187R96n980M7O050j047o048K356N402k995n076L727M449m496l593N268K242
2573C489n220j483N581M98n846Q54N503j861n306K698M977l592m335M444L629
2588D030n172k695N536K003n958r74O135l58n674J018N786k301n020K853M741
$$ plain form
2482 3898 -1320 -3682 1926 3601 -2344 -3190 2906 2280 -3398 -1760 3759 1250 -3782 -561 4028
2497 4028 -37 -3670 849 3507 -1621 -3555 2088 2946 -2760 -2395 3330 2124 -3647 -1463 3934
2512 3934 525 -4108 -35 4156 -595 -3910 1329 3700 -2054 -3434 2638 2888 -3112 -2267 3379
2527 3379 1616 -3780 -923 3884 367 -4021 513 4122 -1266 -3685 1795 3543 -2507 -3126 2886
2542 2886 2662 -3370 -1917 3596 1378 -3754 -738 3931 -106 -3769 873 3752 -1411 -3494 2187
2557 2187 3183 -2797 -2750 3300 2253 -3795 -1439 3963 968 -4108 -381 4068 -428 -4021 1247 3489
2573 3489 -1731 -3214 2367 2865 -2981 -2127 3376 1515 -3791 -1093 3884 292 -4043 401 4030
2588 4030 -1142 -3837 1699 3702 -2256 -3230 2905 2547 -3127 -2109 3677 1376 -3644 -791 3950
2603C950l817l974M723K741n134j811N246J351o096J6O106j000n940J980N493
2618C834k805n039L672M285m104l740M937K457n137j695N729N91n754M19N600
2633C250j418n468K532M859l193m629M205L965m897k948N324J842n542j116N737
2648B503K69n794P95N632j813n309K958M496l704l761M271L088m752k180N089
2663A788J455n681m78N911q67n540J753N313k569m892L296M418m134l348M347
2678G72K743n002j740N336Q03n413K19N285j089n277K036M896l181m039L553L727
2694C629m207l152N003K299n409r89N290L27n503N37N246j478m838K152M640l395
2710A52l706L773L336m662k201M953J474n319n09N427m21n210J128N032k014m803
$$ plain form
2603 3950 133 -3841 882 3623 -1511 -3322 1924 3275 -2821 -2805 3301 2301 -3639 -1659 3834
2618 3834 1029 -4010 -338 3947 -157 -3897 1040 3497 -1640 -3335 2394 2985 -2769 -2350 3250
2633 3250 1832 -3636 -1104 3755 562 -4067 138 4103 -794 -3742 1582 3424 -2118 -3234 2503
2648 2503 2772 -3022 -2227 3405 1592 -3717 -759 3737 33 -3728 543 3631 -1121 -3301 1788
2663 1788 3243 -2438 -2916 2995 2128 -3412 -1659 3654 1085 -3807 -511 3907 -227 -3575 772
2678 772 3515 -1487 -3227 2109 2912 -2501 -2282 3003 1914 -3363 -1327 3569 388 -3651 -98 3629
2694 3629 -578 -3730 1273 3572 -1837 -2826 2464 2791 -2712 -2175 3071 1593 -3245 -1093 3547 152
2710 152 -3554 219 3555 -1107 -3308 1645 3119 -2200 -2709 2718 2297 -2913 -1785 3247 1233 -3570
2726c570K982M052l459l433M248K346m414j638M722O81m905m4N093p70m929J844
2742a194M611k581m542L738L416l775l052M396K131m585j363M806L68m676L83
2757a919M536j128m340J981M007k789l614L694K794m211k071M474J449m788o44
2772b569M877P0m876O73M563j536m180K447L664k994l341L548K647l926j780M422
2788A709O47m534J10M584q71m410J472M004j980l663K618L341l427k585L650K245
2804B910m080j387M315M48m134L2M269j151l682J576L623k443l028L017K486l400
2820f29k014L743J545m019r68M187J35m017L78M005j293l607J764L486k298l082
2836b684K999K172l413j328L417J097l947OL696m60l910J123L839j697l648K283
$$ plain form
2726 -3570 -588 3464 5 -3428 820 3166 -1248 -2886 1836 2517 -2388 -2432 2661 1891 -3038 -1194
2742 -1194 3417 836 -3706 32 3448 -327 -3379 1017 3148 -1437 -2800 2006 2374 -2302 -1919
2757 -1919 2617 1489 -2851 -870 3137 348 -3266 428 3222 -989 -3060 1414 2863 -1925 -2569
2772 -2569 2308 2378 -2498 -1825 2738 1202 -2978 -531 3133 139 -3202 346 2993 -933 -2713 1709
2788 1709 2356 -2178 -2068 2516 1645 -2765 -1293 2711 731 -2932 -314 3027 -400 -2985 665 2910
2804 2910 -1170 -2557 1758 2206 -1928 -1896 2373 1222 -2460 -884 2739 296 -2732 285 2771 -629
2820 -629 -2643 1100 2645 -1374 -2342 1845 1980 -2037 -1659 2346 1053 -2554 -790 2696 398 -2684
2836 -2684 315 2487 -926 -2254 1163 2260 -1687 -1681 2015 1555 -2355 -1232 2607 910 -2738 -455
2852d55L298k904k538L005J989l528j052L665M39l571l4L655q12l460J688L011
2868B396j952k856K538K253k847j758L111J445l678q39L689K31l739O22L472r93
2884A095l229J293L117j987k540K364K094l126j129L305N65l110m76L281q2l425
2900a990J102L072j373l008J865K578k155k269K472J790k748j453L104N07k726
2915a232N8K690l66l055J102K751j675k412K163K050k526j650K818J185k822r36
2931a857L236K29k988J42K774n82k676J280K347j739j928K023J615k378j320K619
2947G97Q24k669o02L151k80k663N70K469r29k553J427K310j852j581J529J617
2963A565k165j094K426Q27k628p1K436r3k564N99K335r78k149J425K054k083j478
$$ plain form
2852 -455 2843 -61 -2599 406 2395 -1133 -2185 1480 1919 -1652 -1686 1969 1157 -2303 -615 2396
2868 2396 444 -2412 126 2379 -468 -2226 885 2330 -1348 -2187 1502 1733 -2006 -1384 2088 1095
2884 1095 -2134 -841 2276 289 -2251 113 2207 -919 -2048 1257 1822 -1288 -1764 1517 1435 -1990
2900 -1990 -888 2184 811 -2197 -332 2246 91 -2178 294 2084 -664 -2117 987 1494 -1232
2915 -1232 -1174 1516 1150 -1905 -803 1948 273 -2139 24 2074 -452 -2102 716 1901 -921 -1857
2931 -1857 1379 1608 -1380 -1238 1536 954 -1722 -442 1905 166 -1762 261 1876 -502 -1822 797
2947 797 1621 -1048 -1650 1501 1221 -1442 -872 1597 668 -1885 -458 1852 0 -1581 -52 1565
2963 1565 -600 -1694 732 1559 -1069 -1140 1296 1203 -1361 -762 1573 595 -1554 -129 1925 -158 -1636
2980a636K101J267k459n09K153L82k515K55K345p26j897P58J755r55j712J479
2996H6J401j833j061J995P18k225l85K360K71k650M65K041o23j852Q00J838j229
3013A17j392J285J298j625q79J767N12j929o4J828k10j736M68J876q18j875J140
3030b37J531j276j263J329J084j622o92J808J59j796J20J865l31j684O15J530
3046A140r99j564J320J206j460p83J700L90j590k53J698O3j897L34J577l32j567
3063a017N79J395p54j248R92J104j290p06J426K09j204j61J422k01j403M26J437
3080A006o15j476J041J070r40j016R94Q08j105o00J330K84j355m6J232J7j230
3097f01K48J122n09j001P26Q04r31o76J052N96j290j68J050J07j179%J284j32
$$ plain form
2980 -1636 465 1732 -727 -1236 917 1299 -1216 -961 1384 658 -1239 -481 1274 319 -1393 86
2996 86 1487 -346 -1407 588 1306 -919 -1304 1056 1327 -1323 -858 1183 560 -1292 -492 1346 117
3013 117 -1275 10 1308 -317 -1196 571 1083 -846 -910 918 708 -1028 -560 1316 498 -1377 -237
3030 -237 1294 18 -1245 84 1168 -454 -1146 662 821 -975 -855 1010 679 -1005 -390 1140
3046 1140 141 -1423 -103 1103 -357 -1140 560 950 -640 -893 805 868 -1029 -695 882 550 -1017
3063 -1017 -438 957 203 -1045 -53 1051 -239 -945 481 690 -514 -675 747 546 -857 -431 1006
3080 1006 391 -1085 -44 1026 86 -930 64 872 -233 -833 497 781 -574 -620 612 629 -601
3097 -601 -353 769 260 -741 -15 789 -142 -818 234 830 -460 -628 422 529 -650 -650 634 502
3115E02j231M85J089o70r54Q42O42p39n83P97L59q48m22J059J18j090L64R99n33
3134A86j068P99R27o92q31O77O43r82l20J006K89r78JQ59m2r81M90M25l54n32
3154d78L30O59o47n49R79M92j161P4P35J33p73r0P56k1r78L97N37m14n27M43O04
3175E01m85n42O73K53q25R2N22O8q60K13Q89k70m79K8N64l09p33O74N70o36l46
3196d38O37K64m80j74N16q9m56j45O75j82m30M48K65n23j78L30M68o79j2M74J55
3217D46p39R2N75k72m16K32M90j99l57J89K17m22k26M05L12n39L6L69J8m15P7
3238a27M24q1l94L03J45k70j21L9K71n2k72Q3M25p28K83K50o5n20N44J81l01k47
3260b30L20J35l59j65M55J45l59k53L41L11m86k6J13J84l16O2L74k65j71M12p9
$$ plain form
3115 502 -729 -244 845 175 -779 63 705 -34 -617 180 539 -309 -731 328 446 -644 -280 719 186
3134 186 -882 -83 844 152 -679 -2 641 -341 -661 345 634 -344 -343 516 474 -507 -17 408 54 -478
3154 -478 -148 511 -136 -685 294 786 -375 -301 434 567 -206 -296 460 439 -539 -142 395 -19 -546 -103 501
3175 501 16 -526 147 400 -425 -333 189 257 -603 -390 499 229 -250 -222 342 33 -700 -26 544 -92 -438
3196 -438 199 463 -17 -191 325 236 -220 -365 310 128 -302 146 411 -112 -290 40 508 -171 -183 291 446
3217 446 -293 -201 374 102 -314 -82 408 209 -148 41 258 -164 -390 15 327 -212 -176 193 211 -204 -127
3238 -127 297 216 -178 125 270 0 -121 -82 189 137 -135 -52 373 -355 -72 178 113 -407 137 318 17 -230
3260 -230 90 225 -134 -299 156 301 -58 -311 30 341 -145 -171 -58 126 -190 -128 246 -19 -190 222 143
3281A43j83l6oJ62j28QK09om12P7K77J1l57J37J75m2j51J36J39j71j33J35J24
3304A08j28o9K68l5l02R5K66l41M4J89J45l06j71K57K72j91k03J98M1k53K65K1
3326A70r5J2l07M48k91J31RN4j00j32K76q1l08J28J56n7j73N7K40R3l37JJ86n5
3350B5j05j6J44j88K39P4j58k6J58j79j37L3J71jk8n4R9R3n4l10K71L3j85J98
3374I7j17l4J0kr2J37n6O0L9R5k84J64j90L02l25L28Kj31o4J51J11k71O7j13R4
3399b2P4o7n7P6R3j20R8k5j13K76k06l04N50k84O5j1l09L88M7k87J9J89K3mn3
3424C6Q4j41K2N7jR4R4j76oj27J90l07Q8O7J44P9j25r2J40k99M3J58P2j68J5J39
3450H0j45P3Lk7k6J26j36J62l15J08m8k6K06j35J3K32j53k9l0K9O3o2Q6N7p7m1
$$ plain form
3281 143 -40 -76 -82 80 -48 -40 169 163 -249 -172 105 116 -241 -104 71 29 -122 14 153 -18 -151 -16 108
3304 108 -20 -89 179 144 -158 -63 203 -138 -94 95 240 -66 -237 20 292 101 -102 96 137 -116 149 170
3326 170 75 87 -220 228 -63 68 77 131 31 -101 175 94 -214 -86 70 13 -160 -103 137 230 -107 -106 80 25
3350 25 -80 -96 48 -140 99 173 15 -11 147 -32 -169 -136 35 34 6 -48 51 144 90 -220 51 84 -101 97
3374 97 -20 -54 -44 -46 -138 -1 -57 3 42 137 -147 17 -173 129 -196 132 134 3 -61 90 201 -70 -3 -116 -22
3399 -22 52 -15 -72 4 97 -23 75 50 -63 213 7 -297 253 -31 34 23 -286 102 149 -138 -119 70 93 89 36
3424 36 120 -21 1 58 57 151 245 69 63 -64 126 -181 -93 -26 118 197 72 -20 120 -179 -136 22 94 -74 -59 80
3450 80 -65 8 11 -16 -42 84 -52 110 -205 -97 -145 -171 35 -100 -87 145 -8 -37 -67 -38 25 -37 49 106 29 -12
3476a2J29j73p6J51l4m9j6J87k06P2Kk5O3J38q6o9l5j91K81j32K48m9j66J52p7
3501B7J35j92J67j29K87m14K27r2K2k16J28q5K26o7Q7j75j3n8j4K93p3L2k19J69
3525E3K6j71j13J69P6J56k14L2j41K39k32L42k87K6r8J94K6p9p4N4p2J09Qj22
3549i3J99k80J66J23j9n0qK5ml8mk5P2n2r3O3RM8k0m04N51k34pl0J98j07N4O5
3577A05J83k83r6J11N2k18qK27k4jj00J80j32LK27j79j55K35j67J20k64j4J61
3600c7q6k6K55k00M8l7P2j05J6j7J88k25K64n5m0N7O5j64Q7p7m4O2o5j3O3j11
3626a25K27k19J7J41k46Q1oQ5J27O1k24J33R3j89K1J99l23J49L7KJ14j25k0j03
3650i3R6J21j75K0j9J65jm21L90k24L86j27k83K97q6rk9J3k17J14R1J24j26P7
$$ plain form
3476 -12 117 -56 -132 19 -15 -64 -80 107 -99 -27 -25 -50 13 151 65 -4 -39 -230 51 -81 167 118 -48 104 27
3501 27 162 -30 137 8 295 -119 108 16 38 -178 -50 -135 91 24 111 -64 -77 -135 -149 144 71 103 -116 53
3525 53 79 -92 -205 -36 40 196 -18 14 -127 112 -120 222 -65 -39 -137 57 83 4 -70 -16 -88 21 29 -93
3549 -93 106 -174 -8 115 96 46 38 63 59 21 17 -8 64 12 -81 -18 -9 39 19 -385 166 -68 -75 -105 93 -14 40 105
3577 105 288 5 -91 20 72 -146 -154 73 49 48 -52 128 -4 -1 226 47 -108 127 -40 80 -184 -198 -37
3600 -37 -123 -149 106 -94 -46 -83 -11 -116 -100 -117 71 -154 110 55 15 72 137 -27 60 -17 -61 1 -64 -77 -14 -125
3626 -125 102 -117 -100 41 -205 -124 -130 -45 82 143 -81 52 145 -44 -23 176 -147 2 39 41 155 30 10 -93
3650 -93 3 124 -51 -31 -50 115 114 -307 83 -141 245 118 -165 132 46 37 8 21 -196 -82 9 133 7 84
3674H4Mr3j01K30j83J53J2j60Q4l6j81k5K72k7j31q5J11K01r0p6J03L2l32J09
3698a25K09q7J83j11O3q1J1J01l31QL92j10k71J65J78j54n4J2o6J30J30J4l3j20
3722E3j02q8P3J43j35J65m0j71L72j98k11P5J59O6j57j93J75K55k26kk2j91r6
3745b96L36n5R5n0j57J35k2l0K29l60L58k64J83j80j1J92j21O3q5q5K92L8j17
3768H8l8L3k12J80j5R6j61J36L3k54J42jR9j21qo4J79j84M4j27K6M4J16pP8L1
3794A33j47R6j22L21k48Q6j79J15q7P5mj37o1N6J10j43P3R2m0j66K84n0j23J37
3818G1l2n7P1j80J56j44R7K35k17L0j5J46p0j26P9J0j70K11j82J19n4R1r7rl3
3843g0K06j11jQ3k78J33O7J08j10l0oO7r6q9qK61l9k6j45KJ56k6R0k40J66j13
$$ plain form
3674 84 88 -5 -106 124 -59 94 106 -54 30 -6 -187 -212 60 33 -98 -183 -72 129 39 -37 66 98 -234 -125
3698 -125 84 -3 180 69 132 51 62 163 -168 -160 232 122 -149 16 194 40 -14 -2 -68 62 192 206 173 53
3722 53 -49 -137 -64 79 -56 109 69 -102 270 72 -139 -64 95 161 4 -189 -14 241 15 13 -9 -200 -296
3745 -296 40 -15 80 30 -127 8 -14 -44 185 -175 183 -81 102 -78 -89 103 -18 45 -40 -125 167 205 88
3768 88 50 83 -129 51 36 132 -29 107 140 -114 28 27 126 5 -3 -67 112 -72 -28 -155 -129 -85 31 24 102 133
3794 133 -14 82 -40 281 33 119 -60 55 -32 43 39 -98 -159 -103 7 -136 -63 29 -11 -177 107 57 -66 71
3818 71 39 -18 53 -127 29 -115 -18 217 0 30 15 161 91 -35 44 54 -116 95 -87 32 -22 69 -28 -37 -70
3843 -70 136 25 24 107 -171 -38 29 137 27 -3 -9 58 -38 -127 -135 126 87 61 -84 -82 74 48 138 -102 64 -49
3869d9J9P5k07N1J42j61P0J75P7j52qlO6m1j46J15J17j05r5J53j80J10J74l26
3893a29J0J19R2J0l74N5N2J9K93j20j02QMJ46j18k0M8l6M8q0O9P8j76M5M4K25
3919B10j88q8K34k7j54J80j52M3K73m49P8m9J02K0K1J95k18K17l43J66k62K12
3941B1q8k9K03q7r3J22J17j17j01J34j52J12k24J86j14J20ON9j91P7LJ92j50q9
3965h3M6q7J91k56K59j90K94k78K90l11J43O3k26J65j8m6K11m8k11J3j5K23j02
3988B7K7j30q9K46j20J63k01n4K70p7N6p9k52L01j08np3J48p5N4L5j22K94l45
4012a09R9j39K38k02K40n4j11L2q2J90q9O7j7L3j39L3O0r2Q4J59k58m7K7J49j30
4037e8r3J09n4J44K8J26k97k4J48R9n2j99QJ72l03J54J85P0l83K47j98J59rQ5
$$ plain form
3869 -49 -30 45 -162 -111 31 -130 -60 115 192 40 32 29 95 54 -92 23 140 35 -60 93 -87 23 197 -129
3893 -129 -119 0 92 102 -272 -217 -165 -146 147 27 -75 -67 -63 83 -35 -55 -7 -43 5 -75 -6 72 -104 -59 -15 210
3919 210 22 -66 168 141 -13 167 15 58 331 -118 -40 -89 13 33 54 249 31 248 -95 71 -191 21
3941 21 -67 -96 107 20 -73 49 166 49 -52 82 -70 42 -182 4 -110 10 16 75 -116 -39 -36 156 6 -83
3965 -83 -37 -124 67 -189 70 -120 174 -104 186 -125 18 81 -145 20 2 -44 167 119 -92 -79 -94 129 27
3988 27 54 -76 -165 81 -39 124 -77 -131 139 62 118 39 -213 88 -20 -25 -98 50 -25 29 64 -58 236 -109
4012 -109 -10 -149 89 -113 127 73 -38 -6 -88 102 13 80 63 96 -43 -10 50 -42 42 201 -57 -104 -77 72 -58
4037 -58 -151 -42 -96 48 76 202 -95 -119 29 128 76 -123 -115 57 -246 -92 93 163 -220 27 -171 -12 -21 64
4061F4j18R2p9LP3K7K1n1p3j4O4p4kM2K1NJ47k00K29k44O9j0m9K12j84J28j66
4088f7K27o0n1R7j55p9J87pj57N8rk1J8M2J03j02J7n4J6J00j5j42K2O0r8J40J1
4115H1o0J9j61k6K31q8j4J7o6j82K93o9k60K71N3k3J14m6j71j41J38J05m6N9o1
4140c3L3j5R3k27K41r7j55N0J38m7rj6j02N6M6P8J16k20J42j43n2J73j95J23J38
4165A16j48J03j72n7J60l6K0K1PN2j12J19k03N0M2J41j53K2O7P3j26J64k41kJ45
4190E2j09J47J13l25k5kK44l5Kok1o7J75k10K2J18j91k8K39N5k00K03k93P6N8
4215hR1J10j53q7J2j2p0RQ5L4j26J37P6j92m1J02J51J0j12N2l9k4k02K80j68Q2
4241cON9j39J23j82r6QJ93Q6J68k80M6l2P0R8k76R1o7J81q4j47J0K79k80Q9J99
$$ plain form
4061 64 -54 38 -41 -38 35 62 83 32 -41 -55 9 -65 -67 -25 -4 1 148 -52 177 -67 2 -8 -57 155 -29 99 -67
4088 -67 160 100 49 146 -9 -88 99 92 -65 -7 -16 -37 -19 23 126 24 41 -13 3 103 88 -54 -32 28 -70 70 81
4115 81 21 40 -121 -147 84 -4 -18 -1 -67 -249 44 -25 -285 -14 39 16 130 84 -87 -228 -90 15 -31 28 -33
4140 -33 0 -15 78 -149 92 -5 -160 -110 28 -19 -28 -44 -146 -90 -44 34 150 -70 72 -71 -123 50 -145 -22 116
4165 116 -32 71 -101 -158 2 -34 -14 7 14 66 -46 73 -130 -80 -38 103 -50 -28 39 112 -14 150 -91 -93 52
4190 52 -57 90 203 -122 -147 -149 95 60 62 56 35 -32 143 -67 -45 73 -118 -146 93 148 -52 151 -142 -66 -8
4215 -8 83 193 40 -47 -35 -47 -117 -108 -23 11 -115 22 98 -94 -135 -33 118 128 16 68 29 5 -197 83 -85 -3
4241 -3 3 62 -77 46 -136 -232 -224 -31 55 223 -57 -11 -43 27 125 -151 -60 -127 54 -30 -177 -167 112 -168 -79 120
4267A20K4l3p6o8Q1j56L8j00J73R4p6j58O8J14o9K86k85j60J77J0o0k0N0J90l27
4292a63K37J12j77k00K18j18JK9M0l2M5k43K22Pr8J51l41J71K50k35J41R3j60
4315e0J19k27J05l0O1q0K83j56j16p7L53j05n5JP5j72O5N8j37K73m15J03K04j22
4339d2K7q8L1L5O1J39Oj49P2P0n0k49K40n8j00J27Nj69L0J85j02K41l67R6Q7M6
4365A24j52j03J77l1r0J07R9j89K5J21N2j43l8J06L8o3N8j34J4l9P7q0J99n4J42
4390B23k60J19pJ24j39k13K92R3p5k63J64j47R1M3o6J43k91P5K30k22M1j17J3
4413a49K82j17o7J27j03R5Q2N3k97mM0P3p6J47M0j84k10K50O7j12P8k20K39m5
4437a1j29L6L6Q5P6k45K90k15n4J75O7L1j56J84l52K52j0m4O3k23L30k39O6n6
$$ plain form
4267 120 144 111 35 -33 48 -108 -70 -170 3 97 21 -137 -69 45 -24 262 -23 -183 -6 4 -56 -76 -26 164 -163
4292 -163 74 186 9 -191 27 -91 -90 -61 -21 -53 -8 -251 -29 -22 -120 31 -310 -139 111 -124 17 110 -50
4315 -50 69 -158 -53 -83 -22 -102 181 25 -91 -168 185 80 25 26 101 -71 -6 52 -85 188 -227 -124 80 -42
4339 -42 -15 -103 -72 -37 24 163 169 20 92 162 112 -137 103 45 -55 72 77 -92 -62 123 21 262 -105 -9 78 124
4365 124 -28 -131 46 15 -75 32 131 -58 -33 88 140 -3 -41 65 103 40 98 -36 -22 -61 16 -64 135 81 223
4390 223 -37 82 75 199 60 -153 139 232 157 -106 58 -89 2 45 -21 122 -169 -94 136 -86 -45 -162 -149
4413 -149 133 16 -51 76 -27 68 150 203 -94 -98 -58 15 -61 86 126 -58 -268 -18 49 -63 15 -205 34 -11
4437 -11 -140 -104 -68 17 93 -152 138 -77 -131 44 111 142 -14 170 -182 70 60 16 79 -144 186 -53 13 -43
4461d3oQ6M1q8jj60L9P5L4n8JJ61j58O6q9J84O2n1j73J88j13J5L3q0N7n6Pj07
4489a34Q7J63J00j59N9k92K90M2j98J17k33J50N9J19k28J49r6k7L2m5Q3L9n1j41
4513a15N7J68j54J8J75j10j90P9J48Q9l63O5O3P4j97K70J00k05J78j55m9r1M5
4536a00R3k41K36j18J6J92j3J49m18K77K3l0m0N3k49L3L10k16J61l0l6j42N4n2
4560h8O2R4n5j12R1j17K5J30j02O6k9qJ72j31K26k16K6j05M6N1k9J50j22k0q0
4585g5J21j02o4q4J61M7j85j29K15J37R0j04j08J1K6P7N3p5L3j35K18j01k0Qo7
4610e2J30K8L0j6j21l9N3J72j51M5J2mk21J73K9N2q8j50L39q1r0j20J36l31J84
4635h1L38k83k5j1nj7P9k0m4P1r9K28j5j52J19l6o5k0p3Q9j1mK9J56k75k5K3K37
$$ plain form
4461 -43 -49 37 78 -10 -11 -171 -132 -57 -23 -81 -80 81 -77 -11 -100 84 146 95 -78 110 -3 12 45 -35 22 -34 -27 -134
4489 -134 -47 116 216 57 116 -176 114 156 -42 75 -158 -8 51 170 -58 91 -5 -32 0 -45 38 77 26 -115
4513 -115 -58 110 -44 -26 149 39 -151 -72 76 165 -198 -133 -70 4 -193 77 177 -28 150 -5 -54 -145 -100
4536 -100 -7 -248 -12 -130 -114 78 65 214 -204 73 96 66 26 79 -170 -137 173 -43 118 88 52 -90 -36 -88
4560 -88 -26 68 13 -99 -8 -125 -100 30 -72 -6 -35 -43 129 -2 224 8 34 -71 -25 26 -3 147 25 5 -75
4585 -75 46 -56 -120 -204 -43 4 -181 -310 -95 42 132 28 -80 -69 -43 34 87 12 45 -90 128 27 7 15 -52
4610 -52 78 106 136 120 -1 -40 13 185 34 79 91 87 -134 39 68 120 32 -118 221 140 50 -70 66 -265 -81
4635 -81 257 -26 -51 -62 -67 -84 -5 -25 -69 2 -97 131 116 -36 83 47 -18 -38 -111 -22 -33 -37 -8 148 -127 -152 -129 108
4663A08k73P3P1J39k21O0J15k72J72R4J2J4o7N9Q6l15J08k49L19o2rJ32q8J9k3
4688Bl6K61k88J93k41K20j42L9j5K3m2l2J92q2j39R9L9p8q1K97l3j95M3M2j73
4713a27j81K89K23k36j15R5J75o7j65R7Q2l00K09K06l38K18j05J15Q3k06J53j26
4735b1J3j28J06J50j65q3L15k07P0oJ32j09p5R5j46j6NK3K55q7K7Qk1l08J82K14
4761B23k57R1J5l85L87n8k2j9R9n9j02P6p0J34J11j64q6K16j22o1p1P5L05j66
4785I0k34L47j62k33J41R0L2j97J57K17l24kJ98R6l11J5O8p0J26j14K67j24j10
4808c7j18K24j1j25l2J71q4k0P7J70k76l0J46l19K18q7J42oO9j20P4j17K0P5k9
4833b5p5N1L6j69L46j47J6J91j86o0J15pl00J25K30q5j67L33j01k47p1J69J91
$$ plain form
4663 108 -165 -92 -21 118 -103 -43 72 -200 -28 66 78 92 25 84 170 -145 -37 -286 33 -29 -38 94 6 25 2
4688 2 -34 227 -61 132 -109 111 -31 8 -7 16 -26 -58 134 52 -87 12 51 -27 -108 189 156 -39 4 46 -127
4713 -127 -308 -19 204 -32 -147 -52 123 56 -109 -12 70 -230 -21 185 -153 65 -40 75 158 -48 105 -21
4735 -21 -8 -136 -30 120 -45 -128 187 -20 50 44 176 67 -8 87 -59 -75 -70 -47 208 121 148 156 135 -173 9 223
4761 223 -34 57 72 -313 74 16 -6 -25 74 15 -87 -11 -81 53 164 0 -86 130 8 -53 -124 -49 256 90
4785 90 -144 203 41 -192 -51 39 71 -126 31 248 -76 -78 120 216 -95 -80 -12 -82 44 -70 197 73 -37
4808 -37 -155 69 58 -67 -99 72 -12 -32 45 215 -61 -91 55 -264 -46 -133 9 3 72 -48 26 -91 -71 4 -25
4833 -25 -100 -49 -13 -182 164 17 33 224 38 -22 93 86 -214 -89 141 56 -111 222 121 -126 -197 -28 163
4856A63j42p9J44p5o9n0J80n0l32K21J49oj63J86k24J52j77m4K14j5j9J62n6j96
4880a26K43J42j64j51j1J67k34n0J34Q9j82J04K19j27j20P4J63j6k84K27j00J04
4902A01o8n7K92l14j28L98j43j26RQ7L1k06K41m9j57N2R2R7p1k21L42j92j87q6
4926b63N11k25l4j34M05j63k85J53L6J3j47K22J09l83J95l4K57m47J85L7J12k67
4948a47J57J21n9k70J68L42l34j37J57J00j55Pj60N57n01J89P3o0k61J64J16k0
4970D7k59K51J51l96K84j9l6j80J7K69j21p9j22L38O5k55J38l4O6k55J77K50l74
4993g7p1J53P2j15q1J84J45j90k27M31k84n6n1M06m42K0J79J54j45n7M2J01j12
5016b1m0K03j97k67M87n6k6l13K32J43n6j04K51k42k81K06J92r0k05P6J56O1l77
$$ plain form
4856 163 21 -58 86 11 -58 -108 72 22 -310 -89 60 54 -109 77 -147 5 -172 -216 -2 -17 -36 126 70 -126
4880 -126 117 259 95 -56 -67 100 -134 -184 -50 39 -143 -39 180 53 -67 7 170 154 -130 97 -3 101
4902 101 33 -24 268 -46 -174 224 81 -45 -36 51 82 -124 117 68 -89 -37 55 152 81 -140 202 10 -177 -263
4926 -263 248 23 -11 -145 260 97 -188 -35 1 14 -133 89 198 -185 10 -24 233 -214 -29 8 120 -147
4948 -147 10 131 72 -198 -30 312 -22 -159 -2 98 -57 -50 -210 347 -154 35 108 48 -213 -49 67 47
4970 47 -212 39 190 -206 78 59 23 -157 -140 129 8 -71 -193 145 210 -45 93 59 125 -130 47 297 -77
4993 -77 -148 5 77 -38 -119 65 210 20 -207 224 -60 -116 -167 239 -203 -183 -4 150 5 -52 -10 91 -21
5016 -21 -61 142 -55 -322 165 109 83 -230 2 145 89 -15 236 -6 -287 -81 111 21 -184 -108 48 109 -268
5039b68K21K20k70K19j52R2j97J32J08p6j35r4L53j35j89K28K06l04o3K98L0l12
5061h8R6q9R1j57N1K94m8j47nJ57j64j35P9L05j09j46QK76l42rJ51p3M2j66J87
5086E9m7J8K2J07o6j71j12L37j52n7J51J58l00j41L35l6r0j22J04J88m42J60J28
5109C1j01J3m8J86q5j71m1M43k09k23K41N8k01l6M53l87N4r7K32J14l99L07L4
5132A68j66j01J14J23l02K35L6k2l5j60J57j61p0L90k35m0r9K60k6k42J59J98
5154A81p3k25j2K31j64P1R5j54K6j03kL30j84j3m6K92k84J44J00m4k58P9K8J6
5178C1k51P0L12k24J3k9j4Q6l8J13m9k59J87J66l5l13K03P6J46l39J23J63k71
5201a33o9L27N4r7j37K07j53J65j78P4J78l08j8K45p2k59J80J61p4k36K67ll41
$$ plain form
5039 -268 -47 173 -97 122 -30 62 -135 -3 105 29 -106 -200 153 18 -171 57 263 -41 -104 194 224 -88
5061 -88 8 -81 10 -147 -96 198 150 3 -2 155 -9 -144 -65 240 131 -15 -7 269 -73 -82 69 -4 38 -128 59
5086 59 12 30 52 159 93 -78 -190 147 -5 -62 89 247 -53 -194 141 105 15 -107 -3 185 -257 -97 31
5109 31 -70 -57 -105 81 -4 -175 -216 227 18 -205 36 94 -107 -143 310 -77 -23 -120 112 226 -173 134 168
5132 168 2 -99 15 138 -164 71 107 85 50 -110 47 -114 -184 206 -29 -69 -168 92 66 -176 -17 181
5154 181 108 -117 -129 102 -62 9 104 -50 -24 -127 -129 201 17 4 -42 250 -34 110 210 166 -92 -13 15 31
5178 31 -220 -150 162 -62 -49 -78 -92 -6 -44 69 20 -239 -52 114 79 -234 -31 45 191 -148 -25 138 -133
5201 -133 -202 125 179 82 -55 152 -1 164 -14 60 238 -70 -88 157 85 -174 6 167 93 -143 124 121 -220
5224b20N1M9R8j63k7L03j4j01j92L00J26l51J94P2j04J5p4L21m59J3J38J89j84
5247b0M4q2K1k68K50J95j09j91K45Q1l10K7K05m4m1j25L53k26k76K47J71K02o13
5270b64K77MN1r5O0J35k88j26K68O5k70J48K23j00j83N1J49Nk76J98J81j75j02
5293f4J43O8l09J32n2L7L6l6R5k6j75J67J22r7k81J29J53q6K3k0J49m6k33K02
5317C1N8k79O6lJ16j68K24M4l8m5j00L15m08J59J10m8P5J9j6n7o9q0J28r3m4J94
5343I1M7o1k52J24K37k08K1Qp2J18j54L74j32k36Q7P9j18j63J51J43Nk69K84M4
$$ plain form
5224 -220 -169 -120 -22 -185 -212 91 77 -24 -216 84 210 -141 53 125 21 36 -38 283 -176 -163 -25 164 -20
5247 -20 24 -58 -37 -305 -55 140 31 -160 85 166 -144 -117 88 44 3 -122 231 5 -271 -24 147 349 -264
5270 -264 13 17 68 -27 33 168 -120 -246 22 87 -183 -35 188 88 -95 -44 105 110 -166 32 213 38 -64
5293 -64 79 147 -162 -30 -82 -45 -9 -45 50 24 -151 16 138 41 -240 -111 42 -44 -21 -41 108 62 -171 31
5317 31 89 -190 -124 -127 -11 -179 45 89 51 6 -94 221 -187 -28 82 34 109 128 112 55 -14 -94 34 -59 -103 91
5343 91 138 77 -175 -51 186 -22 -1 7 -65 53 -101 273 141 -95 -8 71 -47 -210 -59 84 89 -180 104 148
$$ [...]
8191b7
##END NTUPLES=NMR FID
##END=
