##TITLE=1H_IAMT-17Oc
 D2O
 8 sc, 
 1.11.2024
##JCAMPDX= 6.0         $$ Bruker NMR JCAMP-DX V2.0
##DATA TYPE= NMR FID
##DATA CLASS= NTUPLES
##ORIGIN= UXNMR, Bruker Analytische Messtechnik GmbH
##OWNER= root
$$ XWIN-NMR		Version 3.5
$$ Fri Nov  1 14:38:09 2024 Russian Standard Time (UT+4h)  she@DPX200
##.OBSERVE FREQUENCY= 200.1318
##.OBSERVE NUCLEUS= ^1H
##.DELAY= (6, 6)
##.ACQUISITION MODE= SIMULTANEOUS
##.ACQUISITION SCHEME= undefined
##.AVERAGES= 8
##.DIGITISER RES= 18
##SPECTROMETER/DATA SYSTEM= spect
##.PULSE SEQUENCE= zg30
##.SOLVENT NAME= D2O
##.SHIFT REFERENCE= (INTERNAL, D2O, 0, 15.7039)
##AUDIT TRAIL= $$ (NUMBER, WHEN, WHO, WHERE, WHAT)
$$ ##TITLE= Audit trail, XWIN-NMR		Version 3.5
$$ ##JCAMPDX= 5.01
$$ ##ORIGIN= Bruker BioSpin GmbH
$$ ##OWNER= she
$$ F:/spectra/data/she/nmr/H-F/1/audita.txt
$$ ##AUDIT TRAIL=  $$ (NUMBER, WHEN, WHO, WHERE, WHAT)
(   1,<2024-11-01 14:36:51.32 +0400>,<she>,<DPX200>,
      <created by zg, POWCHK disabled, PULCHK disabled
       configuration hash MD5:
       00 E9 B6 7A A2 85 ED C7 34 08 36 98 17 FE 4E 26
       data hash MD5: 16K
       E8 E6 42 1E 12 28 59 55 46 7C 86 31 2A E5 03 DF>)
$$ ##END=
$$ 
$$ hash MD5
$$ F4 9B 86 90 3B CB 56 50 7C C3 27 5D 7D FE D7 92
##$RELAX= 
##$RELAX= 
##$RELAX= 
##$RELAX= 
##$RELAX= 
##$RELAX= 
$$ Bruker specific parameters
$$ --------------------------
##$DU= <F:/spectra>
##$EXPNO= 1
##$NAME= <H-F>
##$PROCNO= 1
##$TYPE= <nmr>
##$USER= <she>
##$AMP= (0..31)
100 100 100 100 100 100 100 100 100 100 100 100 100 100 100 100 100 100 
100 100 100 100 100 100 100 100 100 100 100 100 100 100 
##$AQSEQ= 0
##$AQ_mod= 1
##$AUNM= <au_zg>
##$AUTOPOS= <>
##$BF1= 200.13
##$BF2= 200.13
##$BF3= 200.13
##$BF4= 200.13
##$BF5= 200.13
##$BF6= 200.13
##$BF7= 200.13
##$BF8= 200.13
##$BYTORDA= 1
##$CFDGTYP= 0
##$CFRGTYP= 5
##$CHEMSTR= <none>
##$CNST= (0..31)
1 1 145 1 1 1 1 1 1 1 1 1 1 1 1 1 1 1 1 1 1 1 1 1 1 1 1 1 1 1 1 1 
##$CPDPRG= <>
##$CPDPRG1= <>
##$CPDPRG2= <>
##$CPDPRG3= <>
##$CPDPRG4= <mlev>
##$CPDPRG5= <mlev>
##$CPDPRG6= <mlev>
##$CPDPRG7= <mlev>
##$CPDPRG8= <mlev>
##$CPDPRGB= <>
##$CPDPRGT= <>
##$D= (0..31)
0 1.2 0 0 0 0 0 0 0 0.06 0 0.03 0 0 0 0 0.0002 0 0 0 0 0 0 0 0 0 0 0 0 
0 0 0 
##$DATE= 1730457410
##$DBL= (0..7)
120 120 120 120 120 120 120 120 
##$DBP= (0..7)
150 150 150 150 150 150 150 150 
##$DBP07= 0
##$DBPNAM0= <>
##$DBPNAM1= <>
##$DBPNAM2= <>
##$DBPNAM3= <>
##$DBPNAM4= <>
##$DBPNAM5= <>
##$DBPNAM6= <>
##$DBPNAM7= <>
##$DBPOAL= (0..7)
0.5 0.5 0.5 0.5 0.5 0.5 0.5 0.5 
##$DBPOFFS= (0..7)
0 0 0 0 0 0 0 0 
##$DE= 6
##$DECBNUC= <off>
##$DECIM= 24
##$DECNUC= <off>
##$DECSTAT= 4
##$DIGMOD= 1
##$DIGTYP= 9
##$DL= (0..7)
0 120 120 120 120 120 120 120 
##$DP= (0..7)
150 150 150 150 150 150 150 150 
##$DP07= 0
##$DPNAME0= <>
##$DPNAME1= <>
##$DPNAME2= <>
##$DPNAME3= <>
##$DPNAME4= <>
##$DPNAME5= <>
##$DPNAME6= <>
##$DPNAME7= <>
##$DPOAL= (0..7)
0.5 0.5 0.5 0.5 0.5 0.5 0.5 0.5 
##$DPOFFS= (0..7)
0 0 0 0 0 0 0 0 
##$DQDMODE= 0
##$DR= 18
##$DS= 0
##$DSLIST= <SSSSSSSSSSSSSSS>
##$DSPFIRM= 0
$$ [...]
##$SUBNAM2= <"">
##$SUBNAM3= <"">
##$SUBNAM4= <"">
##$SUBNAM5= <"">
##$SUBNAM6= <"">
##$SUBNAM7= <"">
##$SUBNAM8= <"">
##$SUBNAM9= <"">
##$SW= 24.0689170037331
##$SWIBOX= (0..15)
0 0 2 0 0 0 0 0 0 0 0 0 0 0 0 0 
##$SW_h= 4816.95568400771
##$TD= 16384
##$TD0= 1
##$TE= 0
##$TE2= 300
##$TE3= 300
##$TEG= 300
##$TL= (0..7)
0 120 120 120 120 120 120 120 
##$TP= (0..7)
150 150 150 150 150 150 150 150 
##$TP07= 0
##$TPNAME0= <>
##$TPNAME1= <>
##$TPNAME2= <>
##$TPNAME3= <>
##$TPNAME4= <>
##$TPNAME5= <>
##$TPNAME6= <>
##$TPNAME7= <>
##$TPOAL= (0..7)
0.5 0.5 0.5 0.5 0.5 0.5 0.5 0.5 
##$TPOFFS= (0..7)
0 0 0 0 0 0 0 0 
##$TUNHIN= 0
##$TUNHOUT= 0
##$TUNXOUT= 0
##$USERA1= <user>
##$USERA2= <user>
##$USERA3= <user>
##$USERA4= <user>
##$USERA5= <user>
##$V9= 5
##$VALIST= <valist>
##$VCLIST= <CCCCCCCCCCCCCCC>
##$VD= 0
##$VDLIST= <DDDDDDDDDDDDDDD>
##$VPLIST= <PPPPPPPPPPPPPPP>
##$VTLIST= <TTTTTTTTTTTTTTT>
##$WBST= 1024
##$WBSW= 4
##$XGAIN= (0..3)
0 0 0 0 
##$XL= 0
##$YL= 0
##$YMAX_a= 503292
##$YMIN_a= -415921
##$ZGOPTNS= <>
##$ZL1= 120
##$ZL2= 120
##$ZL3= 120
##$ZL4= 120
##$ABSF1= 10
##$ABSF2= 0
##$ABSG= 5
##$ABSL= 3
##$ALPHA= 0
##$AQORDER= 0
##$ASSFAC= 0
##$ASSFACI= 0
##$ASSFACX= 0
##$ASSWID= 0
##$AUNMP= <proc_1d>
##$AZFE= 0.1
##$AZFW= 0.1
##$BCFW= 1
##$BC_mod= 2
##$BYTORDP= 1
##$COROFFS= 0
##$CY= 11.3945322036743
##$DATMOD= 1
##$DC= 2
##$DFILT= <>
##$DTYPP= 0
##$F1P= 15.6554695791079
##$F2P= 12.8336369535428
##$FCOR= 0.5
##$FTSIZE= 0
##$FT_mod= 4
##$GAMMA= 1
##$GB= 0.15
##$INTBC= 1
##$INTSCL= 1
##$ISEN= 128
##$LB= 0.24
##$LEV0= 0
##$LPBIN= 0
##$MAXI= 10000
##$MC2= 0
##$MEAN= 0
##$ME_mod= 0
##$MI= 1.114404
##$NCOEF= 0
##$NC_proc= 0
##$NLEV= 6
##$NOISF1= 3.799351
##$NOISF2= 2.8
##$NSP= 1
##$NTH_PI= 0
##$NZP= 0
##$OFFSET= 15.70392
##$PC= 1
##$PHC0= -26352.68
##$PHC1= 14.18743
##$PH_mod= 1
##$PKNL= yes
##$PPARMOD= 0
##$PSCAL= 0
##$PSIGN= 0
##$REVERSE= no
##$SF= 200.130013532006
##$SI= 16384
##$SIGF1= 3
##$SIGF2= 2
##$SINO= 400
##$SIOLD= 16384
##$SREGLST= <1H.CDCl3>
##$SSB= 0
##$STSI= 0
##$STSR= 0
##$SW_p= 3612.71676300578
##$SYMM= 0
##$S_DEV= 0
##$TDeff= 0
##$TDoff= 0
##$TI= <>
##$TILT= no
##$TM1= 0
##$TM2= 0
##$TOPLEV= 0
##$USERP1= <user>
##$USERP2= <user>
##$USERP3= <user>
##$USERP4= <user>
##$USERP5= <user>
##$WDW= 1
##$XDIM= 8192
##$YMAX_p= 0
##$YMIN_p= 0
$$ End of Bruker specific parameters
$$ ---------------------------------
##NTUPLES= NMR FID
##VAR_NAME=  TIME,          FID/REAL,        FID/IMAG
##SYMBOL=    X,             R,               I
##VAR_TYPE=  INDEPENDENT,   DEPENDENT,       DEPENDENT
##VAR_FORM=  AFFN,          ASDF,            ASDF
##VAR_DIM=   8192,          8192,            8192
##UNITS=     SECONDS,       ARBITRARY UNITS, ARBITRARY UNITS
##FACTOR=    0.0002076,     1,               1
##FIRST=     0,             0,               0
##LAST=      1.7004516,     0,               0
##MIN=       0,             -415921,         0
##MAX=       1.7004516,     503292,          0
$$ Real data points
##PAGE= N=1
##DATA TABLE= (X++(R..R)), XYDATA
$$ plain form
0 0 0 0 0 0 0 7 0 8 -8 8 -16 18 -21 28 -34 40 -50 62 -70 82 -101 113 -134 158 -178 203 -233 266 -302 344
30 344 -385 432 -488 547 -608 681 -759 840 -935 1038 -1145 1272 -1407 1557 -1726 1912
46 1912 -2120 2360 -2633 2944 -3310 3744 -4268 4916 -5745 6838 -8367 10665 -14531 22644
60 22644 -76240 281762 436085 107994 -109500 -317841 -38249 432691 330513 -126079
70 -126079 -333723 -348801 -39417 349227 211198 -244923 -325797 -56819 277181 418753
80 418753 141792 -293510 -302302 37396 249082 179648 -107222 -399780 -274341 174953 369042
91 369042 165692 -142157 -279797 -48729 316723 317999 -34776 -323883 -299351 981 263912
102 263912 189610 -130947 -316481 -121725 242234 352604 129134 -189574 -297896 -35053
$$ packed form
0@%%%%%PpQj6J6k4L4l9M9o2P4r0J12j32J52j83K14k47K92l36L81m36M99n68O46
30C44p29Q17r20J035j155J289j440J599j775J973k183K417k679K964l283L638
46A912m032M480m993N577o254P054q012R184j0661J2583j5205J9032k5196L7175
60B2644r8884L58002J54323l28091k17494k08341K79592M70940j02178m56592
70a26079k07644j5078L09384L88644j38029m56121q0874K68978L34000J41572
80D18753k76961m35302q792L39698K11686o9434k86870k92558J25439M49294J94089
91C69042k03350l07849j37640K31068L65452J276l52775k89107K4532L00332K62931
102B63912p4302l20557j85534J94756L63959J10370k23470l18708j08322K62843
$$ plain form
112 -35053 266453 190008 -104059 -296649 -252392 77710 342926 172458 -142279 -224680 -70356
123 -70356 217803 318987 16758 -296941 -255897 -4632 211975 196077 -92012 -294160
133 -294160 -125343 184159 297214 138432 -154526 -274354 -46885 229286 198204 -56837
143 -56837 -262334 -230930 56712 283986 163418 -109069 -220415 -90517 179206 280356
153 280356 45351 -228779 -242071 -26879 205082 191639 -71997 -248624 -139489 119992
163 119992 272520 140483 -139237 -234812 -61202 173159 213498 -7272 -240475 -210795
173 -210795 33298 228797 174840 -72995 -224108 -100918 145399 240682 77252 -175193
183 -175193 -236509 -41602 183238 183958 -32241 -214029 -158701 78195 242334 141842 -107007
$$ packed form
112c5053L01506p6445k94067j92590M4257L30102K65216j70468l14737q2401J54324
123g0356K88159J01184l02229l13699M1044K51265K16607j5898k88089k02148
133b94160J68817L09502J13055j58782k92958j19828K27469K76171l1082k55041
143e6837k05497L1404K87642K27274j20568k72487j11346J29898K69723J01150
153B80356k35005k74130j3292K15192K31961j3443k63636j76627J09135K59481
163A19992J52528j32037k79720r5575J73610K34361M0339k20770k33203K9680
173b10795K44093J95499n3957k47835j51113J23190K46317R5283j63430k52445
183a75193o1316J94907K24840P20k16199j81788N5328K36896J64139j00492k48849
$$ plain form
194 -107007 -215077 -81886 139265 209770 26864 -199582 -198605 7002 194085 173887 -45209
205 -45209 -207203 -115207 105923 212403 94535 -135903 -218797 -54395 156716 181225 -774
216 -774 -186908 -161267 50193 209445 141205 -78652 -200733 -93952 112074 192358 51785
227 51785 -160386 -192713 -12258 169786 167352 -17875 -184513 -127975 79342 190894 97349
238 97349 -102705 -197254 -70375 130880 171762 19045 -154432 -158989 20189 183884 142604
249 142604 -55265 -181669 -101517 87381 178252 66376 -130060 -179329 -28152 142041
259 142041 157573 3324 -161942 -134981 54512 172840 102913 -75427 -181043 -79718
269 -79718 113503 162526 30925 -129631 -154231 -1801 161170 138300 -35205 -161722 -109895
$$ packed form
194a07007j08070J33191K21151P0505j82906k26446R77K05607J87083k0198k19096
205d5209j61994R1996K21130J06480j17868k30438q2894J64402K11111K4509j81999
216g74j86134K5641K11460J59252o8240k19857j22081J06781K06026Q0284j40573
227E1785k12171l2327J80455J82044k434j85227j66638N6538K07317J11552r3545
238I7349k00054r4549J26879K01255M0882j52717j73477m557J79178J63695m1280
249A42604j97869j26404Q0152J88898R0871j11876j96436m9269J51177J70193
259A42041J5532j54249j65266K6961J89493J18328o9927j78340j05616J01325
269g9718J93221M9023j31601j60556k4600J52430J62971k2870j73505j26517N1827
$$ plain form
280 -109895 65507 169075 77165 -105379 -167008 -42766 123138 151962 14967 -141317
290 -141317 -134550 30301 155317 107120 -55326 -163507 -88272 91716 157313 43879 -110805
301 -110805 -147091 -17903 139889 135467 -19417 -145037 -112132 45785 155969 86347 -83387
312 -83387 -157461 -55152 106068 147037 26000 -123659 -133467 11647 141040 108857 -38508
323 -38508 -146052 -95320 70081 152166 54934 -95327 -139187 -31872 120256 135719 -7154
334 -7154 -131567 -108707 28192 139588 94117 -64249 -147923 -63855 87055 141475 39584
345 39584 -109104 -133924 -2212 128258 109890 -24874 -130974 -97668 50267 142049 65290
356 65290 -77914 -131191 -45527 98928 135720 9274 -120606 -108715 15740 125032 98329
$$ packed form
280a09895J75402J03568r1910j82544o1629J24242J65904K8824j36995j56284
290a41317O767J64851J25016m8197j62446j08181P5235J79988O5597j13434j54684
301a10805l6286J29188J57792m422j54884j25620L2905J57917J10184o9622j69734
312h3387p4074J02309J61220M0969j21037j49659r808J45114J29393l2183j47365
323c8508j07544N0732J65401Q2085r7232j50261m3860J07315J52128J5463j42873
334g154j24413K2860J36899J11396m5471j58366q3674Q4068J50910N4420j01891
345C9584j48688k4820J31712J30470j8368j34764j06100L3306J47935R1782p6759
356F5290j43204n3277Q5664J44455L6792j26446j29880J1891J24455J09292k6703
$$ plain form
367 98329 -46586 -136527 -68668 69146 129931 50216 -89972 -130769 -18663 113132 113067 -10381
379 -10381 -119963 -99227 35759 132101 72775 -64816 -124547 -51840 80061 128345 24967
390 24967 -105910 -110528 2971 112768 101363 -29532 -127158 -76144 55276 122772 56593
401 56593 -75440 -123909 -30491 96258 113446 3770 -109411 -99252 22073 119609 81205
412 81205 -49573 -121581 -57107 68416 119123 36229 -90075 -113058 -7605 103888 99627
423 99627 -15302 -114571 -83894 42181 118695 60026 -63964 -115493 -40231 80867 113132
434 113132 14852 -98843 -97836 9078 106893 88433 -34953 -118636 -62920 57933 111249
445 111249 45311 -75602 -112528 -17027 92940 96545 -1960 -100404 -88874 27923 111797
$$ packed form
367I8329j44915q9941O7859J37814O0785p9715j40188m0797J12106J31795o5j23448
379a0381j09582K0736J34986R6342n9326j37591n9731P2707J31901M8284j03378
390B4967j30877m618J13499J09797j1405j30895r7626N1014J31420O7496o6179
401E6593j32033m8469R3418J26749J7188j09676j13181J0159J21325R7536l8404
412H1205j30778p2008O4474J25523N0707q2894j26304k2983J05453J11493m261
423I9627j14929r9269L0677J26075P6514n8669j23990n1529P5262J21098L2265
434A13132r8280j13695J007J06914R7815j8460j23386q3683N5716J20853N3316
445A11249o5938j20913l6926R5501J09967L605r8505r8444J1530J16797Q3874
$$ plain form
456 111797 65503 -50712 -109846 -48960 69015 110440 23712 -87085 -96448 -1155 95613
467 95613 88732 -20555 -107926 -70057 43481 106182 52819 -61749 -109146 -29885 82333
478 82333 98797 7373 -90976 -88713 14444 101745 72349 -38595 -104615 -54342 55354 104054
490 104054 35905 -74954 -99001 -9600 87140 87277 -7947 -97951 -77373 33407 101635 54646
502 54646 -48954 -101693 -40822 70948 99888 15160 -80675 -86586 587 92047 78491 -28245
514 -28245 -98939 -57607 42575 97618 45086 -63486 -96787 -16476 76306 84626 3088 -87248
526 -87248 -79805 22611 93933 57249 -37811 -94969 -47745 59452 97186 22407 -70936 -85123
538 -85123 -7530 82838 79229 -17555 -91328 -62455 32419 91993 49989 -50770 -93538 -27291
$$ packed form
456A11797m6294j16215n9134O0886J17975M1425q6728j10797r363R5293R6768
467I5613o881j09287q7371L7869J13538O2701n3363j14568m7397P9261J12218
478H2333J6464r1424r8349K263J03157Q7301k9396j10944o6020N0273J09696M8700
490A04054o8149j10859k4047Q9401R6740J37r5224r0004K0578J10780O8228m6989
502E4646j03600n2739O0871J11770K8940q4728r5835n911Q7173R1460j3556j06736
514b8245p0694M1332J00182N5043n2532j08572l3301Q0311R2782Q320q1538r0336
526h7248P443J02416P1322l6684r5060n7158M7224J07197L7734p4779r3343j4187
538h5123P7593R0368l609r6784p3773K8873R4874N9574m2004j00759m2768O6247
$$ plain form
550 -27291 67604 85606 10807 -77083 -79967 9923 86963 63025 -29243 -88867 -51487 46147
562 46147 93198 32671 -62183 -84727 -14293 72436 79116 -5778 -84269 -66698 24206 86060
574 86060 52894 -39653 -89075 -36015 59082 85387 16824 -68426 -79223 -466 80300 66976
586 66976 -22064 -82824 -54176 35519 88486 40054 -53191 -83517 -21044 64084 79470 3230
598 3230 -77319 -69484 15173 80505 55997 -30502 -82971 -41413 47679 82983 25046 -59418
610 -59418 -77910 -9426 70892 69929 -11642 -78409 -57309 26589 81654 44930 -42263 -80281
622 -80281 -27645 54865 76943 12346 -67218 -71334 4565 74821 60030 -22656 -78333 -45557
634 -45557 38180 79832 31309 -51439 -74804 -15784 60085 70546 -988 -72170 -60339 17833
$$ packed form
550b7291R4895J8002p4799q7890k884Q9890P7040k3938r2268n9624L7380R7634
562D6147M7051o0527r4854k2544P0434Q6729O680q4894p8491J7571R0904O1854
574H6060l3166r2547m9422N3060R5097K6305o8563q5250j0797P8757Q0766j3324
586F6976q9040o0760K8648Q9695N2967m8432r3245l0326O2473Q5128J5386p6240
598C230q0549P835Q4657O5332k4508q6499n2469M1558Q9092L5304n7937q4464
610e9418j8492O8484Q0318r63q1571o6767K1100Q3898N5065l6724q7193l8018
622h0281N2636Q2510K2078o4597p9564m116P5899P0256j4791q2686n5677L2776
634d5557Q3737M1652m8523q2748k3365N9020P5869J0461p1534p1182J1831P8172
$$ plain form
646 17833 75633 49642 -33398 -78153 -33035 47803 73718 18756 -57966 -70530 -3731 66852
658 66852 61909 -13029 -72487 -50483 28782 76446 37401 -43905 -73559 -21153 52779 68532
670 68532 7545 -64271 -61581 9783 68313 52504 -22438 -73940 -39441 39692 71472 24186
682 24186 -49666 -68926 -10418 60318 61932 -5347 -65480 -52411 19807 71332 42321 -35366
694 -35366 -71881 -26904 45812 67187 13653 -56823 -62422 3249 62913 53815 -13985 -68156
706 -68156 -44247 31382 69083 29202 -42261 -67559 -17199 52946 61765 1404 -58473 -53189
718 -53189 11986 64749 45536 -26021 -68178 -32479 38364 65473 19513 -49810 -62843 -3487
730 -3487 57559 53607 -7499 -61056 -46797 22449 65565 33484 -34209 -65109 -23817 45987
$$ packed form
646A7833N7800k5991q3040m4755M5118Q0838K5915n4962p6722j2564O6799P0583
658F6852m943p4938n9458K2004P9265M7664l9045q1306k9654N2406P3932J5753
670F8532o0987p1816K690P1364N8530j5809p4942n1502L4499P9133L1780m7286
682B4186p3852j9260N8508P0736J614o7279o0133J3069P2218N1525k9011p7687
694c5366l6515M4977P2716K1375n3534p0476n599O5671N9664r098o7800n4171
706f8156K3909P5629L7701l9881p1463k5298N0360P0145Q819o0361n9877N284
718e3189O5175N2763j9213p1557m2157L5699P0843K7109m5960o9323j3033N9356
730c487O1046l952o1106n3557J4259O9246M3116l2081o7693l0900M1292O9804
$$ plain form
742 45987 62467 7185 -53759 -54034 5769 59934 47194 -18960 -63479 -36119 30576 62614
754 62614 24982 -42122 -62180 -10615 52181 55246 -1272 -56495 -49463 15663 61889 36506
766 36506 -27407 -61346 -28065 38412 60778 13316 -46926 -54064 -1555 54548 49383 -12878
778 -12878 -59074 -39024 23465 60164 28764 -35519 -59524 -16346 45057 55539 4929 -50886
790 -50886 -49502 8313 56437 40230 -20618 -58302 -31863 30791 58882 19363 -40920 -54026
802 -54026 -7248 48450 50102 -5464 -53908 -41904 16602 55774 32233 -28012 -57183 -21764
814 -21764 38251 55007 10143 -45093 -49887 1125 51810 43125 -14958 -54678 -34272 23692
826 23692 55956 24416 -34889 -52867 -12024 42091 50518 1532 -49652 -44035 10603 52083
$$ packed form
742D5987J6480n5282o0944k75N9803N4165j2740o6154m4519K7360O6695L2038
754F2614l7632o7104k0058N1565O2796L065n6518n5223P032O5126M6226k5383
766C6506o3913l3939L3281O6477K2366m7462o0242p138N2509N6103n165o2261
778a2878m6196K0050O2489L6699l1400o4283k4005M3178O1403J0482n0610n5815
790e0886J384N7815M8124j6207o0848l7684K6439O2654K8091l9519o0283j3106
802e4026M6778N5698J652n5566m8444J2004N8506L9172k3541o0245k9171L5419
814b1764O0015J6756m4864n5236m794N1012N0685q685n8083l9720K0406N7964
826B3692L2264l1540n9305j7978M0843N4115Q427m8986n1184N617N4638M1480
$$ plain form
838 52083 35489 -21416 -54609 -25776 32387 53752 15027 -39547 -49175 -4261 46103 44694
850 44694 -8476 -51094 -36636 17282 52726 28814 -28439 -52231 -16466 36833 49290 7190
862 7190 -44093 -45064 4607 47840 37374 -15519 -50866 -29435 25287 52113 20002 -34393 -48620
875 -48620 -8847 40428 45326 -1863 -48005 -38640 12342 48212 31577 -21703 -50689 -20770
887 -20770 31878 48069 11992 -38078 -45854 -1603 44103 39227 -10007 -47741 -32295 19315
899 19315 49668 23971 -28660 -47449 -12681 35405 44267 4187 -42309 -40641 7051 45125
911 45125 33293 -15393 -48406 -25519 27306 47285 14866 -32683 -44887 -6562 39188 39708
923 39708 -4529 -43273 -33980 12824 46248 27837 -22803 -46800 -16731 30644 43487 8717
$$ packed form
838E2083j6594n6905l3193K8833N8163K1365l8725n4574r628M4914N0364j409
850D4694n3170m2618J4458N3918L5444k3912n7253k3792L5765N3299J2457m2100
862G190n1283r71M9671M3233j0466n2893l5347K1431N4722K6826l2111n4395j4227
875d8620L9773M9275M898m7189m6142R365N0982L5870j6635n3280k8986K9919
887b0770N2648J6191l6077n0070p776M4251M5706m876m9234l7734J5446N1610
899A9315L0353k5697n2631j8789L4768M8086Q862m0080m6496J668M7692L8074
911D5125j1832m8686l3013K2887N2825J9979l2419m7549j2204L8325M5750N20
923C9708m4237l8744R293M6804L3424j8411n0640k3997L0069M7375J2843l4770
$$ plain form
935 8717 -37598 -41283 2365 41397 33663 -9986 -43985 -28913 20946 46089 18655 -27683 -43775
948 -43775 -11248 34998 41168 -405 -39723 -35050 7946 42705 30062 -17124 -44136 -20836
960 -20836 25431 42922 12705 -32203 -41733 -2973 37620 34851 -5715 -39999 -30317 15237 43631
973 43631 22195 -22522 -42031 -15318 30141 40809 4371 -35806 -35970 3368 39195 31076 -12195
986 -12195 -40723 -23800 19949 41390 16423 -27169 -40398 -8089 33512 35913 -1720 -36887
998 -36887 -31148 9649 40468 25274 -17946 -39847 -18002 24337 39833 9266 -31459 -36479
1010 -36479 -1315 35209 32474 -7135 -38150 -25993 15354 39298 18979 -22293 -38829 -12003
1022 -12003 28501 36495 2998 -33212 -32152 4922 37365 27104 -13552 -37957 -20323 19458
$$ packed form
935H717m6315l685M3648L9032p734m3649l3999J5072M9859K5143k7434m6338j6092
948d3775L2527M6246O170m1573l9318M673M2996L4759j2643m7186k7012K3300
960b0836M6267J7491l0217m4908r530L8760M0593k769m0566l4284R682M5554K8394
973D3631k1436m4717j9509K6713M5459J0668l6438m0177j64L9338L5827q119m3271
986a2195k8528J6923M3749K1441k4967m3592j3229L2309M1601K401l7633l5167
998c6887N739M0797L0819j5194m3220k1901K1845M2339J5496l0567m0725n020
1010c6479L5164L6524k735l9609l1015J2157M1347K3944k0319m1272j6536K6826
1022a2003M0504P994l3497l6210J060L7074L2443j0261m0656k4405J7634L9781
$$ plain form
1034 19458 38364 13171 -27437 -36120 -5029 31237 33529 -2490 -35489 -27859 10816 37226
1046 37226 21845 -18223 -37605 -14969 24061 35585 6900 -29563 -32281 751 33625 29103
1058 29103 -8503 -35574 -22250 15306 36247 16216 -23148 -35915 -8336 27567 32824 1424
1070 1424 -31599 -28521 7050 34298 23626 -13513 -35582 -17632 19684 34859 10179 -26163
1082 -26163 -32294 -2608 29816 29698 -4120 -33211 -23646 11739 33403 18363 -18117 -34734 -11840
1095 -11840 23798 31774 4635 -28011 -29324 2603 31968 25208 -9712 -33236 -19500 15585
1107 15585 33299 13001 -22265 -32329 -5785 26377 29537 -32 -30251 -25681 7784 31481
1119 31481 20296 -13959 -33297 -14822 20658 31585 7189 -24383 -29491 -1042 28824 25759
$$ packed form
1034A9458J8906k5193m0608q683L1091L6266K292l6019l2999P630L8675K6410
1046C7226j5381m0068j9382K2636L9030J1524k8685l6463k718L3032L2874m522
1058B9103l7606k7071J3324L7556K0941k0031l9364j2767K7579L5903N257l1400
1070A424l3023L078L5571K7248j0672l7139k2069J7950L7316J5175k4680l6342
1082b6163o131K9686L2424j18l3818k9091R565L5385K1664j5040l6480j6617K2894
1095a1840L5638P976k7139l2646j313L1927K9365o760l4920k3524J3736L5085
1107A5585J7714k0298l5266j0064K6544L2162L160k9569l0219M570L3465K3697
1119C1481j1185l4255j9338J8475L5480J0927k4396l1572n108K8449K9866l065
$$ plain form
1131 25759 -6164 -30696 -21282 11826 31591 15863 -18789 -31779 -8657 23024 29257 3270
1143 3270 -26944 -26069 4961 29444 21384 -10074 -31154 -17311 16730 30791 9801 -20893 -29183
1156 -29183 -4221 26199 26621 -3122 -28258 -22151 8360 29869 17324 -15158 -30629 -11476
1168 -11476 19707 28944 6085 -23598 -26396 932 27334 22734 -6859 -28888 -19016 12760 29760
1181 29760 12726 -17850 -28294 -7432 22741 26863 880 -25721 -23071 5050 27836 19079
1193 19079 -11161 -29337 -14412 16805 28438 8624 -20738 -27063 -2220 24955 23680 -3798
1205 -3798 -26456 -19879 8793 28261 14890 -15155 -27258 -9942 19346 27440 3938 -23439
1217 -23439 -23921 2431 25533 20026 -8203 -27318 -15566 13485 26882 10885 -17401 -26384 -5067
$$ packed form
1131B5759l1923k4532R414L3108J9765j5728l4652j2990K3122L1681O233k5987
1143C270l0214Q75L1030K4483q060l1458k1080J3843L4041J4061k0990l0694q290
1156b9183K4962L0420M22k9743k5136O107L0511K1509j2545l2482j5471J9153
1168a1476L1183R237k2859k9683k798K7328K6402m600k9593k2029R872L1776J7000
1181B9760j7034l0576j0444K0862L0173M122k5983k6601K650K8121K2786q757
1193A9079l0240j8176J4925L1217J1633j9814k9362o325K4843K7175j275k7478
1205c798k2658O577K8672J9468j3371l0045j2103J7316K9288Q094k3502k7377
1217b3439m82K6352K3102n507k8229j9115J1752K9051J3397j5997k8286q983K1317
$$ plain form
1230 -5067 21973 24089 -651 -24044 -21110 5818 26492 16455 -11491 -25989 -12150 15671
1242 15671 26214 7040 -20070 -24054 -987 22676 21209 -4647 -25489 -17432 9746 25690
1254 25690 12786 -14571 -25370 -7915 18720 24301 2205 -21984 -21607 2939 24144 17961 -8554
1267 -8554 -25242 -13681 13020 25003 9309 -17084 -23707 -3513 20675 21453 -1824 -23245 -18477
1280 -18477 6981 24347 13923 -12020 -24379 -9517 16003 23863 4870 -19405 -21843 192
1292 192 21872 19220 -5427 -24326 -15219 10742 24022 11034 -14520 -23510 -6016 18074 21586
1305 21586 1205 -20870 -19312 3907 22979 15913 -9162 -23423 -11285 13613 23448 6858
1317 6858 -17270 -21752 -1994 19573 19608 -2343 -22378 -16569 7722 22804 12663 -11839 -23222
$$ packed form
1230e067K7040K116k4740k3393K934K6928K0674j0037k7946j4498J3839K7821
1242A5671J0543j9174k7110l984K3067K3663j467k5856k0842Q057K7178J5944
1254B5690j2904k7357j0799J7455K6635N581k2096k4189L77K4546K1205o183k6515
1267h554j6688J1561K6701J1983j5694k6393o623K0194K4188P78k3277k1421M768
1280a8477K5458J7366j0424k5943j2359J4862K5520P860j8993k4275k438K2035
1292A92K1680k652k4647j8899R107K5961J3280j2988k5554q990J7494K4090L512
1305B1586k0381k2075J558K3219J9072p066k5075j4261J2138K4898R835j6590
1317F858k4128m482J9758K1567L5k1951k0035N809K4291J5082j0141k4502j1383
$$ plain form
1330 -23222 -8274 16407 22002 3072 -18411 -20188 1161 21229 17031 -6142 -22289 -13324 10422
1343 10422 22756 9139 -14825 -21706 -4355 17795 20008 8 -20177 -17452 4968 21543
1355 21543 13976 -8882 -22252 -10146 13223 21573 5745 -16330 -20086 -1412 18953 17639 -3483
1368 -3483 -20314 -14712 7822 21224 11116 -11887 -21376 -6672 15285 19574 2029 -17665 -18346
1381 -18346 2222 19924 14960 -6374 -20467 -11540 10490 21074 7403 -14103 -19667 -3662
1393 -3662 16676 18259 -964 -18959 -15118 5481 19849 12652 -8947 -20601 -8450 13149 19632
1406 19632 3966 -15888 -18389 234 18070 15414 -4242 -18994 -12671 8232 19954 9014
1418 9014 -11729 -19115 -5481 14582 18162 877 -17395 -15687 3347 18485 13057 -7252 -19443
$$ packed form
1330b3222J4948K4681N595j8930k1483j777K1349K0068m198k3173j6147Q965K3746
1343A0422J2334j3617k3964o881J7351K2150K213k0000k0185K725K2420J6575
1355B1543p567k2858j3370J2106K3369Q350j5828k2075l756J8674K0365j314k1122
1368c483j6831N602K2534J3402j0108k3003r489J4704K1957M289j7545j9694o81
1381a8346K0568J7702m964k1334j4093Q927K2030J0584j3671k1506n564J6005
1393c662K0338J583j9223j7995L841K0599J4368p197k1599j1654J2151K1599O483
1406A9632j5666j9854k501J8623J7836k656j9656j4752O323K0903J1722j0940
1418I014k0743p386J3634K0063L580j7285j8272J708J9034J5138n428k0309j2191
$$ plain form
1431 -19443 -9649 10621 19104 6036 -13559 -18002 -1796 16672 16005 -2273 -17902 -13583 6142
1444 6142 18838 10103 -9647 -18621 -6874 12725 18032 3030 -15491 -16316 1052 17154 14057
1457 14057 -4904 -18254 -11023 8607 18314 7726 -11552 -17779 -4098 14358 16647 150 -16427
1470 -16427 -14291 3951 17753 11376 -7507 -18098 -8188 10689 17651 4805 -13652 -16462 -979
1483 -979 15757 14648 -2609 -17088 -12021 6479 17265 8900 -9492 -17233 -5590 12402 16407
1496 16407 2095 -14615 -14609 1653 16214 12610 -5476 -17224 -9388 8798 16881 6210 -11037
1509 -11037 -15820 -2387 13605 14704 -713 -15349 -12969 4261 16436 10111 -7476 -16663 -7119
1522 -7119 10312 15843 3460 -12700 -14421 -291 14150 13054 -3151 -16105 -10403 6415 16105
$$ packed form
1431a9443R794K0270Q483j3068j9595m443J6206J8468o67j8278j5629M319J9725
1444F142J2696q735j9750q974J1747J9599N307j5002j8521q25J7368J6102l097
1457A4057j8961j3350P231J9630R707j0588j9278o227J3681J8456K289j6497j6577
1470a6427K136J8242J3802o377j8883j0591R910J8877O962j2846j8457k810J5483
1483i79J6736j109j7257j4479N067J8500J0786q365j8392p741J1643J7992M005
1496A6407j4312j6710OJ6262J4561l604j8086j1748P836J8186Q083j0671j7247
1509a1037m783J3433J5992J099j5417j4636K380J7230J2175o325j7587r187R544
1522g119J7431N531j2383j6160j721J4130J4441j096j6205j2954N702J6818R690
$$ plain form
1535 16105 7639 -9413 -15842 -4021 12074 14371 1045 -13760 -13162 2408 15520 10761 -5633
1548 -5633 -15378 -8098 8241 15798 5008 -11302 -14727 -1594 12819 13007 -1255 -14633 -11360
1561 -11360 4974 15300 8420 -7544 -15228 -5697 10589 14467 2460 -12343 -13231 630 13920
1574 13920 11501 -4336 -14973 -8972 6703 14945 6438 -9842 -14400 -3010 11576 12999 413
1587 413 -13062 -11773 3038 13825 9323 -5819 -14460 -6923 8670 14527 3709 -10797 -13073
1600 -13073 -670 12701 11722 -2295 -13636 -9448 4945 14032 7299 -7563 -14186 -4727 9959
1613 9959 13037 1742 -11675 -11874 1533 13078 9557 -4028 -13455 -7775 6588 13756 5243 -9056
1627 -9056 -12939 -2394 10957 12145 -395 -12416 -10153 3479 13059 8100 -5855 -13445 -5851
$$ packed form
1535A6105q466j7052o429J1821J6095K297j3326j4805N98J5570J3112m759j6394
1548e633r745P280J6339P557j0790j6310l425J3133J4413J88j4262j3378L273
1561a1360J6334J0326o880j5964p684R531J6286L878j2007j4803q88J3861J3290
1574A3920k419j5837j0637O001J5675Q242q507j6280m558J1390J4586J423j2586
1587D13j3475J289J4811J0787m502j5142q641P537J5593N857j0818j4506k276
1600a3073J2403J3371r79j4017j1341M188J4393R087o733j4862o623R459J4686
1613I959L078j1295j3417j99J3407J1545l521j3585r427N680J4363P168q513j4299
1627i056l883J0545J3351J188j2540j2021K263J3632R580m959j3955p590P594
$$ plain form
1640 -5851 8485 13033 3028 -10105 -11930 -270 11924 10492 -2681 -12421 -8562 4854 12953
1653 12953 5962 -7582 -12736 -3505 9591 12059 928 -11088 -10598 1865 11946 8565 -4373
1666 -4373 -12461 -6689 6862 12653 3918 -8685 -11748 -1518 10208 10593 -1430 -11451 -9227 3343
1680 3343 12061 7146 -5856 -11791 -4662 7758 12019 2281 -9670 -10468 461 11054 9274 -2900
1694 -2900 -11765 -7386 5269 11981 5271 -7405 -11507 -2887 9169 10783 385 -10622 -9442 2062
1708 2062 11063 8077 -4600 -11911 -5751 6693 11433 3539 -8513 -10620 -873 9717 9633 -1649
1722 -1649 -10756 -8291 3683 11723 6298 -6110 -11459 -3643 7764 10897 1637 -9513 -9848 511
1736 511 10355 8398 -2722 -10837 -7104 5399 11186 4462 -6701 -10833 -2421 8808 9773 0
$$ packed form
1640e851J4336M548j0005j3133j825J1660J2194j432j3173r740L859J3416Q099
1653A2953o991j3544n154R231J3096K468j1131j2016M90J2463J0081l381j2938
1666d373q088N772J3551N791q735j2603l063J0230J1726L85j2023j0021K224J2570
1680C343Q718m915j3002n935P129J2420M261r738j1951p98J0929J0593j780j2174
1694b900q865M379J2655O712o710j2676m102Q620J2056J614j0398j1007J180J1504
1708B062R001k986j2677p311O160J2444M740p894j2052k107R747J0590q4j1282
1722a649r107K465J1974Q040n425j2408n349P816J1407L133r260j1150l35J0359
1736E11R844j957j1120q115L733J2503N787o724j1163m132Q412J1229R65r773
$$ plain form
1750 0 -9434 -8766 1943 10707 7147 -4501 -10862 -4871 6292 10693 2710 -8029 -10043 -773 8971
1765 8971 8799 -1565 -10203 -7546 3807 10284 5428 -5328 -10330 -3611 7109 9939 1062 -8547
1779 -8547 -8973 830 9592 7805 -3096 -9886 -5571 5122 10191 3830 -6593 -9964 -1813 7938
1793 7938 8778 -37 -9057 -7422 2327 9994 6035 -4418 -9578 -4649 6088 9671 2410 -7575 -8940
1808 -8940 -393 8553 7773 -1552 -9521 -6266 3511 9667 4845 -5441 -9454 -2824 7031 9043 944
1823 944 -8214 -8015 968 9050 6520 -2926 -9273 -5491 4666 9509 3115 -6467 -8935 -1626 7523
1838 7523 8180 -637 -8593 -6712 2619 9165 5285 -4406 -9006 -3522 5798 8872 1605 -7124 -8322
1853 -8322 -53 8300 7067 -1990 -8893 -5723 3751 8971 3933 -5254 -8785 -2252 6616 8198 554
$$ packed form
1750@r434O68J0709Q764l560j1648o361N991J1163M401p983j0739k014R270R744
1765H971j72j0364q638K657J1353O477m856j0756n002O719J0720K830q877r609
1779h547m26R803Q762j787j0901o790M315J0693N069o361j0423l371Q151R751
1793G938Q40q815r020J635R749P667l959j0453n160M929J0737L583p261r985j365
1808h940Q547Q946p80r325p969L255R777O156m822j0286m013O630R855K012q099
1823I44r158J99Q983Q082k530r446o347L782J0157M843o394r582k468P309R149
1838G523O57q817p956J881R331O546l880r691m600N484R320L074p267q729j198
1853h322Q269Q353j233r057o903L170R474N220n038r187l531O533Q868J582p644
$$ plain form
1868 554 -7706 -7181 1436 8531 6205 -3018 -8839 -4555 4636 8866 2605 -6194 -8166 -993 7381
1883 7381 7123 -755 -7750 -6198 2428 8414 4709 -4240 -8478 -3325 5657 8432 1689 -6996 -7682
1898 -7682 277 7557 6262 -2287 -8259 -5411 3745 8402 3486 -4911 -7921 -1944 6242 7604 371
1913 371 -7302 -6532 1494 7765 5235 -2983 -8066 -4213 4614 7927 2595 -5899 -7577 -548 6849
1928 6849 6959 -905 -7657 -5764 2380 7886 4207 -3862 -7709 -3008 5351 7528 1416 -6147 -6922
1943 -6922 478 7108 5858 -1911 -7593 -4467 3549 7669 3051 -4636 -7310 -1670 5930 6655 17
1958 17 -6713 -6145 1603 7161 4926 -3212 -7696 -3517 4237 7356 2166 -5430 -6921 -611 6084 6056
1974 6056 -1126 -7052 -5159 2879 7130 3822 -3889 -7245 -2493 5099 6755 833 -5885 -6206 522
$$ packed form
1868E54q260N25Q617P095k326r223n821M284R191M230o261q799j972P173Q374
1883G381k58p878o995J552Q626N986l705q949m238N153Q982K775o743q685o86
1898g682P959P280j295q549n972K848R156M657m916q397l010N977Q186J362p233
1913C71p673P70Q026O271k530q218n083L853Q827L313n332q494j678P029P397
1928F849J10p864o752J893Q144N506l679q069l847M701Q359K177o112p563p75
1943f922P400O630j250p769n682L126Q016M120m618p687k674N640P600P25o638
1958A7o730N68P748N558k235q138m484M179P754L119n190p596j491O310O695k8
1974F056p182n926J893Q038M251l308p711l356M752P592J656n922o718l21O728
$$ plain form
1989 522 6686 5448 -1876 -7103 -3926 3488 7116 2879 -4623 -6882 -1434 5470 6129 -42 -6217
2004 -6217 -5687 1583 6894 4408 -2714 -6882 -3163 3980 6939 1938 -5277 -6273 -350 5859 5374 -831
2020 -831 -6355 -4550 2725 6950 3614 -3549 -6925 -2207 4883 6353 974 -5722 -6027 825 6483
2035 6483 5068 -1921 -6576 -3765 3303 6719 2295 -4430 -6436 -1421 5067 5793 -49 -5889 -4886
2050 -4886 1671 6316 4170 -2802 -6250 -2980 3845 6118 1671 -4872 -5987 -355 5538 5059 -659
2065 -659 -5883 -4426 2380 6294 3340 -3393 -6278 -1798 4391 5805 755 -5195 -5308 380 5920
2080 5920 4660 -1916 -6328 -3809 2851 6109 2435 -4058 -6028 -1211 4634 5473 84 -5380 -4705
2095 -4705 1414 5988 3865 -2564 -5959 -2875 3745 6002 1646 -4517 -5552 -33 5184 4922 -972
$$ packed form
1989E22O164j238p324n227L177P414L628m237p502k259N448O904O59o171o175
2004f217N30P270N311k486p122m168L719P143K959n001p215r96N923O209m85o205
2020h31n524J805P275M225l336p163l376M718P090J470n379o696l05O852N658
2035F483j415o989m655K811P068L416m424o725k006N015O488P26n842n840J003
2050d886O557M645k146o972l448L270O825K273m447o543j115N632N893m79n718
2065f59n224J457O806L914k954o733k885M480O189J414n050n950j13N688N540
2080E920j260o576m412K519O660L258l674o493j970M817N845Q39n389n464O75
2095d705O119M574k123o429l395L084O620K257m356o163j035N519N217k62n894
$$ plain form
2110 -972 -5580 -4163 2379 5848 2734 -2980 -5852 -1892 4349 5577 692 -4818 -4612 664 5230
2125 5230 4203 -1695 -5806 -3321 2474 5579 2317 -3751 -5527 -1207 4678 4843 -174 -5012 -4204
2140 -4204 1382 5503 3436 -2483 -5741 -2405 3277 5420 1314 -4235 -4944 -487 4568 4501 -1001 -5264
2156 -5264 -3810 1854 5289 2846 -3077 -5280 -1954 3717 5020 698 -4488 -4597 392 5160 4129
2171 4129 -1501 -5346 -3118 2732 5346 2136 -3319 -4920 -1082 4341 4646 -201 -4696 -4115 937
2186 937 5112 3269 -1983 -5098 -2123 3018 5237 1767 -3942 -4712 -492 4536 4299 -794 -4954 -3415
2202 -3415 1718 5033 2710 -2782 -5147 -1619 3460 4612 750 -4064 -4390 362 4518 3531 -1193
2217 -1193 -4613 -2940 2541 4721 1924 -3273 -4733 -1185 3759 4169 -430 -4533 -3829 1013 4543
$$ packed form
2110i72m608J417O542L469l114n714k872L960O241J228m885n510K06N276M566
2125E230j027n898m111K485N795L105l262o068j776M320N885J65n017m838Q08
2140d204N586M121k067n919l258L336N682K143m106n549p09M457N055o7n502m263
2156e264J454N664L435k443n923k203L326N671J303m322n186j09M989M768j031
2171D129n630l845K228N850K614l210n455j601L838N423L05m847m495N81N052
2186I37M175j843n252l115K975N141K219l470n709p70M220N028k37n093m160J539
2202c415N133L315k323n492k365L528N079J152l862m814l26M752M156r87m724
2217a193l420J673N481K180k797n197j460L548M944M10m599m103P04M842L530
$$ plain form
2232 4543 3086 -1896 -4867 -2171 2725 4556 1444 -3348 -4298 -371 4095 4009 -514 -4667 -3293 1751
2248 1751 4746 2280 -2626 -4270 -1888 3036 4517 597 -3614 -3863 251 4291 3363 -1311 -4327
2263 -4327 -2542 2003 4420 1965 -2955 -4358 -1061 3719 4058 -31 -3962 -3486 708 4455 2842
2278 2842 -1581 -4533 -2069 2503 4498 1352 -3233 -4054 -682 3641 3511 -531 -4030 -3084 1284 4145
2294 4145 2248 -1883 -4199 -1716 3051 4134 515 -3461 -3433 1 4073 3130 -1170 -4315 -2643 1831
2310 1831 4250 1910 -2612 -4251 -1076 3239 3694 193 -3503 -3169 654 3769 2684 -1396 -4218
2325 -4218 -2160 2031 3974 1270 -2943 -3848 -410 3513 3613 -627 -3713 -2916 1213 4014 2512 -2044
2341 -2044 -3959 -1543 2821 3827 732 -3135 -3546 40 3445 3122 -776 -3841 -2470 1796 3944
$$ packed form
2232D543j457m982k971K696M896J831l112m792r50L927M466q6m523m153J374N044
2248A751K995k466m906j644K382M924J481l920m211k49M114M040r28m674l016
2263d327J785M545K417k455m920j403L297M780L39m089l931M76M194L747j613
2278B842m423k952K464M572J995l146m585q21L372M323j30m042l499R46M368K861
2294D145j897m131k316K483M767J083l619l976K8L434M072r43m300l145J672M474
2310A831K419k340m522j639L175M315M55l501l696L34L823L115j085m080k822
2325d218K058M191J943k704m213r05L438L923J00m240l086P97M129K801j502m556
2341b044j915K416M364J006l095l867m11L586L405l23l898l065J371M266K148
$$ plain form
2356 3944 1566 -2466 -3900 -1183 3179 3371 228 -3524 -3139 696 3721 2623 -1136 -3792 -2212
2371 -2212 2122 3941 1208 -2731 -3587 -556 3115 3331 -122 -3272 -3073 943 3694 2203 -1747 -3777
2387 -3777 -1399 2159 3668 853 -3180 -3479 -124 3471 3140 -640 -3716 -2331 1608 3994 1839
2402 1839 -2150 -3834 -1220 2658 3480 299 -3171 -3151 366 3527 2430 -1406 -3717 -1845 1732 3615
2418 3615 1414 -2507 -3517 -648 3324 3109 -358 -3285 -2884 926 3588 2056 -1795 -3509 -1656
2433 -1656 2328 3454 734 -2614 -3249 -282 3229 3210 -732 -3537 -2484 1145 3473 1824 -1875 -3313
2449 -3313 -888 2560 3255 315 -3050 -3039 488 3354 3014 -1040 -3414 -2097 1798 3667 1340 -2396
2465 -2396 -3327 -640 2945 3197 30 -3331 -2738 763 3393 2167 -1549 -3622 -1449 1847 3469 868
$$ packed form
2356C944k378m032j434K717M362J92l143l752L85L835L025j098l759k656J580
2371b212M334J819k733l939q56L031L671K16l453l150J99M016K751j491l950k030
2387c777K378L558J509k815m033k99L355L595l31l780l076J385L939K386k155
2402A839l989j684K614L878Q22l181l470K0L517L161j097l836k311J872L577J883
2418C615k201l921j010K869L972k15l467k927M01L810K662j532l851j714J853
2433a656L984J126k720l348o35K967L511j9l942k805J053L629K328j649l699j438
2449c313K425L448O95k940l365J1L527K866l40m054k374J317L895J869k327l736
2465b396r31K687L585K52l167l361N93L501K630j226l716k073K173L296J622k601
$$ plain form
2481 868 -2581 -3131 -201 3311 2869 -522 -3363 -2677 1128 3392 1615 -2052 -3635 -989 2237 3360
2497 3360 503 -2965 -2895 263 3283 2536 -802 -3268 -2124 1718 3794 1497 -2011 -3378 -569 2786
2513 2786 3158 -155 -3009 -2720 687 3400 2008 -1515 -3390 -1418 1837 3427 1031 -2391 -3096 -274
2529 -274 2906 2647 -597 -3338 -2330 1062 3108 1590 -1785 -3115 -1242 2219 3060 380 -2809 -2760
2545 -2760 249 3409 2532 -1112 -3194 -1810 1538 3347 1367 -2080 -3357 -479 2638 3078 -81
2560 -81 -3005 -2429 782 3182 1934 -1243 -3453 -1454 1945 3333 993 -2428 -2955 -169 2849 2859
2576 2859 -89 -2870 -2235 1112 3156 1713 -1660 -3258 -1026 2227 3045 609 -2600 -3002 -18 3057
2592 3057 2675 -950 -3231 -1962 1364 3281 1418 -2199 -2918 -569 2596 2745 -25 -2828 -2512 524
$$ packed form
2481H68l449n50K930L512m42l391k841O86L805K264j777l667j583K646L226J123
2497C360k857l468P0L158L020p47l338k466J144L842K076k297l508j367K809L355
2513B786L72l313k854K89L407K713j392l523j875J972L255J590k396l422p05K822
2529b74L180k59l244k741J008L392K046j518l375j330J873L461Q41k680l189M9
2545b760L009L160q77l644k082J384L348J809j980l447j277K878L117M40l159
2560h1k924N76L211K400j248l177k210J999L399J388k340l421n27K786L018J0
2576B859k948k781O35L347K044j443l373j598K232L253Q18k436l209m02K984L075
2592C057l82l625k281J269L326J917j863l617p19K349L165J49k770k803L16L036
$$ plain form
2608 524 3336 2108 -1398 -3307 -1497 1976 3268 1058 -2524 -2949 -91 2712 2676 -400 -3449 -2180
2624 -2180 988 3220 1792 -1790 -3088 -972 2307 3014 451 -2463 -2692 28 2990 2516 -713 -3205
2640 -3205 -2137 1305 3424 1226 -2142 -3222 -948 2406 2910 -131 -2775 -2585 553 2989 2062 -1184
2656 -1184 -3203 -1774 1750 3182 930 -2265 -3102 -207 2618 2427 -505 -3028 -2281 1120 3398 2004
2672 2004 -1631 -3021 -1018 2119 2954 382 -2635 -2775 53 2922 2370 -931 -3097 -1802 1356 3315
2688 3315 1258 -1978 -2836 -691 2501 2883 34 -2780 -2492 603 3099 2217 -1253 -3331 -1754 1717
2704 1717 3120 930 -2203 -2893 -562 2556 2410 -363 -2977 -2389 926 3162 1679 -1568 -3193 -1314
2720 -1314 2092 3021 624 -2282 -2649 105 2966 2406 -522 -3196 -1834 1582 2990 1388 -1746 -3044
$$ packed form
2608E24K812j228l506j909J810L473J292k210l582m25K858K803l6l076l049J269
2624b180L168K232j428l582j298K116L279P07k563k914k29K720K962m74l229k492
2640c205J068L442K119k198l368j080K274L354N04l041k644J90L138K436r27l246
2656a184k019J429L524J432k252l195q37K895K825j91k932k523P47L401K278j394
2672B004l635j390K003L137Q35k572l017j40K828K869n52l301k166J295L158J959
2688C315k057l236q58K145L192L82k849k814K88L095K496q82l470k078J577L471
2704A717J403k190l133o90K331L118j46k773k614N88L315K236j483l247j625J879
2720a314L406R29k397k906l67K754K861n60k928k674J362L416J408j602l134j298
$$ plain form
2736 -3044 -821 2351 2853 212 -2540 -2504 404 3136 2138 -1285 -3159 -1703 1913 2929 1072 -2298
2752 -2298 -2706 -128 2673 2734 -418 -2859 -2147 868 3139 1690 -1350 -3083 -1026 2030 3140 521
2768 521 -2317 -2757 -185 3101 2311 -758 -2942 -1889 1417 3160 1330 -1848 -2831 -719 2440 3253
2784 3253 249 -2768 -2543 532 3132 2364 -1162 -2958 -1563 1846 3128 1141 -2081 -3131 -384
2799 -384 2527 2611 -223 -2939 -2176 975 3023 1899 -1532 -3192 -1054 2196 2926 632 -2428 -2843
2815 -2843 315 2602 2194 -684 -3026 -2203 1399 2923 1330 -1892 -3244 -834 2213 2798 10 -2760
2831 -2760 -2500 558 3044 2050 -942 -3148 -1558 1810 3365 713 -2046 -2960 -362 2498 2538 -169
2847 -169 -2785 -2344 1001 3271 1494 -1562 -3001 -1098 1934 2986 402 -2427 -2861 -81 2791 2294
$$ packed form
2736c044K223L172N02k641k752L6K908K732r98l423j874J456L616J016j857l370
2752b298m08K578K801O1l152k441P12L015K271j449l040j733K057L056J110k619
2768E21k838m40K572L286p90l069k184J053L306J743j830l178r83K112L159Q13
2784C253l004l017K25L075K600p68l526j796J395L409J282j987l222j050K747
2799c84K911Q4k834k716P63L151K048j124l431j660K138L250P30k294l060m15
2815b843L158K287m08k878k342Q23L602J524j593l222j352K410L047N85k788k770
2831b760K60L058K486r94k992k206J590L368J555k652k759r14K598K860M0k707
2847a69k616M41L345K270j777l056j439J903L032J052k584k829m34K780K872m97
$$ plain form
2863 2294 -594 -3023 -2201 1494 2893 1271 -1818 -2979 -843 2242 2760 -94 -2514 -2283 304 3076
2879 3076 2207 -1048 -2952 -1751 2010 3043 1098 -1990 -3025 -368 2660 2252 -85 -2746 -2344 938
2895 938 3068 1647 -1564 -3221 -1397 1909 3040 571 -2672 -2644 22 2783 2149 -469 -3030 -1855
2911 -1855 1177 2952 1272 -1830 -2959 -813 2432 2818 66 -2862 -2355 760 2837 2026 -1232 -2924
2927 -2924 -1370 1656 3046 714 -2229 -2938 -486 2647 2478 -338 -2996 -2290 836 3221 1800 -1502
2943 -1502 -2963 -1176 2219 2965 179 -2552 -2576 221 2841 2246 -703 -3136 -2049 1430 2955 1291
2959 1291 -1852 -2995 -735 2293 2767 -84 -2822 -2639 673 2920 2149 -1301 -3275 -1575 1899 2953
2975 2953 814 -2190 -3034 -273 2805 2731 -296 -2889 -1946 1129 3078 1600 -1698 -3179 -1206 2046
$$ packed form
2863B294k888k429Q22L695J399j622l089j161K136L085N18k854k420K31K587K772
2879C076q69l255j904J201L761J033j945l088j035K657L028m08k337k661M02L282
2895I38K130j421l211j657J824L306J131k469l243K8K666K761o34k618k561J175
2911a855L032J775j680l102j129K146L245L86k752k928N07L115K077q11l258j692
2927b924J554L026J390k332k943p09K452L133j69k816k658P06L126K385j421l302
2943a502j461J787L395P46k786k731k4K797K620n95k949k433J087L479J525j664
2959A291l143j143K260L028M74k851k738J83L312K247p71l450j974J700L474J054
2975B953k139l004q44K761L078p4l027k593R43L075J949j478l298j481J973L252
$$ plain form
2991 2046 3001 516 -2713 -2621 497 2866 2250 -1125 -3066 -1699 1544 3275 1383 -2205 -3003 -401
3007 -401 2903 2823 83 -2685 -2629 740 2879 2074 -1276 -3290 -1300 1856 3128 736 -2338 -2781 -314
3024 -314 2642 2437 -592 -3122 -1903 1054 2850 1318 -1653 -3228 -910 2055 3019 236 -2772 -2510
3040 -2510 416 3203 2229 -905 -3108 -1555 1468 3089 1070 -1963 -2673 -459 2566 2679 -90 -2980
3056 -2980 -2157 789 3236 1858 -1491 -3151 -1212 1751 3195 676 -2567 -2996 -128 2811 2547 -642
3072 -642 -3069 -2223 916 3201 1596 -1536 -3121 -1018 2397 3049 456 -2736 -2753 356 3015 2069
3088 2069 -1216 -3133 -1593 1778 3182 1162 -2148 -2851 -564 2697 2787 -312 -2582 -2157 791 3272
3104 3272 1583 -1498 -3140 -1306 2250 2971 557 -2367 -2787 19 2962 2474 -733 -3210 -1823 1613
$$ packed form
2991B046R55k485l229R2L118K369o16l375j941J367L243J731j892l588p98K602
3007d01L304q0k740k768N6L369K139q05l350k014J990L156J272k392l074m43K467
3024c14K956k05l029k530J219K957J796j532k971j575K318K965R64k783l008K62
3040b510K926K787r74l134k203J553L023J621k019l033p10K214L025J13k769k890
3056b980Q23K946K447j378l349j660J939K963J444k519l243m29K868K939k64l189
3072f42k427Q46L139K285j605l132j585K103L415O52k593l192j7L109K659r46
3088B069l285j917J540L371J404k020l310p03K287L261R0l099k270M25K948K481
3104C272j689l081j642J834L556P21k414k924m20K806K943m88l207k477J387L436
$$ plain form
3120 1613 3238 1365 -1810 -3128 -917 2328 2789 -53 -2898 -2588 618 3160 2069 -1165 -2970
3135 -2970 -1653 1983 3239 664 -2303 -3163 -413 2608 2463 -262 -3192 -2333 1032 2968 1900 -1526
3151 -1526 -3401 -1128 2277 2954 335 -2587 -2984 426 3089 2527 -986 -2783 -1807 1789 2923 1310
3167 1310 -2017 -3367 -624 2463 2832 90 -2863 -2248 579 2894 1911 -1326 -3328 -1361 2054 3044
3183 3044 845 -2487 -3111 -215 2956 2413 -540 -3158 -2091 1181 3374 1666 -1821 -3210 -951
3198 -951 2575 3181 335 -2660 -2920 511 3092 2236 -993 -3222 -1955 1664 3050 1324 -2381 -3037
3214 -3037 -561 2668 2997 157 -2887 -2502 1028 3033 1758 -1310 -3060 -1172 2185 3144 612 -2517
3230 -2517 -2811 2 2690 2595 -777 -3181 -2096 1293 3041 1608 -1965 -2952 -863 2462 3027 184
$$ packed form
3120A613J625j873l175j318K211L245M61k842k845L10L206K542j091l234j805
3135b970J317L636J256k575k967q60K750L021j45k725k930Q59L365J936j068l426
3151a526j875K273L405O77k619k922l97L410K663n62l513j797R76L596J134j613
3167A310l327j350K743L087L69k742k953O15K827K315r83l237k002J967L415R90
3183C044k199l332o24K896L171n43k953k618J067L272K193j708l487j389K259
3198i51L526O06k846k995k60L431K581q56l229k229J267L619J386j726l705o56
3214c037K476L229L29k840l044L85L530K005j275l068j750J888L357R59k532l129
3230b517k94K813K688r5l372k404J085L389J748j433l573r87K089L325N65k843
$$ plain form
3246 184 -2736 -2572 333 2732 2104 -1062 -3306 -1754 1875 3124 1029 -2392 -2923 -414 2623 2694
3262 2694 -346 -3131 -2257 1099 3163 1704 -1913 -3270 -1115 2044 3054 582 -2540 -2775 -113
3277 -113 2803 2394 -623 -2880 -1874 1543 3124 1237 -2124 -2989 -677 2608 2651 69 -2929 -2463
3293 -2463 781 3052 2232 -1135 -3113 -1439 1961 2920 661 -2140 -2815 -253 2667 2508 -400 -3017
3309 -3017 -2198 985 3020 1619 -1592 -3069 -1028 2123 2951 263 -2650 -2656 191 2942 2169 -903
3325 -903 -2870 -1608 1407 2910 1111 -2155 -3069 -570 2656 2654 -392 -2812 -2438 820 3183 1771
3341 1771 -1243 -3273 -1153 1798 3218 714 -2580 -2708 136 2914 2406 -735 -3063 -1981 1451
3356 1451 3206 1364 -1752 -3072 -1068 2261 2633 73 -2684 -2358 795 3062 2024 -1102 -2896
$$ packed form
3246A84k920J64K905K399o28l166k244J552L629J249k095l421n31K509L037P1
3262B694l040k785Q74L356K064j459l617j357K155L159J010k472l122k35K662
3277a13K916m09l017k257J006L417J581j887l361q65K312L285M3k582k998M66
3293b463L244K271q20l367j978J674L400R59k259k801o75K562K920j59k908k617
3309c017Q19L183K035j401l211j477K041L151Q28k688k913oK847K751p73l072
3325i03j967J262L015J503j799l266r14K499L226kl046k420L74L258K363j412
3341A771l014k030K120K951J420k504l294j28K844K778n08l141k328J082L432
3356A451J755j842l116j320K004L329L72k560k757L26L153K267j038l126j794
$$ plain form
3371 -2896 -1739 1948 3017 1109 -2094 -2909 -453 2474 2911 -405 -2836 -2084 837 2999 1716 -1529
3387 -1529 -3054 -1310 2031 2814 345 -2595 -2733 174 2896 2349 -933 -3046 -1754 1379 3015 1274
3403 1274 -1676 -3081 -842 2249 2826 -9 -2832 -2425 595 2940 2024 -1114 -3349 -1394 1569 3069
3419 3069 754 -2250 -2870 -173 2600 2362 -276 -2654 -2157 1097 3089 1816 -1687 -3193 -981 2139
3435 2139 2869 351 -2799 -2253 468 2825 2112 -861 -2941 -1745 1483 2898 1359 -1884 -2925 -441
3451 -441 2352 2682 -276 -2764 -2224 680 2658 1907 -1206 -3219 -1346 1900 2917 963 -2407 -2915
3467 -2915 -156 2612 2392 -604 -2856 -2101 910 2985 1402 -1729 -3094 -1312 2085 2922 378 -2680
3483 -2680 -2484 417 2862 2009 -1047 -2900 -1229 1476 2847 908 -1873 -2797 -232 2421 2456 -622
$$ packed form
3371b896J157L687J069j908l203q15K456K927M37l316k431P52K921K162j283l245
3387a529j525J744L341P83k469k940j38K907K722n47l282k113J292L133J636j741
3403A274k950j405K239L091N77k835k823M07L020K345r16l138k235J955K963J500
3419C069k315l004o20K697K773k38k638k378M97L254J992j273l503j506K212L120
3435B139P30k518l150N46K721K357p13k973k080J196L228J415j539l243j041K484
3451d41K793L30k958k488N40K904J978p51l113k013J873L246J017j954l370n08
3467b915K759K768k20k996k252P55L011K075j583l131j365J782L397Q37k544l058
3483b680J96K901K445q53l056j853J671K705J371j939k781r24K565K653L5l078
$$ plain form
3499 -622 -2932 -2471 849 3025 1698 -1267 -2879 -1050 1950 2997 141 -2363 -2823 111 2710 2142
3515 2142 -686 -2868 -1821 1212 2981 1295 -1974 -2878 -710 2320 2675 -11 -2866 -2253 621 3019
3531 3019 1911 -1199 -3033 -1320 1880 2907 1003 -2220 -2682 -375 2401 2622 -462 -2759 -1870 852
3547 852 2957 1520 -1627 -3004 -1033 2007 2742 249 -2544 -2594 467 2653 2254 -953 -3011 -1664
3563 -1664 1400 3060 1031 -1800 -2872 -391 2411 2747 -101 -2555 -2283 826 2728 1785 -1011 -2548
3579 -2548 -1363 1849 2888 770 -2174 -2611 -275 2296 2447 -668 -2871 -1676 1023 2987 1558
3594 1558 -1796 -2795 -998 2133 2908 119 -2517 -2403 148 2995 1991 -1155 -2785 -1418 1482 3049
3610 3049 789 -1863 -2595 -411 2486 2515 -238 -2999 -1944 830 2541 1483 -1546 -2479 -1193 1934
$$ packed form
3499f22k310M61L320K176j327k965j612J829L000J047k856k504m60K934K599n68
3515B142k828k182J047L033J769j686l269r04K168L030L55k686k855O13K874K398
3531C019j108l110j834J713L200J027j904l223m62K307K776K21l084k297Q89K722
3547H52K105j437l147j377J971L040P35k493k793n0L061K186l99l207k058J347
3563a664L064J660k029k831j072K481K802L36k848k454K72L109J902r43k796j537
3579b548J185L212J039k118k944m37K336K571J51l115k203J195K699J964j429
3594A558l354r99J797L131P75k789k636J14K551K847j004l146j630J367K900J567
3610C049k260k652p32K184K897K9k753k761J055K774J711j058l029r33J286L127
$$ plain form
3626 1934 2798 586 -2262 -2300 122 2574 2176 -475 -2805 -1625 1315 3070 1309 -1529 -2561 -531
3642 -531 2016 2599 33 -2524 -2045 759 2679 1825 -1119 -2930 -1324 1478 2716 762 -2155 -2366
3658 -2366 -18 2309 2230 -251 -2493 -1893 689 2607 1416 -1185 -2635 -1085 1802 2614 383 -2473
3674 -2473 -2441 318 2554 2140 -985 -2934 -1681 1245 2724 889 -1878 -2544 -390 2247 2376 -136
3690 -136 -2514 -2333 546 2645 1817 -1523 -2654 -996 1750 2811 808 -2169 -2457 -79 2413 2277
3706 2277 -391 -2486 -1609 1116 2393 1146 -1486 -2724 -905 2047 2495 93 -2323 -1994 392 2671
3722 2671 1914 -808 -2715 -1367 1685 2646 753 -1672 -2671 -399 2253 2403 -420 -2269 -2110 952
3738 952 2496 1591 -1336 -2676 -868 1675 2680 625 -2077 -2568 186 2406 1990 -690 -2617 -1931
$$ packed form
3626A934Q64k212k848l8K422K452l98k651k330J180K940J755j761k838j032K030
3642e31K547N83k566k557M79K804J920q54k944j811J606K802J238j954k917k11
3658b366K348K327p9k481k242O00K582J918j191k601j450J550K887Q12k231k856
3674b473L2K759K236m14l125j949J253K926J479j835k767o66K154K637J29k512
3690a36k378J81K879K099q28l340j131J658K746J061k003k977k88K378K492j36
3706B277k668k095Q77K725J277j247k632j238J819K952M48k402k416L29K386K279
3722B671p57k722j907J348L052R61j893k425r99K272K652J50k823j849J59L062
3738I52J544r05k927j340J808K543J005k055k702m91K754K220m16k680j927O86
$$ plain form
3754 -1931 1241 2727 1127 -1739 -2358 -415 1888 2384 -16 -2417 -2154 416 2702 1836 -1068 -2717
3770 -2717 -1488 1772 2410 696 -1835 -2255 -266 2338 2150 -447 -2462 -1779 1067 2520 1170 -1609
3786 -1609 -2787 -812 1556 2538 248 -2289 -2234 102 2484 2002 -772 -2560 -1434 1054 2437 826
3802 826 -1662 -2623 -346 2408 2018 3 -2428 -1907 688 2418 1370 -1162 -2494 -1066 1576 2593
3818 2593 549 -2163 -2454 -37 2188 2258 -458 -2735 -1391 970 2183 1398 -1405 -2438 -525 1818
3834 1818 2382 164 -2168 -2016 397 2519 1708 -862 -2494 -1328 1219 2307 667 -1664 -2319 -335
3850 -335 2213 2362 -217 -2249 -1642 483 2370 1406 -1125 -2495 -929 1846 2440 439 -2082 -2233
3866 -2233 -95 2091 1831 -445 -2498 -1446 1122 2288 1031 -1564 -2262 -363 2280 2119 170 -2195
$$ packed form
3754a931L172J486j600k866o19J943K303M96k400k401K63K570K286q66k904j649
3770b717J229L260O38j714k531m20J989K604j88k597k015O83K846J453j350k779
3786a609j178J975K368R82k290k537N5K336K382m82k774j788J126K488J383j611
3802H26k488r61K277K754l90k015k431N21K595J730j048k532j332J428K642J017
3818B593k044k712k91K417K225P0k716k277J344K361J213p85k803j033J913K343
3834A818N64k218k332J52K413K122q11k570j632J166K547J088j640k331o55J984
3850c35K548J49k579k032O07K125J887r64k531j370J566K775N94k001k521j51
3866b233K138K186k60k276k053J052K568J166j257k595o98J899K643j61j949k365
$$ plain form
3882 -2195 -1992 532 2426 2012 -991 -2224 -953 1317 2452 643 -1671 -2133 -206 2023 1823 -413
3898 -413 -2359 -1692 997 2226 1145 -1416 -2383 -809 1511 2451 45 -2032 -2169 127 2070 1457
3914 1457 -601 -2470 -1359 1155 2320 946 -1602 -2012 -318 2052 2142 -231 -2228 -1761 882 2261
3930 2261 1426 -1161 -2369 -950 1302 2296 347 -1682 -2073 363 2354 1906 -629 -2181 -1388 1038
3946 1038 2507 873 -1288 -2216 -485 1869 2118 212 -1921 -2020 190 2030 1721 -542 -2133 -1270
3962 -1270 1180 2189 793 -1569 -2052 -585 1877 1767 -373 -2397 -1719 929 2252 1223 -1046 -2373
3978 -2373 -949 1451 2248 143 -1900 -1841 302 2230 1627 -731 -1982 -1330 1256 2345 730 -1607
3994 -1607 -2166 -545 1962 2129 -90 -1899 -1744 388 2253 1461 -777 -2397 -1176 1241 2033 400
$$ packed form
3882b195K03K524J894m14l003j233J271K270J135j809k314m62J927K229k00k236
3898d13j946O67K689J229j081k561r67J574K320R40k406k077j37K296J943o13
3914A457k058j869J111K514J165j374k548m10J694K370R0k373j997M67K643J379
3930B261q35k587j208J419K252R94j949k029l91K436J991m48k535j552P93K426
3946A038J469j634k161r28J731K354K49j906k133r9K210J840l09k263j591Q63
3962a270K450J009j396k362m83J467K462j10k140k024O78K648J323j029k269j327
3978b373J424K400P97k105k043N9K143J928o03k358j251O52K586J089j615k337
3994a607n59J621K507J67k219j809J55K132J865p92k238j620J221K417P92j633
$$ plain form
4010 400 -1574 -2257 -216 2035 1937 -470 -1964 -1616 790 2295 1027 -1372 -2378 -722 1509 1970
4026 1970 345 -1700 -2149 176 2130 1634 -803 -2124 -1125 1175 2283 929 -1416 -1877 -274 1981
4042 1981 1943 -97 -1947 -1846 517 1956 1359 -923 -2285 -797 1407 2164 394 -1833 -1694 -172
4058 -172 1795 1936 -340 -2212 -1508 853 2265 1032 -1328 -2277 -590 1641 1911 387 -1809 -1997
4074 -1997 88 2062 1262 -614 -2226 -969 1031 2072 545 -1467 -2140 -93 1751 1767 -208 -2054
4090 -2054 -1639 592 2007 1184 -1014 -2175 -686 1143 2117 369 -1678 -1854 -27 2058 1538 -649
4106 -649 -1769 -1270 714 2139 935 -1084 -1919 -430 1609 2002 -88 -1985 -1661 623 2173 1387
4122 1387 -988 -2179 -1047 1167 1996 739 -1450 -2099 -224 1925 1632 -285 -2174 -1429 762 1977
$$ packed form
4010D00j974o83K041K251r8k407j494L48K406J505j268k399j006J656K231M61
4026A970j625k045m49K325J954m96k437j321R99K300J108j354k345m61J603K255
4042A981l8k040j850J01K363J439n97k282j362J488K204P57j770k227J39J522
4058a72J967J41k276j872P04K361J412j233k360r49J687K231K70j524k196j88
4074a997K085J974q00j876j612J257K000J041j527k012o73K047J844J6j975j846
4090b054M15K231J415q23k198j161J489J829R74j748k047j76J827K085n20k187
4106f49j120M99J984J425j204k019q35J489K039L93k090j897L24K284J550p86
4122A387k375j191J132K214Q29j257k189o49J875K149k93j917j889P45K191J215
$$ plain form
4138 1977 1080 -1004 -2069 -534 1581 1976 28 -2019 -1531 208 1858 1578 -636 -1888 -1225 962
4154 962 2172 659 -1141 -1957 -309 1464 1861 -201 -1773 -1522 447 2137 1051 -836 -2228 -1206
4170 -1206 1344 2061 488 -1307 -1975 59 1815 1601 -580 -1993 -1298 763 1938 913 -1232 -2079
4186 -2079 -740 1590 1816 139 -1543 -1580 204 1932 1452 -732 -1923 -970 1402 1768 790 -1284 -1912
4203 -1912 -275 1655 1662 -312 -1857 -1498 501 1837 1303 -1053 -2053 -766 1199 1873 417 -1557
4219 -1557 -1606 149 1946 1597 -496 -2072 -1185 910 2085 802 -1263 -2132 -489 1584 1778 -32
4235 -32 -1828 -1778 412 1814 1224 -743 -1851 -799 1047 1998 640 -1338 -2100 14 1807 1631 -26
4252 -26 -1844 -1327 626 2150 688 -908 -1971 -412 1225 1944 588 -1627 -1403 153 1785 1250
$$ packed form
4138A977q97k084j065J535K115L95j948k047M88J739J650k80k214j252O63K187
4154I62J210j513j800q16J648J773L97k062j572K51J969J690j086j887j392J022
4170a206K550P17j573j795o68K034J756k14k181j413O95K061J175j025k145q47
4186b079J339K330K26j677j682l7J784J728m80k184j191R53K372L66r78k074o28
4203a912J637J930Pj974j545L59J999J336n34k356j000J287J965O74j456j974
4219a557m9J755J797l49k093j576Q87K095J175j283k065q69J643K073J94j810
4235c2j796N0K190J402n90j967j108J052J846R51j358j978p62K114J793j76j657
4252b6j818N17J953J524j462j596j063J559J637P19j356k215K24J556J632n35
$$ plain form
4268 1250 -380 -1879 -1039 1124 1981 868 -1403 -1752 -32 1454 1816 22 -1759 -1503 586 1716
4284 1716 992 -928 -1832 -763 1213 1997 529 -1111 -1558 114 1516 1463 -319 -1821 -1207 634 2002
4301 2002 659 -1041 -1889 -528 1237 1578 310 -1655 -1551 309 1736 1338 -871 -1688 -1053 987
4317 987 1703 542 -1183 -1867 -284 1557 1802 -173 -1699 -1343 584 2044 1069 -1032 -2014 -552 1112
4334 1112 1692 142 -1708 -1577 365 1743 1233 -247 -1771 -1318 915 1774 627 -1199 -1994 -337
4350 -337 1436 1519 -21 -1451 -1407 479 1434 1095 -600 -1734 -926 1037 1831 631 -1113 -1715 -395
4367 -395 1540 1615 -297 -1783 -1560 482 1719 1000 -933 -1929 -410 1070 1745 377 -1553 -1601 -109
4384 -109 1707 1181 -435 -1522 -956 1002 1744 696 -1174 -1444 -251 1179 1434 -199 -1487 -1465 607
$$ packed form
4268A250j630j499Q40K163Q57j113k271l49J720J486L62j794j781K56K089J130
4284A716p24j920r04J069J976P84j468j640m47J672J402n3j782j502O14J841J368
4301B002j343j700q48J361J765L41j268j965J04J860J427l98k209q17O35K040
4317I87P16j161j725o84J583J841K45j975j526L56J927J460r75k101r82J462J664
4334A112N80j550j850J31J942J378n10j480j524M53K233Q59j147j826p95J657
4350c37J773Q3j540j430M4J886R55l39j695j134Q08J963P94j200j744o02J320
4367c95J935P5j912j486K23K042J237p19j933r96J519J480O75j368j930m8J492
4384a09J816n26j616j087N66J958P42j048j870k70J193J430K55j633j288K2K072
$$ plain form
4401 607 1801 1133 -661 -1891 -574 867 1705 462 -1434 -1817 -27 1711 1461 -396 -1619 -1168
4417 -1168 912 1664 723 -1253 -1707 -399 1066 1642 170 -1316 -1443 292 1636 1171 -595 -1758
4433 -1758 -1009 909 1689 637 -1322 -1527 -273 1198 1546 59 -1379 -1131 679 1724 703 -809
4449 -809 -1350 -852 1139 1721 553 -1029 -1586 -29 1579 1560 -589 -1522 -970 716 1574 766 -1019 -1542
4467 -1542 -506 1144 1559 -188 -1707 -1277 89 1650 1159 -739 -1673 -807 799 1749 510 -1276
4483 -1276 -1471 -187 1251 1424 2 -1434 -1318 599 1701 829 -782 -1643 -399 1086 1668 141
4499 141 -1349 -1344 19 1335 1085 -343 -1369 -858 864 1790 658 -1090 -1709 -229 1177 1235 45
4516 45 -1666 -1537 288 1765 900 -526 -1514 -640 946 1459 555 -1215 -1559 97 1326 1293 -453 -1379
$$ packed form
4401F07J194o68j794j230J317J441Q38j243j896l83J790J738k50j857j223M51
4417a168K080P52r41j976m54J308J465N76j472j486j27J735J344m65j766j163
4433a758P49J918P80j052j959k05J254J471L48j487j438K48J810J045j021j512
4449h09n41M98J991N82j168j582n57J557J608j9k149r33N52J686Q58q08j785n23
4467a542J036J650M15j747j519M30J366J561m91j898r34Q66J606R50j239j786
4483a276j95J284J438J73j422j436J16J917J102q72j611q61J244J485N82j527
4499A41j490NJ363J316k50j428j026N11J722R26j132j748o19J480J406N8j190
4516D5j711J29J825J477q65j426r88Q74J586N13r04j770l44J656J229l3j746r26
$$ plain form
4534 -1379 -1211 383 1669 710 -949 -1697 -376 1013 1447 382 -1337 -1311 63 1266 1365 -693 -1487
4551 -1487 -947 1077 1296 670 -1201 -1399 -208 1223 1372 -204 -1295 -924 475 1391 775 -566 -1477
4568 -1477 -726 886 1525 210 -1294 -1234 100 1312 1226 -687 -1380 -626 684 1531 759 -1013 -1482 -426
4586 -426 893 1405 268 -986 -1227 342 1375 930 -515 -1438 -1019 950 1360 579 -1146 -1144 -493 1006
4604 1006 1161 -258 -1348 -967 730 1353 790 -744 -1551 -592 1077 1336 94 -1113 -1106 -8 1267
4621 1267 1210 -375 -1370 -965 661 1429 609 -1021 -1410 -348 1103 1105 20 -1374 -1245 288 1240 635
4639 635 -347 -1415 -439 855 1411 318 -1095 -1345 -105 1249 1137 -207 -1272 -843 468 1318 757
4656 757 -923 -1585 -319 1117 1526 137 -1224 -734 157 1340 977 -310 -1441 -821 572 1297 735
$$ packed form
4534a379J68J594J286r59j659p48J321J389M34j065j719K6J374J203R9k058p94
4551a487N40K024K19o26j871j98J191J431J49j576j091L71J399R16o16j341r11
4568a477P51J612O39j315j504O0J334J212q6j913o93P54J310Q47p72j772m69J056
4586d26J319N12j137j254k41J569J033m45j445r23M19J969M10p81j725KO51J499
4604A006J55j419j090L81J697O23n63j534q07R59J669K59j242j207PJ098J275
4621A267n7j585r95M05J626P68q20j630l89J062J451Kj085j394J29J533R52o05
4639F35r82j068R76J294N56j093j413k50J240J354j12j344j065M29J311Q50n61
4656G57j680o62J266J436M09j389j361M90Q91J183l63j287j131O20J393P25n62
$$ plain form
4673 735 -1022 -1306 -379 1230 929 -62 -1398 -1108 411 1221 628 -666 -1404 -557 795 1419 428 -888
4691 -888 -1278 -71 1200 876 -268 -1388 -900 638 1418 613 -754 -1068 -559 858 1324 163 -1260
4708 -1260 -1068 312 1363 801 -153 -1372 -906 851 1296 467 -957 -1475 19 1094 1122 0 -1450
4725 -1450 -956 288 1368 893 -513 -1317 -446 885 1167 281 -978 -1080 -71 1156 1174 -246 -1299
4742 -1299 -651 715 1264 541 -790 -1193 -348 904 1056 409 -939 -1082 169 1319 714 -634 -1365
4759 -1365 -531 660 1324 495 -595 -897 90 1035 949 -193 -1261 -934 178 1079 508 -786 -1302 -442
4777 -442 884 1176 31 -992 -798 42 1140 902 -263 -1369 -408 526 1143 361 -771 -1073 -371 792
4795 792 1009 -273 -1174 -902 341 1350 675 -707 -1158 -745 694 1527 191 -1140 -975 30 1089
$$ packed form
4673G35j757k84R27J609l01r91j336K90J519Q10n93j294p38Q47J352O24r91j316
4691h88l90J207J271l24j144j120M88J538P80q05j367l14N09J417M66j161j423
4708a260J92J380J051n62r54j219M66J757M45q29j424n18J494J075K8j122j450
4725a450M94J244J080m75j406q04Q71J331K82q86j259j02J009J227J8j420j053
4742a299O48J366N49p23j331m03Q45J252J52o47j348j43J251J150o05j348p31
4759a365Q34J191O64q29j090l02R87R45q6j142j068L27J112R01n71j294n16Q60
4777d42J326K92j145j023J94Q40J098k38j165j106R61R34O17p82j132l02P02J163
4795G92K17j282r01K72J243J009o75j382m51M13J439Q33j336j331J65J005J059
$$ plain form
4812 1089 1049 -532 -970 -693 164 1174 498 -713 -1214 -411 842 1163 262 -935 -1098 -2 1274 915
4830 915 -433 -1029 -662 582 1247 564 -753 -1079 -260 1067 958 -29 -1418 -781 458 1001 480 -701
4848 -701 -1240 -405 811 1170 255 -760 -1080 -14 1044 923 -221 -1257 -899 525 1423 413 -943
4865 -943 -1196 -245 840 1221 -52 -1043 -772 349 1265 1009 -364 -1011 -530 477 1101 362 -720 -1097
4883 -1097 1 1124 877 315 -1155 -916 420 1077 616 -621 -945 -268 697 871 189 -910 -850 -113
4901 -113 810 1044 -329 -1106 -422 474 1039 403 -489 -1131 -210 769 1098 -369 -1069 -916 -12 998 668
4920 668 -494 -1106 -504 777 1069 176 -904 -1107 -24 906 876 -190 -938 -619 437 1161 555 -598
4938 -598 -740 -377 689 1168 -57 -831 -1142 -37 987 674 -458 -1000 -479 492 1184 354 -511 -909
$$ packed form
4812A089m0j581m38K77Q57J010o76j211n01Q03J253L21r01j197j63J096J276l59
4830I15j348n96L67J244O65o83j317l26Q19J327j09r87j389O37J239N43n21j181
4848g01n39Q35J216L59r15j015l20J066J058j21j144j036L58J424Q98j010j356
4865i43k53R51J085L81j273r91K71J121R16k56j373o47M81J007O24p39j082l77
4883a097J098J123k47n62j470K39J336O57m61j237l24O77R65J74o82j099O0P37
4901a13R23K34j373p77O84Q96N65o36q92o42R21R79L29j467p00J53R04J010l30
4920F68j162o12O02J281K92q93j080k03J083R30l0j066p48L19J056P24o06j153
4938e98j42L63J066M79j225p74l11J105J024l13j132n42N21R71O92q30q65l98
$$ plain form
4956 -909 -464 803 831 -172 -916 -854 268 881 459 -451 -986 -360 572 1128 306 -964 -1012 135 830
4975 830 802 -221 -1275 -800 247 1101 587 -539 -1052 -229 1057 840 14 -916 -916 182 892 465 -426
4994 -426 -1045 -419 499 811 676 -599 -763 67 743 723 -43 -575 -604 363 891 623 -528 -788 -522 711
5014 711 906 145 -977 -837 61 682 761 -48 -1072 -816 272 830 424 -580 -1000 -196 700 941 -104
5033 -104 -847 -523 154 928 727 -363 -997 -605 759 825 219 -633 -941 157 762 838 -126 -851 -358 436
5053 436 857 336 -443 -665 -155 756 766 307 -879 -929 118 799 544 -64 -1087 -474 600 935 255
5072 255 -345 -1021 -343 605 720 59 -992 -899 157 756 639 -213 -822 -439 527 1029 21 -656 -919
5091 -919 -286 553 957 -60 -961 -592 408 880 453 -357 -425 -390 695 803 -91 -507 -685 260 888 652
$$ packed form
4956i09M45J267K8j003p44O2J122O13m22r10n35O26R32N56q22j270m8J147O95
4975H30k8j023j054M75J047Q54n14j126n13Q23J286k17q26r30%J098P10m27q91
4994d26o19O26R18L12j35j275j64Q30O76k0p66n32k9R67N28k68j151k60K66J233
5014G11J95p61j122J40Q98O21P9q09j024K56J088N58m06j004m20Q04Q96K41j045
5033a04p43L24O77P74k01j090o34L92J364O6o06q52l08J098O05P6r64p25M93P94
5053D36M21n21p79k22N10R11J0m59j186n0J047O81k55o08j023O13J074L35o80
5072B55o00o76O78R48J15o61j051R3J056N99j17q52o09L83R66N02j008o77k63
5091i19O33Q39M04j017r01L69J000M72m27q10o8L5J085J08q94m16j78R45O28k36
$$ plain form
5111 652 -328 -890 -515 211 637 261 -405 -874 -68 797 797 -172 -523 -369 404 631 742 -371 -900 -370
5131 -370 509 726 166 -739 -714 3 887 503 -229 -1000 -612 367 863 293 -384 -1015 -334 554 745 29
5151 29 -582 -561 -12 812 570 -471 -1032 -558 590 650 436 -739 -872 -279 692 708 -28 -605 -672 127 659
5172 659 291 -289 -1018 -258 540 726 197 -633 -581 -102 813 784 -17 -981 -405 490 942 139 -405 -795 -277
5193 -277 354 799 -80 -804 -483 257 634 591 22 -971 -461 497 865 252 -519 -716 -48 712 410 112
5213 112 -773 -552 187 879 500 -238 -1097 -550 603 660 437 -631 -880 47 724 825 -316 -968 -329
5232 -329 371 804 301 -778 -816 -50 348 769 -120 -735 -547 51 932 344 -220 -603 -418 451 554 165
5252 165 -618 -809 14 669 491 -276 -756 -510 522 599 70 -398 -781 -465 494 467 72 -608 -535 161 703
$$ packed form
5111F52r80n62L75P26M26l76o66m69Q06Q65%r69l51J54P73K27J11j113n29N30
5131c70Q79K17n60r05K5P17Q84l84p32p71L88R79M96n70o77o31O81Q88J91p16
5151B9o11K1N49Q24k42j041n61M74J148O0k14j175j33N93R71J6p36n77o7P99N32
5172F59l68n80p29P60P98J86n29q30N2M79R15k9q01r64N76Q95M52q03n44l90N18
5193b77O31M45q79p24L21P40L77m3n69r93N10R58L68o13p71j97O68P60l02k98
5213A12q85K21P39O92l79p38q59N47J153N7k23j068k49R27O77J01j141o52O39
5232c29P00M33n03j079l8P66L98M21q89o15J88N98Q81n88n64l83J85Q69J03l89
5252A65p83j91Q23O55j78p67m80K46J032P7n29m68l83L16R59k7l95o80P3O96N42
$$ plain form
5273 703 588 -306 -479 -581 233 483 344 -748 -544 -1 543 861 -73 -621 -542 -33 673 380 -369 -627
5293 -627 -624 -78 611 157 -579 -635 -256 652 577 105 -543 -605 294 519 312 -309 -748 -118 539 663 176 -598
5315 -598 -639 -6 706 491 -317 -669 -313 352 607 223 -401 -511 -204 681 694 -211 -518 -408 128 814 361
5336 361 -186 -953 -259 493 522 273 -697 -436 -8 387 484 -89 -591 -471 55 705 274 -692 -530 -106 481
5357 481 653 100 -601 -506 150 457 597 -20 -879 -405 177 603 189 -324 -436 16 564 647 -102 -419 -469
5378 -469 -71 793 334 -169 -573 -330 556 852 92 -480 -703 -50 639 409 -126 -768 -513 72 581 203
5398 203 -737 -731 -240 421 820 49 -419 -421 -125 578 339 -268 -857 -332 236 494 481 -405 -407 -202 394 510
5420 510 -24 -464 -642 106 476 293 -296 -752 -389 496 753 256 -378 -474 113 447 380 -114 -700 -181 383
$$ packed form
5273G03j15q94j73j02Q14K50j39j092K04N43N44L18r34n48P9N09P06k93p49k58
5293f27LN46O89m54p36n6L79R08p5m72o48o2Q99K25k07o21m39O30O57J24m87p74
5315e98m1O33P12k15q08l52L56O65K55l84o24j10L07Q85J3r05l07J10N36O86m53
5336C61n47p67O94P52K9k49r70K61M28L95R7n73n02J20N26O50m31r66J62M24N87
5357D81J72n53p01R5O56L07J40o17q59M74N82M26m14n13j12M52N48Q3p49l17n0
5378d69L98Q64m59n03m04K43Q86K96p60n72k23O53O89k30n35o42K55N85N09l78
5398B03r40OM91O61L99p71m68kK96P03k39o07n89N25N68K58j3q86kK05N96J16
5420E10n34m40j78P48L70j83n89m56L63Q85K57m97o34r6N87L34o7m94n86N19N64
$$ plain form
5441 383 628 155 -374 -575 -10 217 601 267 -410 -679 41 688 568 -89 -506 -289 250 470 267 -440
5461 -440 -626 -8 536 457 -119 -599 -564 59 701 465 -159 -618 -427 334 692 273 -363 -710 -252 257 587
5482 587 13 -398 -346 303 861 519 49 -516 -288 435 370 142 -652 -360 223 598 475 -131 -279 -148 317
5503 317 729 230 -222 -703 -145 475 571 209 -380 -316 48 553 365 -75 -688 -179 192 704 75 -427 -350
5524 -350 -28 542 422 50 -526 -272 91 786 268 -473 -575 -148 351 556 174 -260 -431 22 449 258
5544 258 -32 -523 -153 39 470 360 -14 -788 -32 284 464 -104 -505 -176 2 599 189 -487 -295 -222
5564 -222 382 456 218 -356 -529 -189 474 489 65 -519 -335 173 655 423 -452 -331 -291 409 438 136 -419
5585 -419 -386 -7 436 439 115 -561 -389 209 533 262 -120 -259 -303 483 415 2 -605 -288 166 522 152 -43
$$ packed form
5441C83K45m73n29k01N65K27L84l34o77k69P20O47j20o57m17K17N39K20k03p07
5461d40j86O18N44p9n76m80L5O23O42k36o24m59J91P61L58m19o36l47M58N09L30
5482E87n74m11N2O49N58l42m70n65K28P23o5k28p94K92N83L75j23o06j48J31M65
5503C17M12m99m52m81N58O20R6l62n89O4L64N05j88m40o13N09L71N12o29n02P7
5524c50L22N70j20l72n76K54L63O95n18p41j02M27M99K05l82m34j71M53M27j91
5544B58k90m91L70J92M31j10l74p74P56L16J80n68m01L29J78N97m10o76J92P3
5564b22O04P4k38n74j73L40O63J5m24n84J84N08M82k32q75J21M0P00K9l02n55
5585d19L3L79M43Ll24o76J72N98L24k71l82j39m4P86o8m13o07L17M54L56l70j95
$$ plain form
5607 -43 -395 -76 528 482 280 -323 -380 -160 577 624 -139 -525 -488 219 230 326 -536 -482 -210 399 145 205 -389
5630 -389 -539 111 565 557 -391 -600 -295 225 901 130 -396 -512 -282 601 316 13 -860 -607 138 118 353
5651 353 -167 -566 -187 288 516 106 -641 -585 118 610 211 102 -470 -349 452 655 58 -276 -409 -101
5671 -101 508 622 49 -412 -416 -109 741 424 -80 -556 -266 240 646 288 -338 -474 -256 319 471 62 -391
5692 -391 -339 399 705 161 122 -473 -335 147 499 58 -427 -491 26 392 514 93 -441 -305 95 504 308
5713 308 -359 -674 161 217 384 314 -360 -382 -57 544 250 -112 -535 -463 301 501 224 -314 -447 -163 130
5734 130 531 270 -240 -428 82 313 484 -242 -474 -126 158 514 171 -271 -319 -348 427 236 -142 -523 -88
5755 -88 186 546 19 -136 -584 24 409 319 172 -285 -636 27 594 179 -290 -596 -144 145 707 303 -480
$$ packed form
5607d3l52L19O04m6k02o03n7K20P37M7p63l86L7P07J1R6q62N4K72O09k54O0n94
5630c89j50O50M54qr48k09L05N20O76p71n26j16K30Q83k85l03q73K53P45k0K35
5651C53n20l99L79M75K28m10p47N6P03M92l99j09n72J21Q01K03n97l34j33L08
5671a01O09J14n73m61mL07Q50l17n04m76K90N06M06l58o26j36K18N75J52m09m53
5692c91N2P38L06n44l9n95J38M82L52m41m85o4N17L66J22m21n34J36M00M09j96
5713C08o67l15Q35N6J67p0o74k2L25O01k94l62m23P2P64K00k77n38j33K84K93
5734A30M01k61n10j88N10K31J71p26k32L48K84L56l43m42m8k9P75j91l78l81M35
5755h8K74L60n27j55m48O08L85r0j47m57l51O63N67m15m69l06M52K89N62m04p83
$$ plain form
5776 -480 -414 -55 510 219 59 -557 -392 260 339 286 -321 -520 -398 395 577 148 -322 -634 -41 255 466
5797 466 -22 -320 -244 89 483 194 -224 -471 -54 358 530 13 -275 -312 45 273 404 -104 -800 -219 155
5818 155 633 81 -490 -626 -262 502 510 128 -353 -256 161 530 447 45 -554 -411 193 475 192 -234 -623
5839 -623 107 560 220 -61 -335 -526 117 261 437 -434 -431 -125 314 551 94 -354 -577 -74 496 366 200
5860 200 -303 -275 172 463 244 -334 -384 72 330 397 47 -466 -580 154 612 480 -324 -488 -155 203 656
5881 656 118 -497 -403 41 814 317 -127 -574 -296 314 370 314 -324 -513 -17 388 284 211 -84 -392 144
5902 144 197 295 -207 -438 -200 98 573 -53 -196 -403 -175 430 501 297 -453 -543 -240 254 293 13 -314 -81
5924 -81 522 483 48 -77 -456 -288 228 252 179 -640 -379 260 602 389 -332 -662 -357 246 302 180 -489 -433
$$ packed form
5776d80O6L59N65k91j60o16J65O52P9n3o07j99J22P93J82m29m70l12N93K96K11
5797D66m88k98P6L33L94k89m18k47M17M12J72n17k88l7L57K28J31n08o96N81L74
5818A55M78n52n71j36L64P64Ql82m81R7M17L69q3m02n99J43O04K82k83m26l89
5839f23P30M53l40k81k74j91O43J44J76q71LL06M39K37m57m48k23N03N70j30j66
5860B00n03K8M47K91k19n78n0M56K58O7l50n13j14P34M58j32q04j64L33L58M53
5881F56n38o15R4M44P73m97m44m47K78O10N6n6o38j89M96M05j04p3k95l08N36
5902A44N3R8n02k31K38K98M75o26j43k07K28O05P1k04p50r0L03M94L9k80l27K33
5924h1O03l9m35j25l79J68N16K4p3q19K61O39L42k13p21l30L05O03N6j22o69N6
$$ plain form
5946 -433 69 814 502 -123 -366 -353 314 302 281 -85 -177 -144 339 394 -39 -552 -350 142 534 282 -182 -471
5968 -471 -207 49 713 270 -305 -270 -9 633 227 -21 -395 -388 128 401 306 -249 -380 24 407 412 -140 -386
5990 -386 -404 -57 420 519 -149 -351 -201 538 484 102 -362 -321 -172 418 703 -116 -521 -423 -114 574 502 -92
6012 -92 -335 -326 136 524 148 -342 -138 -243 657 279 -52 -429 -289 209 520 259 -160 -444 -233 466 347
6033 347 78 -233 -387 47 375 143 -334 -483 -271 61 506 243 -470 -655 -174 217 479 -149 -659 -426
6053 -426 341 493 310 -188 -476 -126 319 355 304 -625 -600 -242 474 415 81 -434 -63 381 390 241 -332 -423
6075 -423 -158 360 432 -57 -353 -608 -65 432 331 -25 -448 -203 174 551 399 -233 -701 -121 298 464
6095 464 9 -672 -382 -27 352 283 -41 -358 88 121 551 179 -304 -350 100 499 406 -46 -470 -360 118
$$ packed form
5946d33N02P45l12o25k43J3O67j2k1l66r2L3M83N5m33n13K02M92L92k52m64k89
5968d71K64K56O64m43n75L5K61O42m06k48l74PN16K73r5n55j31M04L83Nn52k46
5990c86j8L47M77R9o68k02J50P39n4l82m64M1J49N90K85q19m05R8L09O88p2n94
6012i2k43RM62L88l76m90K04j05R00l78l31l77J40M98L11k61m19k84K11O99j19
6033C47k69l11j54M34L28k32m77j49K12L32M45k63p13j85M81L91K62o28n10K33
6053d26P67J52j83m98k88L50M45L6n1r29K5L58P16n9l34n15L71M44Rj49n73r1
6075d23K65N18P2m89k96k55N43M97j01l56m23K45L77L77j52o32m68N80M19J66
6095D64m55o81K90L55L79o9l24l17M46L3M30l72m83m6M50L99r3m52m24J10M78
$$ plain form
6116 118 343 276 -248 -359 -230 404 411 140 -463 -537 12 624 353 -258 -512 -417 389 656 173 -466 -778 -297
6138 -297 380 661 138 -283 -321 58 268 185 -100 -388 -299 275 648 269 -352 -405 127 453 452 -10 -602 -53
6160 -53 129 563 530 -174 -490 -379 262 592 208 -256 -488 -81 239 423 -241 -572 -185 156 560 -21 -137
6181 -137 -601 112 173 409 -182 -624 -653 -95 695 512 -209 -621 -484 256 602 -159 -216 -538 -97 662 637
6202 637 -93 -690 -397 164 533 236 -232 -448 -369 453 633 -91 -366 -460 -139 668 587 -100 -250 -420 94
6223 94 655 287 -373 -430 -81 634 660 61 -442 -577 76 307 364 -132 -488 -193 260 674 225 -388 -773
6244 -773 48 631 482 6 -578 -432 349 507 265 -218 -476 -239 610 590 192 -176 -354 117 429 511 71
6265 71 -472 -418 403 585 317 -383 -512 -257 441 375 -175 -392 -394 -88 568 412 -511 -759 -304 332 419 52
$$ packed form
6116A18K25o7n24j11J29O34Pk71o03p4N49O12k71o11k54R5Q06K67m83o39l12M81
6138b97O77K81n23m21l8L79K10q3k85k88Q9N74L73l79o21n3N32L26jm62n92N49
6160e3J82M34l3p04l16J11O41L30l84m64k32M07L20J84o64l31L87L41M04n81j16
6181a37m64P13O1K36n91m42k9N58P90j83p21m12J37P40L46p61n7l22M41P59k5
6202F37p30n97K93N61L69k97m68k16P9Q22J80p24k75r4L21Q07q1o87j50j70N14
6223I4N61l68o60n7L49P15K6n99n03j35O53K31N7m96l56K95M53M14m49o13l85
6244g73Q21N83j49m76n84J46P81J58k42m83k58K37Q49k0l98l68j78M71L12Q2m40
6265G1n43N4Q21J82k68p00j29K55O98o6n50k17kL06O56j56r23k48M55O36Q7l67
$$ plain form
6287 52 -433 -685 58 674 410 -140 -538 -216 271 671 392 -225 -384 -199 340 609 29 -385 -503 259
6307 259 656 496 -154 -781 -284 137 523 138 -245 -542 -173 267 299 72 -416 -616 156 469 525 -193 -718
6328 -718 -205 478 572 70 -365 -653 61 546 586 -140 -604 -158 99 396 234 -278 -389 -156 358 323 5
6349 5 -714 -449 18 323 471 -438 -317 -399 270 381 100 -551 -554 -149 621 576 -167 -523 -256 65 432 31
6371 31 -336 -580 -115 404 762 80 -179 -661 -88 670 569 -124 -494 -57 272 549 158 -238 -453 12
6391 12 397 495 294 -799 -474 120 486 435 -5 -497 -390 334 512 326 -501 -642 -35 365 501 -83 -521
6412 -521 -388 166 757 325 -349 -596 -462 521 490 263 -334 -520 158 425 468 -211 -246 -395 493 524 624
6433 624 -443 -699 -317 366 601 225 -509 -509 212 450 407 -228 -504 -349 228 696 -12 -531 -710 101 526
$$ packed form
6287E2m85k52P43O16k64n50l98L22M87M00k79o17j59J85N39K69n80m14j18P62
6307B59L97j60o50o27M97M21L86l85l83k97L69M40L2k27m88k00P72L13N6p18n25
6328g18N13O83R4n02m35k88P14M85M0p26m64M46K57K97j62n12j11K33N14l5l18
6349Ep19K65M67L05J48r09J21q2O69J11k81o51lM05P70m5p43l56K67L21L67m01
6371C1l67k44M65N19L58o82k59m82N73P58j01o93l70M37L29K77l91l96k15M65
6391A2L85R8k01j093L25N94L66n1m40m92J07P24J78j86q27j41O07M00J36n84m38
6412e21J33N54N91m32o74k47J34R83l1k27n97j86O78K67M3o79l5j49Q88L1J00
6433F24j067k56L82O83K35l76p34%P21K38m3o35k76J55N77M68p08n19j79Q11M25
$$ plain form
6454 526 368 52 -586 -225 152 813 214 -391 -492 -249 456 528 167 -496 -608 110 471 619 60 -711
6474 -711 -390 500 808 207 -410 -612 -93 492 662 352 -550 -255 465 600 163 -312 -591 -316 468 484
6494 484 44 -642 -489 21 424 393 75 -636 -514 12 635 512 -129 -739 -302 259 575 -125 -497 -503 -130
6515 -130 799 450 -132 -643 -393 523 499 203 -367 -616 -21 456 532 141 -589 -380 -8 592 121 -141 -562
6536 -562 -231 282 452 297 -548 -436 33 495 206 -164 -527 -389 272 707 335 -309 -656 -19 437 753
6556 753 -64 -654 -485 192 657 442 -124 -569 -398 316 539 87 -454 -337 -278 623 649 -10 -530 -390 41
6577 41 664 450 -351 -515 -266 418 431 -1 -800 -517 162 399 241 -397 -704 -430 341 503 110 -460 -493
6598 -493 -88 349 257 -156 -540 -697 107 515 520 -194 -656 -401 720 721 123 -618 -545 -241 618 160 -64 -732
$$ packed form
6454E26j58l16o38L61L77O61n99o05j01K43P05P2l61o63j12P18L61J48n59p71
6474g11L21Q90L08o01o17k02N19N85J70l10r02K95P20J35m37m75k79K75P84J6
6494D84m40o86J53N10M03l1l18p11J22N26O23j23o41o10M37N61L16p00l72oL73
6515a30R29l49n82n11K50R16k4k96n70k49N95M77P6l91p30K09L72O00m71k62m21
6536e62L31N13J70j55q45J12M69M62k89l70l63J38O61M35l72o44l47O37M56L16
6556G53q17n90J69O77M65k15n66m45J71P14K23m52n41J17N9R01K6o59n20J40M31
6577D1O23k14q01j64K49O84J3m32p99K83O79K37j58o38l07K74P71J62l93n70l3
6598d93M05M37r2m13l84j57Q04M08Np14m62K55J121Jn98p41P3L04Q59m58k24o68
$$ plain form
6620 -732 -417 260 677 195 -297 -637 -129 496 637 39 -555 -710 164 381 326 -149 -643 -444 196 676
6640 676 410 -164 -493 -85 350 434 -13 -601 -384 111 770 637 -104 -412 -175 174 717 250 -680 -439
6660 -439 157 594 603 -177 -420 -366 32 582 307 -323 -783 -280 498 631 -26 -511 -386 61 599 353 -8
6681 -8 -737 -507 258 717 189 -587 -647 -187 471 778 37 -493 -193 58 817 175 -299 -739 -486 376 742
6702 742 83 -462 -697 -160 746 424 -140 -731 -413 400 597 155 -251 -504 -41 613 580 137 -583 -394
6722 -394 236 652 298 -54 -408 -332 475 604 499 -541 -451 -157 414 680 -57 -605 -483 342 763 444
6742 444 -259 -617 -300 281 797 306 -452 -572 -111 476 522 -189 -332 -364 215 812 268 -254 -429 -36 648
6763 648 313 17 -479 -274 132 415 307 -441 -521 -291 390 513 21 -537 -273 -57 317 406 56 -549 -522
$$ packed form
6620g32L15O77M17m82m92l40N08O25J41n98n94j55Q74K17n5m75m94J99O40M80
6640F76k66n74l29M08M35Q4m47n88K17M95O59j33p41l08K37L49N43m67r30K41
6660d39N96M37Rp80k43N4L98N50k75o30m60N03P78J33o57m85J25M47N38k46l61
6681hp29K30P65M59n28p76o0M60O58L07p41n30L00K51P59o42m74m40K53Q62L66
6702G42o59n45k35N37R06l22n64n91L18Q13J97m42m06k53M63O54l3m43p20J89
6722c94O30M16l54l52l54P6Q07J29j05j040R0K94N71K66p37n48J22Q25M21l19
6742D44p03l58L17N81N16m91p58j20M61N87M6p11j43l2N79N97n44n22j75L93O84
6763F48l35k96m96K05M06K83j08p48q0K30O81J23m92n58K64K16L74Q9l50o05K7
$$ plain form
6784 -522 45 423 73 -281 -471 -179 761 395 147 -102 -640 113 703 460 -396 -920 -77 160 427 406
6804 406 -329 -545 -34 442 315 56 -639 -617 239 468 140 -140 -694 -463 386 506 321 -375 -458 -184 513
6825 513 498 -75 -218 -328 203 668 215 -471 -648 -289 536 764 -19 -660 -730 165 558 443 -111 -879 -335
6846 -335 187 298 163 -308 -860 -282 368 624 -280 -494 -629 83 622 63 -322 -744 -253 533 734 -25
6866 -25 -542 -682 24 341 643 -115 -744 -408 477 651 382 -250 -856 -169 455 804 -71 -350 -432 189 295
6887 295 686 -401 -498 -146 224 619 105 -600 -774 66 560 347 -60 -775 -522 410 478 253 -636 -648 -349
6908 -349 372 623 242 -277 -448 -20 621 656 -296 -496 -643 360 471 289 -544 -557 37 392 473 -120 -479
6929 -479 -463 165 573 529 -443 -460 -112 328 409 13 -268 -745 11 499 479 -285 -416 -274 234 635 226 -580
$$ packed form
6784e22N67L78l50l54j90K92R40l66k48k49n38P53N90k43q56n24Q43K37K67k1
6804D06p35k16N11M76j27k59o95K2Q56K29l28k80n54K31Q49J20j85o96q3K74O97
6825E13j5n73j43j10N31M65m53o86j77L59Q25K28p83o41p0Q95L93j15n54p68N44
6846c35N22J11j35m71n52N78O50K56r04k14j35P12N39n59l85m22M91P86K01p59
6866b5n17j40P06L17L02p58o29L36Q85J74k69o32o06O87O24L49q75k79q2O21J06
6887B95L91j087r7L52L70L95n14p05j74Q40M94k13m07p15K53R32O8k25q89j2K99
6908c49P21K51l81n19j71M28O41L5r52k00j47J003J11j82q33j3N94L55Q1n93l59
6929d79J6O28M08m4r72j7L48M40Q1l96k81m77P56M88k0p64j31J42N08M01m09q06
$$ plain form
6951 -580 -718 123 419 642 18 -460 -417 116 631 297 -254 -656 -218 237 621 147 -481 -257 -13 556
6971 556 577 -251 -375 -480 70 484 312 -183 -504 -182 576 566 -43 -505 -512 185 579 372 -165 -519 -501 117
6993 117 760 591 -275 -666 -251 656 26 -69 -624 -457 75 694 255 -46 -439 -417 220 564 285 -468 -599
7014 -599 -209 320 97 -186 -507 -450 283 413 497 -299 -382 -115 228 530 -19 -237 -590 139 394 378 -516
7035 -516 -399 -397 118 628 286 -192 -579 -101 380 635 134 -581 -454 214 393 511 -185 -692 149 153 503
7056 503 113 -418 -212 -2 489 408 -47 -653 -134 292 673 349 -356 -515 -291 351 529 51 -359 -353 49
7077 49 626 641 -239 -405 -78 425 456 96 -396 -439 -157 574 729 -157 -708 -511 -38 498 281 -174 -531
7098 -531 -191 387 466 241 -199 -297 139 796 363 -192 -490 -163 566 725 286 -316 -615 -323 476 622 22
$$ packed form
6951e80j38Q41K96K23o24m78M3N33N15l34n51m02M38M55L84m74o28K24K44N69
6971E56K1q28j24j05N50M14j72m95l21L22P58j0o09m62pO97L94k07n37l54J8O18
6993A17O43j69q66l91M15R07o30r5n55J67N32O19m39l01l93K2O37L44k79p53j31
7014e99L90N29k23k83l21N7P33J30Q4p96q3K67L43L02n49k18l53P29K55j6q94
7035e16J17KN15N10l42m78l87M78M81K55n01p15J27O68J79J18o96n07Q41ML50
7056E03l90n31K06K10M91q1m55o06N19M26L81l24p05j59K24O42J78m78m10OM02
7077D9N77J5q80j66L27N03L1l60m92m3K82P31J55q86n51J97M73N36k17m55l57
7098e31L40N78P9k25m40r8M36O57m33n55k98L27P29J59m39o02k99K92P99J46o00
$$ plain form
7119 22 -502 -370 -81 378 265 -207 -252 -155 282 480 240 -425 -675 -120 284 204 105 -485 -283 105 470 122
7141 122 -421 -567 -249 545 779 135 -515 -526 -7 585 251 -270 -409 43 236 639 219 -259 -404 -88
7161 -88 548 209 117 -499 -493 63 672 154 -234 -389 -170 267 523 167 -205 -565 37 522 534 -64 -571 -499
7183 -499 232 883 364 -258 -497 -64 423 338 -105 -297 -506 65 646 340 -51 -468 -333 246 525 0
7203 0 -392 -568 29 434 323 -84 -340 -369 82 509 265 -236 -658 -232 301 603 132 -435 -733 67 314
7224 314 380 -16 -722 -594 153 409 354 -304 -558 51 441 251 -52 -564 -473 141 285 386 -287 -578 -276
7245 -276 333 675 59 -209 -409 243 666 635 -179 -534 -527 23 768 404 -325 -707 -142 438 501 104 -182
7266 -182 -383 102 434 362 -186 -644 -257 406 402 290 -368 -402 -422 198 468 -23 -419 -250 174 176 80 -228 -468
$$ packed form
7119B2n24J32K89M59j13m72m5R7M37J98k40o65k50N55M04q0r9n90K02L88L65l48
7141A22n43j46L18P94K34o44o50j1N19N92l34n21j39M52J93M03m20m78j45L16
7161h8O36l39r2o16ON56O09n18l88j55K19M37K56l56l72l60O02M85J2n98n07P2
7183d99P31O51n19o22k39M33M87q5m43j92k09N71N81l06l91m17J35N79K79n25
7203@l92j76N97M05j11m07k56k9M51M27k44n01m22M26N33L02m71n67k98Q00K47
7224C14O6l96p06J28P47K56n5o58k54O09L90j90l03n12R1O14J44J01o73k91L02
7245b76O09L42o16k68k00O52M23l1q14l55PN50P45l64p29l82N65N80O3l97k86
7266a82k01M85L32p2n48m58L87O63mj12o58l4k0O20K70m91l96J69M24Kr6l08k40
$$ plain form
7289 -468 -417 306 884 148 -439 -516 -148 493 202 -214 -416 -495 299 545 377 -313 -497 -170 363 737 25
7310 25 -420 -434 148 651 550 -50 -585 -245 307 716 246 -423 -372 -116 546 72 26 -545 -300 27 532
7331 532 253 100 -641 -198 424 434 -32 -477 -640 -316 239 690 -457 -653 -137 182 470 195 -330 -507
7351 -507 -127 543 622 -17 -286 -521 91 398 441 -98 -593 -291 495 697 208 -236 -507 -23 528 591 -61
7372 -61 -528 -442 49 441 432 -204 -554 -218 312 489 10 -532 -596 -261 734 402 -219 -467 -5 242 469 173
7394 173 -423 -657 -79 304 486 120 -679 -444 181 426 441 -281 -499 -179 204 435 29 -334 -307 -164 385
7415 385 320 -93 -579 -536 275 532 173 -326 -671 -230 181 543 190 -478 -346 126 482 387 70 -721 -217
7436 -217 198 753 146 -347 -757 -74 355 555 24 -528 -286 -264 700 163 -286 -397 -53 274 670 190
$$ packed form
7289d68N1P23N78p36n87p7L68O41k91m16k02p9P94K46j68o90j84L27N33L74p12
7310B5m45j4N82N03j01o00n35L40N52M09m70o69N1K56O62m74m6n71K45L27N05
7331E32k79j53p41M43O22J0m66m45j63L24N55M51j147j96N16L19K88k75n25j77
7351e07L80O70P9o39k69k35O12L07M3n39m95L02P86K02m89m44k71M84N51O3o52
7372f1m67Q6M91L92ro36l50L36N30J77m79n42o4L35R95l32o21k48M62K47K27k96
7394A73n96k34N78L83J82l66p99K35O25K45J5p22k18L20L83K31m06l63K7J43N49
7415C85o5m13m86M3Q11K57l59m99l45M41M11L62l53o68J32M72L56r5l17p91N04
7436b17M15N55o07m93m10O83M29K00n31n52K42K2R64n37m49j11L44L27L96m80
$$ plain form
7456 190 -384 -425 -143 653 410 -295 -401 -368 247 541 181 -269 -622 25 229 666 -41 -431 -283 63 479
7477 479 329 -372 -464 -495 135 434 224 -205 -247 -118 525 578 101 -345 -575 466 414 301 -303 -390 -134 380
7499 380 431 83 -502 -476 80 437 580 245 -487 -419 304 465 458 -352 -392 -239 422 414 -42 -428 -529 -148 307
7522 307 471 -285 -573 -612 352 668 -183 -200 -638 343 545 252 -94 -479 -505 322 668 209 -84 -494 -175
7543 -175 234 608 12 -570 -174 50 533 278 -172 -757 -309 24 568 -45 -335 -627 -296 -96 361 -172
7563 -172 -455 -207 113 249 269 174 -653 -265 483 521 163 -419 -298 -32 516 289 2 -448 -280 287 309
7584 309 277 -398 -442 72 461 596 210 -435 -197 41 695 346 -68 -414 -190 193 349 70 -315 -435 177
7605 177 621 693 5 -336 -326 42 682 188 50 -386 -184 396 457 134 -584 -491 -192 371 312 61 -358 -488
$$ packed form
7456A90n74m1K82P96k43p05j06L3O15K94l60m50l53O47K04M37p07l90J48L46M16
7477D79j50p01r2l1O30K99k10m29m2J29O43N3m77m46k30J041n2j13o04q7K56N14
7499C80N1l48n85K6N56L57J43l35p32O8P23J61pq10m0J53O61qm56l86j01L81M55
7522C07J64p56k88l9R64L16q51j7m38R81K02k93l46l85k6Q27L46m59k93m10L19
7543a75M09L74n96n82L96K24M83k55m50n85M48L33N44o13k90k92L31K00M57n33
7563a72k83K48L20J36K0r5q27L88P48L8l58n82J21K66N48k27k87m50J68N67K2
7584C09l2o75m4N14L89J35l86o45K38K38O54l49m14l46K24L83J56k79l85j20O12
7605A77M44P2o88l41J0L68O40m94j38m36K02N80O1l23p18R3K99N63n9k51m19j30
$$ plain form
7627 -488 315 338 408 35 -408 -94 430 738 -88 -350 -252 133 502 350 -284 -353 -63 221 470 38 -468
7648 -468 -559 -53 401 282 -214 -399 -230 -17 305 303 -310 -429 -276 469 365 147 -420 -373 142 615 229
7669 229 39 -379 -244 300 566 406 -180 -362 84 138 596 -116 -309 -301 39 462 275 -145 -383 -165 207
7690 207 394 298 -175 -342 137 545 395 -11 -396 -451 47 264 100 -449 -487 -230 134 720 -7 -272 -574
7711 -574 194 454 304 -79 -410 -223 332 530 161 -319 -561 -29 279 340 143 -439 33 -91 498 177
7731 177 -181 -474 77 382 483 177 -408 -283 -38 606 309 29 -249 -346 86 646 260 -267 -288 -271 452
7752 452 206 170 -596 -340 64 558 137 -271 -514 -35 148 552 233 -252 -488 26 317 310 142 -659 -398
7773 -398 382 178 356 -148 -454 -16 331 658 131 -538 -425 19 427 346 -54 -330 -312 48 340 140 -166
$$ packed form
7627d88Q03K3P0l73m43L14N24L08q26k62R8L85L69j52o34o9K90K84K49m32n06
7648d68r1N06M54j19m96j85J69K13L22ko13j19J53P45j04k18n67M7N15M73l86
7669B29j90m18J35N44K66j60n86j82M46N4M58p12j93QL40M23j87m20k38K18L72
7690B07J87r6m73j67M79M08j50m06l85n5M98K17j64n49l8K57L64N86p27k65l02
7711e74P68K60j50l83l31J87N55J98l69m80k42N32L08O1j97n82M72j24N89l21
7731A77l58k93N51L05J01l06n85J25K45O44k97k80k78r7M32N60l86n27k1J7P23
7752D52k46l6p66K56M04M94m21m08k43M79J83M04l19m85k36N14K91pj68q01K61
7773c98P80k04J78n04l06M38L47L27n27o69J13M44M08q1m00k76J8L60K92k00l06
$$ plain form
7794 -166 -341 -128 398 412 252 -328 -554 197 299 60 -21 -463 -334 280 368 297 -206 -430 105 279 269 -239
7816 -239 -625 -430 242 482 291 -170 -278 -290 286 400 170 -308 15 240 413 585 -331 -440 -401 385 384
7837 384 160 -280 -352 18 400 606 123 -370 -186 119 252 107 -209 -469 -308 92 312 111 -440 -47
7857 -47 417 342 263 -29 -393 -159 137 357 266 -393 -163 0 375 327 -20 -109 -296 -32 458 176 -166 -343
7879 -343 -298 118 453 122 -692 -411 -53 319 433 -291 -644 -323 42 525 175 -360 -405 59 -49 285 44
7900 44 -478 -573 -113 429 91 -170 -159 -399 -34 469 133 -90 -253 -225 395 431 45 -310 -436 380 693 355
7922 355 -332 -463 -171 171 320 263 -492 -301 -316 510 293 -37 -257 -254 6 412 236 -314 -393 199 286 324
7944 324 -4 -454 -590 -8 381 312 -101 -424 -175 -29 602 193 -334 -273 159 381 601 -99 -416 -228 0
$$ packed form
7794a66j75K13N26J4j60n80k26P51J02k39q1m42J29O14Q8p1n03k24N35J74j0n08
7816b39l86J95O72K40j91m61j08j2N76J14k30m78L23K25J73J72r16j09L9P86j
7837C84k24m40p2L70L82K06m83m93J84L05J33j45l16k60J61M00K20k01n51L93
7857d7M64p5p9k92l64K34K96K20r1o59K30J63L75m8l47q9j87K64M90k82l42j77
7879c43M5M16L35l31q14K81L58L72J14p24l53L21L65M83l50n35m5M64j08L34k41
7900D4n22r5M60N42l38k61J1k40L65N03l36k23j63K8O20L6l86l55j26Q16L13l38
7922C55o87j31K92L42J49n7p55J91j5Q26k17l30k20LK60M06j76n50p9N92Q7L8
7944C24l28m50j36N82L89o9m13l23K49J46O31m09n27O1M32K22K20p00l17J88K28
$$ plain form
7965 0 369 312 -158 -371 -383 318 176 153 -232 -281 128 143 309 -33 -407 -267 20 376 -71 -270 -415 -208
7987 -208 339 197 -284 -499 -477 -9 537 67 -318 -296 2 266 345 167 -511 -320 -13 346 194 -384 -637
8008 -637 -257 252 471 148 -183 -521 172 226 395 139 -249 -555 -63 66 380 -178 -459 -244 186 285 115
8029 115 -221 -427 33 490 404 -59 -434 -226 16 285 146 -234 -392 -436 248 675 99 -422 -346 178 343
8050 343 225 45 -455 -163 147 390 70 -349 -93 -246 278 255 57 -266 -337 269 416 265 -211 -135 -42
8071 -42 99 237 -24 -372 -572 -32 423 434 -77 -365 -264 334 326 391 -88 -235 -227 163 439 79 -319 -419
8093 -419 -37 217 467 -85 -560 -90 100 292 363 -26 -451 -244 277 478 -59 -250 -91 69 330 292 -257
8114 -257 -365 20 10 284 104 -284 -189 12 453 353 93 -262 -253 181 569 -80 -178 -551 101 44 511 -112
$$ packed form
7965@L69n7m70k13j2P01j42k3l85m9M09J5J66l42l74J40K87L56m47j99j45K07
7987b08N47j42m81k15K2M68N46m70l85K2K98K64P9j78o78J91L07L59j52n78k53
8008f37L80N09K19l23l31l38O93N4J69k56l88l06M92J29L14n58k81K15M30R9j70
8029A15l36k06M60M57q6m63l75K08K42K69j39l80j58m4O84M27n76n21P6N24J65
8050C43j18j80n00K92L10K43l20m19K56j53N24k3j98l23p1O06J47j51m76P6R3
8071d2J41J38k61l48k00N40M55J1n11k88J01N98qO5m79j47QL90K76l60l98j00
8093d19L82K54K50n52m75M70J90J92P1l89m25K07N21K01n37j91J59J60K61l8n49
8114b57j08L85j0K74j80l88R5K01M41j00k60l55RM34L88o49r8l73O52n7M67o23
$$ plain form
8136 -112 -526 -406 90 470 229 -173 -219 -84 235 552 -14 -92 -235 2 286 254 -118 -314 -98 -86 649
8157 649 182 -206 -501 -46 2 210 18 -413 -573 49 536 302 137 -391 -275 45 414 218 -144 -408
8177 -408 -111 50 609 53 -313 -191 53 520 156 -23 -489 -172 394 481
$$ packed form
8136a12m14J20M96L80k41m02m6J35L19L17n66p8j43K37K84l2l72j96K16J2P35
8157F49m67l88k95M55M8K08j92m31j60O22M87k34j65n28J16L20L69j96l62k64
8177d08K97J61N59n56l66J22K44M67l64j79m66L17N66Q7
8191D81
$$ Imaginary data points
##PAGE= N=2
##DATA TABLE= (X++(I..I)), XYDATA
$$ plain form
0 0 0 0 0 -8 8 -8 8 -16 16 -23 29 -33 42 -53 61 -76 94 -109 127 -154 178 -206 240 -276 316 -365 415 -468
28 -468 533 -602 673 -759 850 -949 1060 -1182 1312 -1459 1620 -1791 1986 -2201 2433 -2695
44 -2695 2987 -3312 3683 -4108 4589 -5154 5827 -6628 7619 -8877 10526 -12798 16147 -21575
58 -21575 31864 -58300 264611 503292 -96626 -244811 -244302 44531 386201 180523 -359274
69 -359274 -399711 -160441 156063 389906 162687 -300532 -254570 133818 361815 275605 -75856
80 -75856 -415921 -274498 146874 277484 55567 -209431 -321558 -74851 345918 388679
90 388679 23219 -260011 -237437 48678 317550 181373 -222795 -383086 -170573 169249
100 169249 316796 117495 -198559 -254017 29106 330253 275271 -64057 -312156 -256320
$$ packed form
0@%%%qJ6j6J6k4L2l9N2o2P5r5J14j37J70k03K36k81L32l84M46n16N92o81P80q83
28d68J001j135J275j432J609j799K009k242K494k771L079l411L777m187M634n128
44b695N682o299O995p791Q697r743J0981j2455J4247j6496J9403k3324K8945l7722
58b1575N3439r0164L22911K38681n99918j48185N09K88833L41670k05678n39797
69c59274m0437K39270L16504K33843k27219m63219M5962L88388K27997q6210l51461
80g5856l40065J41423M21372J30610k21917k64998j12127K46707M20769M2761
90C88679l65460k83230K2574K86115K68872j36177m04168j60291K12513L39822
100A69249J47547j99301l16054n5458K83123L01147n4982l39328k48099N5836
$$ plain form
110 -256320 59426 290020 107997 -216667 -270665 -72587 225521 354327 75500 -252476
120 -252476 -210178 40182 236240 200647 -131690 -362913 -168801 151287 259161 120577
130 120577 -154756 -254358 81 280773 244626 -22888 -257351 -241758 43137 262641
140 262641 122793 -167153 -258312 -92361 187689 301259 75053 -206057 -205298 11914 217440
151 217440 197170 -87336 -296683 -171102 103831 245723 126466 -145418 -233665 -24781
161 -24781 215110 236420 14482 -232103 -216250 33252 215388 143434 -106446 -254974 -110887
172 -110887 158396 253330 89392 -158584 -216345 -13189 203563 184227 -45706 -240295
182 -240295 -182833 68222 230967 127401 -114341 -214430 -62418 169721 227864 38071
$$ packed form
110b56320L15746K30594j82023l24664n3998J98078K98108J28806k78827l27976
120b52476M2298K50360J96058l5593l32337k31223J94112L20088J07874j38584
130A20577k75333r9602K54439K80692l6147k67514k34463J5593K84895K19504
140B62641j39848k89946r1159J65951K80050J13570k26206k81110P59K17212K05526
151B17440k0270k84506k09347J25581K74933J41892j19257k71884q8247K08884
161b4781K39891K1310k21938k46585J5853K49502J82136p1954k49880j48528J44087
172a10887K69283R4934j63938k47976n7761K03156K16752j9336k29933j94589
182b40295N7462K51055J62745j03566k41742j00089J52012K32139N8143j89793
$$ plain form
192 38071 -195301 -202958 7517 190082 156268 -66372 -229467 -124957 118254 223201 99083
203 99083 -126909 -208827 -37721 172990 178820 -10708 -198691 -178932 42673 207356 131714
214 131714 -83933 -200465 -85010 135856 208417 51570 -161096 -193707 -12715 170009
224 170009 155456 -35811 -196414 -135122 84652 205426 103996 -100436 -193445 -60954
234 -60954 145534 174690 6971 -166587 -167593 15795 182082 135352 -59864 -178340 -95853
245 -95853 99869 192673 68664 -133303 -182090 -28853 146625 152886 -13042 -171891 -136754
256 -136754 57780 181342 106401 -74319 -176103 -76430 119995 169544 24974 -139806
266 -139806 -159767 -4075 163176 135196 -44552 -160523 -101473 72510 176752 78169 -109404
$$ packed form
192C8071k33372p657K10475J82565l3814k22640j63095J04510K43211J04947j24118
203I9083k25992q1918J71106K10711N830j89528j87983J9759K21605J64683p5642
214A31714k15647j16532J15455K20866P2561j56847k12666l2611J80992J82724
224A70009j4553j91267j60603O1292K19774J20774j01430k04432r3009J32491
234f0954K06488K9156j67719j73558j006J83388J66287m6730j95216j18476Q2487
245i5853J95722R2804j24009k01967m8787J53237J75478O261j65928j58849L5137
256a36754J94534J23562p4941j80720j01784R9673J96425M9549j44570j64780
266a39806j9961J55692J67251k7980j79748j15971N9050J73983J04242r8583j87573
$$ plain form
277 -109404 -167430 -43114 124747 153807 5534 -152616 -135759 35096 162752 109841 -58771
288 -58771 -162382 -83415 94833 160460 41464 -118068 -151060 -19348 141402 137032 -25709
299 -25709 -148006 -105197 52310 160356 85576 -88738 -156609 -52559 105103 148470 22144
310 22144 -133139 -135047 15698 147443 113806 -43628 -149849 -89022 74239 152048 53709
321 53709 -100641 -142150 -32034 119553 137757 -7956 -136954 -107315 35478 144670 93283
332 93283 -71248 -149003 -57049 88136 137532 36673 -113722 -134541 728 131119 114629
343 114629 -25913 -138579 -96487 58593 145227 62746 -85408 -134494 -41041 100422 133774
354 133774 9130 -122131 -108816 18363 128055 100968 -49780 -142588 -65714 75308 129752
$$ packed form
277a09404n8026J24316J67861K9060j48273j58150J6857J70855J27656n2911j68612
288e8771j03611P8967J78248O5627j18996j59532l2992J31712J60750m370j62741
299b5709j22297M2809J57507J08046p4780j74314o7871J04050J57662M3367j26326
310B2144j55283j908J50745J31745l3637j57434j06221O0827J63261P7809r8339
321E3709j54350m1509J10116J51587J8204j45713j28998K9639J42793J09192n1387
332I3283j64531p7755R1954J45185M9396j00859j50395k0819J35269J30391j6490
343A14629j40542j12666M2092J55080Q6634q2481j48154m9086R3453J41463L3352
354A33774j24644j31261J3315J27179J09692k7087j50748r2808P6874J41022N4444
$$ plain form
365 129752 46155 -95739 -130625 -12202 114412 110629 -10329 -122174 -100273 39774 135252
376 135252 73343 -68402 -129648 -49458 86256 128635 20982 -109609 -109968 7364 113837
387 113837 100216 -30737 -130206 -75240 60331 123769 54739 -79125 -127000 -25769 101448
398 101448 110768 980 -110182 -100550 25090 122491 79895 -51462 -123917 -57628 72982
409 72982 121669 33112 -93806 -112974 -4301 105946 98169 -17688 -116666 -83103 45929
420 45929 120518 59957 -66240 -119331 -38300 86947 112523 9951 -101537 -97780 13323
431 13323 109551 85393 -36734 -117610 -62663 60247 113697 44002 -78840 -115304 -15512
442 -15512 97936 96775 -6673 -103594 -87568 32727 114313 63536 -52983 -109879 -48728
$$ packed form
365A29752q3597j41894l4886J18423J26614l783j20958j11845K1901J40047R5478
376A35252o1909j41745o1246Q0190J35714M2379j07653j30591l59J17332J06473
387A13837j3621j30953r9469N4966J35571O3438o9030j33864m7875J01231J27217
398A01448R320j09788j11162R632J25640R7401m2596j31357p2455O6289J30610
409G2982M8687q8557j26918j9168J08673J10247p777j15857r8978L3563J29032
420D5929P4589o0561j26197n3091Q1031J25247K5576j02572j11488L757J11103
431A3323R6228k4158j22127q0876N4947J22910N3450o9695j22842l6464R9792
442a5512J13448j161j03448r6921J6026J20295Q1586n0777j16519n6896O1151
$$ plain form
453 -48728 71201 111535 20949 -90257 -97711 794 99463 88718 -24983 -109647 -66768 47595
465 47595 106745 50027 -64885 -109687 -28211 84283 98220 5226 -93262 -89925 18040 106442
477 106442 71564 -41527 -106039 -53860 58378 105860 32198 -77823 -98797 -8728 89350
488 89350 88403 -10372 -98911 -74829 35975 103432 53636 -52996 -103238 -39035 72779 99524
500 99524 12046 -83432 -86847 4714 96002 78519 -31402 -100432 -57096 44543 99249 43184
512 43184 -67099 -98726 -16166 78550 86881 1995 -89251 -78608 25979 96318 56091 -40863
524 -40863 -96008 -46801 60787 96548 19207 -73099 -84429 -5253 86142 80743 -20570 -93284
536 -93284 -60270 34891 93361 47791 -55972 -95263 -25043 68942 86264 10285 -79080 -79381
$$ packed form
453d8728J19929M0334r0586j11206p454R8505R8669j0745j13701q4664M2879J14363
465D7595N9150n6718j14912m4802Q1476J12494J3937r2994r8488L337J07965Q8402
477A06442l4878j13091o4512N2179J12238M7482p3662j10021k0974R0069R8078
488H9350r47r8775q8539K4082J10804O7457m9796j06632n0242O4203J11814K6745
500I9524q7478r5478l415R1561R1288j7483j09921o9030M3336J01639N4706n6065
512D3184j10283l1627Q2560R4716Q331q4886r1246J0643J04587P0339m0227r6954
524d0863n5145M9207J07588L5761p7341r2306j1330P9176R1395n399j01313p2714
536i3284L3014R5161N8470m5570j03763l9291P0220R3985J7322p5979q9365l01
$$ plain form
548 -79381 13148 89293 62765 -31559 -90939 -50595 47903 92762 29745 -64605 -84141 -12087
560 -12087 75422 80544 -7416 -86245 -65572 26237 87153 51618 -44004 -90956 -34179 60026
572 60026 85445 16337 -69471 -78356 2025 82410 67209 -23770 -85631 -53856 37508 88483
584 88483 37565 -56898 -83312 -17579 66364 79834 2699 -78750 -68631 17507 81699 55568
596 55568 -34049 -87250 -40720 51232 83620 23085 -60891 -76945 -5803 72570 69180 -12442
608 -12442 -79493 -57655 27745 82521 43981 -45400 -82381 -25145 58538 77616 10823 -68862
620 -68862 -69817 7931 74927 58316 -23723 -80475 -46637 39911 81535 30921 -53934 -76235
632 -76235 -12591 64508 69696 -3436 -73389 -59459 19738 74919 47999 -34138 -79103 -32607
$$ packed form
548g9381R2529P6145k6528r4324n9380M0344R8498M4859o3017r4350j9536P2054
560a2087Q7509N122q7960p8829K0673R1809O0916l5535r5622m6952N6777R4205
572F0026K5419o9108q5808q885Q0381Q0385j5201r0979o1861L1775R1364N0975
584H8483n0918r4463k6414O5733Q3943J3470p7135q1449J0119Q6138O4192k6131
596E5568q9617n3201M6530R1952L2388o0535q3976j6054P1142P8373l390q1622
608a2442o7051K1838Q5400N4776l8540q9381l6981N7236Q3683J9078o6793p9685
620f8862r55P7748O6996j6611q2039n6752L3838Q6548M1624n0614q4855k2301
632g6235O3644P7099N188p3132o9953J3930P9197N5181k6920q2137m4965M6496
$$ plain form
644 -32607 50288 75599 17811 -60382 -71178 -28 69609 59050 -16105 -73367 -49759 30591
656 30591 76547 36775 -44192 -74487 -20819 56314 70352 4960 -67171 -62183 12442 69865
668 69865 49990 -25079 -73737 -38003 41405 72742 23925 -50361 -70518 -9388 63069 61521
680 61521 -8953 -67426 -52030 22097 71978 40227 -35834 -70552 -26304 47190 68868 12388
692 12388 -59444 -63608 4377 65313 52162 -17732 -68875 -42364 33487 69956 28326 -42797
704 -42797 -68028 -16918 54886 62545 -1525 -61879 -53702 14136 67400 43755 -28526 -66762
716 -66762 -30215 39133 65995 18269 -51268 -63565 -3908 59184 54237 -10535 -63517 -45483
728 -45483 25980 67165 32303 -36236 -63954 -22029 46102 62437 6067 -55678 -54607 6160
$$ packed form
644c2607Q2895K5311n7788p8193j0796P1150O9637j0559p5155n7262K3608Q0350
656C0591M5956l9772q0967l0295N3668P7133J4038o5392p2131M988P4625N7423
668F9865j9875p5069m8658L5734P9408L1337m8817p4286k0157O1130P2457j548
680F1521p0474n8473J5396P4127M9881l1751p6061l4718M4248P3494K1678n6480
692A2388p1832m164O7985O0936j3151o9894n1143K6511P5851L6469m1630p1123
704d2797k5231N1110P1804P659o4070o0354Q177O7838N3264k3645p2281l8236
716f6762L6547O9348K6862m7726o9537j2297N9657O3092m947o4772n2982J8034
728d5483P1463M1185l4862o8539k7718M1925O8131J6335n6370o1745J071O0767
$$ plain form
740 6160 61612 47822 -21429 -64115 -33914 32751 63213 23067 -44126 -61951 -9454 52392
752 52392 54880 -3029 -58098 -48277 17590 63747 36688 -29510 -62348 -26811 39926 61490
764 61490 11431 -49659 -54362 -628 55611 49803 -13756 -59825 -37559 24938 60409 28228
776 28228 -37622 -60437 -14962 45867 55331 3198 -53075 -48751 11244 58526 40388 -22444
788 -22444 -59453 -30031 32487 58685 17869 -43159 -54578 -6138 49561 50668 -6317 -55349
800 -55349 -40854 18659 56902 31882 -30054 -58187 -20422 39126 54270 8785 -46456 -49279
812 -49279 3711 52873 42982 -15630 -55940 -33388 25453 56388 23211 -37052 -54755 -10868
824 -10868 43722 50398 943 -50404 -42830 12686 52669 34682 -22613 -56082 -25574 33438
$$ packed form
740F160N5452j3790o9251m2686L0201O6665L0462m0146o7193j7825N2497O1846
752E2392K488n7909n5069R821O5867M6157k7059o6198l2838L5537O6737K1564
764F1490n0059o1090m703N3734N6239n808o3559m6069K2266O2497L5471l2181
776B8228o5850k2815M5475O0829R464n2133n6273M324N9995M7282j8138o2832
788b2444l7009K9422O2518K6198m0816o1028j1419M8440N5699J107n6985m9032
800e5349J4495N9513L8243k5020o1936k8133L7765N9548J5144m5485n5241k823
812d9279N2990M9162r891n8612m0310K2552N8841L0935l3177o0263j7703M3887
824a0868N4590O676m9455n1347P574N5516L9983j7987n7295l3469L0508N9012
$$ plain form
836 33438 53473 13812 -40869 -49987 -2172 48516 44289 -9378 -52037 -35990 19299 52713
848 52713 26844 -30411 -53024 -15708 37903 49700 6612 -44748 -44780 6747 49184 36647 -16757
861 -16757 -52442 -29375 26834 51603 18100 -34963 -48967 -7449 42817 45166 -2587 -48109
873 -48109 -38347 13900 49200 29883 -23349 -51935 -20561 33709 48511 10789 -38499 -45624
885 -45624 678 45822 37984 -10906 -47733 -32296 19875 49818 22616 -29869 -48282 -12273
897 -12273 37392 45798 2592 -43734 -39903 8580 45757 31696 -17319 -48564 -25078 27873
909 27873 47628 14466 -33122 -45109 -5348 41750 40334 -6699 -44772 -33793 14255 46600
921 46600 25706 -24516 -46149 -16398 31314 44899 8227 -37959 -41240 3060 42759 33390
$$ packed form
836C3438K0035l9661n4681r118M7815N0688m227n3667m2659J6047N5289L3414
848E2713k5869n7255k2613L7316N3611J1797m3088n1360l2N1527M2437j2537n3404
861a6757l5685K3067N6209K4769l3503n3063j4004M1518N0266K349m7753m5522
873d8109R762N2247L5300j9317n3232k8586L1374N4270J4802l7722m9288p125
885d5624M6302M5144p838m8890l6827J5437N2171K9943k7202n2485j8413L6009
897a2273M9665Q406m3206m6326L831M8483L7177j4061m9015l1245K3486N2951
909B7873J9755l3162m7588j1987L9761M7098j416m7033l8073J0979M8048L2345
921D6600k0894n0222k1633K9751M7712J3585l6672m6186l281M4300L9699r369
$$ plain form
933 33390 -12416 -45053 -27871 22255 46363 17404 -28458 -43181 -10495 36450 41757 -1244
945 -1244 -41261 -35037 8772 44030 29172 -19691 -44631 -19238 26494 43449 12339 -32799
957 -32799 -41161 -2361 38657 35297 -7147 -42014 -30277 16195 44264 21156 -24123 -41503
$$ packed form
933C3390m5806l2637J7182N0126K4108k8959m5862j4723L2686M6945N307m3001
945a244m0017O224M3809L5258j4858m8863k4940K5393M5732J6955l1110m5138
957c2799q362L8800M1018l360m2444l4867J1737M6472K8069k3108m5279j7380
$$ [...]
8191b49
##END NTUPLES=NMR FID
##END=
