##TITLE=1H_IAMT-170b
 D2O
 8 sc, 
 10.7.2024
##JCAMPDX= 6.0         $$ Bruker NMR JCAMP-DX V2.0
##DATA TYPE= NMR FID
##DATA CLASS= NTUPLES
##ORIGIN= UXNMR, Bruker Analytische Messtechnik GmbH
##OWNER= root
$$ XWIN-NMR		Version 3.5
$$ Wed Jul 10 14:09:17 2024 Russian Standard Time (UT+4h)  she@DPX200
##.OBSERVE FREQUENCY= 200.1314
##.OBSERVE NUCLEUS= ^1H
##.DELAY= (6, 6)
##.ACQUISITION MODE= SIMULTANEOUS
##.ACQUISITION SCHEME= undefined
##.AVERAGES= 8
##.DIGITISER RES= 18
##SPECTROMETER/DATA SYSTEM= spect
##.PULSE SEQUENCE= zg30
##.SOLVENT NAME= CDCl3
##.SHIFT REFERENCE= (INTERNAL, CDCl3, 0, 15.7039)
##AUDIT TRAIL= $$ (NUMBER, WHEN, WHO, WHERE, WHAT)
$$ ##TITLE= Audit trail, XWIN-NMR		Version 3.5
$$ ##JCAMPDX= 5.01
$$ ##ORIGIN= Bruker BioSpin GmbH
$$ ##OWNER= she
$$ F:/spectra/data/she/nmr/H-F/1/audita.txt
$$ ##AUDIT TRAIL=  $$ (NUMBER, WHEN, WHO, WHERE, WHAT)
(   1,<2024-07-10 14:07:53.92 +0400>,<she>,<DPX200>,
      <created by zg, POWCHK disabled, PULCHK disabled
       configuration hash MD5:
       00 E9 B6 7A A2 85 ED C7 34 08 36 98 17 FE 4E 26
       data hash MD5: 16K
       F7 F9 7E 64 03 5E 56 E0 28 23 F3 40 68 D9 42 B8>)
$$ ##END=
$$ 
$$ hash MD5
$$ 3B 8A 4A B7 87 12 0E 47 D3 F8 45 BE 98 9D AE 18
##$RELAX= 
##$RELAX= 
##$RELAX= 
##$RELAX= 
##$RELAX= 
##$RELAX= 
$$ Bruker specific parameters
$$ --------------------------
##$DU= <F:/spectra>
##$EXPNO= 1
##$NAME= <H-F>
##$PROCNO= 1
##$TYPE= <nmr>
##$USER= <she>
##$AMP= (0..31)
100 100 100 100 100 100 100 100 100 100 100 100 100 100 100 100 100 100 
100 100 100 100 100 100 100 100 100 100 100 100 100 100 
##$AQSEQ= 0
##$AQ_mod= 1
##$AUNM= <au_zg>
##$AUTOPOS= <>
##$BF1= 200.13
##$BF2= 200.13
##$BF3= 200.13
##$BF4= 200.13
##$BF5= 200.13
##$BF6= 200.13
##$BF7= 200.13
##$BF8= 200.13
##$BYTORDA= 1
##$CFDGTYP= 0
##$CFRGTYP= 5
##$CHEMSTR= <none>
##$CNST= (0..31)
1 1 145 1 1 1 1 1 1 1 1 1 1 1 1 1 1 1 1 1 1 1 1 1 1 1 1 1 1 1 1 1 
##$CPDPRG= <>
##$CPDPRG1= <>
##$CPDPRG2= <>
##$CPDPRG3= <>
##$CPDPRG4= <mlev>
##$CPDPRG5= <mlev>
##$CPDPRG6= <mlev>
##$CPDPRG7= <mlev>
##$CPDPRG8= <mlev>
##$CPDPRGB= <>
##$CPDPRGT= <>
##$D= (0..31)
0 1.2 0 0 0 0 0 0 0 0.06 0 0.03 0 0 0 0 0.0002 0 0 0 0 0 0 0 0 0 0 0 0 
0 0 0 
##$DATE= 1720606073
##$DBL= (0..7)
120 120 120 120 120 120 120 120 
##$DBP= (0..7)
150 150 150 150 150 150 150 150 
##$DBP07= 0
##$DBPNAM0= <>
##$DBPNAM1= <>
##$DBPNAM2= <>
##$DBPNAM3= <>
##$DBPNAM4= <>
##$DBPNAM5= <>
##$DBPNAM6= <>
##$DBPNAM7= <>
##$DBPOAL= (0..7)
0.5 0.5 0.5 0.5 0.5 0.5 0.5 0.5 
##$DBPOFFS= (0..7)
0 0 0 0 0 0 0 0 
##$DE= 6
##$DECBNUC= <off>
##$DECIM= 24
##$DECNUC= <off>
##$DECSTAT= 4
##$DIGMOD= 1
##$DIGTYP= 9
##$DL= (0..7)
0 120 120 120 120 120 120 120 
##$DP= (0..7)
150 150 150 150 150 150 150 150 
##$DP07= 0
##$DPNAME0= <>
##$DPNAME1= <>
##$DPNAME2= <>
##$DPNAME3= <>
##$DPNAME4= <>
##$DPNAME5= <>
##$DPNAME6= <>
##$DPNAME7= <>
##$DPOAL= (0..7)
0.5 0.5 0.5 0.5 0.5 0.5 0.5 0.5 
##$DPOFFS= (0..7)
0 0 0 0 0 0 0 0 
##$DQDMODE= 0
##$DR= 18
##$DS= 0
##$DSLIST= <SSSSSSSSSSSSSSS>
$$ [...]
##$SUBNAM2= <"">
##$SUBNAM3= <"">
##$SUBNAM4= <"">
##$SUBNAM5= <"">
##$SUBNAM6= <"">
##$SUBNAM7= <"">
##$SUBNAM8= <"">
##$SUBNAM9= <"">
##$SW= 24.0689651099613
##$SWIBOX= (0..15)
0 0 2 0 0 0 0 0 0 0 0 0 0 0 0 0 
##$SW_h= 4816.95568400771
##$TD= 16384
##$TD0= 1
##$TE= 0
##$TE2= 300
##$TE3= 300
##$TEG= 300
##$TL= (0..7)
0 120 120 120 120 120 120 120 
##$TP= (0..7)
150 150 150 150 150 150 150 150 
##$TP07= 0
##$TPNAME0= <>
##$TPNAME1= <>
##$TPNAME2= <>
##$TPNAME3= <>
##$TPNAME4= <>
##$TPNAME5= <>
##$TPNAME6= <>
##$TPNAME7= <>
##$TPOAL= (0..7)
0.5 0.5 0.5 0.5 0.5 0.5 0.5 0.5 
##$TPOFFS= (0..7)
0 0 0 0 0 0 0 0 
##$TUNHIN= 0
##$TUNHOUT= 0
##$TUNXOUT= 0
##$USERA1= <user>
##$USERA2= <user>
##$USERA3= <user>
##$USERA4= <user>
##$USERA5= <user>
##$V9= 5
##$VALIST= <valist>
##$VCLIST= <CCCCCCCCCCCCCCC>
##$VD= 0
##$VDLIST= <DDDDDDDDDDDDDDD>
##$VPLIST= <PPPPPPPPPPPPPPP>
##$VTLIST= <TTTTTTTTTTTTTTT>
##$WBST= 1024
##$WBSW= 4
##$XGAIN= (0..3)
0 0 0 0 
##$XL= 0
##$YL= 0
##$YMAX_a= 337562
##$YMIN_a= -283337
##$ZGOPTNS= <>
##$ZL1= 120
##$ZL2= 120
##$ZL3= 120
##$ZL4= 120
##$ABSF1= 10
##$ABSF2= 0
##$ABSG= 5
##$ABSL= 3
##$ALPHA= 0
##$AQORDER= 0
##$ASSFAC= 0
##$ASSFACI= 0
##$ASSFACX= 0
##$ASSWID= 0
##$AUNMP= <proc_1d>
##$AZFE= 0.1
##$AZFW= 0.1
##$BCFW= 1
##$BC_mod= 2
##$BYTORDP= 1
##$COROFFS= 0
##$CY= 11.3945322036743
##$DATMOD= 1
##$DC= 2
##$DFILT= <>
##$DTYPP= 0
##$F1P= 15.6554695791079
##$F2P= 12.8336369535428
##$FCOR= 0.5
##$FTSIZE= 0
##$FT_mod= 4
##$GAMMA= 1
##$GB= 0.15
##$INTBC= 1
##$INTSCL= 1
##$ISEN= 128
##$LB= 0.24
##$LEV0= 0
##$LPBIN= 0
##$MAXI= 10000
##$MC2= 0
##$MEAN= 0
##$ME_mod= 0
##$MI= 1.114404
##$NCOEF= 0
##$NC_proc= 0
##$NLEV= 6
##$NOISF1= 3.799351
##$NOISF2= 2.8
##$NSP= 1
##$NTH_PI= 0
##$NZP= 0
##$OFFSET= 15.70392
##$PC= 1
##$PHC0= -25669.67
##$PHC1= 11.58748
##$PH_mod= 1
##$PKNL= yes
##$PPARMOD= 0
##$PSCAL= 0
##$PSIGN= 0
##$REVERSE= no
##$SF= 200.130013532006
##$SI= 16384
##$SIGF1= 3
##$SIGF2= 2
##$SINO= 400
##$SIOLD= 16384
##$SREGLST= <1H.CDCl3>
##$SSB= 0
##$STSI= 0
##$STSR= 0
##$SW_p= 3612.71676300578
##$SYMM= 0
##$S_DEV= 0
##$TDeff= 0
##$TDoff= 0
##$TI= <>
##$TILT= no
##$TM1= 0
##$TM2= 0
##$TOPLEV= 0
##$USERP1= <user>
##$USERP2= <user>
##$USERP3= <user>
##$USERP4= <user>
##$USERP5= <user>
##$WDW= 1
##$XDIM= 8192
##$YMAX_p= 0
##$YMIN_p= 0
$$ End of Bruker specific parameters
$$ ---------------------------------
##NTUPLES= NMR FID
##VAR_NAME=  TIME,          FID/REAL,        FID/IMAG
##SYMBOL=    X,             R,               I
##VAR_TYPE=  INDEPENDENT,   DEPENDENT,       DEPENDENT
##VAR_FORM=  AFFN,          ASDF,            ASDF
##VAR_DIM=   8192,          8192,            8192
##UNITS=     SECONDS,       ARBITRARY UNITS, ARBITRARY UNITS
##FACTOR=    0.0002076,     1,               1
##FIRST=     0,             0,               0
##LAST=      1.7004516,     0,               0
##MIN=       0,             -283337,         0
##MAX=       1.7004516,     337562,          0
$$ Real data points
##PAGE= N=1
##DATA TABLE= (X++(R..R)), XYDATA
$$ [...]
$$ plain form
2455 -898 -4108 -2359 2121 3760 1085 -3072 -2757 1374 4284 1938 -2439 -4551 -1296 3426 3161 -997
2471 -997 -3555 -2075 2059 4445 1535 -2892 -3228 -248 2652 2385 -1220 -3738 -1366 2718 3277 247
2487 247 -2594 -2132 1279 3308 257 -3241 -2717 592 3353 1723 -2148 -3168 698 3937 2704 -1164
2503 -1164 -4373 -1830 2725 3211 -395 -3522 -2930 1167 4385 2173 -2323 -3546 -609 2690 3014 -822
2519 -822 -3980 -2260 1989 3523 971 -2519 -2586 1355 3716 1227 -2654 -3563 -455 3665 2775 -2361
2535 -2361 -4337 -506 3910 4337 -272 -4642 -3097 2351 4060 896 -3269 -4367 81 4566 3401
2550 3401 -1546 -3883 -1698 2693 3650 226 -3887 -3192 712 3086 1949 -2048 -3238 344 4051
2565 4051 2616 -1446 -4136 -1981 3179 3823 -980 -4552 -2493 2305 5007 1747 -3322 -4177 234
$$ packed form
2455h98l210J749M480J639k675m157L15M131K910k346m377k112L255M722k65m158
2471i97k558J480M134K386k910m427l36K980K900k67l605k518K372M084N59l030
2487B47k841M62L411K029l051l498N24L309K761j630l871j020L866L239j233l868
2503a164l209K543M555M86l606l127N92M097L218k212m496j223K937L299L24l836
2519h22l158J720M249J534k552l490o7L941K361k489l881r09L108M120q90n136
2535b361j976L831M416M27m609m370J545N448J709l164m165j098M448M485j165
2550C401m947k337K185M391R57l424m113O95L904K374j137l997j190L582L707
2565D051j435m062k690K155N160O44m803l572K059M798K702l260n069q55M411
$$ plain form
2580 234 4145 2727 -2097 -5056 -1998 3385 4250 257 -3034 -2621 1348 3918 1633 -2847 -3261 -633
2596 -633 2384 2438 -928 -3454 -1022 3072 3350 159 -3498 -2722 1605 3590 761 -3278 -3974 261
2612 261 4329 3191 -1430 -4125 -1417 3085 3736 -87 -3933 -3328 1380 3296 1593 -1881 -2798 188
2628 188 3070 2317 -1009 -3049 -1187 1585 2498 -125 -2852 -1706 1774 3368 1447 -1755 -2697 286
2644 286 3134 2185 -1729 -3818 -1168 2778 3622 200 -3283 -2180 1744 3676 1248 -2667 -3055 -506
2660 -506 2717 1983 -983 -2713 -776 2054 2608 -64 -2262 -1728 976 2089 450 -2085 -2184 495
2676 495 2576 1774 -1257 -2491 -514 2586 2358 -795 -3398 -2287 1485 3392 775 -2560 -2774 694
2692 694 3181 2187 -1648 -3440 -959 2176 2232 -407 -2505 -1565 1804 2685 554 -1958 -1787 687 2043
$$ packed form
2580B34L911j418m824k959L058N383Q65l993l291M13L969K570k285m480m14K628
2596f33L017N4l366k526K432M094K78l191l657P76M327J985k829m039o96M235
2612B61M068j138m621k695K708M502O51l823l846O05M708J916j703l474r17K986
2628A88K882p53l326k040J862K772R13k623k727J146L480J594j921l202r42K983
2644B86K848r49l914k089K650L946Q44l422l483J103L924J932k428l915l88K549
2660e06L223p34k966j730J937K830N54k672k198N34K704J113j639k535r9K679
2676D95K081q02l031j234J977L100k28l153k603J111L772J907k617l335k14L468
2692F94K487r94l835j792K481L135N6k639k098R40L369Q81k131k512J71K474J356
$$ plain form
2709 2043 979 -1781 -2748 -19 2412 2166 -329 -2614 -1287 2314 3044 336 -3053 -2611 291 3172
2725 3172 2185 -2030 -3300 -374 3190 3011 -259 -3365 -1862 1517 2488 245 -2575 -2187 1055 2947
2741 2947 1169 -1618 -1907 159 2111 1850 -1553 -3137 -868 2274 2548 81 -2551 -2055 1508 3734
2757 3734 1336 -2418 -3396 -839 2985 2871 -1172 -3495 -1465 2269 3743 841 -2809 -2594 1213 2671
2773 2671 908 -2167 -2904 -204 3217 1841 -1365 -2032 -552 2227 2605 -816 -3211 -1686 1474 2858
2789 2858 951 -2465 -2823 873 3355 2360 -1152 -3483 -1934 2539 3162 52 -2914 -2621 1294 4093
2805 4093 2103 -2236 -2591 67 2171 1752 -1757 -3389 -1026 2544 2051 -483 -2168 -1355 2103 3071
2821 3071 -129 -2843 -2212 493 2868 1896 -2192 -3347 -220 2926 3119 -19 -3170 -2613 1091 3097
$$ packed form
2709B043j064k760r67K729K431k46k495k285J327L601P30k708l389M42K902K881
2725C172r87m215j270K926L564j79l270l106J503L379R71k243k820L88L242J892
2741B947j778k787k89K066J952k61l403j584K269L142K74k467k632M96L563K226
2757C734k398l754r78K557L824j14m043k323K030L734J474k902l650K15L807J458
2773B671j763l075p37K700L421j376l206o67J480K779L78l421k395J525L160J384
2789B858j907l416l58L696K482r95l512k331J549M473O23l110k966K93L915K799
2805D093j990m339l55K658K104m19l509j632K363L570m93k534j685Q13L458R68
2821C071l200k714O31K705K375r72m088j155L127L146J93l138l151N57L704K006
$$ plain form
2837 3097 960 -1948 -3494 -450 3042 2655 -931 -2563 -985 1771 2721 -450 -3160 -1946 1369
2852 1369 2311 517 -2207 -1926 1530 3362 1178 -2105 -2693 -842 2502 2120 -1260 -3290 -1761 1518
2868 1518 3266 1487 -2310 -2998 286 2479 1864 -1002 -3201 -1826 2122 2975 558 -1724 -1763 1033
2884 1033 2857 527 -2413 -2243 348 2292 1139 -1836 -2818 551 3320 2452 -891 -2917 -1800 2008
2900 2008 2670 -48 -2910 -2868 328 2843 2462 -1194 -3218 -1179 1797 2693 352 -2746 -2716 570 2343
2917 2343 1371 -1175 -2123 24 2893 1999 -1287 -2586 -1054 1838 2075 -1136 -3157 -1192 2334 3064
2933 3064 513 -2443 -2286 950 3091 1403 -2021 -3585 -929 2450 2943 -152 -2373 -1817 960 2916
2949 2916 992 -1991 -2607 -357 1835 1779 -849 -2359 -355 2372 2526 -407 -2297 -1675 1359 2565
$$ packed form
2837C097k137k908j546L044L492l87l586j632J578K756R50l171k710J214L315
2852A369R42j794k724K81L456J832k184l283n88J851L344l82l380k030J529L279
2868A518J748j779l797o88L284K193o15k866k199J375L948Q53k417k282l9K796
2884A033J824k330k940J70K591J944j153k975r82L369K769q68l343k026J117L808
2900B008O62k718k862M2L196K515l81l656k024K039K976Q96k341l098L0L286J773
2917B343r72k546r48K147K869q94l286j299J532K892K37l211k021J965L526P30
2933C064k551k956J57L236K141j688l424j564K656L379M93l095k221N56K777J956
2949B916j924k983o16K250K192n6k628j510K004K727J54k933j890O22L034J206
$$ plain form
2965 2565 48 -2935 -2262 1112 3275 1552 -2039 -2810 21 3056 2432 -960 -3716 -1797 1566 3010
2981 3010 689 -2265 -2014 361 2597 2049 -937 -2520 -991 1113 1718 -163 -2165 -1246 1271 2615
2997 2615 657 -1710 -1781 964 2783 1159 -2140 -3131 -178 3015 2462 -1095 -3170 -1174 2365 2830
3013 2830 65 -2936 -2559 467 2445 1211 -1433 -2663 -561 2155 2221 223 -2080 -1501 912 1694
3029 1694 265 -1659 -1508 618 2123 1238 -1382 -1902 27 2194 1670 -1160 -2934 -944 1760 2608
3045 2608 242 -2763 -1946 1374 3093 1353 -1655 -2855 -451 2253 2080 -867 -2368 -976 1287
3060 1287 2288 385 -1734 -1559 577 1436 652 -1256 -1867 -299 1581 1574 -571 -2107 -785 1846 2126
3077 2126 17 -2557 -1910 1011 2670 632 -1989 -2724 234 3103 2107 -698 -2759 -1214 1581 2277
$$ packed form
2965B565k517k983O73L374K163j723l591p71K831L035o24l392k756J919L363J444
2981C010k321k954K51K375K236n48k986j583J529K104O05j881k002R19K517J344
2997B615j958k367p1K745J819j624l299r91K953L193n53l557k075J996L539M65
3013B830k765l001L77L026J978j234k644j230K102K716O6j998k303N79K413P82
3029A694j429j924J51K126J505q85k620n20J929K167n24k830j774J990K704Q48
3045B608k366l005Q17L320J719j740l008j200K404K704j73k947j501J392K263
3060A287J001j903k119J75K136Q59p84j908o11J568J880pk145j536J322K631K80
3077B126k109k574O47K921J659k038k621p35K958K869r96k805k061J545K795O96
$$ plain form
3093 2277 3 -1881 -1873 644 2184 925 -888 -1347 44 1439 1002 -710 -1815 -711 1073 1552
3109 1552 -124 -1773 -1189 1083 2070 629 -1815 -2281 94 2290 1877 -1189 -2495 -659 1752 2556
3125 2556 424 -2026 -2105 912 1910 742 -1125 -2206 -144 1636 1379 -714 -1553 -534 1098 1410
3141 1410 -263 -1786 -1270 476 1624 481 -1218 -1538 249 2057 1177 -960 -2230 -821 1564 2048
3157 2048 -447 -2352 -1602 1298 2746 1060 -1853 -2405 13 2174 1332 -741 -2028 -656 1522 1828
3173 1828 -226 -1355 -963 889 1489 -9 -1476 -1365 286 1640 953 -1116 -1955 -212 2008 1732
3189 1732 -311 -2179 -1416 903 2239 639 -1782 -2118 -46 2342 1804 -734 -2305 -467 1487 1937
3205 1937 -49 -2035 -1492 907 1629 168 -1016 -1080 432 1740 666 -1091 -1273 -248 1132 1345
$$ packed form
3093B277k274j884QK517J540j259j813m59J391J395m37j712j105J104J784M79
3109A552j676j649N84K272R87j441k444m66K375K196m13l066j306J836K411Q04
3125B556k132k450p9L017R98j168j867j081K062J780k57k093q39J019J632L12
3141A410j673j523N16J746J148j143j699l20J787J808q80k137j270J409K385M84
3157B048k495j905P50K900J448j686k913n52K418K161q42k073j287J372K178L06
3173A828k054j129L92J852O00j498j467J11J651J354o87k069q39J743K220k76
3189A732k043j868P63K319J336j600k421l36K072K388n38k538j571J838J954M50
3205A937j986j986N43K399P22j461j184o4J512J308j074j757j82J025J380K13
$$ plain form
3221 1345 -687 -1846 -954 1276 1746 439 -1551 -1907 456 2194 848 -1080 -2179 -903 1577 2045
3237 2045 -106 -2059 -1030 819 1833 535 -1549 -1696 437 1284 897 -1184 -1362 -111 1463 1253
3253 1253 -949 -1519 -664 1176 1584 -266 -1692 -1249 507 1863 679 -891 -1932 56 1596 1622
3269 1622 -453 -1984 -1204 1021 1889 250 -1730 -1653 335 1699 853 -889 -1554 -321 1435 1077 -486
3286 -486 -1627 -519 1265 1482 -138 -1501 -525 623 1302 169 -1386 -1663 111 1703 1334 -515
3302 -515 -1762 -814 1058 1867 158 -1692 -1523 486 1673 837 -930 -1518 -151 1429 1489 -275 -1510
3319 -1510 -865 745 1230 -186 -1198 -720 861 1385 267 -972 -1085 422 1588 884 -1119 -1885 -467
3336 -467 1123 1261 -139 -1725 -1140 562 1921 958 -975 -1579 -444 1314 1070 -350 -1530 -856 1156
$$ packed form
3221A345k032j159Q92K230M70j307j990l56K363J738j346j928j099J276K480M68
3237B045k151j953J029J849J014j298k084j47K133Q47l87k081j78J251J574k10
3253A253k202n70Q55J840M08j850j426M43J756J356j184j570j041J988J540K6
3269A622k075j531P80K225Q68j639j980P7J988J364q46j742o65J233J756l58j563
3286d86j141J108J784K17j620j363R76J148O79j133j555k77J774J592l69j849
3302e15j247R48J872Q09j709j850J69K009J187q36j767n88J367J580O0j764j235
3319a510O45J610M85j416j012M78J581N24j118j239j13J507J166p04k003p66J418
3336d67J590J38j400j586N85J702J359r63j933o04J135J758k44j420j180O74K012
$$ plain form
3353 1156 1586 262 -1390 -977 479 1497 342 -1120 -1096 336 1130 571 -695 -1065 193 1410 1333
3370 1333 -833 -1859 -924 728 1495 193 -1286 -1428 44 1597 1263 -439 -1508 -720 830 1412
3386 1412 -250 -1142 -1202 237 1454 715 -723 -1175 123 1208 741 -719 -1354 -317 1268 1111 -640
3403 -640 -1324 -558 1022 1588 -93 -1538 -1393 431 1478 451 -624 -1464 -208 1290 1244 43 -1476
3420 -1476 -1285 345 1363 493 -1016 -1223 195 1250 1028 -284 -1163 -145 1098 1042 -314 -1581 -753
3437 -753 796 1322 77 -1256 -702 1109 1908 454 -1164 -1572 39 1493 1228 -477 -1576 -814 778
3454 778 1528 578 -982 -1233 179 1227 793 -239 -1175 -377 1051 882 -261 -1114 -264 690 1190 -23
3472 -23 -1427 -1093 408 1525 561 -1041 -1155 92 1526 1281 -550 -1579 -638 872 1346 70 -1494
$$ packed form
3353A156M30j324j652M13J456J018j155j462K4J432P94n59j266l70J258J217p7
3370A333k166j026R35J652P67j302j479j42J472J553l34j702j069P88J550N82
3386A412j662q92o0J439J217p39j438m52J298J085m67j460o35J037J585j57j751
3403f40o84P66J580N66j681j445J45J824J047j027j075q40J256J498m6j201j519
3420a476J91J630J018q70j509k07J418J055k22j312q79J018J243n6j356j267Q28
3437g53J549N26j245j333N54J811P99j454j618m08J611J454k65j705j099P62J592
3454G78P50r50j560k51J412J048m34j032r36P98J428j69j143q53Q50R54N00j213
3472b3j404L34J501J117r64j602j14J247J434k45j831j029R41J510M74j276j564
$$ plain form
3489 -1494 -1014 303 1297 677 -675 -1306 -122 784 795 -201 -1271 -737 994 1333 -103 -1106 -827 649
3507 649 1528 430 -1195 -1155 53 1157 980 -494 -1489 -500 1543 1178 -99 -1587 -1193 730 1370
3524 1370 413 -1304 -1204 -371 1291 942 -613 -980 -160 494 837 -36 -851 -933 190 617 183 -949
3542 -949 -963 -12 1113 834 -602 -1101 -459 1045 1204 -420 -1445 -670 802 1898 293 -989 -1468
3559 -1468 213 1203 878 -921 -1409 -535 864 1113 -128 -994 -425 327 1197 62 -1070 -1030 -64 991
3577 991 388 -537 -1140 -418 1131 1135 -182 -1205 -853 891 1323 260 -1385 -1235 317 1542 1111 -929
3595 -929 -1563 -472 1065 1212 -293 -1080 -989 633 817 187 -688 -807 250 949 497 -455 -745 -185 756
3614 756 756 41 -1111 -667 727 1069 450 -929 -1087 137 1309 668 -723 -1261 -287 914 1169 -178
$$ packed form
3489a494M80J317R94o20j352o31J184R06J1r96j070N34J731L39j436j003K79J476
3507F49Q79j098j625M0J208J104j77j474r95R89K043l65j277j488L94J923O40
3524A370r57j717J00Q33J662l49j555l67Q20O54L43q73q15q2J123M27m34j132
3542i49j4R51J125k79j436m99O42J504J59j624j025P75J472J096j605j282m79
3559a468J681R90l25j799m88Q74J399K49j241q66N69P52Q70j135j132M0R66J055
3577I91o03r25o03P22J549Mj317j023L52J744M32j063j645J50J552J225m31k040
3595i29o34J091J537J47j505p87R1J622J84o30q75j19J057O99m52r52k90N60R41
3614G56%p15j152M44J394L42o19j379j58J224J172o41j391n38R74J201K55j347
$$ plain form
3632 -178 -1559 -795 787 1397 415 -1187 -1208 261 1008 269 -636 -897 221 1365 692 -122 -746 -340
3650 -340 488 890 -66 -806 -561 275 1141 573 -858 -1187 -169 1104 1095 -516 -1389 -864 444 1362 430
3669 430 -1152 -1019 465 1161 949 -696 -1097 27 834 701 -201 -985 -403 520 840 45 -863 -533 423
3688 423 1147 164 -947 -929 62 992 643 -513 -1425 -442 1119 1119 476 -1355 -1061 280 1109 788 -882
3707 -882 -1145 -358 920 1142 -158 -1070 -580 753 1052 -47 -684 -683 372 850 352 -726 -430 263 828
3726 828 579 -549 -936 -181 680 926 -92 -952 -405 584 1258 536 -722 -1239 -189 943 733 -557
3744 -557 -1200 -541 615 919 7 -781 -860 326 1072 189 -837 -1066 150 983 423 -428 -992 35 756
3763 756 862 -510 -1182 -628 648 1051 478 -777 -871 64 1474 752 -445 -824 -636 647 1194 -43
$$ packed form
3632a78j381P64J582O10r82j602k1J469P47p39r05k61J118J144o73q14o24M06
3650c40Q28M02r56p40K45Q36Q66n68j431l29J018J273rj611q73N25J308R18r32
3669D30j582J33J484O96k12j645m01J124Q07j33r02p84N82R23L20p95r08L30R56
3688D23P24r83j111J8R91R30l49j156r12R83J561%o43j831K94J341Q29l21j670
3707h82k63P87J278K22j300r12M90J333K99j099o37JJ055M78m98j078K96O93N65
3726H28k49j128l87P55Q61K46j018q60N47R89O74p22j258n17J050J132k10j290
3744e57o43O59J156L04r12p88p9J186P46q83j026k29J216Q33n60q51n64J027P21
3763G56J06j372o72N54J276M03n73j255r4R35J410p22j197l79J88J283N47j237
$$ plain form
3781 -43 -784 -958 220 1180 581 -950 -953 -9 888 516 -364 -872 -62 864 824 -45 -1007 -230 755 1180 159
3802 159 -1009 -793 358 1122 481 -748 -961 -109 1185 706 -325 -1167 -801 297 797 264 -633 -1047
3820 -1047 -70 830 582 -459 -825 -357 998 717 -263 -714 -386 674 863 -190 -898 -677 639 1033
3838 1033 593 -706 -871 -172 775 673 -352 -1309 -386 559 1127 321 -701 -966 -134 968 484 -403
3856 -403 -1035 -446 522 847 -86 -1062 -311 262 990 78 -944 -726 194 1079 529 -381 -758 -10 1147
3875 1147 540 -383 -902 -108 707 1014 153 -1154 -603 621 998 668 -534 -988 -26 747 571 -81 -808
3894 -808 -694 473 957 -80 -1023 -624 266 938 426 -624 -866 62 773 601 -430 -979 -377 799
3912 799 1051 -134 -1112 -846 283 1275 52 -730 -942 228 927 680 -345 -798 -461 603 791 132
$$ packed form
3781d3p41j74J178R60n99j531lR44Q97l72q80n08Q10R26m0q69r62P77R85M25j021
3802A59j168K16J151P64o41j229k13Q52J294m79j031q42L66J098N00n33q97m14
3820a047R77R00k48j041l66M68J355k81r80m51L28J060J89j053p08K21J316L94
3838A033m40j299j65O99R47j02j025r57R23R45N68q06j022k65Q32J102m84q87
3856d03o32N89R68L25r33r76P51N73P28r12j022K18R20Q85n50r10l77P48J157
3875A147o07r23n19P94Q15L07q61j307N51J224L77l30j202m54R62P73j76o52p27
3894h08J14J167M84j037r43L99Q90O72n12j050k42R28P11j72j031n49O02J176
3912G99K52j185r78K66J129R92j223p82k12J170O99k47j025m53L37J064J88o59
$$ plain form
3930 132 -957 -687 409 897 170 -552 -402 -211 974 595 -344 -963 -70 793 956 -167 -1128 -472 617
3949 617 865 -86 -896 -1061 42 980 221 -400 -779 -293 471 790 96 -773 -556 433 432 376 -728 -698 79
3970 79 797 739 -425 -762 -198 645 803 -118 -871 -458 392 916 221 -1011 -983 68 1057 556 -616 -1038
3990 -1038 21 702 720 -211 -824 -676 437 881 63 -664 -704 116 857 364 -98 -725 -275 303 718 -178
4010 -178 -803 -289 599 773 221 -620 -955 226 1204 497 -327 -901 -207 763 729 -317 -1086 -602 429
4029 429 939 -23 -842 -918 -93 668 399 -386 -802 -50 751 553 -233 -514 -135 532 532 161 -717 -670 234
4050 234 837 235 -680 -869 -271 806 736 -88 -1144 -541 759 818 247 -607 -798 -41 911 460 -670
4069 -670 -995 -153 644 537 -16 -820 -468 485 777 -40 -525 -540 231 747 17 -255 -646 -78 956 638
$$ packed form
3930A32j089K70J096M88p27p22J50J91J185l79r39o19Q93Q63J63j123r61O56J089
3949F17K48r51q10j65J103R38p59o21l79M86P64L19o94q69K17R89jn6j104L0P77
3970G9P18n8j164l37N64Q43J58r21p53M13Q50N24o95j232K8J051R89n01j172m22
3990a038J059O81J8r31o13J48J113M44q18p27m0Q20P41m93m62o27M50N78M15q96
4010a78o25N14Q88J74n52q41l35J181R78p07q24n74O94R70l4j046p69M84J031
4029D29N10r62q19p6Q25P61k69p85m16P52Q01j98p86k81L79O67%l71q78M7R04
4050B34O03o02r15j89N98J077p0q24j056O03J300N9n71q54j91P57R52m51j130
4069f70l25Q42P97j07n53q04L52R53K92q17m85j5P71N16p30k72l91N68J034l18
$$ plain form
4089 638 -503 -861 -425 533 729 -119 -728 -764 358 756 745 -389 -789 -227 983 738 -42 -689 -570
4108 -570 645 713 -88 -703 -216 -113 1033 357 -850 -681 113 570 522 -556 -964 -287 537 947 163
4127 163 -857 -613 328 945 600 -661 -835 -143 720 633 -227 -856 -552 199 933 138 -810 -681 275 636
4147 636 206 -711 -637 -80 806 439 -320 -453 31 714 633 -23 -952 -393 304 821 -124 -576 -805 30 1016
4168 1016 743 -521 -896 -423 573 723 60 -776 -722 89 975 449 -293 -679 -44 692 79 -556 -810 -119
4188 -119 646 693 -249 -853 -396 539 756 145 -693 -401 202 929 654 -670 -1004 -525 460 842 -152 -769
4208 -769 -635 409 1129 316 -619 -550 -3 810 381 -99 -668 -175 749 716 178 -646 -391 538 823 60
4228 60 -749 -230 409 1054 415 -565 -553 -283 683 686 -123 -1053 -427 505 600 340 -413 -912 281 428 544
$$ packed form
4089F38j141l58M36R58J96q48o09l6J122L98j1j134m00N62J210k45p80o47J19
4108e70J215O8q01o15M87J03J146o76j207J69P94M57m8j078m08O77Q24M10p84
4127A63j020K44R41O17l45j261j74O92Q63q7q60o29L04P51P34p95r48J29R56L61
4147F36m30r17P4N57Q86l67p59j33M84O83q1o56r29N59O97N17r45m52k29Q35R86
4168A016k73j264l75M73R96J50o63q36N4Q11Q86n26p42l86O35P36o13o35k54O91
4188a19P65M7r42o04M57R35K17o11q38K92O03P27k75j324l34M79R85L82r94o17
4208g69J34J044P20q13r35O9N47Q13m29m80n69M93R24l3n38q24K55R29K85p63
4228F0q09N19O39O45o39r80J2K70R66Lq09r30O26R32R5k60p53m99J193J47J16
$$ plain form
4249 544 -111 -634 -341 514 773 -140 -658 -371 148 593 367 -515 -472 455 417 43 -505 -639 63 930 598
4270 598 -657 -495 -254 703 768 5 -910 -1037 168 600 405 -201 -612 -157 603 582 10 -378 -640 169
4290 169 481 -167 -575 -428 12 841 391 -685 -489 191 799 479 -381 -951 -592 952 906 -16 -441 -652
4310 -652 495 487 470 -520 -543 -130 59 351 -303 -803 -369 317 495 253 -354 -429 54 454 511 -143 -596 167
4332 167 801 628 -300 -913 -68 690 565 -3 -825 -542 425 777 283 -498 -740 73 817 471 -47 -565
4352 -565 -303 159 619 -68 -487 -431 5 575 521 -227 -675 62 419 729 -111 -579 -263 394 329 166 -766
4373 -766 -288 509 714 104 -368 -709 122 773 651 -709 -923 -255 404 710 125 -433 -665 -26 578 321
4393 321 -276 -338 51 664 378 -353 -533 38 418 447 -44 -688 -467 249 848 114 -691 -718 385 842 429
$$ packed form
4249E44o55n23K93Q55K59r13n18K87N19M45k26q82M3R27l8l74n48j34P02Q67l32
4270E98j255J62K41R57O5p63r15j27J205M32j95o06m11M55P60k1n72l88k62Q09
4290A69L12o48m08J47M40Q29m50j076J96O80O08l20q60n70L59J544m6r22m25k11
4310f52J147qj7r90k3M13J89K92o54n00M34O86J78k42o07p5M83M00N7o54m53P63
4332A67O34j73r28o13Q45P58j25n68q22K83R67L52m94p81k42Q13P44l46n18n18
4352e65K62M62M60o87m19N6M36N70n4p48m48P37L57L10q40m68L16O57o5j63r32
4373g66M78P97K05o10m72l41Q31O51j22j360k14O68O59L06n85n58k32O39O04k57
4393C21n97o2L89O13k86p31j80N71L80K9m91o44K21P16N99p34q05k7J103M57m13
$$ plain form
4414 429 -260 -788 -54 750 779 -94 -714 -299 287 589 50 -695 -629 -246 641 506 -306 -859 -40 459 485
4435 485 -253 -521 -291 226 305 153 -587 -678 141 548 527 -314 -525 -99 677 799 -190 -692 -241 451 556
4456 556 229 -559 -646 482 658 310 -234 -583 -270 551 471 -37 -598 -344 233 579 -171 -298 -364 184 396
4477 396 265 -199 -625 -104 358 708 -259 -586 12 491 734 -76 -976 -751 -12 535 448 -273 -775 -14
4497 -14 432 830 -93 -573 -225 367 409 -52 -487 -534 -128 136 49 -414 -451 42 767 284 -65 -628 28 302
4519 302 570 62 -506 -488 97 619 213 -386 -872 -111 634 349 -176 -588 -396 460 527 142 -493 -793 286
4540 286 516 142 -430 -279 -32 469 249 -363 -298 47 388 353 124 -305 -564 261 565 449 -375 -563 -168
4561 -168 653 379 -307 -627 -288 389 874 314 -570 -797 198 654 319 -484 -413 49 454 402 -104 -551 -274
$$ packed form
4414D29o89n28P34Q04K9q73o20M15N86L02n39p45O6L83Q87j35q12n53Q19M99K6
4435D85p38k68K30N17P9j52p40r1Q19M07k1q41k11M26P76J22r89n02M51O92J05
4456E56l27p88q7J128J76l48n44l49L13Q21q0n08n61K54N77L46p50j27o6N48K12
4477C96j31m64m26N21M62L50r67l27N98M79K43q10r00K25P39N47q7p21n02P61
4497a4M46L98r23m80L48N92M2m61m35m7M06K64q7m63l7M93P25m83l49n63O56K74
4519C02K68n08n68J8N85N22m06n99m86P61P45k85n25m12J92Q56O7l85o35l00J079
4540B86K30l74n72J51K47N01k20o12O5L45L41l5k29m29k59Q25L04j16q24j88L95
4561a68Q21k74o86l20L39O77M85n60q84k27R95M56l35q03P1M62M05n2n06m47K77
$$ plain form
4582 -274 438 313 -111 -546 -335 165 582 -7 -379 -368 308 678 351 -233 -680 -270 498 379 -155 -524
4602 -524 -334 176 882 452 -379 -747 -158 484 588 -439 -395 -355 275 684 -162 -605 -430 394 541 -176
4622 -176 -509 -438 24 472 427 -427 -411 -1 448 651 70 -256 -413 461 230 188 -153 -639 7 602 638 -225
4644 -225 -465 -325 412 551 33 -311 -9 281 652 59 -399 114 244 537 -24 -410 -459 -89 578 440
4664 440 -241 -536 -23 491 472 131 -468 -488 353 496 224 -209 -439 -290 227 535 232 -441 -381 43 521
4685 521 178 -433 -527 -3 363 430 -278 -361 43 319 456 -273 -534 -359 253 506 39 -702 -534 200 595
4706 595 196 -251 -310 -177 497 303 -91 -442 -405 230 344 166 -441 -271 -139 275 258 -239 -333 -146 199
4727 199 314 -121 -586 -5 267 458 -315 -243 -387 209 630 205 -357 -347 -140 597 693 -50 -490 -411 369
$$ packed form
4582b74P12j25m24m35K11N00M17n89l72J1O76L70l27n84m47M10P68j19n34l69
4602e24J90N10P06m30q31l68N89O42J04j027M4M0O30M09q46m43J75Q24J47p17
4622a76l33P1M62M48m5q54J6M10M49K03n81l26j57Q74k31m2l41m86O46N95L6q63
4644b25k40J40P37J39n18l44L02K90L71n93m58N13J30K93n61l86m9L70O67j38
4664D40o81k95N13N14j9l41n99k0Q41J43k72m33k30J49N17L08l03o73O0M24M78
4685E21l43o11r4N24L66O7p08q3M04K76J37p29k61J75O12K53m67p41J68P34L95
4706E95l99m47n9J33O74j94l94l51L7O35J14j78o07J70J32M14j7m97r4J87L45
4727A99J15m35m65N81K72J91p73P2j44N96M21m25n62J0K07P37R6p43m40P9P80
$$ plain form
4748 369 841 238 -509 -584 248 491 236 -399 -301 -231 226 612 180 -110 -155 77 364 -32 -287 -296 450 912
4770 912 -7 -541 -805 59 677 264 -418 -571 -219 359 595 -52 -342 -259 118 634 437 -512 -368 -338 393
4791 393 581 8 -248 149 178 540 24 -296 -471 89 426 24 -179 -609 229 572 234 -288 -581 7
4811 7 470 561 -17 -629 -484 453 495 137 23 -467 -119 381 499 17 -334 -234 29 476 83 -318 -423
4832 -423 171 234 246 -289 -422 193 294 57 -505 -352 -171 354 445 -106 -584 -28 305 434 377 -620 -718 71
4854 71 495 322 -403 -338 -236 476 571 39 -352 -377 -205 238 30 -64 -332 304 640 138 -193 -228 -116 80
4876 80 428 13 -591 -403 138 532 353 -478 -222 290 422 258 -220 -678 -348 240 565 -85 -176 -40 377
4897 377 223 124 -141 -349 7 184 158 -266 -494 341 395 542 15 -334 -214 93 282 161 -584 -539 128
$$ packed form
4748C69M72o03p47p5Q32K43k55o35R8P0M57L86m32k90m5K32K87l96k55rP46M62
4770I12r19n34k64Q64O18m13o82j53L52N78K36o47k90Q3L77N16j97r49J44L0P31
4791C93J88n73k56L97K9L62n16l20j75N60L37m02k03m30Q38L43l38n22k93N88
4811GM63R1n78o12J45R37M2l58j14m90L48N00J18m82l51J00K63M47l93m01j05
4832d23N94O3J2n35j33O15J01k37n62J53J81N25R1n51m78N56L33J29n7r97r8P89
4854G1M24j73p25O5J02P12R5n32l91k5J72M43k08r4k68O36L36n02l31l5J12J96
4876H0L48m15o04J88N41L94j79q31K56N12J32j64m78m58L30N88L25o50r1J36M17
4897C77j54r9k65k08L56J77k6m24k28Q35N4J47n27l49J20L07J89j21p45M5O67
$$ plain form
4918 128 601 291 -284 -732 -51 826 623 -70 -538 -490 129 516 233 -425 -191 -14 553 307 -282 -310 -53
4939 -53 376 181 134 -452 61 132 165 118 -41 -171 145 349 272 -132 -263 -21 394 230 -28 -626 -225 -30
4961 -30 498 185 -232 -569 -13 524 205 -221 -556 -6 373 66 72 -554 -316 484 282 -68 -329 -118 253
4982 253 250 105 -310 -382 -48 392 311 -15 -572 -384 427 143 -158 -354 -638 -8 610 575 -270 -295 -30 230
5004 230 475 -275 -380 -320 324 296 287 -135 -284 107 378 130 -138 -507 -23 417 -93 -541 -460 -89 500 217
5026 217 -205 -414 -79 107 380 127 -308 -342 -63 589 152 35 -329 -310 323 492 -152 -524 -366 226 284
5047 284 217 -241 -224 124 624 -313 -356 -104 -176 61 32 -85 -288 -149 83 205 4 -260 -380 70 153 227
5069 227 -366 -475 15 331 321 113 -358 -282 127 367 304 -574 -391 86 235 252 -234 -538 -213 169 146 -10
$$ packed form
4918A28M73l10n75m48O81Q77k03o93m68M8O19L87k83o58K34J77N67k46n89k8K57
4939e3M29j95m7n86N13P1L3m7j59j30L16K04p7m04j31K42M15j64k58n98M01J95
4961c0N28l13m17l37N56N37l19m26l35N50L79l07Oo26K38Q00k02l50k61K11L71
4982B53lj45m15p2L34M40q1l26n57J88Q11k84l01j96k84O30O18l5q45k5K65K60
5004B30K45p50j05O0O44k8rm22j49L91K71k48k68l69M84M40n10m48Q1L71N89k83
5026B17m22k09L35J86K73k53m35l4K79O52m37j17l64J9O33J69o44l72J58N92N8
5047B84o7m58J7L48N00r37m3K52p2K37k9j17k03J39K32J22k01k64j20M50Q3P4
5069B27n93j09M90L16j0k08m71P6M09K40o3q78J83M77J49J7m86l04L25L82k3j56
$$ plain form
5091 -10 -374 -356 394 179 8 -185 -356 211 317 186 19 -481 -139 298 646 -255 -286 -504 16 257 153
5112 153 -301 -474 2 101 595 -276 -523 -322 386 461 -110 -265 -233 54 243 -256 -300 -309 200 154 354 -537
5134 -537 -294 112 261 507 24 -368 -388 198 353 97 -145 -631 -207 482 224 -283 -473 -116 65 398
5154 398 -167 -377 -396 194 594 99 -355 -113 140 428 365 -193 -462 141 207 230 -394 -122 -270 220 51
5175 51 256 -278 -230 -38 60 -67 -68 -269 -179 239 142 -189 -306 -98 131 494 337 -156 -389 28 146 302
5197 302 -248 -361 -75 291 183 -167 -441 15 490 542 19 -384 -477 161 177 -101 -387 -533 252 315 295 93
5219 93 -389 -125 158 597 168 -173 -343 -57 247 307 40 -427 259 303 -36 -247 -197 11 158 493 -71
5240 -71 -317 -246 256 419 202 -399 -334 57 608 20 -123 -371 -37 146 180 37 -139 -355 55 199 34
$$ packed form
5091a0l64J8P50k15j71j93j71N67J06j31j67n00L42M37L48r01l1k18N20K41j04
5112A53m54j73M76R9M94q71k47K01P08P5n71j55L2K87J89m99m4rN09m6K00q91
5134e37K43M06J49K46m83l92k0N86J55k56k42m86M24O89k58n07j90L57J81L33
5154C98n65k10j9N90M00m95m54K42K53K88o3n58k69O03O6K3o24K72j48M90j69
5175E1K05n34M8J92R8j27jk01R0M18r7l31j17K08K29L63j57m93k33M17J18J56
5197C02n50j13K86L66j08l50k74M56M75N2n23m03r3O38J6k78k86j46P85O3k0k02
5219I3m82K64K83M39m29l41j70K86L04O0k67m67O86M4l39k11N0K08J47L35n64
5240g1k46P1N02J63k17o01O5L91N51n88j43k48L34J83L4j43j76k16M10J44j65
$$ plain form
5261 34 -85 -240 -207 179 -44 -326 -236 -185 517 184 -251 -395 -196 116 275 223 -510 -523 2 517 220 -117
5283 -117 -485 33 372 376 -55 -366 -161 63 413 -163 239 -411 -11 214 133 271 -262 -329 22 115 100 -302
5305 -302 -40 352 347 -36 -437 -120 -81 147 348 -4 -477 -97 266 82 206 -325 -413 140 675 132 -321
5326 -321 -494 166 589 101 -203 -344 106 560 232 -112 -233 -37 -10 385 69 35 -335 -178 432 166 -288
5347 -288 -208 -432 296 426 -55 -321 -216 205 367 205 -465 -142 160 295 137 -138 -494 -209 267 119
5367 119 85 -258 -190 219 498 81 -40 -229 -35 130 180 -190 -170 -130 179 325 -301 -345 -243 65 305 274
5389 274 -434 -341 -285 333 429 -218 -358 79 467 243 78 -350 -55 282 115 30 -175 -245 95 160 134 -72
5411 -72 -283 -93 417 23 27 -124 -101 44 403 23 45 133 160 251 176 -448 -255 -312 319 604 -181 -211 -482 331
$$ packed form
5261C4j19j55L3L86k23k82R0N1P02l33m35j44J99L12J59n2p33j3N25N15k97l37
5283a17l68N18L39Mm31l11K05K24L50n76M02o50M00K25q1J38n33o7L51R3j5m02
5305c02K62L92nl83m01L17L9K28K01l52m73L80L63j84J24n31q8N53N35n43m53
5326c21j73O60M23m88l04j41M50M54l28l44j21J96K7L95l16l4l70J57O10k66m54
5347b88Q0k24P28J30m81k66J05M21J62j62o70L23L02J35j58k75l56K85M76j48
5367A19l4l43O8M09K79m17j21j89J94J65N0l70K0M0L09J46o26m4J02L08K40l1
5389B74p08R3N6O18R6o47j40M37L88k24j65m28K95L37j67q5k05p0L40O5k6k06
5411g2k11J90N10l94Mj51K3J45L59l80K2Q8K7R1p5o24J93n7O31K85p85l0k71Q13
$$ plain form
5435 331 426 158 -321 -317 78 339 74 -180 -260 -193 172 321 -300 -122 -203 60 157 -28 -255 -173 -153 251 -26
5458 -26 -175 -201 8 405 231 -43 -451 -134 177 368 374 -594 -216 166 328 236 -254 -369 22 180 328 -43
5480 -43 -529 -154 194 368 29 -68 -406 347 296 -116 -403 -263 188 408 412 63 -245 -5 424 364 6 -203
5502 -203 -485 82 20 370 -21 -188 -144 322 494 64 -557 -291 356 172 -68 -327 27 -267 251 174 -244
5523 -244 -150 74 268 214 2 -251 -48 217 152 3 -274 -19 142 378 355 -16 -424 -38 68 228 -52
5544 -52 -208 -161 72 481 109 -317 -239 40 119 2 -325 -170 103 497 249 -292 -343 37 428 -26 -156 -419
5566 -419 -248 239 253 -298 -330 -307 171 173 265 34 -194 -94 281 -37 25 -266 -25 -1 415 178 -310 -25 42
5589 42 226 64 123 -631 -52 45 294 -163 -288 -160 269 214 -39 -291 -330 46 280 215 -465 -224 -74 127
$$ packed form
5435C31R5k68m79ML95K61k65k54q0O7L65J49o21J78q1K63R7j85k27Q2K0M04k77
5458b6j49k6K09L97j74k74m08L17L11J91Or68L78L82J62r2m90j15L91J58J48l71
5480d3m86L75L48J74l39r7l38P53n1m12k87J40M51K20Ml49l08K40M29o0l58k09
5502b03k82N67o2L50l91j67M4M66J72m30o21K66O47j84k40k59L54k94N18p7m18
5523b44R4K24J94n4k12k53K03K65o5j49k77K55J61K36k3l71m08L86J06J60k80
5544e2j56M7K33M09l72m26P8K79P9j17l27J55K73L94k48n41n1L80L91m54j30k63
5566d19J71M87J4n51l2K3M78KR2k31k28J00L75l18O2k91K41K4M16k37m88K85O7
5589D2J84j62N9p54N79R7K49m57j25J28M29n5k53k52l9L76K34o5o80K41J50K01
$$ plain form
5611 127 194 20 -133 -297 180 395 185 -87 -128 144 154 -27 -209 -65 82 177 360 -85 -494 -398 326 464
5633 464 -65 -39 -264 -79 88 332 -3 -283 1 177 378 -100 -145 -470 209 98 291 -376 -177 66 209
5654 209 474 -85 -171 -4 350 49 48 -123 -160 396 221 227 -429 -473 -30 202 228 4 -163 -58 322 59 115
5677 115 16 -165 -105 376 -83 -320 -187 -141 254 401 41 -324 -345 -53 -87 -22 -295 -128 286 219 218 -185 -69
5700 -69 68 262 20 -351 -35 -9 224 290 57 -337 -368 82 318 -1 -634 61 115 453 349 -294 -282 -206
5722 -206 126 -40 -16 -243 86 168 213 63 -216 -73 18 364 207 -35 -196 -141 231 -184 -115 -351 -268 -106
5744 -106 329 -177 -324 -165 -18 515 250 -234 -224 146 349 408 -164 -403 -266 100 209 185 -42 -186 -34
5765 -34 -44 204 -41 116 -137 -227 82 -20 -286 -443 129 87 154 -414 -38 278 342 -81 -105 -182 -24 516 110
$$ packed form
5611A27O7j74j53j64M77K15k10k72m1K72J0j81j82J44J47R5J83m45m09R6P24J38
5633D64n29K6k25J85J67K44l35k80K84J76K01m78m5l25O79j11J93o67J99K43J43
5654B09K65n59q6J67L54l01jj71l7N56j75Oo56m4M43K32K6k24j67J05L80k63N6
5677A15r9j81O0M81m59k37J33M6L95J47l60l65k1K92l4O5k73J67M14o7jm03J16
5700f9J37J94k42l71L16K6K33O6k33l94l1M50K36l19o33O95N4L38j04o43J2P6
5722b06L32j66K4k27L29Q2M5j50k79J43R1L46j57k42j61N5L72m15O9k36Q3J62
5744a06M35n06j47J59J47N33k65m84J0L70K03N9n72k39J37L66J09k4k27j44J52
5765c4j0K48k45J57k53r0L09j02k66j57N72m2O7n68L76L16O4m23k4p7J58N40m06
$$ plain form
5788 110 -123 -461 -383 404 450 -57 -164 37 103 251 9 -152 -331 84 307 169 -147 -80 -38 -83 257 -46
5810 -46 -171 -292 132 286 -214 -350 -155 -220 327 132 -49 16 -128 398 215 -64 -259 66 152 213 194 -202
5832 -202 -330 -47 234 245 -151 -4 -32 58 287 0 -190 -93 458 283 -155 -227 -150 -328 178 -72 -96 -536
5854 -536 110 351 360 -56 -305 -26 196 366 -76 -107 -214 -124 459 189 -260 -183 -196 221 49 163 -167 -199
5876 -199 -167 292 -128 -158 -77 33 225 100 -138 -350 -197 287 115 379 -229 -136 106 268 -48 -188 -259 -252
5898 -252 357 76 -106 -368 105 312 167 -116 141 -109 -44 377 313 -167 -74 -29 -30 339 -328 -309 74 288
5920 288 314 47 -37 58 318 30 -93 -190 84 253 713 218 -111 -99 -206 -47 168 80 -367 -201 14 472
5942 472 -191 -170 -143 99 -113 260 -334 -202 29 220 184 102 23 -281 266 -70 143 -311 -410 211 258 -122
$$ packed form
5788A10k33l38P8P87M6n07j07K01O6J48k42j61j79M15K23j38l16O7M2m5L40l03
5810d6j25j21M24J54n00j36J95o5N47j95j81O5j44N26j83k79j95L25Q6O1j9l96
5832b02j28K83K81J1l96J47k8R0K29k87j90R7N51j75m38p2P7j78N06k50k4m40
5854e36O46K41Rm16k49K79K22J70m42l1j07R0N83k70m49P7j3M17j72J14l30l2
5876a99L2M59m20l0Q1J10J92j25k38k12J53M84j72K64o08R3K42J62l16j40p1P
5898b52O09k81j82k62M73K07j45k83K57k50O5M21o4m80R3M5jL69o67J9L83K14
5920B88K6k67q4R5K60k88j23r7K74J69M60m95l29J2j07J59K15q8m47J66K15M58
5942D72o63K1K7K42k12L73n94J32K31J91l6q2p9l04N47l36K13m54r9O21M7l80
$$ plain form
5964 -122 -195 -300 42 24 39 107 -360 30 245 286 -17 -49 -167 -44 263 258 34 -413 180 148 -31 -179 -64
5987 -64 -99 256 234 19 -353 -268 214 287 187 -160 -339 128 370 207 -198 -465 -266 165 335 235 96 34
6009 34 -37 34 89 -6 -269 268 98 49 -59 -255 -267 58 109 103 31 -42 -205 134 -28 -365 -32 23 136 149 -451
6034 -451 165 156 212 377 -317 -329 -194 176 123 -145 -212 -175 -127 440 151 21 -132 -247 36 232 12 -75 -212
6057 -212 -59 259 43 -35 -396 -37 192 26 -172 -269 145 241 266 -159 -160 -85 156 168 -92 -468 -361 233 262
6080 262 10 73 52 116 73 129 189 20 133 -133 214 -151 -90 -107 8 61 58 -189 -148 -13 18 79 -109 -282 -57
6105 -57 466 -42 91 -105 62 -121 129 -103 -90 -196 -125 -58 189 -50 -38 -135 132 -108 302 63 -346 -49
6127 -49 179 279 144 -33 -81 119 124 126 -175 -47 193 440 245 -333 -117 206 22 181 -457 46 -7 214
$$ packed form
5964a22p3j05L42j8J5O8m67L90K15M1l03l2j18J23L07nk24m47N93l2j79j48J15
5987f4l5L55k2k15l72Q5M82P3j00l47j79M67K42j63m05k67J99M31J70j00j39o2
6009C4p1P1N5r5k63N37j70m9j08j96j2L25N1op2p3j63L39j62l37L33N5J13J3o00
6034d51O16rN6J65o94j2J35L70n3k68o7L7M8N67k89j30j53j15K83J96k20q7j37
6057b12J53L18k16p8l61L59K29j66j98r7M14R6K5m25jP5K41J2k60l76J07N94K9
6080B62k52O3k1O4m3N6O0j69J13k66L47l65O1j7J15N3lk47M1J35L1O1j88j73K25
6105e7N23n08J33j96J67j83K50k32J3j06P1O7K47k39J2r7K67k40M10k39m09K97
6127d9K28J00j35j77m8K00NKl01J28K40K47j95n78K16L23j84J59o38N03n3K21
$$ plain form
6149 214 313 -143 -253 -249 170 213 170 -29 98 -18 82 174 -113 -81 64 250 246 -111 -1 -150 195 46 -156
6172 -156 -244 89 63 177 -141 -202 -211 32 269 62 95 -152 -109 113 448 -25 -125 -121 363 573 -50 41 160
6195 160 -329 -179 121 -91 -105 -16 203 -111 -250 -280 38 71 223 286 -201 85 260 1 211 -23 -139 -128
6217 -128 252 295 76 -278 -200 196 272 84 -238 -337 -230 170 366 -90 -391 -138 104 5 160 118 101 116 -20
6240 -20 -24 57 -243 -43 140 -48 -124 -189 217 131 277 -16 -264 -36 -84 456 -199 -153 -402 35 265 10 -167
6263 -167 -233 183 348 197 260 -164 -161 145 209 196 -51 -23 -31 145 353 -20 -100 276 -53 160 -114 -287 11
6286 11 119 318 -79 -137 -170 109 -7 132 72 -192 -370 153 240 -40 -175 -123 317 520 370 160 -49 142
6308 142 124 -77 154 -50 -96 21 179 117 -293 37 29 242 -200 -108 -209 -98 349 81 -151 -288 -40 207
$$ packed form
6149B14R9m56j10MM19M3m3j99J27j16J00R2k87L2J45J86ml57J10j49L45j49k02
6172a56q8L33k6J14l18o1rK43K37k07L3k47M3K22L35m73j00MM84K10o23R1J19
6195A60m89J50L00k12j4Q9K19l14j39l0L18L3J52O3m87K86J75k59K10k34j16J1
6217a28L80M3k19l54P8L96P6j88l22r9J07M00J96m56l01K53K42r9J55m2j7J5j36
6240b0mQ1l00K00J83j88p6o5M06q6J46k93k48K28m8N40o55M6k49M37K30k55j77
6263a67o6M16J65j51O3m24LL06O4j3k47K8qJ76K08l73q0L76l29K13k74j73K98
6286A1J08J99l97n8l3K79j16J39o0k64j78N23Q7k80j35N2M40K03j50k10k09J91
6308A42j8k01K31k04m6J17J58o2m10L30qK13m42R2j01J11M47k68k32j37K48K47
$$ plain form
6330 207 154 54 -300 204 21 259 276 -172 -272 2 253 143 -172 74 -114 180 149 -178 -476 25 -1
6351 -1 248 -99 -34 -36 155 231 -262 -170 -117 71 189 -42 -130 -305 -59 167 26 181 -201 -81 -125 211 144 -55
6375 -55 -96 12 143 145 203 -210 -28 -136 70 132 -87 -26 161 145 -46 -70 96 -357 198 67 -271 -187 -284 -140
6399 -140 -21 -58 15 -195 -265 252 20 -157 -567 -56 167 210 -119 -178 14 38 237 305 -130 105 -198 377
6421 377 82 -63 -59 360 209 -209 89 -163 -350 92 209 -97 -117 -88 35 416 96 -257 -107 -40 294 68
6443 68 -80 -266 -338 -20 156 29 -451 -36 101 61 432 -170 -149 -112 -61 131 -123 -282 -120 254 -270 -80
6465 -80 -35 -69 229 -25 -373 -287 -199 229 323 17 -211 -87 -2 50 -28 494 49 20 -313 125 86 -135 -146 -33
6489 -33 -46 228 -122 -129 269 270 166 146 -71 -218 109 17 -75 -183 47 -6 260 -24 -117 -255 -172 96 171 232 -109
$$ packed form
6330B07n3j00l54N04j83K38J7m48j00K74K51j10l15K46j88K94l1l27k98N01k6
6351aK49l47O5kJ91P6m93R2N3J88J18k31q8j75K46K26j41J55l82J20m4L36o7j99
6375e5m1J08J31KN8m13J82j08K06O2k19O1J87j6j91k4J66m53N55j31l38Q4r7J44
6399a40J19l7P3k10p0N17k32j77m10N11K23M3l29n9J92K4J99O8m35K35l03N75
6421C77k95j45MM19j51m18K98k52j87M42J17l06k0K9J23L81l20l53J50O7L34k26
6443F8j48j86p2L18J76j27m80M15J37m0L71o02K1L7N1J92k54j59J62L74n24J90
6465h0M5l4K98k54l48Q6Q8M28R4l06k28J24Q5N2p8N22m45k9l33M38l9k21j1J13
6489c3j3K74l50pL98Jj04k0k17j47L27r2r2j08K30n3K66k84r3j38Q3K68P5O1l41
$$ plain form
6514 -109 -18 200 333 -31 -52 -40 -142 385 246 -158 -6 -40 97 112 -338 -141 -66 124 266 150 -362 -396
6536 -396 168 22 23 -87 -358 1 165 41 -1 -319 -192 -17 86 -13 -423 -159 -123 -68 -8 -8 -46 -35 62 110
6560 110 23 -332 -242 193 -100 30 -159 -36 -22 275 -240 57 -232 159 181 131 46 -362 35 117 279 -68
6582 -68 -5 -52 -61 267 -48 43 63 -200 41 121 -7 138 -58 -107 230 222 -123 66 -24 106 -148 160 -25 274
6606 274 -11 33 96 67 -42 232 296 -142 -61 -258 14 344 8 -253 -349 -46 -85 212 -18 -222 -156 171 -147
6629 -147 -121 74 -205 -15 -130 170 53 -280 -162 -49 -18 87 -81 37 218 54 -18 50 -167 -12 207
6650 207 131 -226 -183 66 302 -125 80 -372 -139 -27 173 -108 -184 -58 -110 150 160 -15 -105 242 -34 243
6672 243 -48 -154 -58 150 71 -114 -54 21 71 -13 -48 -367 88 -239 222 32 -41 -178 128 220 246 -178 -106 -298
$$ packed form
6514a09R1K18J33l64k1J2j02N27j39m04J52l4J37J5m50J97P5J90J42j16n12l4
6536c96N64j46Jj10k71L59J64j24m2l18J27J75J03r9m10K64L6N5O0%l8J1R7M8
6560A10q7l55R0M35k93J30j89J23J4K97n15K97k89L91K2n0q5m08L97Q2J62l47
6582f8O3m7rL28l15R1K0k63K41Q0j28J45j96m9L37ql45J89r0J30k54L08j85K99
6606B74k85M4O3k9j09K74O4m38Q1j97K72L30l36k61r6L03l9K97k30k04O6L27l18
6629a47K6J95k79J90j15L00j17l33J18J13L1J05j68J18J81j64p2O8k17J55K19
6650B07p6l57M3K49K36m27K05m52K33J12K00k81p6J26n2K60J0j75r0L47k76K77
6672B43k91j06R6K08p9j85O0P5N0q4l5l19M55l27M61j90p3j37L06R2K6m24P2j92
$$ plain form
6696 -298 230 312 239 -217 46 32 51 101 119 63 214 160 86 5 58 2 180 -112 118 96 -125 309 129 167 168
6721 168 -219 -315 123 29 47 -22 -323 -428 21 249 74 -53 -140 173 260 62 -12 -205 -23 111 -86 -75 66
6744 66 -43 195 77 -53 -147 -99 31 -86 56 -314 110 401 346 -168 -177 -42 -21 427 104 -129 -127 -18 124
6767 124 240 -105 162 -144 127 186 -147 174 -303 -197 -45 117 136 -171 234 177 -159 -275 -376 23 98
6788 98 41 152 -85 45 133 203 249 -32 -82 186 137 342 -153 64 -76 -26 196 79 -42 -356 192 78 3
6811 3 -62 -343 -152 223 60 -121 237 125 91 25 -217 -28 -118 435 95 -78 55 -229 233 -187 180 76
6833 76 -38 -107 239 -34 -197 101 -372 116 88 122 -198 -326 -192 -11 -96 -60 -144 -86 -91 234 194 -147 -263 233
6857 233 158 -103 10 -31 167 110 104 -166 176 142 -53 278 5 -37 -89 -233 200 191 -88 27 65 160 227 2
$$ packed form
6696b98N28Q2p3m56K63j4J9N0J8n6J51n4p4q1N3n6J78k92K30k2k21M34j80L8J
6721A68l87r6M38r4J8o9l01j05M49K28j75j27q7L13Q7j98p4j93J82J34j97J1J41
6744F6j09K38j18j30r4M8J30j17J42l70M24K91n5n14rJ35K1M48l23k33KJ09J42
6767A24J16l45K67l06K71N9l33L21m77J06J52J62J9l07M05n7l36j16j01L99P5
6788I8n7J11k37J30Q8P0M6k81n0K68m9K05m95K17j40N0K22j17j21l14N48j14p5
6811Co5k81J91L75j63j81L58j12l4o6k42J89r0N53l40j73J33k84M62m20L67j04
6833G6j14o9L46k73j63K98m73M88k8L4l20j28J34J81q5L6q4N8nL25m0l41j16M96
6857B33p5k61J13m1J98n7ok70L42l4j95L31k73m2n2j44M33rk79J15L8R5O7k25
$$ plain form
6881 2 -263 -84 213 42 43 -148 289 107 -159 -8 -166 100 -38 482 25 -336 -156 -9 -193 7 -335
6902 -335 -96 63 108 -121 -126 56 -158 152 443 159 -71 -84 -51 -9 117 13 -125 -49 -17 29 -157 -154 -103 -230
6926 -230 -59 276 288 310 55 48 215 -137 -88 -85 152 94 -175 -276 -92 154 85 -126 -112 227 -426 281 333 -158
6950 -158 -260 -46 63 176 138 -17 196 -144 113 -50 -181 10 -163 -103 -29 235 -50 154 61 -111 -94 -277
6972 -277 331 153 85 124 -36 -77 99 -65 195 -115 -83 -183 -7 211 -17 137 -235 62 85 268 37 -241
6994 -241 -85 96 -21 -38 -256 54 166 194 -56 69 -62 61 87 99 -202 37 101 271 -11 15 -228 -432
7016 -432 -28 20 157 191 108 -259 -84 -105 301 -27 -153 103 184 -46 -14 -18 -9 55 -180 8 -94 91 288 71
7040 71 -56 -72 -30 -255 -39 35 -310 220 123 -42 -104 4 -20 152 -100 -204 9 59 -104 41 -155 26 -107
$$ packed form
6881Bk65J79K97j71Jj91M37j82k66J51j58K66j38N20m57l61J80J47j84K00l42
6902c35K39J59M5k29nJ82k14L10K91k84k30j3L3M2J26j04j38P6L2M6j86LN1j27
6926b30J71L35J2K2k55pJ67l52M9LK37n8k69j01J84K46o9k11J4L39o53P07N2m91
6950a58j02K14J09J13l8j55K13l40K57j63j31J91j73O0P4K64k85K04r3j72J7j83
6972b77O08j78o8L9j60m1J76j64K60l10L2j00J76K18k28J54l72K97K3J83k31k78
6994b41J56J81j17j7k18L10J12K8k50J25j31J23K6J2l01K39O4J70k82K6k43k04
7016d32M04M8J37L4q3l67J75k1M06l28j26K56Q1k30L2mRO4k35J88j02J85J97k17
7040G1j27j6M2k25K16P4l45N30r7j65o2J08k4J72k52j04K13N0j63J45j96J81j33
$$ plain form
7063 -107 133 -95 -79 56 -164 230 4 24 -230 -114 74 114 279 -15 -302 -51 95 130 -74 -159 -101 -150
7085 -150 -3 -51 76 8 -195 166 313 144 -143 -66 56 -132 160 69 -44 -82 -80 99 42 -166 9 -10 230
7108 230 16 -127 -198 -6 128 202 83 -267 -178 48 -88 -79 55 59 75 118 -120 -94 -380 238 13 229 120
7131 120 -69 71 247 314 85 -69 -12 142 -92 -94 -17 -231 -223 113 236 -3 -162 -24 217 64 226 -76
7153 -76 -17 -106 47 -7 182 -289 34 111 37 -79 -33 -121 41 318 -70 -212 75 -117 148 83 79 149 -42 149
7177 149 -182 -256 -91 -39 -86 183 128 -150 -22 -116 112 -67 -61 -69 -229 130 461 -398 -174 128 180 57 97 282
7201 282 -71 231 -3 -23 126 46 174 79 79 -438 -59 74 -98 162 -162 -140 88 145 59 -73 -50 -67 -196
7224 -196 -32 237 -100 -152 27 67 145 223 129 -70 24 182 68 -81 -62 -292 258 -29 -107 -41 159 -108 157
$$ packed form
7063a07K40k28J6J35k20L94k26K0k54J16J88M0J65k94k87K51J46L5k04q5N8m9
7085a50J47m8J27o8k03L61J47j69k87P7J22j88K92r1j13l8KJ79n7k08J75j9K40
7108B30k14j43p1J92J34P4j19l50Q9K26j36RJ34MJ6M3k38K6k86O18k25K16j09
7131A20j89J40J76O7k29j54N7J54k34kP7k14QL36J23k39j59J38K41j53J62l02
7153g6N9q9J53n4J89m71L23P7p4j16M6q8J62K77l88j42K87j92K65o5mP0j91J91
7177A49l31p4J65N2m7K69n5k78J28r4K28j79Oqj60L59L31q59K24L02N2j23M0J85
7201B82l53L02k34k0J49q0J28r5%n17L79J33j72K60l24K2K28N7q6j32K3j7j29
7224a96J64K69l37n2J79M0P8P8r4j99R4J58j14j49J9k30N50k87p8O6K00k67K65
$$ plain form
7247 157 11 12 -64 -96 280 -293 256 -106 156 237 59 -45 -148 209 164 390 50 -10 -264 -107 140 25
7269 25 60 183 19 0 225 60 -133 -68 -164 381 -14 -247 0 57 82 62 302 -342 38 -40 -105 -117 45 -55
7293 -55 72 116 35 -195 127 161 135 -77 282 94 133 41 78 140 -405 -151 -212 195 -34 -148 -61 157 34 267
7317 267 147 218 34 224 -128 -283 -658 160 186 184 10 -62 -92 -119 -40 117 -83 -86 134 168 -95 -151 20 71
7341 71 85 -243 131 22 84 -229 -3 148 34 -39 -91 94 -214 192 -45 168 96 -7 220 177 -15 137
7363 137 128 -76 263 -16 180 146 -338 -226 -150 25 90 148 178 -127 327 1 183 54 -218 52 29 120 162
7386 162 18 -269 181 82 162 -280 8 -231 -182 190 251 -214 171 119 30 -142 -208 -91 -10 76 136 -399 -47
7409 -47 -278 124 25 292 -116 -229 -19 -8 72 -353 246 -147 -59 -79 225 75 295 47 -56 220 -121 -150
$$ packed form
7247A57j46Jp6l2L76n73N49l62K62Q1j78j04j03L57m5K26l40o0k54J57K47j15
7269B5L5J23j64j9K25j65j93O5r6N45l95k33K47N7K5k0K40o44L80p8o5j2J62j00
7293e5J27M4q1k30L22L4k6k12L59j88L9r2L7O2n45K54o1M07k29j14Q7K18j23K33
7317B67j20P1j84J90l52j55l75Q18K6kj74p2l0k7P9J57k00lK20L4k63n6J71N1
7341G1J4l28L74j09O2l13K26J51j14p3n2J85l08M06k37K13p2j03K27m3j92J52
7363A37rk04L39k79J96l4m84J12P6J75O5N8L0l05M54l26J82j29k72K70k3R1M2
7386A62j44k87M50r9Q0m42K88k39M9L72O1m65L85n2q9j72o6J17Q1Q6O0n35L52
7409d7k31M02r9K67m08j13K10J1Q0m25N99l93Q8k0L04j50K20k48j03K76l41k9
$$ plain form
7431 -150 -231 30 -113 -277 45 -43 426 46 -194 -52 75 404 57 60 29 -31 92 169 -76 -33 -126 262 154
7454 154 33 75 -7 -26 39 53 116 -11 12 2 2 -90 -56 -117 192 -29 40 47 -197 -158 289 172 -126 111 -31 163
7480 163 -71 105 -435 -340 -12 -152 36 -38 -149 79 96 320 0 181 331 55 294 48 110 148 -271 19
7502 19 -295 -95 10 261 150 208 230 180 -9 184 106 -9 -230 68 29 130 84 -338 -164 52 22 68 -94
7525 -94 -222 75 205 -13 115 86 83 145 51 -121 36 107 -153 -117 121 109 84 127 132 196 75 186 189 -93 -59 181
7551 181 -36 35 -306 38 17 -40 39 -15 37 -75 57 -48 27 -1 -86 140 98 -165 137 -4 -220 42 -105
7574 -105 -268 -97 96 -110 -36 -152 119 5 -76 -100 -284 90 206 5 -163 7 -86 54 154 -135 22
7595 22 -66 139 35 -76 -513 -88 133 68 150 250 276 115 169 229 57 139 86 -2 -323 -229 27 100 5 85 142
$$ packed form
7431a50q1K61j43j64L22q8M69l80k40J42J27L29l47Ll1o0J23P7k45M3r3L88j08
7454A54j21M2q2j9O5J4O3j27K3j0%r2L4o1L09k21O9Pk44L9M47j17k98K37j42J94
7480A63k34J76n40R5L28j40J88p4j11K28J7K24l20J81J50k76K39k46O2L8m19K90
7502A9l14K00J05K51j11N8K2n0j89J93p8j15k21K98l9J01m6m22J74K16l0M6j62
7525i4j28K97J30k18J28k9lO2r4j72J57P1k60L6K38j2k5M3NO4j21J11Lk82L4K40
7551A81k17P1l41L44k1n7P9n4N2j12J32j05P5k8q5K26m2k63L02j41k16K62j47
7574a05j63J71J93k06P4j16K71j14q1k4j84L74J16k01j68J70r3J40J00k89J57
7595B2q8K05j04j11m37M25K21o5Q2J00K6j61N4O0j72Q2n3q8l21R4K56P3r5Q0N7
$$ plain form
7620 142 -7 -136 -250 106 190 187 -197 -53 -68 -13 88 -21 -331 169 60 42 74 46 -211 127 107 155 33
7643 33 28 -70 280 -63 160 149 170 155 35 -157 -96 109 -37 8 -443 -1 -133 157 321 -40 -81 -61 -178 206
7667 206 255 18 -72 109 151 196 -91 -224 263 -202 -46 39 61 -40 -88 128 -25 9 54 51 180 172 -85 14 118
7692 118 167 12 195 -86 -115 -37 125 59 -218 -71 -151 309 274 264 -14 -1 -80 306 234 -238 32 -27 -9 100
7716 100 170 -52 -18 -2 180 13 -133 105 43 -18 -3 -139 32 316 -119 -230 9 -167 12 41 -68 -151 -23
7739 -23 -134 143 126 -16 230 -51 -178 145 -206 -231 166 151 -56 -184 -106 102 -253 -137 -73 -231 312 143
7761 143 81 39 189 236 38 202 345 279 8 -17 21 36 42 -26 111 -141 -231 -40 -161 -150 -60 -64 262 36 26
7786 26 81 100 -197 31 -213 191 66 134 65 -270 118 85 -163 51 226 -121 80 -104 194 165 125 -48 -83
$$ packed form
7620A42j49j29j14L56Q4ll84J44j5N5J01j09l10N00j09j8L2k8k57L38k0M8j22
7643C3nr8L50l43K23j1K1j5j20j92O1K05j46M5m51M42j32K90J64l61m1K0j17L84
7667B06M9k37r0J81M2M5k87j33M87m65J56Q5K2j01m8K16j53L4M5lJ29qk57R9J04
7692A18M9j55J83k81k9P8J62o6k77J47q0M60l5j0k78J3p9L86p2m72K70n9J8J09
7716A00P0k22L4J6J82j67j46K38o2o1J5j36J71K84m35j11K39j76J79K9j09q3J28
7739b3j11K77j7j42K46k81j27L23l51k5L97j5k07j28P8K08l55J16O4j58N43j69
7761A43o2m2J50M7j98J64J43o6k71k5L8J5Oo8J37k52r0J91j21J1R0mL26k26j0
7786B6N5J9k97K28k44M04j25O8o9l35L88l3k48K14J75l47K01j84K98k9m0j73l5
$$ plain form
7809 -83 29 -52 -26 362 -177 -136 -26 331 -206 -115 2 22 -163 96 -34 216 -87 -47 -125 -14 475 -153 218
7832 218 -235 6 -384 50 -21 11 57 -174 -209 -27 -469 105 -157 -262 39 246 16 20 205 161 -41 -181
7854 -181 80 -78 -17 41 34 143 -82 4 -90 -80 175 -227 74 -41 30 190 76 -39 102 164 183 -62 -215
7877 -215 -191 -96 -42 71 -46 176 16 -54 56 115 -102 -105 -260 191 58 -123 -226 -48 184 -273 -85 -6 -3
7900 -3 393 205 -75 -135 -266 -232 183 47 -38 7 72 116 145 -51 -38 88 -52 143 -272 30 142 9 3 1 185
7925 185 -14 192 -12 -163 -38 -73 20 113 134 128 106 -137 -190 46 121 224 -41 -147 72 232 -260 3 -7
7948 -7 148 54 178 97 -177 18 -139 2 -187 -196 215 -82 14 -68 6 267 90 320 -105 6 85 -25 -110 -27
7972 -27 -13 223 213 102 195 -31 51 178 133 -3 8 -3 111 -14 -26 -80 39 98 68 -297 12 213 -75 -101
$$ packed form
7809h3J12q1K6L88n39M1J10L57n37R1J17K0j85K59j30K50l03M0p8J11M89o28L71
7832B18m53K41l90M34p1L2M6k31l5J82m42N74k62j05L01K07k30MJ85m4k02j40
7854a81K61j58O1N8pJ09k25Q6r4J0K55m02L01j15P1J60j14j15J41O2J9k45j53
7877b15K4R5N4J13j17K22j60p0J10N9k17lj55M51j33j81j03J78K32m57J88P9L
7900cL96j88k80o0j31L4M15j36q5M5O5M4K9j96J3J26j40J95m15L02J12j33okJ84
7925A85j99K06k04j51J25l5R3R3K1ok2k43n3K36P5J03k65j06K19J60m92K63j0
7948gJ55r4J24q1k74J95j57J41j89rM11k97R6q2P4K61j77K30m25J11P9j10q5Q3
7972b7J4K36j0j11R3k26Q2J27m5j36J1j1J14j25j2n4J19N9l0l65L09K01k88k6
$$ plain form
7996 -101 78 65 -72 -67 -78 211 -267 -16 -2 -43 18 -85 -134 -115 241 101 137 -78 -45 10 26 -59 139 -145 -224
8021 -224 -22 57 65 91 -1 4 -184 -105 -120 64 38 70 -152 280 45 -216 132 446 -32 59 -38 137 139 -104 -2
8046 -2 -79 -203 205 92 15 -75 -66 77 -29 -131 -81 -44 -212 -29 137 173 -17 49 -150 -58 56 12 -388 -72
8070 -72 159 158 -66 28 -288 -207 -109 -143 260 -53 159 68 39 -109 58 -2 -34 -118 -15 43 -226 90 303 -68
8094 -68 -62 -336 -15 220 -3 229 -74 -276 62 390 -219 -162 -207 -83 45 116 21 -323 170 -173 245 -135
8116 -135 155 -72 -30 3 -98 164 90 97 119 -22 62 -216 3 58 220 -119 -371 -71 -50 69 -122 196 195 326
8140 326 -24 -156 -163 28 -73 303 -16 -87 448 -32 -156 285 -155 -75 -264 143 121 -104 -25 -77 -89 -76 327
8163 327 -296 -48 29 -92 97 99 154 -33 124 -11 90 76 377 -105 -58 -97 -21 -285 -80 -44 250 228 272 65
$$ packed form
7996a01J79j3j37Nj1K89m78K51J4m1O1j03m9J9L56j40L6k15L3N5J6q5J98k84p9
8021b24K02P9QK6r2Nj88P9j5J84k6L2k22M32k35k61L48L14m78R1r7J75Kk43J02
8046bp7j24M08j13p7r0RJ43j06j02N0L7j68J83J66L6j90O6j99R2J14m4m00L16
8070g2K31jk24R4l16Q1R8l4M03l13K12r1k9j48J67o0l2q4J03N8k69L16K13l71
8094f8Ok74L21K35k23K32l03k02L38L28o09N7m5J24J28P1r5l44M93l43M18l80
8116a35K90k27M2L3j01K62p4PK2j41Q4k78K19N5J62l39k52L00K1J19j91L18jJ31
8140C26l50j32pJ91j01L76l19p1N35m80j24M41m40Q0j89M07k2k25P9n2j2J3M03
8163C27o23K48P7j21J89KN5j87J57j35J01j4L01m82M7l9P6k64K05L6K94k2M4k07
$$ plain form
8187 65 -39 -46 -17 -208
$$ packed form
8187F5j04pK9j91
8191b08
$$ Imaginary data points
##PAGE= N=2
##DATA TABLE= (X++(I..I)), XYDATA
$$ plain form
0 0 0 0 0 0 7 -7 7 -8 14 -14 21 -28 29 -39 48 -57 71 -83 97 -114 134 -157 181 -209 239 -275 313 -358
28 -358 402 -458 515 -578 649 -727 809 -903 1005 -1116 1236 -1373 1518 -1681 1864 -2061
44 -2061 2284 -2534 2818 -3134 3500 -3927 4427 -5028 5765 -6689 7890 -9528 11894 -15641
58 -15641 22505 -39216 164338 114113 -209679 -83824 -68188 86566 128669 -176315 -283337
69 -283337 17962 119638 148465 137369 -86902 -111581 162811 129677 -66093 -123521 -177508
80 -177508 -88564 151630 76476 -112776 -38501 67901 126014 196427 11200 -223642 -115144
91 -115144 60968 54403 479 -132856 -186171 63464 256727 127507 -26903 -85197 -69944
102 -69944 81969 128299 -88310 -213042 -101096 27848 118669 108854 -52547 -75594 106622
$$ packed form
0@%%%%Pj4J4j5K2k8L5m9N7o8Q7j05J28j54J80k11K48k91L38l90M48n14N88o71
28c58P60q60R73j093J227j376J536j712J908k121K352k609K891l199L545l925
44b061M345m818N352n952O634p427Q354r455J0793j2454J4579j7418K1422k7535
58a5641L8146o1721K03554n0225l23792J25855J5636J54754M2103l04984j07022
69b83337L01299J01676K8827j1096k24271k4679K74392l3134j95770n7428n3987
80a77508Q8944K40194p5154j89252P4275J06402N8113P0413j85227k34842J08498
91a15144J76112o565n3924j33335n3315K49635J93263j29220j54410n8294J5253
102f9944J51913M6330k16609j24732J11946J28944R0821r815j61401k3047J82216
$$ plain form
113 106622 142520 22684 -60748 -142913 -110455 70011 64984 -85571 -75221 -486 82874
124 82874 198995 86062 -139450 -95025 33891 42929 34621 -89978 -209205 -28354 163372
135 163372 114845 39622 -43059 -88568 77077 157576 -32478 -145353 -110878 -52981 78105
146 78105 95826 -66865 -67772 72255 100415 87427 17086 -128222 -88720 56854 30437 -47913
158 -47913 -75748 -83970 43562 173720 77927 -50474 -53431 -18473 58731 82457 -65842 -167080
170 -167080 -77894 44266 106949 75170 -49087 -73426 56455 123452 48420 -61054 -123519
181 -123519 -75278 43614 61224 -33219 -70821 -8188 77211 117813 47251 -73720 -74172 20962
193 20962 48417 -6253 -78994 -106864 -13555 110063 95300 -522 -49614 -32197 51698 102519
$$ packed form
113A06622L5898j19836q3432q2165L2458J80466n027j50555J0350P4735Q3360
124H2874J16121j12933k25512M4425J28916R038q308j24599j19227J80851J91726
135A63372m8527p5223q2681m5509J65645Q0499j90054j12875L4475N7897J31086
146G8105J7721j62691r07J40027K8160j2988p0341j45308L9502J45574k6417p8350
158d7913k7835q222J27532J30158r5793j28401k957L4958P7204K3726j48299j01238
170a67080Q9186J22160O2683l1779j24257k4339J29881O6997p5032j09474o2465
181a23519M8241J18892J7610r4443l7602O2633Q5399M0602p0562j20971m52R5134
193B0962K7455n4670p2741k7870R3309J23618j4763r5822m9092J7417Q3895N0821
$$ plain form
205 102519 -512 -125835 -108359 -10310 73224 75513 -30205 -82850 17430 105585 82896
216 82896 1069 -94188 -89618 27371 60767 -21728 -72851 -55255 30440 121066 69348 -49744
228 -49744 -55794 6426 50289 43256 -55808 -125068 -44619 59051 79504 35460 -48651 -56582
240 -56582 52328 104215 32288 -60976 -108706 -54524 57388 63100 -26123 -65407 -26281 60844
252 60844 113396 37064 -71966 -66990 6369 48339 17862 -70624 -91200 7063 87209 65995
264 65995 -3620 -53903 -19561 66286 65822 -28185 -95163 -76001 11862 80949 36943 -51585
276 -51585 -52771 23243 87506 73454 -22308 -94302 -55004 28729 52437 -1281 -68935 -58490
288 -58490 36437 99842 53201 -35209 -58962 -3433 53675 32865 -52209 -91692 -28332 56043
$$ packed form
205A02519j03031j25323J7476R8049Q3534K289j05718n2645J00280Q8155k2689
216H2896q1827r5257M570J16989L3396q2495n1123J7596Q5695R0626n1718j19092
228d9744o050O2220M3863p033r9064o9260Q0449J03670K0453m4044q4111p931
240e6582J08910N1887p1927r3264m7730N4182J11912N712q9223l9284L9126Q7125
252F0844N2552p6332j09030M976P3359M1970l0477q8486k0576R8263Q0146k1214
264F5995o9615n0283L4342Q5847m64r4007o6978J9162Q7863O9087m4006q8528
276e1585j186P6014O4263j4052r5762p1994L9298Q3733K3708n3718o7654J0445
288e8490R4927O3405m6641q8410k3753N5529N7108k0810q5074l9483O3360Q4375
$$ plain form
300 56043 66739 8922 -49902 -30740 56401 83440 5013 -73356 -77752 -13792 59584 41508
312 41508 -43003 -59428 566 62558 82931 17807 -71738 -55248 19998 41185 10031 -51415
324 -51415 -76407 4607 81163 49356 -10259 -36595 -20391 46458 58885 -32364 -83181 -41832
336 -41832 17267 59511 29044 -55766 -43326 47702 73501 34939 -29796 -82230 -32668 51849
348 51849 34893 -25590 -50963 -38335 36375 91656 29746 -43973 -38595 -2827 36141 33574
360 33574 -42148 -76774 -15033 41333 48305 17596 -36515 -30077 44171 61030 -1883 -55315
372 -55315 -59782 -8682 53101 30763 -43753 -47578 12776 60476 62577 -1463 -69041 -40063 31821
385 31821 38701 -4008 -50008 -58426 10408 74740 42162 -18368 -32853 -13573 31305 47004
$$ packed form
300E6043J0696n7817n8824J9162Q7141K7039p8427p8369m396O3960P3376j8076
312D1508q4511j6425N9994O1992K0373o5124q9545J6490P5246K1187l1154o1446
324e1415k4992Q1014P6556l1807n9615k6336J6204O6849J2427r1249n0817M1349
336d1832N9099M2244l0467q4810J2440R1028K5799l8562o4735n2434M9562Q4517
348E1849j6956o0483k5373J2628P4710N5281o1910p3719N378L5768L8968k567
360C3574p5722l4626O1741N6366O972l0709n4111O438P4248J6859o2913n3432
372e5315m467N1100O1783k2338p4516l825O0354M7700K101o4040o7578K8978P1884
385C1821O880m2709m6000q418O8834O4332l2578o0530j4485J9280M4878J5699
$$ plain form
397 47004 -18009 -69479 -35347 15110 40775 28605 -29615 -41236 30733 63333 21074 -26655
409 -26655 -58452 -32146 43258 39795 -33141 -50584 -16372 34928 77072 26599 -57831 -41037
421 -41037 18310 35774 22107 -36412 -75736 -11145 55927 40305 4812 -26686 -30344 30741
433 30741 57963 -3231 -48721 -42790 -12327 36859 35028 -30340 -42349 12953 48610 45210 55
446 55 -58100 -38208 33180 40114 -9856 -49374 -48139 15452 76222 39273 -34062 -43540 -3315
459 -3315 41467 43692 -22070 -72697 -33751 29649 46370 17636 -29895 -36511 20994 58893 21581
472 21581 -31345 -47742 -21634 28076 35149 -20067 -47650 -9555 37627 54151 18966 -45154
484 -45154 -43855 21552 45091 7732 -41838 -61146 -8489 62281 48041 -17240 -40942 -16699
$$ packed form
397D7004o5013n1470L4132N0457K5665j2170n8220j1621P1969L2600m2259m7729
409b6655l1797K6306P5404l463p2936j7443L4212N1300M2144n0473q4430J6794
421d1037N9347J7464j3667n8519l9324O4591O7072j5622l5493l1498l658O1085
433C0741K7222o1194m5490N931L0463M9186j831o5368j2009N5302L5657l400m5155
446E5n8155J9892P1388O934m9970l9518J235O3591O0770l6949p3335r478M0225
459c315M4782K225o5762n0627L8946O3400J6721k8734m7531o616N7505L7899l7312
472B1581n2926j6397K6108M9710P073n5216k7583L8095M7182J6524l5185o4120
484d5154J299O5407K3539l7359m9570j9308N2657P0770j4240o5281k3702K4243
$$ plain form
496 -16699 35211 57700 -1136 -63118 -44145 9500 39186 25473 -26773 -43019 11293 51365
508 51365 31691 -9135 -40878 -28952 23119 32989 -12693 -41300 -27283 16952 55463 28952
520 28952 -32185 -37907 6593 39946 29826 -26409 -64578 -24925 37755 47211 6248 -39083
532 -39083 -32846 27234 58529 17869 -38832 -50098 -9104 35753 26539 -20763 -39586 -7499
544 -7499 36169 43140 4051 -34410 -25501 15204 32033 1740 -38463 -38916 5822 43665 30233
557 30233 -15556 -35271 -5871 36479 38465 -8847 -51745 -38015 15769 44952 16462 -32883
569 -32883 -37352 10692 50090 33562 -18688 -45175 -18458 24429 28587 -8890 -38164 -21635
581 -21635 22093 42346 14850 -24525 -24912 8329 30305 13212 -26628 -42038 -8921 30254
$$ packed form
496a6699N1910K2489n8836o1982J8973N3645K9686j3713n2246j6246N4312M0072
508E1365j9674m0826l1743J1926N2071R870m5682k8607J4017M4235L8511k6511
520B8952o1137n722M4500L3353j0120n6235l8169L9653O2680R456m0963m5331
532c9083O237O0080L1295m0660n6701j1266M0994M4857r214m7302j8823L2087
544g499M3668O971l9089l8461Q909M0705J6829l0293m0203m53M4738L7843j3432
557C0233m5789j9715K9400M2350J986m7312m2898J3730N3784K9183k8490m9345
569c2883m469M8044L9398j6528n2250k6487K6717M2887M158l7477k9274J6529
581b1635M3728K0253k7496l9375l87L3241K1976j7093l9840j5410L3117L9175
$$ plain form
593 30254 30699 -1205 -30728 -20259 27243 45175 7947 -35414 -42533 -5703 38358 26885 -23770
606 -23770 -38989 -7999 33819 45730 3701 -41424 -26055 16633 29181 6101 -32361 -37830
618 -37830 8909 41258 19035 -14577 -24842 -4736 31415 28856 -17717 -40976 -19316 14324
630 14324 34277 11694 -33031 -28501 17988 40588 25094 -15778 -46861 -18048 31151 29354
642 29354 -7592 -35335 -28340 18444 49809 16733 -28576 -28515 2388 30002 20388 -24749 -42443
655 -42443 -5149 30135 25873 -3478 -27767 -14663 27635 36879 -2384 -34256 -29071 2298 33094
668 33094 19557 -25833 -34871 1153 33453 36418 1912 -40497 -28736 19314 32821 5559
680 5559 -28434 -38768 503 44843 28028 -17220 -28822 -7335 25288 32659 -10753 -44378
$$ packed form
593C0254M45l1904k9523J0469M7502J7932l7228m3361p119L6830M4061j1473n0655
606b3770j5219L0990M1818J1911m2029m5125J5369M2688J2548k3080l8462n469
618c7830M6739L2349k2223l3612j0265K0106L6151k559m6573k3259K1660L3640
630A4324J9953k2583m4725M530M6489K2600j5494m0872l1083K8813M9199j797
642B9354l6946k7743O995M6784L1365l3076m5309O1L0903K7614r614m5137j7694
655d2443L7294L5284m262k9351k4289J3104M2298R244l9263l1872N185L1369L0796
668C3094j3537m5390r038L6024L2300K965l4506m2409J1761M8050J3507k7262
680E559l3993j0334L9271M4340j6815m5248j1602K1487L2623P371m3412l3625
$$ plain form
692 -44378 -17792 20554 27277 7769 -27534 -28210 21205 42440 9790 -23419 -33485 -10356 32527
705 32527 26873 -21071 -35042 -11466 20123 41282 14385 -33789 -28903 10420 28247 17480
717 17480 -18592 -42891 -10103 33997 26956 -4831 -24336 -16861 20739 37158 -808 -35423
729 -35423 -23662 6911 27794 15297 -25736 -31884 10155 36965 21817 -10916 -34379 -16780
741 -16780 26348 29438 -8362 -32489 -24143 9397 38961 21125 -22672 -28465 193 24692 24903
754 24903 -8044 -39046 -19658 20708 27047 4384 -21125 -23256 12115 38401 11075 -26164
766 -26164 -26738 -2543 25343 21763 -19745 -35774 -1724 28698 29004 2329 -31859 -23498 20134
779 20134 31608 2737 -25411 -32072 -2396 34627 23864 -13803 -24211 -8512 18030 30320
$$ packed form
692d4378K6586L8346O723j9508l5303o76M9415K1235l2650l3209j0066K3129M2883
705C2527n654m7944j3971K3576L1589K1159k6897m8174M886L9323J7827j0767
717A7480l6072k4299L2788M4100p041l1787j9505P475L7600J6419l7966l4615
729c5423J1761L0573K0883j2497m1033o148M2039K6810j5148l2733k3463J7599
741a6780M3128L090l7800k4127Q346L3540K9564j7836m3797n793K8658K4499K11
754B4903l2947l1002J9388M0366O339k2663k5509k131L5371K6286k7326l7239
766b6164n74K4195K7886l580m1508j6029L4050L0422L06k6675l4188Q361M3632
779B0134J1474k8871k8148o661K9676L7023j0763l7667j0408J5699K6542J2290
$$ plain form
791 30320 1665 -31652 -22323 7868 22757 13109 -17004 -27523 4822 31796 18030 -11556
803 -11556 -26840 -12225 21493 25228 -9796 -31370 -16310 15300 33474 12407 -25122 -25824 7872
816 7872 29079 16436 -15596 -33904 -12263 22345 25347 -1006 -21941 -16588 10871 29624 11502
829 11502 -20699 -25496 -1655 19905 16236 -10439 -26788 -6400 23653 23798 -619 -22963 -18201
842 -18201 12936 28794 3008 -27216 -25433 3427 30247 20829 -15861 -28469 -2530 24360
854 24360 23755 -3371 -30493 -21442 12883 25599 7081 -17376 -22166 2246 27631 18073 -11498
867 -11498 -22956 -8844 14674 19974 -3931 -25010 -14095 13044 25521 9624 -19168 -22350
879 -22350 6088 26428 13110 -17353 -29947 -7322 23995 23829 -4943 -26178 -14420 17272
$$ packed form
791C0320k8655l3317R329L0191J4889r648l0113j0519L2345K6974j3766k9586
803a1556j5284J4615L3718L735l5024k1574J5060L1610J8174k1067l7529p02L3696
816G872K1207j2643l2032j8308K1641L4608L002k6353k0935N353K7459J8753j8122
829A1502l2201m797K3841K1560l669k6675j6349K0388L0053J45k4417k2344M762
842a8201L1137J5858k5786l0224J783K8860K6820r418l6690j2608K5939K6890
854B4360o05k7126k7122R051L4325J2716j8518k4457m790K4412K5385r558k9571
867a1498j1458J4112K3518N300k3905k1079J0915K7139J2477j5897k8792l182
879b2350K8438K0340j3318l0463j2594K2625L1317j66k8772k1235J1758L1692
$$ plain form
891 17272 29369 5977 -23493 -24683 1872 24365 14147 -14552 -23579 -4227 20116 22448 -1846
904 -1846 -22324 -12827 11106 19771 3995 -20704 -22194 5828 25370 13603 -12656 -23131 -3463
917 -3463 24567 22260 -9418 -28616 -15251 14167 27125 5223 -25050 -21282 9466 28208 15727
930 15727 -14954 -27732 -4780 21903 16701 -7865 -22966 -12398 14702 24752 3470 -18363
942 -18363 -15401 5773 20772 10511 -16802 -24460 -1387 20923 17103 -5552 -22689 -10619 18607
955 18607 25542 420 -23618 -21187 4612 26586 12994 -19481 -24920 858 23443 21410 -5606
968 -5606 -26349 -11066 17289 19117 -701 -19628 -18769 7198 25143 8021 -15278 -15832 356
981 356 18912 16093 -11016 -24174 -6177 13644 17027 2764 -20434 -17251 12296 24836 8146
$$ packed form
891A7272J2097k3392k9470j190K6555K2493j0218k8699r027J9352K4343K332k4294
904a846k0478R497K3933Q665j5776k4699j490K8022J9542j1767k6259j0475J9668
917c463K8030k307l1678j9198J3365K9418J2958k1902l0273L768L0748J8742j2481
930A5727l0681j2778K2952K6683n202k4566j5101J0568K7100J0050k1282k1833
942a8363K962K1174J4999j0261k7313p658K3073K2310l820k2655j7137J2070K9226
955A8607O935k5122k4038K431K5799K1974j3592l2475n439K5778K2585k033k7016
968e606k0743J5283K8355J828j9818j8927Q59K5967J7945j7122k3299n54J6188
981C56J8556k819k7109j3158J7997J9821L383j4263k3198L183K9547J2540j6690
$$ plain form
994 8146 -14253 -23362 -4529 23532 17114 -12849 -22629 -8206 14691 25018 2787 -23116 -14237
1007 -14237 10197 19330 7858 -15921 -23212 1908 22497 11013 -9398 -16643 -5645 16943
1019 16943 20087 -4833 -21237 -10905 7028 18497 8484 -17577 -20528 5050 21904 14062
1031 14062 -6291 -22325 -10806 17873 19939 -4325 -19718 -15420 5964 25066 10277 -18326
1043 -18326 -17012 4087 17327 13639 -9115 -24524 -4658 17938 12560 -3512 -14815 -12303 11795
1056 11795 23342 1648 -17240 -13468 611 17434 14086 -13986 -21920 -817 14766 17028 3384
1069 3384 -20374 -15888 12051 19219 4222 -12888 -20961 -2968 23347 14351 -11638 -16007 -4373
1082 -4373 12941 19533 -2345 -22845 -9542 10913 14494 4795 -14452 -18105 7155 22640 7635
$$ packed form
994H146k2399r109J8833K8061o418k9963r780J4423K2897J0327k2231k5903Q879
1007a4237K4434R133j1472k3779p291K5120K0589j1484k0411p245J0998K2588
1019A6943L144k4920j6404J0332J7933J1469j0013k6061k951K5578J6854p842
1031A4062k0353j6034J1519K8679K066k4264j5393M298K1384J9102j4789k8603
1043a8326J314K1099J3240l688k2754j5409J9866K2596n378j6072j1303K512K4098
1056A1795J1547k1694j8888L772J4079J6823l348k8072p934K1103J5583K262j3644
1069C384k3758M486K7939P168j4997j7110q073J7993K6315q996k5989m369J1634
1082d373J7314O592k1878k0500J3303K0455L581r699j9247l653K5260J5485j5005
$$ plain form
1095 7635 -10324 -15840 -5991 16129 17773 -7471 -20044 -9229 7695 20020 9793 -16457 -18485
1108 -18485 4860 17664 11389 -7186 -21926 -8701 16932 16479 -3641 -15025 -10504 8534 21491
1121 21491 4683 -18528 -13952 5335 14901 9053 -11592 -20380 1214 19371 11523 -4915 -15787
1134 -15787 -10324 12331 19389 -1445 -17069 -14057 1380 18434 13534 -11035 -17933 -1185 13122
1147 13122 15148 15 -19668 -13669 9845 15559 3256 -11252 -15083 2774 20614 9374 -12669
1160 -12669 -14910 -1541 13511 13596 -7900 -20795 -5121 14280 15695 1805 -15879 -14691 8868
1173 8868 19728 5417 -12701 -17539 -3897 16406 15442 -5497 -16778 -7130 9527 17703 4721
1186 4721 -15644 -15170 4043 14803 7529 -8962 -16535 -1285 17652 12627 -6824 -15330 -5807
$$ packed form
1095G635j7959n516R849K2120J644k5244j2573J0815J6924J2325j0227k6250k028
1108a8485K3345J2804o275j8575j4740J3225K5633m53k0120j1384M521J9038J2957
1121B1491j6808k3211M576J9287R566n848k0645q788K1594J8157p848j6438j0872
1134a5787N463K2655P058k0834j5624L012J5437J7054m900k4569o898J6748J4307
1147A3122K026j5133j9683N999K3514N714j2303j4508l831J7857J7840j1240k2043
1160a2669k241J3369J5052Q5k1496j2895J5674J9401J415j3890j7684J188K3559
1173H868J0860j4311j8118m838J3642K0303r64k0939j1281R648J6657Q176j2982
1186D721k0365M74J9213J0760p274j6491p573J5250J8937n025j9451q506R523
$$ plain form
1199 -5807 11978 16229 -2646 -19366 -10636 8850 17474 6458 -13717 -16850 3431 18526 10455
1212 10455 -7895 -17925 -8564 11813 15699 -406 -14046 -10860 4434 16792 9222 -10176 -15016
1225 -15016 -1431 11733 10515 -4731 -16474 -6287 11809 14312 87 -13487 -10356 7563
1237 7563 17155 3577 -15333 -15709 1868 17050 11351 -9288 -17597 -3140 15217 16074 -1753
1250 -1753 -16986 -12215 6432 15932 5676 -11818 -14365 247 14141 11980 -4243 -14330 -5753
1263 -5753 9141 11756 -497 -13190 -10505 5537 15063 4769 -10867 -11766 2584 15492 9280
1276 9280 -10033 -17325 -3303 12999 13257 -2624 -16087 -9608 9966 17505 4324 -12212 -14589
1289 -14589 320 14654 9190 -7583 -13491 -4292 9396 12843 792 -11213 -7537 5362 11043
$$ packed form
1199e807J7785M251j8875j6720Q730J9486Q624j1016k0175l133K0281J5095q071
1212A0455j8350j0030R361K0377L886j6105j3640L186J5294J2358p570j9398m840
1225a5016J3585J3164j218j5246j1743J0187J8096K503j4225j3574L131J7919
1237G563R592j3578j8910l76J7577J5182n699k0639q309J4457J8357Q57j7827
1250a753j5233M771J8647R500j0256j7494k547J4612J3894k161j6223j0087Q577
1263e753J4894K615j2253j2693K685J6042R526j0294j5636q99J4350J2908o212
1276I280j9313p292J4022J6302K58j5881j3463O479J9574P539j3181j6536k377
1289a4589J4909J4334n464j6773n908R199J3688L447j2051j2005L676J2899N681
$$ plain form
1302 11043 3571 -9442 -12586 867 13236 7614 -6508 -12273 -2067 12252 13219 -3879 -16277
1315 -16277 -8541 8125 14607 3597 -13820 -14105 4693 16922 8974 -7193 -14982 -4547 11893
1328 11893 12215 -3807 -13406 -8098 5515 13807 4713 -10106 -9352 3480 10561 6344 -6612 -13501
1342 -13501 -2487 11063 8675 -3090 -11164 -6966 9064 15542 1460 -13837 -11425 2700 14377
1355 14377 8698 -11052 -16268 -306 13716 12634 -1438 -14636 -8715 9135 13188 778 -10616
1368 -10616 -11616 1103 13080 7212 -7549 -9428 -561 9210 9633 -2258 -13160 -5711 7819
1381 7819 9703 1504 -10371 -10542 4960 15663 5853 -9030 -12836 -2350 12604 12441 -5837 -16212
1395 -16212 -6465 8533 14587 4171 -12597 -11815 5136 13556 5180 -7692 -13532 -2710 11777
$$ packed form
1302A1043p472j3013l144J3453J2369n622j4122n765J0206J4319R67j7098j2398
1315a6277P736J6666O482j1010j7417k85J8798J2229p948j6167p789J0435J6440
1328A1893L22j6022r599N308J3613Q292r094j4819P54J2832P081m217j2956o889
1342a3501J1014J3550k388j1765q074M198J6030O478j4082j5297K412J4125J1677
1355A4377n679j9750n216J5962J4022j082j4072j3198N921J7850M053j2410j1394
1368a0616j000J2719J1977n868j4761j879Q867R771M23j1891j0902P449J3530
1381G819J884q199j1875j71J5502J0703r810j4883l806J0486J4954j63j8278j0375
1395a6212R747J4998O054j0416j6768P82J6951Q420q376j2872n840J0822J4487
$$ plain form
1408 11777 8842 -5066 -9682 -3667 7360 11745 777 -12163 -7874 4694 10221 4612 -9060
1421 -9060 -13179 1463 13807 8682 -4183 -12391 -6958 9755 14023 -1019 -13213 -10493 2874
1434 2874 14401 8443 -10008 -12646 946 11428 8917 -3562 -14000 -5564 9055 9561 -1571
1447 -1571 -8558 -7451 5261 12918 3866 -9694 -8804 503 9996 7653 -5732 -14144 -2501 9532
1461 9532 10885 855 -10923 -10227 5982 14474 3374 -8849 -13556 -983 11257 11156 -5844
1474 -5844 -12167 -2835 7823 12032 -27 -11806 -8261 5187 10457 1294 -7628 -9853 1206 13491
1488 13491 5460 -6657 -8756 -2592 9025 9717 -3602 -12140 -6669 5556 11655 4460 -9204 -11122
1502 -11122 1471 12515 8084 -5667 -12466 -5434 8149 10917 -1058 -10613 -7202 5173 11843
$$ packed form
1408A1777k935j3908m616O015J1027M385j0968j2940M289J2568N527n609j3672
1421i060m119J4642J2344n125j2865q208N433J6713M268j5042j2194K720J3367
1434B874J1527n958j8451k638J3592J0482k511j2479j0438Q436J4619N06j1132
1447a571o987J107J2712P657r052j3560Q90R307R493k343j3385q412J1643J2033
1461I532J353j0030j1778O96J6209Q492j1100j2223m707J2573J2240j01j7000
1474e844o323R332J0658M209j2059j1779L545J3448N270r163q922k225J1059J2285
1488A3491q031j2117k099O164J1617O92j3319q538N471J2225O099p195j3664j918
1502a1122J2593J1044m431j3751o799P032J3583K768j1975r555L411J2375O670
$$ plain form
1515 11843 3790 -8814 -8956 1838 8900 5482 -6383 -11632 -211 11018 7128 -3197 -8821
1528 -8821 -5092 5724 11247 1258 -10810 -9695 1598 11285 7047 -6308 -11295 -1333 8868 9503
1542 9503 331 -10519 -9101 3662 10612 3416 -7716 -10338 254 11605 7859 -6069 -9986
1555 -9986 -1315 8080 7928 -3454 -12020 -4948 7606 9560 952 -9172 -8399 3966 11876 4830
1569 4830 -8035 -11357 -2359 9159 9716 -2149 -10761 -5827 5516 11578 4837 -8255 -10341 15
1583 15 9281 6552 -4492 -10146 -2856 8390 8190 -1867 -8407 -4222 6540 9243 -1014 -10783
1597 -10783 -7749 3771 11386 4946 -7490 -9649 448 9651 7367 -3392 -10730 -5001 6477
1610 6477 9243 1085 -9546 -9370 2074 11358 7107 -4225 -9211 -2810 7091 7317 -3015 -10332
$$ packed form
1515A1843q053j2604j42J0794P062l418j1865n249J1421J1229l890j0325n624
1528h821L729J0816N523r989j2068J115J1293R687m238j3355m987R962J0201O35
1542I503r172j0850J418J2763O950p196j1132k622J0592J1351l746j3928l917
1555i986Q671R395j52j1382q566P072J2554J954q608j0124P73J2365P910p046
1569D830j2865l322Q998J1518N57j1865q612M934J1343O062o741j3092k086J0356
1583A5R266k729j1044n654P290J1246k00j0057o540M185J0762K703j0257r769
1597a0783L034J1520P615o440j2436k159J0097R203k284j0759p338N729J1478
1610F477K766q158j0631J76J1444R284m251j1332m986O401R901K26j0332p317
$$ plain form
1624 -10332 -5395 5443 9936 2614 -7671 -6730 4294 9942 2920 -8465 -10816 -774 9518
1637 9518 6876 -4924 -9728 -2388 9202 11549 439 -10233 -8128 2498 9096 4622 -7960
1650 -7960 -11199 -1216 9191 8470 -640 -8651 -4866 6039 9188 1041 -7864 -7479 1691 9247 4596
1665 4596 -6858 -8918 1066 8889 6307 -5377 -12036 -4088 7862 7684 -2241 -10165 -6790 5501
1679 5501 12224 3752 -7901 -8262 358 9035 7463 -3800 -9568 -2707 6684 8490 2630 -6132 -6117
1694 -6117 4086 9012 2868 -5435 -8058 -690 8328 6538 -4177 -7347 -712 7552 9200 -153
1708 -153 -9669 -5482 6037 9058 2182 -7812 -9245 2759 12213 6802 -4239 -7973 -2785 7395
1722 7395 9239 -847 -8270 -4889 3164 8078 4973 -4685 -6786 1753 7607 4446 -2515 -7704 -3535
$$ packed form
1624a0332M937J0838M493p322j0285R41J1024N648p022j1385k351J0042J0292
1637I518k642j1800m804P340J1590K347j1110j0672K105J0626O598m474j2582
1650g960l239R983J0407p21r110q011L785J0905L149q147q905L85R170P556m651
1665D596j1454k060R984P823k582j1684o659P948J1950j78r925p924L375J2291
1679E501O723q472j1653l61Q620Q677j572j1263n768O861R391J806n860q762J5
1694f117J0203M926o144q303k623P368R018j790j0715l170O635Q264J648r353
1708a53r516M187J1519L021o876r994j433J2004R454n411j1041l734N188J0180
1722G395J844j0086p423L381Q053M914l105r658k101Q539N854l161o961n189M169
$$ plain form
1737 -3535 6067 6138 -3072 -7518 -4110 3978 9289 1785 -8730 -8025 1810 7678 4247 -6092 -11044
1752 -11044 -1608 9398 7989 -720 -7481 -5053 5304 9864 1608 -6770 -6218 68 7031 5574
1766 5574 -3875 -6849 -371 5068 4853 -412 -7500 -5400 3695 5690 228 -5457 -5516 2122 10188 5494
1782 5494 -5016 -7362 -777 6626 6948 -3157 -11220 -5474 5153 7975 2623 -6318 -7423 2692
1796 2692 9704 4620 -4034 -7156 -2909 5189 6009 -2152 -7148 -2741 3233 6382 2269 -5559 -5771
1811 -5771 2473 6608 2789 -4286 -8263 -1835 7816 6562 -2868 -7726 -4071 5244 9378 1588 -8755
1826 -8755 -7378 1782 8358 5217 -5326 -9511 -1263 7845 6318 -1549 -7130 -4628 4216 6894 -9
1841 -9 -6043 -4789 1082 6316 3966 -4224 -5864 816 5568 4561 -2453 -8216 -4363 4786 6920 672
$$ packed form
1737c535R602P1r210m446L408Q088N311p504j0515P05R835N868l431j0339m952
1752a1044R436J1006j409q709o761K428J0357M560q256q378N52O286O963j457
1766E574r449k974O478N439k15n265p088K100R095J995n462n685n9P638Q066m694
1782E494j0510k346O585P403L22j0105q063N746J0627K822n352q941j105J0115
1796B692P012n084q654l122M247Q098Q20q161m996M407N974L149m113p828k12
1811e771Q244M135l819p075l977O428R651j254r430m858L655R315M134p790j0343
1826h755J377R160O576l141j0543m185Q248R108j527p867n581K502Q844K678o903
1841io034J254N871N234k350q190j640O680M752j007p014n763L853R149K134o248
$$ plain form
1857 672 -5710 -5838 2931 10151 4620 -6550 -9007 -2637 6050 7145 -2043 -8572 -2925 6285 8332
1872 8332 1976 -6257 -7207 1531 6666 1718 -4867 -5819 33 7175 5410 -3044 -6432 -1590 4519
1887 4519 5749 -175 -7325 -5377 3303 7286 2556 -5411 -7673 127 9088 6933 -2468 -8090 -4588
1902 -4588 4279 7317 -254 -8187 -5300 3335 8469 4564 -4396 -7069 -259 6174 3347 -3741 -6641
1917 -6641 -1552 5551 5617 -1575 -5935 -2686 3990 7260 1575 -5884 -6671 305 5910 3923 -3146 -7021
1933 -7021 -1433 6944 7743 193 -7326 -6334 1793 7188 2775 -5055 -6461 -152 6353 4958 -2622
1948 -2622 -6319 -1146 5693 4951 -2113 -6953 -4151 3412 6145 986 -4888 -3955 2320 6650 2773
1963 2773 -4457 -6688 -849 5496 5178 -1595 -7461 -4507 4001 8097 2996 -4135 -6114 -151 5900
$$ packed form
1857F72o382j28Q769P220n531j1170k457O370Q687J095r188o529N647R210K047
1872H332o356q233r50Q738N135m948o585r52N852P142j765q454l388M842O109
1887D519J230n924p150J948Q680L983m730p967k262P800Q961k155r401n622L502
1902d588Q867L038p571p933K887Q635N134l905q960k673O810O433k827p088k900
1917f641N089P103O6p192m360L249O676L270n685p459p87O976N605j987p069l875
1933g021N588Q377P99p550p519R92Q127N395m413p830j406O309O505j395p580
1948b622l697N173O839p42p064m840K802P563K733n159n874R33O275M330l877
1963B773p230k231N839O345l18o773n866K954Q508M096n101p131j979N963O051
$$ plain form
1978 5900 3545 -3712 -6799 -2089 5257 6131 -337 -5964 -2778 4039 6061 984 -5582 -5696 1038
1993 1038 5553 2428 -3634 -5006 636 5966 4890 -2230 -6545 -3030 3639 5768 996 -5883 -6532
2008 -6532 631 6867 5443 -1636 -5719 -2442 4257 5083 -1054 -6026 -3966 2311 6131 1828 -4657
2023 -4657 -4508 2138 6734 3302 -3793 -6625 -1433 5077 4129 -2430 -5760 -2654 4059 6474 738
2038 738 -5376 -4227 1883 5315 2680 -4459 -7124 -1020 5922 5784 45 -5685 -4210 3518 6993
2053 6993 1742 -4758 -5748 -776 5129 3902 -3016 -5031 246 5282 4617 -1362 -6353 -2188 4440
2068 4440 4580 -1594 -6359 -4668 3174 7992 3133 -4673 -5359 -425 5448 5599 -2077 -7257 -3635 3100
2084 3100 5122 1973 -4054 -4595 1822 5813 2720 -3143 -5657 -1805 4921 4024 -2791 -5683 -1280
$$ packed form
1978E900k355p257l087M710P346Q74o468n627L186O817K022n077o566j14O734
1993A038M515l125o062j372N642N330j076p120m315L515O669K129m772o879o49
2008f532P163O236j424p079m083L277O699Q26o137m972K060O277L820m303o485
2023d657J49O646M596l432p095k832N192O510r48o559l330L106O713K415n736
2038G38o114J149O110L432k635p139k665O104O942j38n739n730J475P728L475
2053F993n251o500r90M972N905j227o918k015N277N036o65n979m991M165O628
2068D440J40o174m765J691P842M818m859p806o86M934N873J51p676n180L622O735
2084C100K022l149o027n41O417L991l093n863k514L852O726q97o815k892M403
$$ plain form
2099 -1280 4419 6564 494 -6538 -4472 3153 6259 1366 -5396 -7436 -86 6592 4726 -2011 -5332
2114 -5332 -2075 4015 5649 -135 -6172 -3980 1355 4763 2510 -3676 -4888 712 5662 3948 -1586
2129 -1586 -5344 -3007 3871 4801 -1286 -5891 -3640 2872 6859 3189 -4860 -5267 1543 5868 4025
2144 4025 -3053 -7337 -2425 4935 4962 -649 -4783 -3187 3001 6279 1527 -4483 -4542 -88 3996 2940
2160 2940 -2763 -5171 -625 4363 4619 457 -4371 -3391 2547 4910 340 -4652 -5099 269 6027 4078
2176 4078 -3196 -5088 -655 5098 5474 -682 -6810 -4516 2767 5172 1267 -3883 -4335 1086 5721
2191 5721 3244 -2444 -4156 -1602 2941 3714 -1338 -4429 -2032 2478 4204 2033 -3131 -3731 1427
2206 1427 4275 1719 -3099 -5290 -1681 4791 4786 -1660 -4919 -2491 3712 6677 1626 -5509 -5605 580
$$ packed form
2099a280N699K145o070p032K066P625L106m893o762k040P350O678j866o737l321
2114e332L257O090J634n784o037K192N335L408k253o186j212N600M950j714n534
2129a586l758K337O878R30o087m605K251O512L987l670q049m07O810M325j843
2144D025p078m284M912P360K7n611m134J596O188L278m752o010n9M454M084j056
2160B940n703k408M546M988K56m162m828R80N938K363m570m992m47N368N758j949
2176D078p274j892M433N753L76o156o128K294P283K405l905n150m52N421M635
2191E721k477n688j712K554M543P73n052l091K397M510J726k171n164o00N158
2206A427K848k556m818k191L609O472no446l259K428O203K965n051p135r6O185
$$ plain form
2222 580 5184 3137 -2746 -6039 -1438 5231 4972 -220 -4103 -2976 1786 4177 729 -3668 -3411 283
2238 283 3795 3027 -1894 -3499 -61 3652 2999 -1441 -4749 -2919 2625 4262 363 -4178 -3732 1681
2254 1681 6279 3315 -3964 -5672 -1019 4616 4154 -1729 -5944 -2774 3517 5614 1774 -3409 -4213
2269 -4213 841 4844 2232 -3290 -4975 -1430 3349 3743 -736 -3982 -1773 2874 4831 1080 -4285
2284 -4285 -4665 42 4374 2867 -2375 -5204 -1194 4880 5279 -552 -4912 -3012 2337 4394 849
2299 849 -4394 -4311 994 4547 2837 -2003 -3806 25 3841 2783 -1956 -4482 -1814 2832 3630 -344
2315 -344 -4041 -2344 2716 4955 1666 -3804 -4907 -49 4548 2947 -2581 -5535 -2309 4050 5897
2330 5897 860 -4637 -4044 1536 5183 2499 -3698 -5824 -740 4589 3872 -1019 -4455 -1467 3861
$$ packed form
2222E80M604k047n883l293M601O669k59n192l883J127M762K391l448m397K57L694
2238B83L512p68m921j605L438L713o53m440l308J830N544J637l899m541M46N413
2254A681M598k964p279j708M653N635m62n883m215L170O291K097l840n183q04
2269d213N054M003k612n522j685L545M779L94m479l246K209M647J957l751n365
2284d285l80M707M332j507n242k829M010O074L99n831m360J900N349K057l545
2299H49n243Q3N305L553j710m840j803L831L816j058m739k526K668M646P98l974
2315c44l697J697N060K239l289n470j103M858M597j601n528k954L226O359J847
2330E897n037n497N93N580L647k684o197k126N084N329p17m891l436K988N328
$$ plain form
2345 3861 4406 -492 -4201 -3234 1467 4118 1257 -3507 -3923 793 4936 3437 -1694 -4600 -1784 3303
2361 3303 3907 -337 -4287 -3702 1114 5092 2753 -2726 -4058 -175 3829 3578 -1676 -4957 -2125 2654
2377 2654 3578 -403 -3516 -2158 2615 4254 524 -3524 -3116 920 3460 1323 -3386 -3744 323 3921
2393 3921 3406 -797 -4145 -2023 2760 4063 701 -3925 -4359 173 4671 2949 -1876 -3952 -1038
2408 -1038 3435 4340 -271 -4467 -3049 1610 3991 968 -3190 -3382 1569 4708 2166 -2445 -4029
2423 -4029 -282 3687 2984 -2519 -4787 -2052 2540 4715 1400 -3842 -3437 1530 4518 2609 -2360
2438 -2360 -5024 -2110 3177 3849 54 -3125 -2774 1315 4570 2250 -2457 -3542 -791 2977 2690 -1955
2454 -1955 -4309 -915 3439 3538 -240 -3622 -2105 2424 4004 -186 -3674 -3577 332 4253 2531 -2287
$$ packed form
2345C861N45m898l709R67M701K651k861m764m16M716M143j499n131k906K816N087
2361C303O04m244l950N85M816L978k339n479j332L883M004k51n254l281K832M779
2377B654R24l981l113J358M773J639l730m048M08M036K540k137m709l58M067L598
2393C921n15m203l348K122M783J303l362m626m34M532M498j722m825k076K914
2408a038M473R05m611m196J418M659K381l023m158j92M951L139k542m611j584
2423d029L747L969p03n503k268K735M592K175l315n242M05M967K988j909m969
2438b360k664K914N287O72l795l179L51M089L255k320m707j085K751L768k87m645
2454a955k354L394M354R9l778l382J517M529J580m190l488R7L909L921j722m818
$$ plain form
2470 -2287 -3557 -282 3259 3478 -103 -3900 -2806 1193 3077 994 -2217 -3243 155 3627 2682
2485 2682 -1559 -3094 -1154 2265 2749 -800 -3748 -1477 2029 3290 571 -2848 -2467 1706 3920
2500 3920 1102 -2727 -3863 -495 3716 2907 -1601 -3393 -1056 2632 3976 621 -3660 -3084 634
2515 634 2909 2163 -2141 -3825 -671 3657 3038 -547 -3163 -2096 2112 3226 -146 -3761 -2973 1284
2531 1284 4006 1879 -2876 -3881 1159 4333 2414 -2440 -4975 -1773 3729 3924 -826 -4245 -2944
2546 -2944 2268 4905 1742 -3150 -3928 -682 3118 2827 -1378 -4362 -2076 2521 3579 811 -2681
2561 -2681 -2595 1322 4095 1192 -2965 -3989 -243 3703 2930 -2032 -4278 -705 3758 4213 -292 -4913
2577 -4913 -3412 1835 4380 976 -3596 -4133 -57 4596 3385 -1220 -3766 -1663 2252 3287 -40
$$ packed form
2470b287j270L275L541K19l581l797J094L999J884k083l211j026L398L472r45
2485B682m241j535J940L419M84l549k948K271L506J261k719l419L81M173K214
2500C920k818l829j136L368M211q09m508j792K337L688J344l355m281N76L718
2515F34K275p46m304j684L154M328o19l585k616J067M208J114l372l615P88M257
2531A284K722k127m755j005N040L174j919m854k535L202N502J95m750l419J301
2546b944N212K637l163m892p78L246L800k91m205k984K286M597J058k768l492
2561b681Q6L917K773k903m157j024L746L946p73m962k246L573M463M55m505m621
2577d913J501N247K545l404m572n37M076M653j211m605k546K103L915J035l327
$$ plain form
2592 -40 -3558 -2828 1301 3246 1948 -1712 -3045 132 3644 2653 -1367 -3978 -1552 2438 3258 -565
2608 -565 -3847 -2192 2159 4550 2009 -3091 -3920 143 3695 2257 -2318 -4449 -1797 2894 3627 203
2624 203 -2697 -2273 1195 2991 1046 -2673 -3005 -312 2453 2001 -785 -2561 -570 2434 2792 -173
2640 -173 -2891 -2020 1135 2832 753 -2950 -3217 398 3765 2658 -1363 -3500 -1282 2738 2940 -455
2656 -455 -3411 -2671 1602 3360 1250 -2054 -2478 381 2616 1997 -1133 -2875 -917 1470 2027 -378
2672 -378 -2235 -1349 1720 2805 922 -1834 -2360 267 2547 1785 -1923 -3219 -697 2513 3001 -174
2688 -174 -2964 -2013 1723 3515 758 -2713 -3067 -85 2853 1930 -1351 -2622 -499 2237 2561 -364
2704 -364 -2438 -1394 1318 1728 -203 -2205 -1840 656 2836 1549 -1585 -2754 -391 2916 2526 -1219
$$ packed form
2592d0l518P30M129J945j298l660j333L177L512r91m020k611K426L990Q20l823
2608e65l282J655M351K391k541n100q29M063L552j438m575k131K652M691P33l424
2624B03k900M24L468J796j945l719l32K693K765m52k786j776J991L004L58k965
2640a73k718Q71L155J697k079l703k67L615L367j107m021k137K218M020K02l395
2656d55k956P40M273J758k110l304m24K859K235o19l130j742J958K387N57k405
2672c78j857Q86L069J085j883k756n26K627K280p62l708j296K522L210M88l175
2688a74k790R51L736J792k757l471l54K982K938r23l281j271K123K736L24k925
2704c64k074J044K712M10j931k002L65K496K180j287l134j169K363L307l90l745
$$ plain form
2720 -1219 -3618 -1715 1952 3595 716 -2807 -2716 739 3586 1720 -2042 -3466 -1176 2677 2470 -1152
2736 -1152 -2664 -1090 2376 2993 347 -2526 -1820 1038 2042 862 -1834 -2728 236 3110 1865 -912
2752 -912 -2657 -1048 2413 2746 -406 -3583 -3002 749 3484 2093 -2240 -3371 38 3278 2847 -948
2768 -948 -3667 -2067 1890 2557 -18 -2711 -1909 1057 3320 936 -2392 -2305 567 2519 1419 -2126
2784 -2126 -3322 -84 2451 2559 -233 -2485 -1879 2071 3355 637 -2819 -3233 -266 3279 2389 -1369
2800 -1369 -3123 -1188 2302 3704 471 -3153 -2708 1076 2777 693 -2217 -2821 506 3374 1674
2815 1674 -1472 -2493 -328 2473 2322 -1421 -3468 -1161 2029 2524 596 -2669 -2816 1150 3582 1741
2831 1741 -1565 -3369 -1630 2407 3015 -120 -2895 -2020 1146 3697 2055 -2306 -2784 -144 2261 1737
$$ packed form
2720a219k399J903L667J643k879l523R1L455K847j866l762j424K290L853k07l622
2736a152j512J574L466O17k646k873P06K858J004j180k696q94K964K874j245k777
2752i12j745J609L461L33l152l177N81L751K735j391m333j131L409L240m31l795
2768i48k719J600L957O67k575k693Q02K966K263k384l328Q7K872J952j100l545
2784b126j196L238K535J08k792k252O06L950J284k718l456m14K967L545q90l758
2800a369j754J935L490J402l233l624M45L784J701k084k910o04L327K868j700
2815A674l146j021K165K801j51l743k047K307L190M95j928l265j47L966K432j841
2831A741l306j804J739M037O08l135k775Q75L166K551j642m361m78K640K405n24
$$ plain form
2847 1737 -1097 -3095 -803 2669 2440 -338 -2194 -1054 1998 3034 -159 -3206 -2193 680 2815
2862 2815 1675 -2194 -3283 -116 2944 2810 -110 -3051 -2473 1079 3068 880 -2129 -2980 -479 3151
2878 3151 2864 -780 -2755 -919 1771 2237 -336 -2659 -1737 1547 2493 424 -1916 -1837 1137 3073
2894 3073 1093 -2072 -2524 -462 2540 2132 -771 -3112 -1277 1624 3141 1032 -2345 -3064 4 2348
2910 2348 1757 -1070 -3075 -1555 1669 3018 607 -1835 -1747 900 2761 1010 -2081 -2517 105 2225
2926 2225 1345 -1440 -2735 174 2795 2182 -1067 -3115 -1605 1936 3065 -158 -2962 -2531 505 3087
2942 3087 2337 -1010 -2928 -728 2022 2529 -182 -2890 -2374 704 2433 1414 -1394 -2189 152 2525
2958 2525 1771 -1275 -2457 -507 2213 1807 -880 -2720 -1178 2427 2913 141 -2535 -2344 1075 3096
$$ packed form
2847A737k834j998K292L472k29k778j856J140L052J036l193l047J013K873K135
2862B815j140l869j089L167L060j34k920k941N78L552J989k188l009q51K501L630
2878C151k87l644j975J836K690M66k573k323R22L284R46k069k340P9K974J936
2894C073j980l165m52K062L002m08k903k341J835K901J517k109l377p19L068K344
2910B348n91k827k005J520L224J349k411k442Q8K647J861j751l091m36K622K120
2926B225q80k785j295K909K621o13l249k048J510L541J129l223k804M31L036K582
2942C087p50l347j918K200K750N07k711k708N16L078J729j019k808p95K341K373
2958B525p54l046j182J950K720m06k687j840J542L605M86k772k676J91L419K021
$$ plain form
2974 3096 1130 -2216 -3076 -641 2899 2929 -200 -2658 -1452 1174 2731 688 -2153 -2675 -297 1946
2990 1946 1616 -641 -2115 -178 2066 2292 -513 -2495 -1452 1624 2292 -150 -2748 -2115 1075 3128
3006 3128 1368 -2138 -2902 -73 3008 2213 -1121 -3652 -1492 1677 3155 550 -2060 -1990 543 2519
3022 2519 1442 -1151 -2490 -1096 1678 1628 -648 -1811 -990 1370 2293 251 -1857 -1690 641 1849
3038 1849 673 -2130 -2701 31 2667 2075 -785 -2863 -984 2122 2939 225 -2830 -2383 594 2574
3054 2574 1291 -1459 -2306 -11 2096 1852 -36 -2053 -1451 844 1791 425 -1589 -1245 770 1748
3070 1748 1276 -1152 -1608 -26 1540 1339 -1015 -2533 -898 1659 2139 366 -2505 -1678 1016 2567
3086 2567 829 -1818 -2746 -371 2338 1743 -877 -2252 -782 1426 2057 570 -1738 -1542 324 1322
$$ packed form
2974C096j966l346q60K435L540L0l129k458J206K626J557k043k841n22K378K243
2990A946l30k257j474J937K244K26k805j982J043L076O68k442k598O33L190K053
3006C128j760l506p64K829L081p95l334k531K160L169J478k605k610P0K533J976
3022B519j077k593j339J394K774n0k276j163Q21K360R23k042k108J67K331J208
3038A849j176k803n71K732K636n92k860k078J879L106Q17k714l055M47K977J980
3054B574j283k750q47K295K107k44j888k017O02K295R47j366k014L44K015R78
3070A748m72k428m56J582J566k01k354j518J635K557M80j773k871Q27K694J551
3086B567j738k647r28K375K709n95k620j375J470K208O31j487k308J96J866R98
$$ plain form
3102 1322 572 -1027 -1868 131 1726 1472 -617 -1558 -380 1384 1899 -616 -2211 -1523 551 2429
3118 2429 1087 -1848 -2361 -15 2600 1856 -916 -2724 -1407 1317 2291 -28 -1897 -1576 577 2003
3134 2003 830 -1008 -1395 86 1077 1070 -938 -1625 -476 1403 1447 -147 -1623 -1143 1082 2238 337
3151 337 -1833 -1831 116 1888 1471 -969 -2639 -383 2086 2099 118 -2099 -1766 801 2185 1000 -1550
3168 -1550 -1657 -100 1885 1529 -728 -1644 -192 1122 1468 -384 -1794 -1052 1071 1580 155 -1116
3184 -1116 -1333 357 2065 1005 -1286 -2108 -501 1641 2068 -176 -2236 -1348 1214 2332 1308 -1651
3200 -1651 -2119 119 2048 1043 -1034 -1945 -790 1612 1626 -152 -1567 -611 652 1715 25 -1682
3216 -1682 -1257 557 1433 792 -1001 -1415 95 1814 1472 -492 -1780 -1326 1139 1970 142 -1708 -2091
$$ packed form
3102A322p50j599q41J999J595k54k089r41J178J764N15k515j595O88K074J878
3118B429j342k935n13K346K615p44k772j808J317K724R74k319j869L21K153J426
3134B003j173j838l87J481R91pk008o87J149J879M4j594j476M80K225J156j901
3151C37k170KJ947J772m17k440j670K256K469J3j981k217L33K567J384j185k550
3168a550j07J557J985l56k257r16J452J314L46j852j410P42K123N09j425j271
3184a116k17J690J708j060k291q22J607K142M27k244k060Q88K562J118j024k959
3200a651m68K238J929j005k077r11J155K402J4j778j415R56J263J063j690j707
3216a682M25J814Q76o41j793m14J510J719l42j964j288M54K465Q31j828j850l83
$$ plain form
3233 -2091 151 2267 1581 -787 -2163 -668 1061 1399 -274 -1879 -1266 885 1621 97 -910 -938
3249 -938 599 1640 495 -1427 -1514 55 1327 1002 -694 -1809 -480 1320 1684 179 -1441 -1348 575
3266 575 1724 801 -1082 -1709 -520 1741 1705 -283 -1718 -1211 1201 1699 485 -1683 -1305 197 1343
3283 1343 487 -831 -1130 180 1670 1113 -921 -1347 -110 1169 1288 -116 -1791 -862 1281 1754 817
3300 817 -1451 -1615 -241 1434 1373 -603 -2035 -1077 1002 1884 530 -1062 -1081 99 1586 1002 -873
3317 -873 -1846 -453 1167 1064 -523 -1648 -591 1312 1358 -305 -1553 -851 619 1163 109 -1441 -1446
3334 -1446 286 1494 1068 -704 -1797 -433 1175 1592 195 -1536 -1640 380 1717 702 -797 -1306
3350 -1306 -116 1598 1417 -250 -1688 -642 938 1259 -357 -1307 -946 894 1445 491 -1037 -1320 620
$$ packed form
3233b091K242K116o86k368j376J495J729L38j673j605O13K151P36j524j007k8
3249i38J537J041j145j922q7J569J272l25j696j115J329J800L64j505j620R3J923
3266E75J149r23j883o27J189K261l6j988j435N07K412M98j214k168L78J502J146
3283A343q56j318k99J310J490n57k034m26J237J279J19j404j675R29K143M73r37
3300H17k268j64J374J675o1j976j432R58K079Q82j354j592j9J180J487n84j875
3317h73r73J393J620j03j587j125J057J903M6j663j248P02J470N44j054j550n
3334a446J732J208m26j772j093J364J608M17j397j731j04K020J337j015j499n09
3350a306J190J714j81j667j438J046J580L21j616r50L61J840N51r54j528k83J940
$$ plain form
3367 620 1663 573 -1147 -1726 -169 1424 1424 -412 -1588 -747 850 1559 290 -1137 -1650 -201 1393
3384 1393 1029 -284 -1261 -1031 916 1455 -61 -1360 -944 464 1380 106 -1172 -1034 333 1489 850
3401 850 -928 -1383 -102 1302 1311 -393 -2192 -970 1038 1258 199 -1488 -1445 333 1512 1018 -612
3418 -612 -1424 -442 913 1254 -129 -1376 -918 487 1345 677 -744 -1291 122 982 781 -909 -1553 -69
3436 -69 1651 956 -734 -1574 -484 1290 1557 -133 -1447 -1156 472 1183 563 -1093 -1479 -89 1208
3453 1208 1275 -323 -1350 -1075 512 1103 370 -922 -1015 -186 1283 674 -439 -1201 -247 772 1130 -483
3471 -483 -1309 -669 807 1384 -239 -1087 -952 722 1808 789 -1418 -1716 -241 1272 1047 -600 -1542
3488 -1542 -672 981 1257 368 -1181 -955 335 1055 500 -768 -1155 -108 1220 824 -200 -995 -333
$$ packed form
3367F20J043j090j720n79J557J593%j836j176Q41J597P09j269j427n13J449J594
3384A393l64j313r77K30J947N39j516j299M16J408R16j274j278J38J367J156o39
3401H50j778m55J281J404Rj704j799J222K008K20j059j687M3J778J179m94j630
3418f12q12R82J355L41j383j247M58J405Q58o68j421n47J413Q60k01j690o44J484
3436f9J720o95j690q40J090J774K67j690j314K91J628P11o20j656l86J390J297
3453A208O7j598j027K75J587N91p33j292r3Q29J469o09j113p62R54J019L58j613
3471d83q26O40J476N77j623q48J35J674J086j019k207k98J475J513k25j647r42
3488a542Q70J653K76q89j549K26J290P20n55j268l87J047J328l96j024p95O62
$$ plain form
3505 -333 719 1098 -282 -1215 -787 587 1126 451 -911 -1427 171 1527 1054 -934 -1795 -665 1033
3522 1033 1538 -126 -1577 -776 837 1155 336 -793 -895 -52 1051 615 -335 -1139 -338 843 830 3
3540 3 -682 -376 545 1007 342 -1063 -917 158 1325 733 -922 -1730 -208 1191 1372 -113 -1727 -930
3558 -930 641 1640 256 -1295 -1025 99 1251 1028 -429 -1030 -227 742 917 -269 -875 -785 468 878
3576 878 363 -488 -782 191 1334 246 -770 -1205 -262 1321 943 -479 -1386 -649 707 1371 446 -1060
3594 -1060 -1491 -54 1151 704 -840 -1129 -393 1001 1345 -205 -849 -561 768 1054 248 -994 -633
3611 -633 62 790 614 -467 -772 -179 1116 897 -380 -1136 -625 623 1463 -8 -1108 -982 48 1219
3629 1219 705 -612 -1536 -220 1160 1334 -278 -894 -657 428 1257 345 -953 -624 305 984 518 -617
$$ packed form
3505c33J052L79j380r33M28J374N39o75j362n16J598J356m73j988q61J130J698
3522A033N05j664j451Q01J613L18q19j129j02Q43J103m36r50q04Q01J181j3q27
3540Co85L06R21M62o65j405J46J075J167n92j655q08J522J399J81j485j614P97
3558i30J571R99j384j551K70J124J152k23j457o01Q03R69J75j186o06R0J253M10
3576H78n15q51k94R73J143j088j016m35R43J583l78j422r07P37J356O64r25j506
3594a060m31J437J205m47j544k89P36J394L44j550o44K88J329K86q06j242L61
3611f33O95P28j76j081l05N93J295k19j277p56N11J248Q40j471j100J26J030J171
3629A219n14j317r24J316J380J74j612o16K37J085Q29r12j298L29R29O79m66j135
$$ plain form
3647 -617 -1084 -53 840 733 -383 -960 -444 862 996 100 -1045 -691 508 1101 790 -820 -1047 -25
3665 -25 1222 1119 -301 -1362 -738 804 1363 97 -1055 -1037 231 1088 754 -723 -894 183 947 541
3683 541 -222 -791 -388 561 899 -164 -1146 -902 450 886 262 -795 -1378 -84 964 868 -431 -1148
3701 -1148 -482 738 1263 205 -898 -817 292 1404 421 -849 -1222 -168 1062 865 -257 -950 -354
3718 -354 849 826 -122 -1050 -695 598 869 -121 -810 -875 36 901 542 -673 -1183 -176 937 1220 -54
3737 -54 -1072 -841 120 902 714 -726 -849 -176 1151 965 -383 -892 -329 880 903 -288 -928 -364 613
3756 613 1050 325 -724 -830 209 978 444 -815 -795 -305 997 1152 -142 -1139 -834 733 1134 303
3774 303 -850 -1159 -160 1150 776 -480 -1110 -154 467 830 236 -1103 -724 514 1005 332 -919 -893
$$ packed form
3647f17m67J031Q93j07j116n77N16J306J34q96j145L54J199N93l11j610k27J022
3665b5J247j03j420j061O24J542N59j266j152J8J268Q57l34j477j71J077P64m06
3683E41p63n69M03R49L38j063r82K44J352M36o24j057n83J294J048r6j299p17
3701a148O66J220N25j058j103Q1J109J112r83j270l73J054J230j97j122o93N96
3718c54J203k3r48r28L55J293K71r90o89o5R11Q65l59j215n10J007J113K83j274
3737e4j018K31R61P82j88j440j23O73J327j86j348n09N63J209K3j191o40N64R77
3756F13M37p25j049j06J039P69n34j259K0M90J302J55j294r97L05J567M01q31
3774C03j153l09R99J310l74j256o30R56O21L63n94j339L79J238M91o73j251K6
$$ plain form
3792 -893 239 1037 359 -815 -781 101 788 547 -539 -1164 -360 834 1101 113 -822 -791 532 1023 517
3811 517 -466 -1061 -304 863 1127 34 -864 -478 528 1012 358 -834 -991 118 1010 368 -609 -884
3829 -884 -398 948 718 -265 -828 -459 704 945 -3 -1093 -665 639 930 486 -677 -986 -257 1278
3847 1278 820 -291 -762 -547 346 841 226 -816 -734 -112 1192 854 -614 -798 -240 526 603 53 -889
3866 -889 -415 490 883 47 -882 -612 479 1095 801 -836 -1008 -166 818 755 -227 -910 -311 1023 823
3885 823 33 -1073 -864 304 818 504 -587 -991 -142 550 733 -454 -949 -371 696 521 213 -952
3903 -952 -825 532 1036 297 -437 -847 -77 926 793 -655 -949 -408 620 866 -134 -847 -971 497
3921 497 763 607 -599 -831 -62 991 473 -378 -951 -481 470 837 265 -681 -360 208 922 231 -481
$$ packed form
3792h93J132P98o78j174L4Q82O87k41j086o25Q04J194K67r88r35L1J323M91n06
3811E17r83n95P57J167K64j093q98L86J006M84o54j192j57J109Q92o42r77k75
3829h84M86J346k30r83n63L69J163K41r48j090M28J304K91m44j163l09P29J535
3847A278m58j111m71K15Q93M95o15j042Q2O22J304l38j468j84N58P66P7n50r42
3866h89M74R05L93q36r29K70J091O16k94j637j72Q42R84o3r82o83N99J334k00
3885H23p90j106K09J168N14l14j091m04Q49O92J83j187m95N78J067j75l08j165
3903i52J27J357N04p39p34m10P70J003j33j448k94N41J028K46j000p13j24J468
3921D97K66j56j206k32P69J053n18q51n73M70R51L67n72r46L21N68P14o91p12
$$ plain form
3940 -481 -1143 -103 824 501 -390 -821 -162 664 1267 -152 -992 -503 591 1210 218 -1120 -840 294
3958 294 952 419 -275 -594 -368 612 678 -243 -1081 -589 98 1026 134 -517 -787 104 929 961 -464 -982
3978 -982 -392 447 701 -125 -1003 -515 540 1062 332 -832 -943 199 938 777 -432 -1118 -165 652 642
3997 642 -54 -849 -167 561 494 391 -291 -361 339 593 819 -445 -549 19 759 741 -69 -858 -520 103 704
4018 704 234 -909 -1026 -170 1223 556 -441 -987 -41 775 893 -149 -916 -558 410 850 13 -689 -784
4037 -784 449 885 253 -375 -645 308 659 776 -147 -852 -180 527 855 15 -823 -624 418 831 478
4056 478 -510 -769 -222 936 917 -104 -1200 -503 576 903 226 -1023 -797 -54 771 545 -556 -805
4074 -805 -177 470 560 -175 -825 -379 743 463 -222 -779 -536 491 792 41 -520 -684 -30 893 795 -27
$$ packed form
3940d81o62J040R27l23q91m31O59Q26O03j419q40M89J094O19r92j338K80J134
3958B94O58n33o94l19K26R80O6r21q38M92O87R28q92o51k70Q91Q25L2j425n18
3978i82N90Q39K54q26q78M88J055N22p30j164j11J142P39j61j209o86R53Q17j0
3997F42o96p95O82P28o7j03o82p0P00K54K26j264j04N68P40j8q10p89L38O23O01
4018G04m70j143j17Q56J393o67r97n46R46Q16J18j042p67L58R68M40q37p02r5
4037g84J233M36o32o28k70R53L51J17r23p05O72P07L28q40q38J99J042M13l53
4056D78r88k59N47J158j9j021j096O97J079L27o77j249K26P43Q25k26j101k49
4074h05O28O47R0p35o50M46J122k80o85n57K43J027L01p51n61j64O54R23r8q22
$$ plain form
4094 -27 -1083 -834 305 1050 116 -453 -670 132 1136 419 -531 -721 -23 663 390 -351 -736 -515 383
4113 383 570 41 -582 -160 339 939 68 -608 -762 -41 1053 555 -431 -827 -167 662 879 40 -1128
4132 -1128 -802 330 711 732 -493 -783 -73 790 292 -218 -761 -594 747 657 -252 -703 -506 458 712
4151 712 157 -588 -265 194 690 403 -417 -580 -172 413 507 -72 -831 -551 213 1107 435 -508 -848 201
4171 201 796 1023 -238 -1096 -466 500 731 -76 -861 -517 319 670 237 -693 -659 -156 693 496 -479 -743
4191 -743 200 772 711 -559 -844 -584 492 724 114 -768 -942 281 1383 622 -184 -862 -455 604 589
4210 589 -171 -867 -549 61 903 401 -455 -635 168 261 491 -397 -868 -142 1081 453 -395 -613 -176 686
4230 686 739 393 -824 -424 50 817 76 -400 -696 16 864 414 -93 -914 -416 273 922 251 -586 -664
$$ packed form
4094b7j056K49J139P45r34n69k17Q02J004p17r50j90O98O86k73p41l85K21Q98
4113C83J87n29o23M22M99O00q71o76j54P21J094m98r86l96O60Q29K17q39j168
4132a128L26J132L81K1j225k90P10Q63m98n10n43J67J341r0r09m51J97R64K54
4151G12n55p45L23M59M96k87q20j63M08N85R4n79p59K80P64Q94o72r43l40J049
4171B01N95K27j261q58O30R66K31q07p85L44Q36L51m33r30L4N03Q49j97r75k64
4191g43R43N72o1j270k85K60J076K32o10q82j74J223J102p61q06o78M07J059j5
4210E89p60o96L18O10Q42n02q56j80Q03R3K30q88m71P26J223o28q48k18M37Q62
4230F86N3l46j217M00M74P67p41m76k96P12Q48m50n07q21M98O89O49o71q37p8
$$ plain form
4250 -664 -16 669 445 -298 -557 -128 670 561 -5 -1004 -423 484 725 43 -704 -491 443 729 343 -488
4270 -488 -981 -122 536 834 -387 -933 -375 617 809 430 -248 -649 28 338 338 -14 -835 -284 318 481
4290 481 55 -335 -21 280 685 219 -760 -665 266 823 286 -579 -663 113 929 496 -97 -732 -312 560 678
4311 678 -38 -956 -766 198 783 525 -479 -826 -287 454 627 -31 -762 -538 244 475 143 -405 -587 122
4331 122 402 250 -593 -516 90 650 859 -456 -767 -186 485 873 -340 -826 -591 211 727 5 -653 -807
4351 -807 -210 529 619 -132 -600 -36 531 1003 260 -585 -466 150 635 226 -380 -466 -50 408 238 -367 -439
4372 -439 13 578 554 -163 -645 -251 122 1110 376 -756 -483 3 788 594 -428 -776 -345 418 503 -34
$$ packed form
4250f64O48O85k24p43k59M29P98j09n66r99N81R07K41o82p47K13R34K86l86q31
4270d88m93Q59O58K98j221n46N58R92J92l79o78m01O77L10%l52q21N51O02J63
4290D81m26l90L14L01M05m66r79R5R31N57n37q65q4P76Q16m33n93o35M20Q72J18
4311F78p16r18J90R64N85k58j004l47N39P41J73o58p31K24P82K31l32n48j82P09
4331A22K80j52q43P7O06N60K09j315l11N81O71L88j213m86K35Q02N16p22o58j54
4351h07N97P39R0p51m68N64N67M72p43q45J19O16M85m09o06q6M16M58j70o05p2
4372d39M52N65k4p17m82L94L73R88p34j132K73M86P85j94j022l48M31P63Q5n37
$$ [...]
8191I2
##END NTUPLES=NMR FID
##END=
