##TITLE=1H_IAMT-170
 D2O
 8 sc, 
 8.7.2024
##JCAMPDX= 6.0         $$ Bruker NMR JCAMP-DX V2.0
##DATA TYPE= NMR FID
##DATA CLASS= NTUPLES
##ORIGIN= UXNMR, Bruker Analytische Messtechnik GmbH
##OWNER= root
$$ XWIN-NMR		Version 3.5
$$ Mon Jul  8 14:18:56 2024 Russian Standard Time (UT+4h)  she@DPX200
##.OBSERVE FREQUENCY= 200.1314
##.OBSERVE NUCLEUS= ^1H
##.DELAY= (6, 6)
##.ACQUISITION MODE= SIMULTANEOUS
##.ACQUISITION SCHEME= undefined
##.AVERAGES= 8
##.DIGITISER RES= 18
##SPECTROMETER/DATA SYSTEM= spect
##.PULSE SEQUENCE= zg30
##.SOLVENT NAME= D2O
##.SHIFT REFERENCE= (INTERNAL, D2O, 0, 15.7039)
##AUDIT TRAIL= $$ (NUMBER, WHEN, WHO, WHERE, WHAT)
$$ ##TITLE= Audit trail, XWIN-NMR		Version 3.5
$$ ##JCAMPDX= 5.01
$$ ##ORIGIN= Bruker BioSpin GmbH
$$ ##OWNER= she
$$ F:/spectra/data/she/nmr/H-F/1/audita.txt
$$ ##AUDIT TRAIL=  $$ (NUMBER, WHEN, WHO, WHERE, WHAT)
(   1,<2024-07-08 14:18:00.98 +0400>,<she>,<DPX200>,
      <created by zg, POWCHK disabled, PULCHK disabled
       configuration hash MD5:
       00 E9 B6 7A A2 85 ED C7 34 08 36 98 17 FE 4E 26
       data hash MD5: 16K
       64 D5 E2 78 EB 7C 65 D7 32 55 8E 0B AB 55 0E 36>)
$$ ##END=
$$ 
$$ hash MD5
$$ 32 0F 76 20 36 0C 26 39 95 E3 2D 76 18 E5 CF D0
##$RELAX= 
##$RELAX= 
##$RELAX= 
##$RELAX= 
##$RELAX= 
##$RELAX= 
$$ Bruker specific parameters
$$ --------------------------
##$DU= <F:/spectra>
##$EXPNO= 1
##$NAME= <H-F>
##$PROCNO= 1
##$TYPE= <nmr>
##$USER= <she>
##$AMP= (0..31)
100 100 100 100 100 100 100 100 100 100 100 100 100 100 100 100 100 100 
100 100 100 100 100 100 100 100 100 100 100 100 100 100 
##$AQSEQ= 0
##$AQ_mod= 1
##$AUNM= <au_zg>
##$AUTOPOS= <>
##$BF1= 200.13
##$BF2= 200.13
##$BF3= 200.13
##$BF4= 200.13
##$BF5= 200.13
##$BF6= 200.13
##$BF7= 200.13
##$BF8= 200.13
##$BYTORDA= 1
##$CFDGTYP= 0
##$CFRGTYP= 5
##$CHEMSTR= <none>
##$CNST= (0..31)
1 1 145 1 1 1 1 1 1 1 1 1 1 1 1 1 1 1 1 1 1 1 1 1 1 1 1 1 1 1 1 1 
##$CPDPRG= <>
##$CPDPRG1= <>
##$CPDPRG2= <>
##$CPDPRG3= <>
##$CPDPRG4= <mlev>
##$CPDPRG5= <mlev>
##$CPDPRG6= <mlev>
##$CPDPRG7= <mlev>
##$CPDPRG8= <mlev>
##$CPDPRGB= <>
##$CPDPRGT= <>
##$D= (0..31)
0 1.2 0 0 0 0 0 0 0 0.06 0 0.03 0 0 0 0 0.0002 0 0 0 0 0 0 0 0 0 0 0 0 
0 0 0 
##$DATE= 1720433880
##$DBL= (0..7)
120 120 120 120 120 120 120 120 
##$DBP= (0..7)
150 150 150 150 150 150 150 150 
##$DBP07= 0
##$DBPNAM0= <>
##$DBPNAM1= <>
##$DBPNAM2= <>
##$DBPNAM3= <>
##$DBPNAM4= <>
##$DBPNAM5= <>
##$DBPNAM6= <>
##$DBPNAM7= <>
##$DBPOAL= (0..7)
0.5 0.5 0.5 0.5 0.5 0.5 0.5 0.5 
##$DBPOFFS= (0..7)
0 0 0 0 0 0 0 0 
##$DE= 6
##$DECBNUC= <off>
##$DECIM= 24
##$DECNUC= <off>
##$DECSTAT= 4
##$DIGMOD= 1
##$DIGTYP= 9
##$DL= (0..7)
0 120 120 120 120 120 120 120 
##$DP= (0..7)
150 150 150 150 150 150 150 150 
##$DP07= 0
##$DPNAME0= <>
##$DPNAME1= <>
##$DPNAME2= <>
##$DPNAME3= <>
##$DPNAME4= <>
##$DPNAME5= <>
##$DPNAME6= <>
##$DPNAME7= <>
##$DPOAL= (0..7)
0.5 0.5 0.5 0.5 0.5 0.5 0.5 0.5 
##$DPOFFS= (0..7)
0 0 0 0 0 0 0 0 
##$DQDMODE= 0
##$DR= 18
##$DS= 0
##$DSLIST= <SSSSSSSSSSSSSSS>
##$DSPFIRM= 0
$$ [...]
##$SUBNAM2= <"">
##$SUBNAM3= <"">
##$SUBNAM4= <"">
##$SUBNAM5= <"">
##$SUBNAM6= <"">
##$SUBNAM7= <"">
##$SUBNAM8= <"">
##$SUBNAM9= <"">
##$SW= 24.0689651099613
##$SWIBOX= (0..15)
0 0 2 0 0 0 0 0 0 0 0 0 0 0 0 0 
##$SW_h= 4816.95568400771
##$TD= 16384
##$TD0= 1
##$TE= 0
##$TE2= 300
##$TE3= 300
##$TEG= 300
##$TL= (0..7)
0 120 120 120 120 120 120 120 
##$TP= (0..7)
150 150 150 150 150 150 150 150 
##$TP07= 0
##$TPNAME0= <>
##$TPNAME1= <>
##$TPNAME2= <>
##$TPNAME3= <>
##$TPNAME4= <>
##$TPNAME5= <>
##$TPNAME6= <>
##$TPNAME7= <>
##$TPOAL= (0..7)
0.5 0.5 0.5 0.5 0.5 0.5 0.5 0.5 
##$TPOFFS= (0..7)
0 0 0 0 0 0 0 0 
##$TUNHIN= 0
##$TUNHOUT= 0
##$TUNXOUT= 0
##$USERA1= <user>
##$USERA2= <user>
##$USERA3= <user>
##$USERA4= <user>
##$USERA5= <user>
##$V9= 5
##$VALIST= <valist>
##$VCLIST= <CCCCCCCCCCCCCCC>
##$VD= 0
##$VDLIST= <DDDDDDDDDDDDDDD>
##$VPLIST= <PPPPPPPPPPPPPPP>
##$VTLIST= <TTTTTTTTTTTTTTT>
##$WBST= 1024
##$WBSW= 4
##$XGAIN= (0..3)
0 0 0 0 
##$XL= 0
##$YL= 0
##$YMAX_a= 301858
##$YMIN_a= -267475
##$ZGOPTNS= <>
##$ZL1= 120
##$ZL2= 120
##$ZL3= 120
##$ZL4= 120
##$ABSF1= 10
##$ABSF2= 0
##$ABSG= 5
##$ABSL= 3
##$ALPHA= 0
##$AQORDER= 0
##$ASSFAC= 0
##$ASSFACI= 0
##$ASSFACX= 0
##$ASSWID= 0
##$AUNMP= <proc_1d>
##$AZFE= 0.1
##$AZFW= 0.1
##$BCFW= 1
##$BC_mod= 2
##$BYTORDP= 1
##$COROFFS= 0
##$CY= 11.3945322036743
##$DATMOD= 1
##$DC= 2
##$DFILT= <>
##$DTYPP= 0
##$F1P= 15.6554695791079
##$F2P= 12.8336369535428
##$FCOR= 0.5
##$FTSIZE= 0
##$FT_mod= 4
##$GAMMA= 1
##$GB= 0.15
##$INTBC= 1
##$INTSCL= 1
##$ISEN= 128
##$LB= 0.24
##$LEV0= 0
##$LPBIN= 0
##$MAXI= 10000
##$MC2= 0
##$MEAN= 0
##$ME_mod= 0
##$MI= 1.114404
##$NCOEF= 0
##$NC_proc= 0
##$NLEV= 6
##$NOISF1= 3.799351
##$NOISF2= 2.8
##$NSP= 1
##$NTH_PI= 0
##$NZP= 0
##$OFFSET= 15.70392
##$PC= 1
##$PHC0= -25654.74
##$PHC1= 11.38748
##$PH_mod= 1
##$PKNL= yes
##$PPARMOD= 0
##$PSCAL= 0
##$PSIGN= 0
##$REVERSE= no
##$SF= 200.130013532006
##$SI= 16384
##$SIGF1= 3
##$SIGF2= 2
##$SINO= 400
##$SIOLD= 16384
##$SREGLST= <1H.CDCl3>
##$SSB= 0
##$STSI= 0
##$STSR= 0
##$SW_p= 3612.71676300578
##$SYMM= 0
##$S_DEV= 0
##$TDeff= 0
##$TDoff= 0
##$TI= <>
##$TILT= no
##$TM1= 0
##$TM2= 0
##$TOPLEV= 0
##$USERP1= <user>
##$USERP2= <user>
##$USERP3= <user>
##$USERP4= <user>
##$USERP5= <user>
##$WDW= 1
##$XDIM= 8192
##$YMAX_p= 0
##$YMIN_p= 0
$$ End of Bruker specific parameters
$$ ---------------------------------
##NTUPLES= NMR FID
##VAR_NAME=  TIME,          FID/REAL,        FID/IMAG
##SYMBOL=    X,             R,               I
##VAR_TYPE=  INDEPENDENT,   DEPENDENT,       DEPENDENT
##VAR_FORM=  AFFN,          ASDF,            ASDF
##VAR_DIM=   8192,          8192,            8192
##UNITS=     SECONDS,       ARBITRARY UNITS, ARBITRARY UNITS
##FACTOR=    0.0002076,     1,               1
##FIRST=     0,             0,               0
##LAST=      1.7004516,     0,               0
##MIN=       0,             -267475,         0
##MAX=       1.7004516,     301858,          0
$$ Real data points
##PAGE= N=1
##DATA TABLE= (X++(R..R)), XYDATA
$$ [...]
1745a366J426J662J203p2j137j347j540j308o23L75J618J919J236O40j55j111
$$ -1366 60 1722 2925 2853 1716 369 -1171 -2479 -3102 -2727 -1109 810 2046 2686 2531 1420
1761A420j604j721q30J71O76J312J451J137M8q01j099j036o97m54L65R10J400
$$ 1420 -184 -1905 -2735 -2564 -1888 -576 875 2012 2060 1259 160 -876 -1573 -2027 -1662 -752 648
1778F48P88L21l6q77r95j523p08K23O61J123J499J113O43o66j396j525j027o34
$$ 648 1436 1757 1721 844 -151 -1674 -2382 -2159 -1498 -375 1124 2237 2880 2214 818 -707 -1734 -2368
1796b368j69J274J725J194P58j70n88j013j474r45l8L96J252J068Q53J13k77q17
$$ -2368 -2537 -1263 462 1656 2414 2244 1656 643 -831 -1776 -1814 -1418 -166 902 1755 1868 1591 774
1814G74j152p50n23J89N37Q97J267R12j11o32j149j464r99q5M63J117J569R86
$$ 774 -378 -1128 -1651 -1462 -925 -28 1239 2151 2040 1408 259 -1205 -2204 -2289 -1826 -709 860 1846
1832A846L00j23r95j372j320m23j78P00J293J028J004p2o24q75q75p34n03M72
$$ 1846 2146 2023 1028 -344 -1664 -2087 -2265 -1565 -272 756 1760 1688 1064 189 -686 -1420 -1923 -1451
1850a451P94J204N20L45j2p25r07j199m33J6O66J222J232Q67L70q91j222j509
$$ -1451 -657 547 1067 1412 1400 675 -232 -1431 -1864 -1848 -1182 40 1272 2139 2509 1618 396 -1113
1868a113q85l00K40J098J744J063N35m66q14j190j021p53J60P78J256N75P50J78
$$ -1113 -1998 -2298 -2058 -960 784 1847 2382 1916 1102 -88 -1109 -1862 -1702 -924 332 907 1657 1835
1886A835n18j059r84l71l43M86N71J137Q89K32m73p69q32j008q94L7Q50J263J197
$$ 1835 1317 258 -726 -1097 -1440 -954 -383 754 1643 1875 1402 633 -199 -1207 -2101 -2064 -1214 49 1246
1905A246M94K23k81j123j557p64l18N13M04J404R28N10m82o72n30j044l74m30
$$ 1246 1740 1963 1682 559 -998 -1762 -2080 -1567 -1163 241 1169 1679 1197 525 -5 -1049 -1423 -1853
1923a853Q11R60O48K98k9J34o76j078o73j09L15M84R92J152O75m12q40j000r32
$$ -1853 -1042 -82 566 864 835 969 293 -785 -1458 -1567 -1252 -768 224 1376 2051 1639 799 -201 -1133
1942a133n55k93M92J224J156O81M49m08q01j032r02j64N0Q73M63P74P06m1q91
$$ -1133 -1688 -1981 -1489 -265 891 1572 2021 1613 812 -220 -1122 -1286 -1236 -363 100 874 1580 1539 648
1961F48o49k84n85l6r4R26R42J12L83j40n43q85r74n19L90M46Q23R66Q10J05p05
$$ 648 -1 -285 -870 -906 -1000 -74 868 980 1363 1223 680 -205 -1179 -1698 -1308 -862 -39 927 1737 1842 1137
1982A137j002j141m94m35K04Q80J427O37P1k13l52p76j114l59J25P62N93K68P57
$$ 1137 135 -1006 -1500 -1935 -1731 -851 576 1213 1284 1071 719 -57 -1171 -1530 -1405 -643 -50 218 975
2001I75J77m52o54q83j20k61mN59J032Q35M36k86o25q17r33q65M96N68R28Q70
$$ 975 1152 700 46 -837 -957 -1218 -1222 -663 369 1204 1640 1354 729 -88 -1021 -1886 -1390 -822 106 976
2021I76N24L41o13p99j087m10j34J79N22Q30P16M11l38m68m70p74m32K12L99P01
$$ 976 1500 1841 1228 429 -658 -1068 -1202 -1023 -501 329 1045 1456 1118 650 180 -594 -1026 -814 -415 286
2041B86O08J80J46j47p45r16n53l7K92N63P38O43M76k85p55p11p53m08j90N61
$$ 286 894 1074 1220 1073 328 -588 -1141 -1178 -886 -323 415 1058 1534 1249 494 -217 -970 -1378 -1568 -1007
2061a007R02O32N08J1l19l02q39p88OL15M86L19P01J71j05n13l51l84k96j27L51
$$ -1007 -105 527 1035 1046 727 425 -414 -1202 -1196 -881 -395 -76 625 796 691 178 -173 -557 -853 -980 -629
2082f29K80Q13L57K24k55n58n43o34n45M23N84O38N35N93J8o87m85m89n58j00
$$ -629 -349 464 821 1045 790 232 -311 -945 -1490 -1067 -483 155 690 1283 1301 614 129 -360 -918 -1018
2102a018M83L44P37Q8M31j54l20p56k75k58r2N79K44N57L11J38m85l84n60l26
$$ -1018 -535 -191 546 634 1065 911 591 -165 -440 -698 -790 -211 33 590 901 1039 554 170 -390 -716
2122g16O2m1L83O40N15L42k46n82m26r32j72j36L19Q58O24M50Rk68n78n69m38
$$ -716 -654 -695 -312 328 843 1185 939 357 -69 -1001 -1173 -1309 -990 -132 492 942 951 683 105 -464 -902
2143i02k33K27M10P61M10j16j25j19n37m55k68M5L48M37N17L67K8k41o18m98l96
$$ -902 -1135 -908 -498 263 673 557 432 313 -224 -679 -947 -902 -554 -117 400 767 795 554 -64 -562 -958
2164i58q5J67P49N06N04L98k74l92p94l89l56M4N10K97O77L86l5j29p04k14m92
$$ -958 -1043 -876 -127 379 883 1281 1007 615 -179 -568 -924 -880 -370 -73 604 990 955 826 122 -92 -584
2185e84k14K35M61N32J18L30m3l08m96n92J0k65M62L59M03N66j16j92m79n18n32
$$ -584 -798 -563 -102 430 548 878 835 527 31 -561 -551 -816 -354 5 408 974 858 666 187 -331 -863
2206h63j33J33N37O66K91K22o0m27n03m12l34j4L43L79L00N05j05j07m86p6m72
$$ -863 -996 -863 -326 340 631 853 793 366 -137 -549 -883 -897 -554 -175 125 630 525 418 -68 -144 -616
2227f16o4K49K15M61K74p1L2l6o41l93k32J74O6M23M42M69L88m59k74o35m03j89
$$ -616 -680 -431 -216 245 519 448 480 444 -197 -590 -822 -648 -582 -159 283 752 1140 681 407 -228 -631 -820
2249h20K63J80L95O52K33j33j71k87m57n33J50L54M4K86M64R5j08j97n10j57l90
$$ -820 -557 -377 18 670 903 770 599 312 -145 -678 -528 -174 -130 156 620 715 607 410 -100 -257 -647
2270f47m0M82L96K20K62l8j20k89o07m39m7J41N85L34L94K66M0p19m39k23j72
$$ -647 -687 -205 191 411 673 635 515 226 -381 -820 -867 -726 -141 193 587 853 893 174 -265 -488 -660
2291f60O2L7M48N77N6j26q8p7l59l97j21J51M55P2L33L42j02l50n36l47q4p5K66
$$ -660 -598 -561 -113 464 520 394 306 229 -130 -527 -648 -497 -42 30 363 705 603 253 -283 -630 -714 -789 -523
2314e23M14N02L78l0k08l79m88l86j57K07M04O55L69j00J4k57l03m93k3O3J58
$$ -523 -109 393 771 741 533 154 -334 -720 -877 -670 -266 389 758 658 672 415 112 -381 -404 -341 -183
2335a83N1N83J97p3r6m22J5n31j4J31K36M69K73J34j42j74n51l01l68J68J55M01
$$ -183 -132 451 648 575 479 57 72 -459 -473 -342 -106 363 636 770 628 454 -97 -398 -766 -598 -443 -42
2357d2M67L19j11m1n03l96j19k96J38K14N51K73J7j46r7j56m04j38P2N2K77J11
$$ -42 425 744 633 592 89 -307 -426 -722 -584 -370 181 454 471 325 228 72 -332 -470 -398 -346 -69 42
2379D2K32j36j4k00L7m08j35n7M09L89K94k4K48K4n13n22j54q8K15K35N63P3L4
$$ 42 274 138 124 -76 -39 -447 -582 -639 -230 159 453 429 677 701 188 -334 -488 -576 -361 -126 437 510 544
2402E44n6k92n06j73K24l98L31P01N6q0R2j12k03j62k76M4KJ48L71J91J65l16
$$ 544 488 196 -310 -483 -259 -657 -326 375 431 351 443 331 128 -34 -310 -266 -264 -116 255 446 611 295
2424B95Nn69j44k03M1K14L18K94L70Q5m15l67p9l19j00m4N57O0L94J40K0l68k64
$$ 295 300 -269 -413 -616 -575 -361 -43 251 621 706 291 -76 -155 -474 -574 -618 -61 -1 393 533 553 185 -79
2447g9n95P1J22K12J44M14K03j80%k43k56l94J50l9K33L30M06K46k57l00k72p7
$$ -79 -674 -603 -481 -269 -125 289 492 312 312 69 -187 -581 -431 -470 -237 93 499 745 488 188 -84 -161
2469a61m77K82m1J53N48L17P0k23m04j39k60j2KK38L13JL91j43k55k97Q8m83K39
$$ -161 -638 -356 -397 -244 304 621 691 468 64 -75 -335 -347 -345 -107 206 207 598 455 200 -97 -9 -492 -253
2492b53J06K01K07K70r2K4k14l76k63q3J69N5K83O32j87j24n4k36m51O6j63P0
$$ -253 -147 54 261 531 439 463 249 -127 -390 -473 -304 -249 34 666 479 355 301 65 -386 -320 -483 -413
2514d13K59K42K25J51J04n76k33k91K33l8J73K96J55J31o8k10r6m38J2J14nK84
$$ -413 -154 88 313 464 568 -8 -241 -532 -299 -337 -164 132 287 418 350 140 44 -394 -382 -268 -273 11
2536A1K99l2J2L6j35p9l32k54k1K65J18L35L82j70k18j37k52j30k0J98J41K06
$$ 11 310 278 290 326 191 112 -220 -474 -495 -230 -112 223 605 435 217 80 -172 -302 -322 -124 17 223
2558B23o4K8N6j5l8l56K2N0Jj7J62L11n1k8k29p3l07q7K45J18J89l5Q1K3p1j76
$$ 223 159 187 243 228 190 -166 -144 -94 -93 -110 52 363 312 284 55 -18 -325 -412 -167 -49 140 105 186 209 138 -38
2584c8j75j23j18J75J78K60J80J06j91k59j17m71J91pJ46L12J44J08j04r0j79
$$ -38 -213 -336 -454 -279 -101 159 339 445 254 -5 -122 -593 -402 -409 -263 49 193 301 197 107 -72
2605g2ll63K14R7J10J49R4O6M4k86l04j24J11k16L60K40K88MO7k47o3k40l77Q2
$$ -72 -75 -438 -224 -127 -17 132 226 292 336 50 -254 -378 -267 -483 -123 117 405 409 476 229 166 -74 -451 -369
2629c69K07J93J22K47j92K49k39l40j8j39N0K61O8K74j54kj32P1j51j94j07K12
$$ -369 -162 31 153 400 208 457 218 -122 -140 -279 -229 32 100 374 220 218 86 157 6 -188 -295 -83
2651h3P4J12L34j01n1K5k98l89PJ0N4L30J46J77j18j36r4j34l22Q8Q7O9L34J34
$$ -83 -9 103 437 336 285 310 12 -377 -370 -360 -306 24 170 347 229 93 -1 -135 -457 -369 -282 -213 121 255
2675B55k9o6j76j14p3J04n4%J54j45M71l7l49J78l11L1r0L3K91K10r4J78k6j97
$$ 255 226 160 -16 -130 -203 -99 -153 -153 1 -144 327 290 -59 119 -192 -161 -251 -218 73 283 189 367 341 144
2699A44k08j34j84j28L50M8K39J59r7J25k40j47j72R8k95N8N78K27q6k60N0j91
$$ 144 -64 -198 -382 -510 -160 -112 127 286 189 314 74 -73 -245 -147 -442 -384 194 421 335 75 125 -66
2721f6L0j77m2J74o5M45J08o7J22k70j65k49j08M9R6O6L59K58j74j69q7r2k44
$$ -66 -36 -213 -255 -81 -146 299 407 340 462 192 27 -222 -330 -281 -185 -119 240 498 324 155 68 -24 -268
2744b68l4j6L00J27M5J11j49J8k33j38n4J76J37Q4K09P8p8j73j15k98o2K33j02
$$ -268 -302 -318 -18 109 154 265 116 134 -99 -237 -291 -115 22 106 315 393 315 142 27 -271 -333 -100 -202
2767b02K31J49M0nJ34j55k72k60j15q0L55K72j58N34k40j21o1k71J24r6P2J78
$$ -202 29 178 218 213 347 192 -80 -340 -455 -535 -180 92 -66 468 228 107 46 -225 -101 -197 -125 53
2789E3J54j20K19n4j72j90L0J14k56QJ36L78O4l8j87k21r2k13J04Jo8K44M85j09
$$ 53 207 87 306 252 80 -110 -80 34 -222 -214 -78 300 364 326 139 -82 -174 -387 -283 -282 -350 -106 379 270
2813B70J48p6k11k94j75K20O5j30K10J7K32j93j91J26j79lj46J41K62L5J16J48
$$ 270 418 342 131 -163 -338 -118 -53 -183 27 44 276 83 -108 18 -161 -164 -310 -169 93 128 244 392
2835C92m44j8p5j85jK82J19Q6m9K66k8k37l35J31j51P3j64L04J24qP1m2j20Q2
$$ 392 -52 -70 -145 -330 -331 -49 70 156 107 373 345 108 -227 -96 -247 -174 -338 -34 90 82 153 111 -9 73
2859G3j02r4lR7n8J44K9R9L2k76N7r0j46J12l0K40J8J94k20N2k95qq6n1L3L89
$$ 73 -29 -123 -126 -29 -87 57 86 185 217 -59 -2 -92 -238 -126 -156 84 102 296 76 128 -167 -175 -261 -312 -279 110
2885A10P5n4p7J85l37J21l56O0O2K20J27RJ5l29K22k07K5K3p9J5K75P7k13J53
$$ 110 185 131 54 239 -98 23 -333 -273 -211 9 136 145 160 -169 53 -154 -129 -106 -185 -170 105 182 -31 122
2909A22K21n41J43j47p0J41J17J42J54j00N5k49m7k41rL2l0L66K21N1j10K1j91
$$ 122 343 -198 -55 -202 -272 -131 -14 128 282 182 237 -12 -59 -300 -309 -277 -307 59 280 331 221 242 51
2932E1k09Lj89K11K75j53J78J6R6o3k50m6j61K61J4KJ99O9l31J22r5m56K0J84
$$ 51 -158 -155 -344 -133 142 -11 167 183 279 216 -34 -80 -241 20 34 36 235 304 -27 95 0 -456 -436 -252
2956b52J76k6J46J75K4j02O8m80Q3j57K3K57J39J12l7j13K7j9k91KJ14J67r8R9
$$ -252 -76 -102 44 219 243 141 209 -271 -188 -345 -322 -65 74 186 149 36 63 44 -247 -245 -131 36 -62 37
2980C7J03J44n4l5q1k13k15J59O1N3K51Q5j06L1j92q3k84L19j02j8K39K1R7%K35
$$ 37 140 284 230 195 114 -99 -314 -155 -94 -41 210 295 189 220 28 -55 -339 -20 -122 -140 99 120 217 217 452
3005D52n28j14j87r2L87L8j7J38J88j32p1L8k32P2j25J70Q7J25N9j77J65k95k46
$$ 452 -76 -190 -377 -469 -82 -44 -61 77 265 133 62 100 -132 -60 -185 -15 72 197 256 79 244 -51 -297
3028b97J8J0M6J12K96o9J98p1N6l30j98J6J03M0k7K08L7j50K14j28k05o9j12K50
$$ -297 -279 -269 -223 -111 185 116 314 243 299 -31 -229 -213 -110 -70 -97 111 148 -2 212 84 -121 -190 -302 -52
3052e2K0J33M5j16M9p2q9J8k82J19M6K89K53j61r8J86m09p1r4j86J99O2J54K65
$$ -52 -32 101 146 30 79 7 -82 -64 -346 -227 -181 108 361 200 102 288 -121 -192 -286 -472 -273 -211 -57 208
3076B08J49nr9l55j80n6Q6K32o5K24Q0L5k31j8k1k60K3J50O3J01J58j7k1k12j66
$$ 208 357 352 253 -102 -282 -338 -252 -20 -85 139 219 254 23 5 -16 -276 -253 -103 -40 61 219 202 181 -31 -197
3101a97J18k66J76m9J14K81K64j9j72k11k15j59pQ2M0L28J00Lj39p5O6ol08O0
$$ -197 -79 -345 -169 -218 -104 177 441 422 250 39 -176 -335 -342 -260 -220 108 208 211 72 -3 63 57 -251 -191
3125a91J92j36K01J12O3j55k78Q5RL8j58K54L8K16n5k4l5j73j93r6K7J12J73J91
$$ -191 1 -135 66 178 241 86 -192 -107 -98 -60 -218 36 74 290 235 211 176 3 -190 -286 -259 -147 26 217
3149B17O8J09k48p8j48j43j97K15J83j84L03J01M4j63k90j88L20p2M4J25J07k8
$$ 217 285 394 146 68 -80 -223 -420 -205 -22 -206 97 198 242 79 -211 -399 -79 -151 -107 18 125 97
3171I7j06J89k74L2n3r4J00j4m2L47K5R1o5j89J00l40jj24J37M28J07k7q6p6p2
$$ 97 -9 180 -94 -62 -115 -209 -109 -123 -165 182 207 298 233 44 144 -196 -197 -321 -184 244 351 324 238 162 90
3196I0k93j5j1O0J32M1J66k0q7J0j62j09m2K08j5R1K8J14Q0k55k89K15k29J90
$$ 90 -203 -218 -229 -169 -37 4 170 150 63 73 -89 -198 -240 -32 -47 44 72 186 266 11 -278 -63 -292 -102
3220a02J07P7LL60k3m5m93r8j44K23j40K32Q7KK62k88J50j19k13l3Q5n0n3M81
$$ -102 5 82 85 445 422 377 -116 -214 -358 -135 -275 -43 44 46 308 20 170 51 -162 -195 -110 -160 -213 268
3244B68n3p3J60k44k67l6j32J70J94j26K62K50n9j81q4j22k9k75K63J54J4K04
$$ 268 215 142 302 58 -209 -245 -377 -207 -13 -139 123 373 314 133 49 -73 -102 -377 -114 40 54 258
3266B58N1R1k56j65o2k12p9J73K37j50K21O2j31M5l61K05j22K12M8J6J85L8k79
$$ 258 309 400 144 -21 -83 -295 -374 -201 36 -114 107 169 38 83 -278 -73 -195 17 65 81 266 304 25
3289B5j89K8j64m5N0J01K34L20n3N8m03k4k0j21J04j88K04J22J35K8J45k08j11
$$ 25 -164 -136 -300 -345 -295 -194 40 360 307 365 -38 -62 -82 -203 -99 -287 -83 39 174 202 347 139 28
3312B8m5q2n2J4J23K4J69J2k46J47j36j62J85j19j26L35k2L82j59p3k09j43k00
$$ 28 -17 -99 -151 -137 -14 10 179 191 -55 92 -44 -206 -21 -140 -266 69 47 429 270 197 -12 -155 -355
3335c55J11J55R6j27K03J10P5k00j59J88l90M6J33K14j8J96J28k81j10p2q4O6
$$ -355 -244 -89 7 -120 83 193 268 68 -91 97 -293 -247 -114 100 82 278 406 125 15 -57 -141 -75
3357g5j59K54J25J58j14j14Q4l59k2p4j35J23M09J47l0P7q3j07k98J76k39nK98
$$ -75 -234 20 145 303 189 75 159 -200 -222 -296 -431 -308 101 248 218 295 212 105 -193 -17 -256 -261 37
3380C7j08K05j1P0k17J09j14j43K8J8J30J53n0L1J28l22k9k7PJ57p2J47k0Q2n0
$$ 37 -71 134 123 193 -24 85 -29 -172 -144 -126 4 157 107 138 266 -56 -85 -112 -105 52 -20 127 107 189 139
3405A39j85m2o4o3O9J16m4L89o4J00j67k90j53N6k48M06j41J94J30P3O0l95N8
$$ 139 -46 -88 -152 -215 -146 -30 -74 315 251 351 184 -106 -259 -203 -451 -45 -186 8 138 211 271 -124 -66
3428f6o1m1L0J16j19K93j76J82L4n7j54rj12J2N0J36K12k05o5J41j56j61L1J25
$$ -66 -127 -168 -138 -22 -141 152 -24 158 192 135 -19 -28 -140 -128 -78 58 270 65 0 141 -15 -176 -145 -20
3452b0k97K52K88j58K77k65L7l01N9r1O8mQ6K13mJ33k04j91J25l7j73J00J96j37
$$ -20 -317 -65 223 65 342 77 114 -187 -128 -219 -151 -155 -69 144 140 273 69 -122 3 -34 -207 -107 89 -48
3476d8J75M3N4j23j72o5J20k95L38p0K98R1n9k71n5j08m8p9K13p9J48K81k22J3
$$ -48 127 170 224 101 -71 -136 -16 -311 27 -43 255 346 287 16 -39 -147 -195 -274 -61 -140 8 289 67 80
3500H0q0m3J0j18r5J53K34q5o7K83j98k08N5o0q2m3K25J41k2K90k28o6j55j1p8
$$ 80 0 -43 -33 -151 -246 -93 141 56 -11 272 74 -134 -79 -139 -221 -264 -39 102 80 370 142 76 -79 -90 -168
3525a68k36Q1M29J10M8Q5k44r5o5l71J77J22n2L52r1K19j35l7k17j25K53j03r9
$$ -168 -404 -323 106 216 264 349 105 10 -55 -426 -249 -127 -179 173 82 301 166 129 -88 -213 40 -63 -162
3548a62J88J54J06P1l13j3n1l50K17K2l4K39L6NJ71k58j74j37J5J71J54J9O5n
$$ -162 26 180 286 357 44 31 -20 -370 -153 -131 -165 74 110 115 286 28 -146 -283 -268 -97 57 76 141 136
3572A36J86p9k73j61j7N9k09L61o9K60j31J2K5l3l38o9K22%J51J45N6jK3k44n
$$ 136 322 243 -30 -191 -208 -149 -358 3 -66 194 63 75 100 67 -271 -340 -118 -118 33 178 234 233 256 12 7
3597Gj81r8J18r2L96Q6K0j15J69l35j39j61J78J81l1J45P2J18k26j96J58j74J14
$$ 7 -174 -272 -154 -246 150 236 256 141 310 -25 -164 -325 -147 34 3 148 220 338 112 -84 74 -100 14
3620A4m1Q1Q8Mj48O5P2l43R8j97L61j68o2K12K46j8Pk79l75J14j43J39K30jJ02
$$ 14 -27 54 142 146 -2 63 135 -208 -110 -307 54 -114 -176 36 282 264 271 -8 -383 -269 -412 -273 -43 -44 58
3645E8K34q3j31j04m6j68J7J66J68q4QP1k12J45j08n0N4m2M9J38O2K48k10M7m4
$$ 58 292 209 78 -26 -72 -240 -223 -57 111 27 35 106 -106 39 -69 -119 -65 -107 -58 80 142 390 180 227 183
3670A83l36K00k71J50k5J07J45J23m4l02J37j90k82O0RM38K03k62K84j30k02j0
$$ 183 -153 47 -224 -74 -99 8 153 276 232 -70 67 -123 -405 -345 -336 102 305 43 327 197 -5 -15
3692a5j85k0J56J55P5j6O5K55m03q1Q4k79LK44j02K86J28j39J22j98j86k30K60
$$ -15 -200 -220 -64 91 166 150 215 470 67 -14 70 -209 -206 38 -64 222 350 211 333 135 -51 -281 -21
3715b1k5J11L4Q7J28k89K56l26N0r4q0N3L3J91M2O6n7j31j99O5m1O4J19j6K42
$$ -21 -46 65 99 186 314 25 281 -45 5 -89 -169 -116 -83 108 150 216 159 28 -171 -106 -147 -83 36 20 262
3740B62m0j28j35j00q1j15K25p5J95K03m5Q1j02Lk84n7k26K05m5K77L38j74O9
$$ 262 222 94 -41 -141 -222 -337 -112 -187 8 211 166 247 145 148 -136 -193 -419 -214 -259 18 356 182 251
3763B51jl08Q9k53ML37r6K0K92j76j55J60j73j2k10O6J76P3J78K0k57J22p6k91
$$ 251 250 -58 31 -222 -218 119 23 43 335 159 4 164 -9 -21 -231 -165 11 84 262 282 25 147 71 -220
3787b20Q5l1j73K55K09K45j03j26k06Nk46K34j40k9K01L91j08k44Q0l7k85R5J82
$$ -220 -135 -166 -339 -84 125 370 267 141 -65 -60 -306 -72 -212 -241 -40 351 243 -1 79 42 -243 -148 34
3810C4j78N9K41j08J29p8k11j12J17l55K54K88k04L13j48J44K7k16k74N6L6J32
$$ 34 -144 -85 156 48 177 99 -112 -224 -107 -462 -208 80 -124 189 41 185 212 -4 -278 -222 -186 -54
3832e4J22J36k4R3K5k30k98L3K73k40J37N1R5J17k52L1L7j13k7oK46q4j34K50
$$ -54 68 204 180 273 298 68 -230 -197 76 -164 -27 24 119 236 -16 15 52 -61 -88 -94 152 68 -66 184
3856A84J24J15k63k82j04Q0m1J43LL55r6l9Jj66j55k10J70J19q5Q2J16m7J34l22
$$ 184 308 423 160 -122 -226 -146 -187 -44 -41 314 218 179 180 14 -141 -351 -181 -62 -147 -65 51 4 138 -184
3880a84J81j73n0k27K93K07K6O6RJ11k45r7j54K6N8J51J23p3J5P9p6j93l05J69
$$ -184 -3 -176 -226 -453 -160 47 73 139 148 259 14 -83 -237 -211 -153 -2 121 48 63 142 66 -127 -432 -263
3904b63O4nK64m4J83m3j23J68k18j78O1n8K77j79K79j12j00K15k94N1q1J13mp
$$ -263 -199 -204 60 16 199 156 33 201 -17 -195 -134 -192 85 -94 185 73 -27 188 -106 -55 -136 -23 -27 -34
3928c4J53%o0J00m0l18j3n8Nn9K48K58j06j0R1j40jk63N6J05j09M50j69J69j19
$$ -34 119 119 59 159 119 -199 -212 -270 -265 -324 -76 182 76 66 157 17 16 -247 -191 -86 -195 255 86 255 136
3953A36k34J86k11N3Q0L8o3P9m2K0R4J9l08n0k1K12q2J63J16q5J71m82J1P4j18
$$ 136 -98 88 -123 -70 10 48 -15 64 22 42 136 155 -153 -203 -224 -12 -94 69 185 100 271 -211 -200 -126 -244
3978b44j18M00j58L13R1mj97k20j54N3j82M54l8Q2J19o6J00k19k43J67r9J68O4
$$ -244 -362 38 -120 193 284 280 83 -137 -291 -238 -420 34 -4 78 197 131 231 12 -231 -64 -163 5 69
4001F9J27L3P9j12m6k06O9j27Rp7O2j1L64N1j47Rl28J21k65K00k6K91J39r5j5
$$ 69 196 229 308 196 150 -56 13 -114 -105 -182 -120 -131 233 284 137 146 -182 -61 -326 -126 -152 139 278 183 168
4026A68l06K05k41JQ9%%K33j39J77k04J62l24q8O7o9J16R0K26j14J36k05J71l90
$$ 168 -138 67 -174 -173 -84 -84 -84 149 10 187 -17 145 -179 -267 -200 -269 -153 -63 163 49 185 -20 151 -239
4050b39J50K6J3j9K10J76p8N9l14m0J03j86J46j29L01P5j72J95l98K07j18nr6
$$ -239 -89 -63 -50 -69 141 317 239 298 -16 -56 47 -139 7 -122 179 254 82 277 -121 86 -32 -37 -133
4073a33Q1nK04q6K39l17J72j92q3J41j21J84k07J31K15m1q4n2j22j60L0R2Q8K13
$$ -133 -52 -57 147 61 300 -17 155 -37 -120 21 -100 84 -123 8 223 182 98 46 -76 -236 -206 -114 -26 187
4097A87o1J17k23N5j85k1l5M1l0J06J36L05j71q5mk16M8K9mR1n2J10j24L4k6k22
$$ 187 126 243 20 75 -110 -131 -166 -125 -155 -49 87 392 221 136 132 -84 -36 -7 -11 80 28 138 14 48 22 -200
4123b00O2o5l0q9L44K6J76j8k92k9k3k05J98J82j18j21L91N4j57p9j16N7Nj31
$$ -200 -138 -203 -233 -322 22 48 224 206 -86 -115 -138 -343 -145 37 -81 -202 189 243 86 7 -109 -52 -47 -178
4147a78Q0K12J0J0q5N1L5j04k06J92j1M8L4K2J74q1p5k08J37l72J51Q9J37R6J8
$$ -178 -98 114 124 134 49 100 135 31 -175 17 6 54 88 110 284 203 128 -80 57 -315 -164 -75 62 158 176
4172A76j67q7N2L2r1Q2j88K11J57o7O1j06j30J64j58j69J97p4K02P9J60k49p3
$$ 176 9 -78 -26 6 -85 -3 -191 20 177 110 171 65 -65 99 -59 -228 -31 -105 97 176 336 87 14
4195A4O5j76N0l74L07J10l0K13j18M5k4j75K8K5j59J82j13K33l3K73m53m0j6J84
$$ 14 79 -97 -47 -421 -114 -4 -34 179 61 106 82 -93 -65 -40 -199 -17 -130 103 70 343 -110 -150 -166 18
4219A8k70J14J30R2J0j00RLj19K21q9O5j66J40R3n8j04J86k08J15k67P2j08J39
$$ 18 -252 -138 -8 84 94 -6 3 6 -113 108 19 84 -82 58 151 93 -11 175 -33 82 -185 -113 -221 -82
4243h2J86j24K32M6k50j3l2j24R9m5n6N2L27k20J02K3m66L15j56J13L7K6l7K65
$$ -82 104 -20 212 258 8 -5 -37 -161 -62 -107 -163 -111 216 -4 98 121 -345 -30 -186 -73 -36 -10 -47 218
4267B18n6r6n0k02p7l4j07M01j68K64K0j7j69N4j52P1Q2m8R5J9o0M2J61j85j47
$$ 218 162 66 16 -186 -263 -297 -404 -3 -171 93 113 96 -73 -19 -171 -100 -18 -66 29 48 -12 30 191 6 -141
4292a41P7r7R6J12N1%jQ3l34Q1M4ro5L7kK09l7K4j9r6Pj78L4R1M1n4K61j27J32
$$ -141 -64 -161 -65 47 98 98 97 180 -154 -73 -29 -38 -103 -66 -68 141 104 128 109 13 20 -158 -124 -33 8 -46 215 88 220
4321B20l9l20R9l54L44p3J84m5J96k57J6J7p0j24J93J24o3J9j50J22O5o1j24k2
$$ 220 181 -139 -40 -394 -50 -123 61 16 212 -45 -29 -12 -82 -206 -13 111 48 67 -83 39 104 43 -81 -103
4345a03k90M29l6O3j72K48j58j7J7J5k84K14j24K20M7J58k46J15K2N7k48j05n7
$$ -103 -393 36 0 63 -109 139 -19 -36 -19 -4 -288 -74 -198 22 69 227 -19 96 118 175 -73 -178 -235
4368b35K88j45J34N0o6m3O5o9o8J46K5J17l4l6on5n8P0n0j14M5N7Q2j5K5J18j05
$$ -235 53 -92 42 92 26 -17 48 -21 -89 57 82 199 165 129 123 68 10 80 30 -84 -39 18 100 85 110 228 123
4395A23r8jo1n5q5J72j7J0J23J57j26k11J29n9mm6K33l7O3j74p6N2Q5j51n4Q8
$$ 123 25 24 -37 -92 -177 -5 -22 -12 111 268 142 -69 60 1 -3 -49 184 147 210 36 -40 12 97 -54 -108 -20
4421b0k04L52Q0m3j60N0o0j23O6j30l0K24J4J93Np5m4j62j64J83J57j37j22L74
$$ -20 -224 128 208 165 5 55 -5 -128 -62 -192 -222 2 16 209 214 139 95 -67 -231 -48 109 -28 -150 224
4445B24k65K26k19r9O5n7j03K24P9J92k93J69K2l00J87p6p2K03J18o4Q8%k03J01
$$ 224 -41 185 -34 -133 -68 -125 -228 -4 75 267 -26 143 165 -135 52 -24 -96 107 225 161 249 249 46 147
4469A47j59P3ol01J89R5L6Q0o7J31l19J10j62R0Q7o3M5l2J28j21M3R5k45J13j07
$$ 147 -12 61 55 -246 -57 38 74 154 87 218 -101 9 -153 -63 24 -39 6 -26 102 -19 24 119 -126 -13 -120
4494a20r2J73q3L75nj19J1j89o5qJ51j58L11k64J19J88j15j3pk79R9J9M3K2J78
$$ -120 -212 -39 -122 253 248 129 140 -49 -114 -122 29 -129 182 -82 37 225 110 97 90 -189 -90 -71 -28 -6 172
4519A72r0j94j62K9M44j78k2m7J66L0lNk80N7l3J30j01j40J78J53l09K22Q1p4
$$ 172 82 -112 -274 -245 199 21 -1 -48 118 148 145 150 -130 -73 -106 24 -77 -217 -39 114 -195 27 108 34
4543C4m3j51P6L9J32r1J66o6qJ33j27k68J11J08j23j9L30j27j18jr2k9J16PJ07
$$ 34 -9 -160 -84 -45 87 -4 162 96 88 221 94 -174 -63 45 -78 -97 233 106 -12 -13 -105 -134 -18 -11 96
4568I6j78n6K28N2j61J2o8L9j52J99k57K39mK30k55J59k72R0j36R0Q0j73K11J16
$$ 96 -82 -138 90 142 -19 -7 -75 -36 -188 11 -246 -7 -11 219 -36 123 -149 -59 -195 -105 -25 -198 13 129
4592A29k36J94o5m7M7q9j56J54K0j2K32J5M6k47m0rK2j82L77r5mJ61j7j44J17
$$ 129 -107 87 22 -25 22 -67 -223 -69 -49 -61 171 186 232 -15 -55 -64 -42 -224 153 58 54 215 198 54 171
4617A71k07J7m7j14J27J56k01L79l16L0J20o9n9l3J52j23p7K50k05N5J2L9q1l5
$$ 171 -36 -19 -66 -180 -53 103 -98 281 -35 -5 115 46 -13 -46 106 -17 -94 156 -49 6 18 57 -24 -59
4641e9q7J96J74j17r0j0m4Rj82jJ80j76J60J81J0pN4j62j34j13L40p1j05J0J80
$$ -59 -146 50 224 107 17 7 -37 -28 -210 -211 -31 -207 -47 134 144 137 191 29 -105 -218 122 51 -54 -44 136
4666A36r2k48L43k21j26R2K99k05R0M2j60NRn6j54J70lr0K35J31k1n9j49L7m0
$$ 136 44 -204 139 -82 -208 -116 183 -22 68 110 -50 -45 -36 -92 -246 -76 -79 -169 66 197 176 117 -32 5 -35
4691c5o1Q1j56Q4J02J64n1J52j87j01J19k94R2K50j17j2j5rl6K07k07l2r1J77
$$ -35 -96 -15 -171 -87 15 179 128 280 93 -8 111 -183 -91 159 42 30 15 6 -30 177 -30 -62 -153 24
4715B4N4j9M6j80J89r2p3k06J2J55O1Rj25K45j6J67k80r9J90j55L1l5pL91k69
$$ 24 78 59 105 -75 114 22 -51 -257 -245 -90 -29 -20 -145 100 84 251 -29 -128 62 -93 -62 -97 -104 287 18
4740A8o1Ok5K06l05Q4O9M7J24j25o6L7J86p1l11J8J56k09L15K1n3J47k02M1j88
$$ 18 -43 -37 -62 144 -161 -77 -8 39 163 38 -28 9 195 124 -187 -169 -13 -222 93 114 61 208 6 47 -141
4765a41K32q4r9J27M7J49j08r9L9j34m7nJ1L2K22k69L70k24NJ24j57lN7j17N5
$$ -141 91 7 -92 35 82 231 123 24 63 -71 -118 -123 -112 -80 142 -127 243 19 24 148 -9 -12 45 -72 -17
4790a7N6k4J00j0k9j77Q1Rj11R1N8O0j20J32k4l16J77O1k02R0R0P7k6l3K40r1
$$ -17 39 15 115 105 76 -101 -20 -11 -122 -31 27 87 -33 99 75 -241 -64 -3 -205 -115 -25 52 26 -7 233 142
4816A42l05K31p3k5%k16M09q0L7rj58rJ03j11j3R0mO6O6j89O4M1q0j99K24M6N3
$$ 142 -163 68 -5 -30 -30 -246 163 83 120 111 -47 -56 47 -64 -77 13 9 75 141 -48 16 57 -23 -222 2 48 101
4843A01o4lJ27Jk24J69o5k5L9j29j0R5K06j75r8J10J18l53P2M1J07j72L17k51
$$ 101 37 34 161 162 -62 107 42 17 56 -73 -83 12 218 43 -55 55 173 -180 -108 -67 40 -132 185 -66
4867f6J3J26r1p6P6o6l7J86p4J29M0j35k10P1p0K86k17J92j08J51o1pj83K02j54
$$ -66 -53 73 -18 -94 -18 -84 -121 65 -9 120 160 25 -185 -114 -184 102 -115 77 -31 120 59 52 -131 71 -83
4892h3j16J83j32J85Q9k56mJ79j6j87J74J1j23K45n9J1j60J71k6o4p5O3m2P0p8
$$ -83 -199 -16 -148 37 126 -130 -134 45 29 -158 16 27 -96 149 90 101 -59 112 86 22 -53 10 -32 38 -40
4917d0L5J21m5o8K2jJl9J17l26K67P1k64Q8O9L5p2M9K8J8j08m0L06j57P0j21o1
$$ -40 -5 116 71 3 25 24 25 -14 103 -223 44 115 -149 -61 8 43 -29 20 48 66 -42 -82 224 67 137 16 -45
4944d5J06k00K1Q6J12R4m1p4N2k1j56l1n3J32R4r4M8P3j56L6r2J23o3jJ67lj37
$$ -45 61 -139 -118 -32 80 174 133 59 111 90 -66 -97 -150 -18 76 -18 30 103 -53 -17 -109 14 -49 -50 117 114 -23
4971b3rLK08j42k54J49l9K41lr1M1l4L4l0K4l17J80J46n6J71j26l8j5J67l53P7
$$ -23 -32 -29 179 37 -217 -68 -107 134 131 40 81 47 81 51 75 -242 -62 84 28 199 73 35 20 187 -166 -89
4997h9k0K2k0J85j51P5P8r1o9j4J84p3n0L6m1N8m2J0J48l15J03kJ03j61K88k47
$$ -89 -109 -87 -107 78 -73 2 80 -11 -80 -94 90 17 -33 3 -38 20 -22 -12 136 -179 -76 -78 25 -136 152 -95
5023i5J37jM6N9k25j40J17j3M3K29j69O1m1K7J6j64N9j71J67m2j5K54j04rJ22
$$ -95 42 41 87 146 -79 -219 -102 -115 -72 157 -12 49 8 35 51 -113 -54 -225 -58 -100 -115 139 35 26 148
5048A48k90j4J83n2O9q7j01K84k77J23R1k06M4j64K58j05J35P9l6O0l5j37J8n6
$$ 148 -142 -156 27 -25 44 -43 -144 140 -137 -14 77 -129 -85 -249 9 -96 39 118 82 142 107 -30 -12 -68
5072f8m6J34P0nL6M1l66O6N7J64j88M7Q6o5R5m4j11P4M1j5O2j36K08p7mJ40j82
$$ -68 -114 20 90 85 121 162 -204 -138 -81 83 -105 -58 28 -37 58 14 -97 -23 18 3 65 -71 137 60 56 196 14
5099A4J19r4k44L39l35J39m7K02L2N6j34K54l96O2J3j71J17J30r7m7L00j89Q3
$$ 14 133 39 -205 134 -201 -62 -109 93 125 181 47 301 -95 -33 -20 -191 -74 56 -41 -88 212 23 106
5122A06l05J33o1J55j18K41k49N5N1p1P7k62L38j06j94L54j66op0Q5K9q1rJ18
$$ 106 -199 -66 -127 28 -90 151 -98 -43 8 -63 14 -248 90 -16 -210 144 -22 -28 -98 -13 16 -65 -74 44
5146D4k22J22J91o2m4R6j22k43J93Po6J06J76j36J78j52m5J52j36k56K70K5O8
$$ 44 -178 -56 135 73 29 125 3 -240 -47 -40 -106 0 176 40 218 66 21 173 37 -219 51 76 144
5169A44N7q9p8j22k9OK15j35n9l7O7J42o3J9L4k4J03j68j81J28j38K11P9j32J38
$$ 144 201 112 34 -88 -117 -111 104 -31 -90 -127 -60 82 19 38 72 48 151 -17 -198 -70 -208 3 82 -50 88
5194H8j0q8j54J99J31j89O7J41j21J17k21R8l46K13q2R5M4P6l8j05P0o2J95m9
$$ 88 78 -10 -164 35 166 -23 44 185 64 181 -40 58 -288 -75 -157 -62 -18 58 20 -85 -15 -77 118 69
5218F9j12nj0J83j1q2M4p3J12k15O2m5j6k3J37PpK66j60k04q1J72N6J1q7k50K43
$$ 69 -43 -48 -58 125 114 32 76 3 115 -100 -38 -83 -99 -122 15 22 15 281 121 -83 -164 8 64 75 -12 -262 -19
5245a9j46K34o4j0o3L1j57K25j58L12j03k5n9N8J32j90m6q9J18J2O5l0K07r7j21
$$ -19 -165 69 5 -5 -68 -37 -194 31 -127 185 82 57 -2 56 188 -2 -48 -137 -19 -7 58 28 235 138 17
5270A7oj26J29k8l9M9L9O7o8j93J78j73J57J6j2J10j76P8LL8P7l93J42k3K07j6
$$ 17 11 -115 14 -14 -53 -4 35 102 34 -159 19 -154 3 19 7 117 -59 19 22 60 137 -256 -114 -137 70 54
5296E4J39j0j82M6j85J03k23J81l4K9J80J2j81J67j8Rj61P5j34J95m3m5R5j53
$$ 54 193 183 1 47 -138 -35 -258 -77 -111 -82 98 110 -71 96 78 87 -74 1 -133 62 19 -26 69 -84
5320h4J93R4p5k39J8J03J7J0ko8J52o7q0n5j12K56j04L5R7k5R2j30N0K0j21j0
$$ -84 109 203 128 -111 -93 10 27 37 35 -33 119 52 -28 -83 -195 61 -43 -8 89 64 156 26 76 96 -25 -35
5346c5p7K66j08k23K11k7p5j50J92K5N2j10Pl8J62n5J0mok10K70r3k2J94k59K35
$$ -35 -112 154 46 -177 34 7 -68 -218 -26 -1 51 -59 -52 -90 72 17 27 23 17 -193 77 -16 -38 156 -103 132
5372A32p6J88m18p4K38Q9k8n3j9K43j21n3r5N6n7o4M9P4l5J32j18rK41k20J03
$$ 132 56 244 -174 -248 -10 79 51 -2 -21 222 101 48 -47 9 -48 -112 -63 11 -24 108 -10 -19 222 2 105
5397A05l39K81l41K24LJJ93j01K7j60J5lJ3O2r2J16P1JR9j49L3k29L2Q2O5m0J83
$$ 105 -234 47 -294 -70 -67 -66 127 26 53 -107 -92 -95 -82 -20 -112 4 75 76 175 26 59 -170 -138 -56 9 -31 152
5424A52k34J69o4J13L4j15m6o8M7k5r5J89r3j01J35qo7K13j62J75r8j58K56j3
$$ 152 -82 87 23 136 170 55 9 -59 -12 -37 -132 57 -36 -137 -2 -10 -77 136 -26 149 51 -107 149 136
5448A36k21Pkp5J8L0J04Q4m7j00l3o3K55n9M4k49qK31%m3Lp2m7O8J53j64J48j52
$$ 136 -85 -78 -80 -155 -137 -107 -3 81 34 -66 -99 -162 93 34 78 -171 -179 52 52 9 12 -60 -107 -39 114 -50 98 -54
5476e4R4J17j86K56j72n3Q6k65K66o2J48j94P4j89Q1J84j82j76q7M34j9l8Q1p7
$$ -54 40 157 -29 227 55 2 88 -177 89 27 175 -19 55 -134 -53 131 -51 -227 -314 120 101 63 144 67
5500F7k22J20J57k4q2j59J30J06j37k7J66M0k64J60N0j77K07k5n9M6j14J17R0
$$ 67 -155 -35 122 98 16 -143 -13 93 -44 -71 95 135 -129 31 81 -96 111 86 27 73 -41 76 166
5523A66j35j36P2J46J8n5j44J46J6r9k05K2K42j24J09J48j45J27l13K94j76j18
$$ 166 31 -105 -33 113 131 76 -68 78 94 -5 -210 -188 54 -70 39 187 42 169 -144 150 -26 -144
5545a44R5j34J73J6j0M0o3L62k47j26j73J44q0J67NM4K02l21J14j21p2J5N2n6
$$ -144 -49 -183 -10 6 -4 36 -27 335 88 -38 -211 -67 -147 20 25 69 271 -50 64 -57 -129 -114 -62 -118
5569a18K61J3o9j47J21j96J63K2k55K92r6P7o6L5j11J70k74k6K72k83K19J9J13
$$ -118 143 156 87 -60 61 -135 28 50 -205 87 -9 68 2 37 -74 96 -178 -204 68 -215 4 23 136
5592A36P8k04o2J12K6k08J9J89r4Q8l4k2J28j70r3P2q7J15M5K4P9o0k7K4m0n3
$$ 136 214 10 -52 60 86 -122 -103 86 -8 80 46 24 152 -18 -111 -39 -126 -11 34 58 137 77 50 74 34 -19
5618a9k06qK41J20o3k88M12l13K3J60l19L10k8k08R5K11j11rj13J97M2n3j34J0
$$ -19 -225 -233 8 128 65 -223 189 -124 -101 59 -260 50 22 -186 -91 120 9 0 -113 84 126 73 -61 -51
5642e1J1Q2j48L0m5KJ11j18P0p7OK13j10lJ67j60K0Jj08j2J34q7J17N8o9o1j7
$$ -51 -40 42 -106 -76 -121 -119 -8 -126 -56 -133 -127 86 -24 -27 140 -20 0 1 -107 -119 15 -72 45 103 34 -27 -44
5669d4J08nk28KJ9J86J24q4O3k57r0J42K67m34K98k6j41rjJ68K4j27m3j27k5K06
$$ -44 64 59 -169 -167 -148 38 162 78 141 -116 -206 -64 203 -231 67 41 -100 -109 -110 58 82 -45 -88 -215 -240 -34
5695c4O3l9n7R0j43J70j16k7n3J47M0J17P8k47J60j76J34J14k69o0J46o7J56M8
$$ -34 29 -10 -67 23 -120 50 -66 -93 -146 1 41 158 236 -11 149 -27 107 221 -48 -108 38 -29 127 175
5719A75j45j6k8n0J72j39j10K0L19j05j14J6L3j0R1q8j49K53j22MqpM7k41L12
$$ 175 30 14 -14 -64 108 -31 -141 -121 198 93 -21 -5 28 18 109 21 -128 125 3 7 -1 -8 39 -202 110
5744A10J8k95M3Q8LK99k43N8qj54n8N2n6J04q8K26N7k02J71j74l4q5J70O1j61
$$ 110 128 -167 -124 -36 -33 266 23 81 73 -81 -139 -87 -143 -39 -127 99 156 -46 125 -49 -83 -168 2 63 -98
5769i8K73n3j23l6kM2j85J25N4j8N8P2j04J04o2K5Ok25K2l5k8K47j23J81j97J93
$$ -98 175 122 -1 -37 -39 3 -182 -57 -3 -21 37 109 5 109 47 72 78 -147 -125 -160 -188 59 -64 117 -80 113
5795A13j15n0J06q6K27k35J35j71lK89k41n1n9J25n1o3J65jpl5J25j00j36J4J9
$$ 113 -2 -52 54 -32 195 -40 95 -76 -79 210 -31 -82 -141 -16 -67 -130 35 34 27 -8 117 17 -119 -105 -86
5820h6p2J36J77o3m1j9p0j5K6O4k16K80N4k70P1J01q8J4n6J13Q0j17j79N08k78
$$ -86 -158 -22 155 92 51 32 -38 -53 -27 37 -179 101 155 -115 -44 57 -31 -17 -73 40 120 3 -176 332 54
5845E4l5m0J68j17k36K09R7m21N72j80q2k2l9J69k09m6n5K16q2O9Q7J37j45j90
$$ 54 19 -21 147 30 -206 3 100 -321 251 71 -11 -33 -72 97 -112 -158 -213 3 -79 -10 77 214 69 -121
5869a21L79o89M82n7j30J21j12J65l8J58j88K5K0j00K18p4J7k2K8r7Q1q4K8l6
$$ -121 258 -431 51 -6 -136 -15 -127 38 0 158 -30 -5 15 -85 133 59 76 54 82 -15 66 -18 10 -26
5893b6J77p3j88L7R8o4J6M6j53K7k3J06K3M8j73J46j78J18J2P8j60J66Q4j24O0
$$ -26 151 78 -110 -73 25 -39 -23 23 -130 -103 -126 -20 3 51 -122 24 -154 -36 -24 54 -106 60 144 20 80
5918H0k88K40m1M5L5K4j85N2J86k61K31j51o3P2L8M0k48K20J22Mk24J43R5j54
$$ 80 -208 32 -9 36 71 95 -90 -38 148 -113 118 -33 -96 -24 14 54 -194 26 148 152 -72 71 166 12
5942A2L1M5j32j50K56j14j5O7j3M6r4L26k60o0J26m7NJ13K2j94J23k76K21j34
$$ 12 43 88 -44 -194 62 -52 -67 0 -13 33 -61 265 5 -55 71 24 29 142 164 -30 93 -183 38 -96
5966i6N9K4%L5O6n9j71J27k2Mn0o2K7J15k0J29RRj11J74l24R3j31L45l22J26K3
$$ -96 -37 -13 -13 22 88 29 -142 -15 -37 -33 -83 -145 -118 -3 -23 106 115 124 13 187 -137 -44 -175 170 -152 -26 -3
5993cO8K8l9j3J0j46q5L04n9j39Q1k68J70K1p3J87j83K18M2r7o5J31p7J4n0J31
$$ -3 65 93 54 41 51 -95 -180 124 65 -74 7 -261 -91 -70 -143 44 -139 79 121 24 -41 90 13 27 -23 108
6019A08O6k61j7J46m6J04r0p0R1m8m4j8J65r5J71j46LJ51q2j19J87j18pJ6j12
$$ 108 174 -87 -104 42 -4 100 10 -60 31 -17 -61 -79 86 -9 162 16 19 170 88 -31 156 38 31 47 -65
6044f5R8J87l0k24R1j78N9l7J1K10Q3o3j73P8m5j0o0pJ41j98QJ24O7j36j45o6
$$ -65 33 220 190 -34 57 -121 -62 -99 -88 122 205 142 -31 47 2 -8 -68 -75 66 -132 -124 0 67 -69 -214 -280
6070b80L29q8M6J1O4J47k50L9O3j82p0JL5J89j72J96j33J89j58k8m4J3m9N2PM
$$ -280 49 -39 7 18 82 229 -21 18 81 -101 -171 -170 -135 54 -118 78 -55 134 -24 -52 -96 -83 -132 -80 -73 -69
6096f9K62j72m3M8n7P0r0K87l01R5L7j3k9N9k60J10N9n5K0K04k61R6n7L49j6k59
$$ -69 193 21 -22 26 -31 39 -51 236 -65 30 67 54 25 84 -176 -66 -7 -62 -42 162 -99 -3 -60 289 273 14
6122A4J64m42L59q6O8O6k51J53k9J05l6q9J53k73K06o8J32j75K26j62J8l9l50
$$ 14 178 -264 95 9 77 143 -108 45 16 121 85 -4 149 -124 82 14 146 -29 197 35 53 14 -336
6145c36K89M4J6J6l7P0M7j00R7lj89l8K89k64j12L54LL0l34J29K5Q3j62J75J35
$$ -336 -47 -3 13 29 -8 62 109 9 106 103 -86 -124 165 -99 -211 143 146 176 -158 -29 -4 79 -83 92 227
6170B27j57j10J45K5L0r1j81mK89k84n6K49Jr1o6l5J38j05M8P1j39J84L3j18q6
$$ 227 70 -40 105 130 160 69 -112 -116 173 -111 -167 82 83 -8 -74 -109 29 -76 -28 43 -96 88 121 3 -83
6195h3K6j6J35j82J02k7J11P5j66l0J85j25j28J54K65m01L27m3j66k09K56o4N1
$$ -83 -57 -73 62 -120 -18 -45 66 141 -25 -55 130 5 -123 31 296 -105 222 179 13 -196 60 -4 47
6218D7q8j37L20j19m3M2j32J38r8J20j04J42m4j6K6J6O5k12J65q2q8l9L7P0r7
$$ 47 -41 -178 142 23 -20 22 -110 28 -70 50 -54 88 44 28 54 70 135 -77 88 6 -82 -121 -84 -14 -111
6243a11O4J0K84k23j3j64J93J3r1L0M7M9j20L4l3l61L38J10r8n1O5j11R2J96j26
$$ -111 -47 -37 247 24 11 -153 40 53 -38 -8 39 88 -32 2 -31 -392 -54 56 -42 -93 -28 -139 -47 149 23
6268B3r0J34jj58l3O9K76l52K02k4q1J6n7P6jO5q3j6K14M6k84K39M4j80R3j40
$$ 23 -67 67 66 -92 -125 -56 220 -132 70 46 -35 -19 -76 0 -1 64 -19 -35 179 225 -59 180 224 44 137 -3
6294cJ15L0j01qn8J94j99K3o8L3jJ33j01J04J21k12K8m4p9N5m2n9n4R4L55o4k11
$$ -3 112 142 41 33 -25 169 -30 -7 -75 -42 -43 90 -11 93 214 2 30 -14 -93 -38 -80 -139 -193 -99 256 192 -19
6321a9K33k72J7J31q6o1k8J96j55r4k3J23P5n5j9P5J1l9n2J25k68J89K2j63J48
$$ -19 214 -58 -41 90 4 -57 -85 111 -44 -138 -161 -38 37 -18 -37 38 49 10 -42 83 -185 4 26 -137 11
6346A1N0j22RJ09M1j55P2l1q5J15o9j57L69j77K11j40l5J28k61m1J23R5p2j32
$$ 11 61 -61 -52 57 98 -57 15 -16 -101 14 -55 -212 157 -20 191 51 16 144 -117 -158 -35 60 -12 -144
6370a44J57j97J52j19J3K73k66J8P8k58M59k05m7J57k02J60j54J69nl5K74k66
$$ -144 13 -184 -32 -151 -138 135 -131 -113 -35 -293 166 -39 -86 71 -131 29 -125 44 39 4 278 12
6392A2P6j13p1J22K48l63J1j30L67r8R3k23j49N2L4mJ19K59j18k26K59o0k40O7
$$ 12 88 -25 -96 26 274 -89 -78 -208 159 61 154 -69 -218 -166 -132 -136 -17 242 124 -102 157 97 -143 -76
6416g6K15j6k25K01k18J48j62K38l1j78p4J27L7j07Q3O4j6j23R1j21K15k95Q2
$$ -76 139 123 -102 99 -119 29 -133 105 74 -104 -178 -51 -14 -121 -38 26 10 -113 -22 -143 72 -223 -141
6439a41J36oR1olj93M3j30O3nK46O5k18r5K45j21Q5L7k7Q0j9j92J06o0O3P0k43
$$ -141 -5 -11 80 74 71 -122 -79 -209 -146 -151 95 160 -58 -153 92 -29 56 93 66 146 127 -65 41 -19 44 114 -129
6466a29J74r4qN4J25kk35J88r2P9l5l5R1j26p6J12J90j17j16N7L7l61L17N8k29
$$ -129 45 -49 -57 -3 122 120 -115 73 -19 60 25 -10 81 -45 -121 -9 181 64 -52 5 42 -319 -2 56 -173
6491a73R4l8J33j21j08K83J5k0J47k37nJ69j55Q4o1j14J03Q9k10J4J35k7o4J09
$$ -173 -79 -117 16 -105 -213 70 85 65 212 -25 -30 139 -16 68 7 -107 -4 85 -125 -111 24 -3 -67 42
6515D2j56K31k34K1L4K60k41P0o6m2J18J14j88P7J89l42L4O8o2RK45q6j67K3J78
$$ 42 -114 117 -117 -96 -62 198 -43 27 -39 -81 37 151 -37 40 229 -113 -79 -11 -73 -64 181 95 -72 -49 129
6540A29j50P2o2P3oj85j26K88j03mQ0l1j59J49l3L7Q0r0Pl3J53k28R3K5j73K86
$$ 129 -21 51 -11 62 56 -129 -255 33 -70 -74 6 -25 -184 -35 -68 -31 49 -41 -34 -67 86 -142 -49 -24 -197 89
6566H9k27J39Q7j53K1N6p3J34K5l11K13m0j4KO5k6K18k92K29j13k02R0K6k7L27
$$ 89 -138 1 88 -65 -44 12 -61 73 98 -213 0 -40 -54 -52 13 -13 205 -87 142 29 -173 -83 -57 -84 243
6591B43q0k70m1P2K30j29j98J61J77o0k25K15j07q3n6L95j40k82K96j27l7o9O9
$$ 243 163 -107 -148 -76 154 25 -173 -12 165 105 -120 95 -12 -95 -151 244 104 -178 118 -9 -46 -115 -46
6614d6J66l4k14R7q5R9N6lk48K57j7N8Q1lj75J38j42j03M3J7J15r8R6M6l40J61
$$ -46 120 86 -128 -31 -116 -17 39 36 -212 45 28 86 167 164 -11 127 -15 -118 -75 -58 57 -41 55 101 -239 -78
6640g8j0J21J54k29K83k55L4o1q2l8J34j78K54n8J43j73J50M1o6j23K27l23R4
$$ -78 -88 33 187 -42 241 -14 20 -41 -123 -161 -27 -205 49 -9 134 -39 111 152 86 -37 190 -133 -39
6663c9R1j04r0K86k67m1K28q6j03R9k1K7LJ03N1m6j21N9l6N3r3L3R6l00K69o0
$$ -39 52 -52 -142 144 -123 -164 64 -22 -125 -26 -47 -20 -17 86 137 91 -30 29 -7 46 -47 -14 82 -218 51 -9
6689ij47J04J16j38Mj3R7J1J9n6mm9%M0PO1M5mj94J54q4P5l3j02N4N2J39j1q2
$$ -9 -156 -52 64 -74 -70 -83 14 25 44 -12 -16 -65 -65 -25 -18 43 88 84 -110 44 -40 35 2 -100 -46 6 145 134 52
6718E2o3j4lo2M3N2p8p8m0K12Jk55J40J56q7j50O3J42j26J27K0Q7k49L63l98J29
$$ 52 -11 -25 -28 -90 -47 5 -73 -151 -191 21 22 -233 -93 63 -24 -174 -111 31 -95 32 52 139 -110 253 -145 -16
6744a6r5ro5L74o0r6rL9J40q1j11q0K3PJ69k16R7mP4m5q1M8r2J17J8N5l4m4J00
$$ -16 -111 -120 -185 189 129 33 24 63 203 122 11 -69 -46 -39 130 -86 11 7 81 36 -45 3 -89 28 46 101 67 23 123
6773A23M2l46K24r0j76K12J61m5l10N50m58mJ44k05K00k19K12o7K61j03j26m3
$$ 123 165 -181 43 -47 -223 -11 150 105 -205 345 -113 -117 27 -178 22 -197 15 -52 209 106 -20 -63
6795f3j7O1q6Q3k2O2j2J73k9j88J24q3Q8l4j91J33pj20J53L5j04K19j65Nk3k3
$$ -63 -80 -19 -105 -22 -44 18 6 179 150 -38 86 3 91 57 -134 -1 -8 -128 25 60 -44 175 10 15 -8 -31
6821c1J26n7j70N0J53n8O6k69L5K32qMl0n9K4j83K37N0p2j51J39q5J9R9n4J4J36
$$ -31 95 38 -132 -82 71 13 79 -190 -155 77 69 73 43 -16 8 -175 62 112 40 -111 28 -57 -38 61 7 21 157
6848A57j28m6R0j35J27J25nm66J98O1K24q0j46J0K17k63J05j18R0r8P4j06J90
$$ 157 29 -17 73 -62 65 190 185 -281 -83 -22 202 122 -24 -14 203 -60 45 -73 17 -81 -7 -113 77
6871G7Ql16J48L0j06J46R7Q4j10n9J5L9N6j11J10r6M3l1J00k21L3J54j6qj16J25
$$ 77 85 -231 -83 -53 -159 -13 84 168 58 -1 14 53 109 -2 108 12 55 24 124 -97 -64 90 74 66 -50 75
6897G5j72o3m6L46j62j8J55j03Q3j6k5M2q7J88l04J89j58J7p3N8RN0N9q1J19l4
$$ 75 -97 -160 -206 140 -22 -40 115 12 95 79 54 96 9 197 -107 82 -76 -59 -132 -74 -65 -15 44 -37 82 48
6923D8K9k22J38J42L5j07oJ05j67J47k25M9j43J58p4P8j77K69j65oK45k31J46
$$ 48 77 -145 -7 135 170 63 57 162 -5 142 -83 -34 -177 -19 -93 -15 -192 77 -88 -94 151 -80 66
6946F6k23J01K40l73K11k2k0j18J29J78j22j8j76J23J46o3n5P4j05m3N8J0rR6
$$ 66 -157 -56 184 -189 22 0 -20 -138 -9 169 47 29 -147 -24 122 59 4 78 -27 -70 -12 -2 -11 85
6970H5m6jm7j13K25l5j08O5Mo1Q6m0j03J11K7J19o5j97R3K7j12O1j2l31M51p5
$$ 85 39 38 -9 -122 103 68 -40 25 29 -32 54 14 -89 22 49 168 103 -94 -1 26 -86 -25 -37 -368 83 8
6996HO2K6k40P5J33k11J26M5M1j22R6j62J69O8k49J39K2J12m0r7L1j11r6K02Q1
$$ 8 70 96 -144 -69 64 -147 -21 24 65 -57 39 -123 46 114 -135 4 26 138 98 1 32 -79 -175 27 108
7021A08o0k59J95P2J2J45m1j3j90L5j52J04q3K7L9O1O3k53J20j1L0j20K30M6k37
$$ 108 48 -211 -16 56 68 213 172 159 -31 4 -148 -44 -127 -100 -61 0 63 -190 -70 -81 -51 -171 59 105 -132
7046a32J71o9J98j77k60K21M6J08p8k06N9J80j5j45k4N7m5N8P3r6j0J90j62R6
$$ -132 39 -30 168 -9 -269 -48 -2 106 28 -178 -119 61 46 -99 -123 -66 -111 -53 20 -76 -86 104 -58 38
7070C8k6k61K00j60K13l9K13k2j71p1lJ14m1J68j53q2J0K4J8R0n1M7o4M9r5l7
$$ 38 12 -249 -49 -209 4 -35 178 156 -15 -86 -89 25 -16 152 -1 -83 -73 -49 -31 59 8 55 -9 40 -55 -92
7096i2K17n7Kk09J31Q0KJ0k44J25J22P5j62p8J4k19K87J60j98j25K81j60J66j86
$$ -92 125 68 70 -139 -8 72 74 84 -160 -35 87 162 0 -78 -64 -283 4 164 -34 -159 122 -38 128 -58
7120e8K12l79P5J24J22J5o5L1K9J7M6j70l3j29J47q6m0O2Q3MR5j06k19K72O3j36
$$ -58 154 -225 -150 -26 96 111 46 77 106 123 169 -1 -34 -163 -16 -102 -142 -80 3 7 102 -4 -223 49 112 -24
7146b4q7K85q9l06L37r6J71N3k49M0j6M7Mj93J18K6j39M6P9J0o8Q2n4M1n5n9J25
$$ -24 -111 174 85 -221 116 20 191 244 -5 35 19 66 70 -123 -5 21 -118 -72 7 17 -51 31 -23 18 -37 -96 29
7173B9j23KK22K0j57J08m6j57r1J14J36j68K44n7j32R3m2l2P6Q2p0m2p2J32j69
$$ 29 -94 -92 130 150 -7 101 55 -102 -193 -79 57 -111 133 76 -56 37 -5 -37 39 121 51 9 -63 69 -100
7198a00j5RJ35n6K25j76m5N4m3J7K85j88O6j8j34J33k23J15l1o4O2L8ok15J51
$$ -100 -115 -106 29 -27 198 22 -23 31 -12 5 290 102 168 150 16 149 -74 41 10 -54 8 46 40 -175 -24
7223b4Q1j2J54j70j99J36P8Lo8K57k34J5J85l45L6J60N9q6j29J87J9J4j01l4m0
$$ -24 57 45 199 29 -170 -34 44 47 -21 236 2 17 202 -143 -107 53 112 26 -103 84 103 117 16 -18 -58
7248e8j12K44k19J39K24j46j14K9j63L18j41n9J78q2Q2k09J60o4r7J37J6l1m7
$$ -58 -170 74 -145 -6 218 72 -42 -13 -176 142 1 -58 120 38 120 -89 71 7 -90 47 63 32 -15
7271a5o2J72k11J84n8M3j86J54J78j96J1k5j07Q7j28K30nl8J21k39J42J02j32
$$ -15 -77 95 -116 68 10 53 -133 21 199 3 14 -11 -118 -31 -159 71 66 28 149 -90 52 154 22
7294B2k84L35k0q2j51J10R8J4o2J68k26J1N0L5J09j19j10l6K18o7n6Q2l8J67j82
$$ 22 -262 73 53 -29 -180 -70 28 42 -20 148 -78 -67 -17 18 127 8 -102 -138 80 13 -43 39 1 168 -14
7319a4j08J22Jk1L1P6j74J11Q8m5j47O6j1O7l9j66K16j08n7P6P8j50K02r2n6m0
$$ -14 -122 0 1 -20 11 87 -87 24 112 67 -80 -14 -25 42 3 -163 53 -55 -112 -36 42 -108 94 2 -54 -94
7345i4jj6J14j81p5J94L0m9K76l22j1J52j8j42J81J29l23J19OJJ19r2r2K83j12
$$ -94 -95 -111 3 -178 -253 -59 -29 -78 198 -124 -135 17 -1 -143 38 167 -156 -37 -31 -30 89 -3 -95 188 76
7370G6o5J2M4O3j93R7k03K70j91K29k09K1P4q1L6m8K02k53K82p8q9J37k02K86
$$ 76 11 23 67 130 -63 34 -169 101 -90 139 -70 -49 25 -56 -20 -68 134 -119 163 85 -4 133 -69 217
7394B17k20j06j7J28J6J4k6p2J7M8J00p9j02M5j13J75m3n3j99K89O5j59k8K57
$$ 217 -3 -109 -126 2 18 32 6 -66 -49 -1 99 20 -82 -37 -150 25 -18 -71 -270 19 84 -75 -103 154
7418A54p5o9j16k7K37r3j8L0j17J24R4j77J99m4l28J21R9m5j63J21K72l10R9n
$$ 154 79 10 -106 -133 104 11 -7 23 -94 30 124 -53 146 102 -226 -105 -6 -51 -214 -93 179 -131 -32 -37
7442c7K45k44kj05L00k20J10M4j51L2k7R4o0Q8PK9m9j36J29O3m9N5m7j33K04k22
$$ -37 208 -36 -38 -143 157 -63 47 91 -60 -28 -55 39 -21 67 74 103 54 -82 47 110 61 116 69 -64 140 -82
7468h2L1M4j27P3J34K7p9N8k48K93k29P4J56j18k6R9J8k8O3j63N0j1O8M1k8J3
$$ -82 -51 -7 -134 -61 73 100 21 79 -169 124 -105 -31 125 7 -19 80 98 70 133 -30 20 9 77 118 90 103
7494A03j11R5q7Q0m4m4o8J00m2O2J43r9j01n1J0J58p2J28o7j38M5L7Q9o3N6k27
$$ 103 -8 87 0 80 36 -8 -76 24 -18 44 187 88 -13 -64 -54 104 32 160 93 -45 0 37 126 63 119 -108
7520a08p7K04P4K2j44p9J09k55K46j48K33ol6N1j93J26L5j08l3J2M3N5j48J33
$$ -108 -185 19 93 115 -29 -108 1 -254 -8 -156 77 71 35 86 -107 19 54 -54 -87 -75 -32 23 -125 8
7544HpPk0J10N5k13Q5j15r0P1R3M0Ll6J47k07J21o0M4r5K02j33J36j50M9J0j37
$$ 8 1 8 -12 98 153 -60 25 -90 -180 -109 -16 24 27 -9 138 -69 52 -8 36 -59 143 10 146 -4 45 55 -82
7571h2J76q7k1J77j37P7Pr3K9j42J23k4M8j21K21n7l6j26Q9Q9k47K01j04J61q9
$$ -82 94 7 -14 163 26 103 110 17 46 -96 27 3 51 -70 151 94 58 -68 21 110 -137 64 -40 121 32
7596C2m5J37l30K42j00qN5P3m9j9O7j78J28J7J46j24J80l15r3J9O8j93K83J4O
$$ 32 -13 124 -206 36 -64 -72 -17 56 7 -12 55 -123 5 22 168 44 224 -91 -184 -165 -97 -290 -7 7 13
7621A3l1k0o3N7K53l86J23L3J01p4O0j95K18j59J9J49j57J0K13m49J63K57j84
$$ 13 -18 -38 -101 -44 209 -177 -54 -21 80 6 66 -129 89 -70 -51 98 -59 -49 164 -285 -122 135 -49
7644d9LQ7KN1m7O4j5L0J8n5m1K2j09q5J58p4J5J56r8l0k8%P0r2JJ83j43o7R5n
$$ -49 -46 41 43 94 47 111 96 126 144 89 48 70 -39 -124 34 -40 -25 131 33 3 -25 -25 45 -47 -46 137 -6 -73 22 17
7674A7Q1l69P4J12OK48m92K76n0l5J53M5o5qPO4j44mK47j47n8J31k19R7J91k68
$$ 17 98 -271 -197 -85 -79 169 -323 -47 -97 -132 21 66 1 -7 0 64 -80 -84 163 16 -42 89 -130 -33 158 -110
7700a10m2L11k03K31j41j34j3P4M0r0K8J86k92K46o1kL5J02k48k7P8m8q5K26q1
$$ -110 -152 159 -44 187 46 -88 -101 -27 13 -77 -49 137 -155 91 30 28 63 165 -83 -110 -32 -80 -165 61 -20
7725b0r0K03j98n5J67j19K4N8L0j4Qo9m4J92j83J01o5J79k8j78JM16k92o4k0j95
$$ -20 -110 93 -105 -160 7 -112 -88 -30 0 -14 -6 -75 -119 73 -110 -9 -74 105 77 -101 -100 316 24 -40 -60 -255
7751b55K59j24p3K91j24P6j32K6J58l6o8M3o4l20M72j52q6J05o4J44j64P7j22
$$ -255 4 -120 -193 98 -26 50 -82 -56 102 66 -2 41 -23 -343 129 -23 -109 -4 -68 76 -88 -11 -133
7774a33P2R6o2q1J11N4j56K40j41J4k0R9l4o6k70M10k63K32Jk52J84kJ2O2k18
$$ -133 -61 35 -27 -108 3 57 -99 141 0 14 -6 93 59 -7 -277 133 -130 102 103 -149 35 33 45 107 -111
7799a11K5J78j25n1J03j02M7j34J36q5K30k89J39pQ9R1l48K44l6J84j35k25R8
$$ -111 -86 92 -33 -84 19 -83 -36 -170 -34 -119 111 -178 -39 -46 43 134 -214 30 -6 178 43 -182 -84
7822h4j8K23j19o4K7J85l00J20J31r4J11k73J21R9L7L0J04k02P0r0j10j34J29
$$ -84 -102 121 2 -62 -35 150 -150 -30 101 7 118 -155 -34 65 102 132 236 34 104 14 -96 -230 -101
7845a01J30l4j24K09j64J89o6Jp5J97k63J96Qj7o2p0J57j61n5J34P0k72J57M6
$$ -101 29 -5 -129 80 -84 105 39 40 -35 162 -101 95 103 86 24 -46 111 -50 -105 29 99 -173 -16 30
7869C0k07K65p9O9j4p4j71N1O3P9%P1j44m7L3kM3r3J42j25m4K36jq7l7R7j22P8
$$ 30 -177 88 9 78 64 -10 -181 -130 -67 12 12 83 -61 -108 -75 -77 -34 -127 15 -110 -154 82 81 -6 -43 54 -68 10
7897A0op2J46J31Pl75R0O0n8J21p6J9J42n1q6j09K14k33J03Qm9J11K1j80P6M4
$$ 10 4 -68 78 209 216 -159 -69 -9 -67 54 -22 -3 139 88 2 -107 107 -126 -23 -15 -64 47 68 -112 -36 8
7923Hq8M6p5J50k4o5J70j39J32j61k8o0K28k51K75j79n6K78j15j20J93k82K43
$$ 8 -80 -34 -109 41 17 -48 122 -17 115 -46 -74 -134 94 -157 118 -61 -117 161 46 -74 119 -163 80
7946H0o9Q9O7k42K59l20K96r8j16P7K9j02LK34j37j03J45p2Q1l6n2M4L7l0O3j20
$$ 80 11 100 167 -75 184 -136 160 62 -54 23 52 -50 -47 187 50 -53 92 20 101 65 13 57 94 64 127 7
7972Gr3J7m1K15j06n5j0K24j03N8o1K1O8j84P6r5q1M37j16j08q7k4K22j20k8r1
$$ 7 -86 -69 -110 105 -1 -56 -66 158 55 113 52 73 141 -43 33 -62 -143 294 178 70 -17 -41 181 61 33 -58
7998e8n2L8J0N8k2k6J54or7j00J0J19L2J20k71K4l6KJ89r2m3k11L37J1k56K79
$$ -58 -110 -72 -62 -4 -26 -52 102 96 -1 -101 -91 28 60 180 -91 -67 -103 -101 88 -4 -47 -258 79 90 -166 113
8024A13j13L1K1q0O5M1o0nMl4M9j76L35j27j08r5K55o9O4p3L9k13J05N8Q2l6r5
$$ 113 0 31 52 -28 37 78 18 13 17 -17 32 -144 191 64 -44 -139 116 47 111 38 77 -136 -31 27 109 73 -22
8051b2J12J33k85j4j2No6L51l18P9j1J2J18j8p9J22L4n8K9r1j4O6p2J49p2j12
$$ -22 90 223 -62 -76 -88 -83 -149 202 -116 -37 -48 -36 82 64 -15 107 141 83 112 21 7 73 1 150 78 -34
8077c4J33j35k9J11j35J74n0q7J26j90K78j59P4m0k72J35P5j56R5N9J06j22j9
$$ -34 99 -36 -65 46 -89 85 35 -52 74 -116 162 3 77 37 -235 -100 -25 -181 -86 -27 79 -43 -62
8100f2rJ50j28R4j51O5O5k3j3q1K66j67p2L1J14r5J44K6k06R1n7J86k21O7k90
$$ -62 -71 79 -49 45 -106 -41 24 1 -12 -93 173 6 -66 -35 79 -16 128 154 -52 39 -18 168 -53 14 -276
8125b76L7M15k40j19K17j54K84j23J6p4q9J30r2K2J73k14M0J3j01R0J36j35N8
$$ -276 -239 176 -64 -183 34 -120 164 41 57 -17 -106 24 -68 -46 127 -87 -47 -34 -135 -45 91 -44 14
8148A4J0k22R1P3J58k96J6J69p3K28j49P6R5k39L5J9p3rN0l1j3J68j8L5j44%J34
$$ 14 24 -198 -107 -34 124 -172 -156 13 -60 168 19 95 190 -49 -14 5 -68 -77 -27 -58 -71 97 79 114 -30 -30 104
8175A04p1j18J85q7P2J59k03j9r9N2PJ06k53R3P8O4
$$ 104 33 -85 100 13 85 244 41 22 -77 -25 -18 88 -165 -72 6 70
8191G0
$$ Imaginary data points
##PAGE= N=2
##DATA TABLE= (X++(I..I)), XYDATA
0@%%%%%%Qj6J6k1K9l6M4n6O8p9R7j17J38j65J93k24K61l01L46l96M53n17N88o66
$$ 0 0 0 0 0 0 0 8 -8 8 -13 16 -20 24 -32 36 -43 54 -63 75 -90 103 -121 140 -161 185 -211 242 -275 313 -353
30c53P49q43R46j058J182j318J469j632J810k007K224k465K728l019L346l709
$$ -353 396 -447 499 -559 623 -695 774 -858 952 -1055 1169 -1296 1432 -1587 1759 -1950
46a950M118m583N116n731O449p308Q352r657J1338j3597J6823k1836L0786n1699
$$ -1950 2168 -2415 2701 -3030 3419 -3889 4463 -5194 6144 -7453 9370 -12466 18320 -33379
60c3379J90170J45067k32770m9638l3603o6474j08367P7837J80189J10863l9235
$$ -33379 156791 301858 69088 19450 -14153 -80627 -188994 -111157 69032 179895 140660
71A40660r147L6823l6740j74491j21839L1552Q8815J0436J1482R3695R5718m6857
$$ 140660 131513 168336 131596 -42895 -164734 -133182 -44367 -33931 -22449 71246 166964 120107
83A20107j32429p5472j399l7078o4895K3518J36828J14809J0821l1203n983l8425
$$ 120107 -12322 -87794 -89193 -126271 -191166 -167648 -30820 83989 94810 63607 57624 19199
95A9199j21085j23728j1217Q0980P1191M0377O8909Q9862J5764r1556j07361m3332
$$ 19199 -101886 -225614 -236831 -155851 -84660 -44283 24626 114488 130252 38696 -68665 -111997
107a11997j0159k6241l05Q5666J21189M8331l2906k9152j391l9051q8855m4216
$$ -111997 -122156 -148397 -148702 -63036 58153 106484 73578 44426 43035 3984 -84871 -129087
119a29087N6760Q3944L2511J9376O1073M4936n8051j17596n8831J1909J184j3069
$$ -129087 -72327 11617 44128 63504 124577 169513 111462 -6134 -64965 -53056 -51872 -64941
131f4941N6015J24540P6865k7060n2864j9070m1689j02289p5454L6985R3006M8484
$$ -64941 -8926 115614 192479 165419 112555 93485 51796 -50493 -125947 -88962 4044 52528
143E2528J6000M6777M4228m1447j05363o3746K150k156k3455K3853Q6054O2699
$$ 52528 68528 115305 159533 118086 12723 -51023 -48873 -51029 -74484 -50631 35423 98122
155I8122j5933m3417j8535k7439o9504n7736J8294O6552M6316K2764L4969K9955
$$ 98122 82189 38772 20237 -7202 -76706 -134442 -116148 -49596 -3280 19484 54453 84408
167H4408k9195q4007p3824k8251m862O173M2805Q3460P3175J6892k9167m0611
$$ 84408 55213 -28794 -102618 -130869 -135731 -129558 -86753 -3293 69882 86774 57607 16996
179A6996m5463n6799m6417J41M8598O2134M6916L2476J9307j0836m9911o1409
$$ 16996 -28467 -85266 -131683 -131542 -82944 -20810 26106 58582 77889 67053 17142 -44267
191d4267l4452K141K0994L0953M8194N6216K8755j7738m4022m1573l7909l6172
$$ -44267 -78719 -76578 -55584 -24631 23563 79779 108534 90796 46774 5201 -32708 -68880
203f8880r692M1125P1832N6899K5502O182j5155n2987p5262m9290j509K4840L2118
$$ -68880 -78572 -37447 34385 91284 116786 122968 107813 54826 -20436 -69726 -71235 -46395 -14277
216a4277M8592N9970L1824k1334n0260m4172l7646l7008j2267L3853N5913L6544
$$ -14277 34315 94285 126109 104775 54515 10343 -27303 -64311 -76578 -42725 13188 49732
228D9732J1984N476q797m2072n8540l4233l37J2883K0968M2859N1851K1286k2977
$$ 49732 61716 67192 58395 16323 -42217 -76450 -76787 -63904 -42936 -77 51774 73060 50083
241E0083l9984l7157m1197l9526o772L9127N4104L9557K7353J8917j0400m9975
$$ 50083 10099 -27058 -68255 -107781 -114553 -75426 -21322 18235 45588 64505 54105 4130
253D130n9569l2220l920Q205K5442N0052N0829J7740j4681k2390k3831l4294l2854
$$ 4130 -55439 -87659 -91579 -83374 -57932 -7880 42949 60689 46008 23618 -213 -34507 -67361
266f7361l016L1096L8156K8358K4893J8535p469l8545m3486k3561m804N425K2037
$$ -67361 -70377 -39281 -1125 27233 52126 70661 63192 24647 -18839 -42400 -47204 -41779 -19742
279a9742M3466M6399K1584q619k5068l3330m1320l6411q723K6485M2976L7718
$$ -19742 23724 70123 91707 83088 58020 24690 -16630 -53041 -61764 -35279 7697 45415
291D5415K6051J3773o938l3457m6549l4540j1151N017J5130K9067L8552K5393
$$ 45415 71466 85239 78301 44844 -1705 -36245 -47396 -42379 -27249 1818 40370 65763
303F5763n003k6992k9091k5732k6882j7696J2133L7362L4675J7265P789J601k1955
$$ 65763 60760 33768 4677 -21055 -47937 -65633 -53500 -16138 18537 35802 43591 45192 23237
316B3237m8222m4466j1731J2594J7734K7398M4913L8101j397l4511l4797k4437
$$ 23237 -24985 -69451 -81182 -68588 -50854 -23456 21457 59558 58161 23650 -11147 -35584
328c5584k8925k3954J0909M7146M4747J8391P309N815j5161m4438m1451o293J6782
$$ -35584 -64509 -88463 -77554 -30408 14339 32730 40039 45854 30693 -13745 -55196 -61489 -44707
341d4707J4070J7028L6230L6706K728k9082k8420j6990k2506k1403Q204M3531
$$ -44707 -30637 -13609 22621 59327 62055 32973 4553 -12437 -34943 -56346 -48142 -4611
353d611M3865J9409N481K132j6924m4025m5126j4206J3953J9609K4112L7555L6180
$$ -4611 39254 58663 64144 66276 49352 5327 -39799 -54005 -40052 -20443 3669 41224 77404
366G7404N261k8922l6871k6789k1323j6706M160L1606L8775K0732K521m475j2518
$$ 77404 82665 53743 16872 -9917 -31240 -47946 -43786 -12180 26595 47327 49848 45373 32855
379C2855k9524l6331j9142P772K0645J9376K1336K3574R990j8915l5976k9005
$$ 32855 3331 -33000 -52142 -44370 -23725 -4349 16987 40561 50551 31636 -4340 -33345
391c3345j4901r445m73K3052M1875L2114N004j1097j5435k5573l7754k6744O203
$$ -33345 -48246 -57691 -58164 -35112 6763 38877 43881 32784 17349 -8224 -45978 -72722 -66519
404f6519K8644K6298J8809K2356J6945j0773l4873k9157j0232l876l050J3936
$$ -66519 -37875 -11577 7232 29588 46533 35760 887 -28270 -38502 -42378 -45428 -31492
416c1492L5659L1512M496j1055q377j2131k7528k5747J710K4364K3053J5425K0823
$$ -31492 4167 35679 40175 29120 20743 8612 -18916 -44663 -42953 -18589 4464 19889 40712
429D0712J8926o203l3542l3428j5779n379j697J4963L6387L4971J1066r573j3770
$$ 40712 59638 53435 19893 -13535 -29314 -34693 -36390 -21427 14960 49931 60997 51424 37654
442C7654j8549k9463k7496m801J8807K3994J8496J6933J2679l823k3995k8132
$$ 37654 19105 -10358 -37854 -42655 -23848 146 18642 35575 48254 44431 20436 -7696
454g696j7203o265p26Q565K1976K5877J3671l704j4555j8776k2727k2260q897
$$ -7696 -24899 -31164 -31890 -23325 -1349 24528 38199 34495 19940 1164 -21563 -43823 -52720
467e2720J2414K6020K5279J7852R256l086k0475l2418k7359j0740M772J5269K3804
$$ -52720 -40306 -14286 10993 28845 38101 35015 14540 -17878 -45237 -55977 -51205 -35936 -12132
480a2132K9487K1272M76j7093k2239k0428j7796r826P724K3796K5183J5927P495
$$ -12132 17355 38627 39103 22010 -229 -20657 -38453 -48279 -40555 -16759 8424 24351 31846
493C1846K49j1882k4622k3934r039N529J3034J9053K4724J9854K056j5684k2472
$$ 31846 32095 20213 -4409 -28343 -37382 -31853 -18819 234 24958 44812 46868 31184 8712
506H712k1559j8375r081Q775K5567K8599K0767Q803m013j8836k8425k5146j1659
$$ 8712 -12847 -31222 -40303 -31528 -5961 22638 43405 52208 48195 29359 934 -24212 -35871
519c5871L311J4044K1888K3208J4989J006j1789j8755k1024j7249o133P184J6018
$$ -35871 -32560 -18516 3372 26580 41569 42575 30786 12031 -8993 -26242 -32375 -25191 -9173
532i173J8336J6306Q817m336j6241k1170j7703j1188j726J1199K2231K3265J3316
$$ -9173 9163 25469 34286 29950 13709 -7461 -25164 -36352 -38078 -26879 -4648 18617 31933
545C1933J268r260j9568k6099k1498n485R985J8265K1096K0557J3424k811j7839
$$ 31933 33201 23941 4373 -21726 -43224 -48709 -38724 -20459 637 21194 34618 31807 13968
558A3968k1770j7118j1088l362R088K1067K1392J1763J360n131j1252j7734j6823
$$ 13968 -7802 -24920 -36008 -39370 -30282 -9215 12177 23940 25300 20169 8917 -8817 -25640
571b5640n629P080J3756J5098J5860J2823J269j3625k1118j7890r905j804P870
$$ -25640 -31269 -24189 -10433 4665 20525 33348 34617 20992 -126 -18016 -27921 -29725 -21855
584b1855J9506K4890J6982K277r068j4683j8780k0960j2305N323J8249J8968J4329
$$ -21855 -2349 22541 39523 41800 32732 18049 -731 -21691 -33996 -28673 -10424 8544 22873
597B2873J0776M404j0334k1800j9199p354m04J805R088J9180J7738K744r559j0315
$$ 22873 33649 38053 27719 5919 -13280 -20634 -21038 -19233 -10145 9035 26773 29517 19958 9643
611I643j0840j6552j5389P78J7523J8524J0863Q350P048o056k3420k5222j0762
$$ 9643 -1197 -17749 -33138 -32360 -14837 3687 14550 22900 29948 23892 472 -24750 -35512
624c5512Q43L579J1048K3458K4480O212j2217j5215j2051j5601j6102j436J7433
$$ -35512 -34669 -31090 -20042 3416 27896 34108 21891 6676 -5375 -20976 -37078 -38514 -21081
637b1081K0566J1220O448O853j681j7621k2183r509L209N287P007J5684J9514
$$ -21081 -515 10705 17153 24006 22325 4704 -17479 -26988 -23779 -18492 -11485 4199 23713
650B3713Q277r248j4537j1133j1302j3177l969J4590K4150J7067O709K226l944
$$ 23713 31990 22742 8205 -2928 -14230 -27407 -31376 -16786 7364 24431 31140 33366 29422
663B9422j7227k5011j5893J582R959J0418J3649J8533J2244n904j7787j5153r103
$$ 29422 12195 -12816 -28709 -27127 -17168 -6750 6899 25432 37676 31772 13985 -1168 -10271
676a0271q605n342P603J9561J6208L359k996k010p653j7671j6647j802J0175R930
$$ -10271 -18876 -24218 -16615 2946 19154 22513 19517 17507 9854 -7817 -24464 -26266 -16091 -6161
690f161Q971J3270J2825k056j8349j8801j0236o007m723N626K0554K1814Q228
$$ -6161 2810 16080 28905 26849 8500 -10301 -20537 -26544 -31267 -25641 -5087 16727 24955
703B4955l171n401q874j8044j9416m695J1116J4221R724J0150J0910Q12j3591
$$ 24955 21784 16383 7509 -10535 -29951 -34646 -23530 -9309 415 10565 21475 22287 8696
716H696j6331q186k347k552K321J3055J8034Q985k517n642o680j2108j4599o765
$$ 8696 -7635 -15821 -18168 -20720 -18399 -5344 12690 21675 19158 13516 6836 -5272 -19871 -26636
730b6636P728J3959J1929R919R917K987j0442j8991j5013o444p54M287J2621J8678
$$ -26636 -18908 -4949 6980 16899 26816 29803 19361 370 -14643 -21087 -21841 -17554 -4933 13745
744A3745J3759R00p777r849j0850j2392q912K473J1979J2214Q032N890K783n259
$$ 13745 27504 28404 20627 10778 -72 -12464 -21376 -18903 -6924 5290 13322 19212 21995 16736
758A6736j4492j4019o318Q97L631P418J3343J3149L269p148j0941j0828j1870
$$ 16736 2244 -11775 -18093 -17196 -13565 -6147 7196 20345 23614 16466 5525 -5303 -17173
771a7173j0320L53J2531J6488J1966O420K227o121j5100j7320r402K2N507R206
$$ -17173 -27493 -27140 -14609 1879 13845 20265 22492 16371 1271 -16049 -25451 -25429 -19922 -10716
785a0716J3451J3733N029n598j0562j0360r619o945M21R435J2706R734N410J258
$$ -10716 2735 16468 21497 15899 5337 -5023 -14642 -21587 -21166 -11731 975 10709 16119 17377
799A7377m258j0564j3066q316j438M745J0067J3462J1695M998l695j0656j3134
$$ 17377 13119 2555 -10511 -18827 -20265 -15520 -5453 8009 19704 24702 21007 10351 -2783
812b783j1876o744J400Q452J3235J3150Q619J000o844j1762j2531r096k898M651
$$ -2783 -14659 -21403 -20003 -11551 1684 14834 23453 24453 17609 5847 -6684 -15780 -18678 -14027
826a4027J0363J1442Q245L351k293p617j0980r843n202J506N947R299J0610P659
$$ -14027 -3664 7778 16023 19374 17081 9464 -1516 -11359 -16561 -15055 -9108 191 10801 18460
840A8460M74p014j0404j0701q570l702L535J0404J2940R748M303j900q338j2608
$$ 18460 18934 11920 1516 -9185 -17755 -21457 -17922 -7518 5422 15170 19473 17573 9235 -3373
854c373j2440o960J687P772J0310J0228P811J876n509r597r791o620k576J927
$$ -3373 -15813 -22773 -21086 -13314 -3004 7224 15035 16911 11402 1805 -7986 -14606 -17182 -15255
868a5255P193J0836Q719L113k135n878q172q714o343M26O887Q912Q379P071L877
$$ -15255 -8062 2774 11493 14606 12471 6593 -1579 -10293 -16636 -16210 -9323 -411 7968 15039 18916
883A8916l072j0586j2182p570k134J738O784J2205J2083M403l452o679p617r384
$$ 18916 15844 5258 -6924 -14494 -16628 -14890 -8106 4099 16182 20585 17133 10454 2837 -6547
897f547q722j489P198R783P430N418L854j612r187j1169o124o40Q58L488Q740
$$ -6547 -15269 -16758 -9560 223 7653 13071 16925 15313 6126 -5043 -11167 -11807 -10949 -7461 1279
912A279J0223N218k788o252o490q415q688l046O388J1138Q721N330L308r05q588
$$ 1279 11502 16720 13932 7680 1190 -7225 -15913 -18959 -12571 -1433 7288 12618 15926 15021 6433
927F433j3071r071j996K260M776R060J1216P101k345p594p339o784o464l155M295
$$ 6433 -6638 -15709 -17705 -15445 -10669 -1609 9607 16708 14363 6769 -570 -7354 -13818 -16973 -12678
942a2678R821Q317L790K042P4n110j0267r177j845L663M669O170R299P695k56
$$ -12678 -2857 5460 9250 11292 11366 6256 -4011 -13188 -15033 -11370 -6701 -531 8768 16463 16207
957A6207p866q627o312n781m148K699J0981J1862N738M93r54n280j0527j0949
$$ 16207 8341 -286 -6598 -12379 -16527 -13828 -2847 9015 14753 15246 14292 9012 -1515 -12464
971a2464k849M710N903N172P152P672Q31p312q998m920l187l440P47Q277J0088
$$ -12464 -15313 -10603 -4700 472 7624 15296 16127 8815 -183 -5103 -8290 -11730 -10983 -2706 7382
986G382M549o66j611k658p791j0031m277L524O071N529O107P552K252o793j0348
$$ 7382 11931 11265 9654 6996 -795 -10826 -15103 -11579 -5508 21 6128 13680 15932 9139 -1209
1001a209p088l453k217Q08P462J1028O378j99k630l570o550r035m897K738O934
$$ -1209 -8297 -11750 -13967 -13159 -5697 5331 11709 11510 8880 5310 -1240 -10275 -15172 -12434 -5500
1016e500N633M227M862K363m098q363o148k093r81K18M477Q907P405J013l213
$$ -5500 133 4360 9222 11585 7487 -876 -7024 -9117 -10098 -9880 -5403 3504 10909 11922 8709
1031H709l723n218p802n939J038P002P538M860M304L276k544q625q876l754l66
$$ 8709 4986 -232 -8034 -13973 -12935 -5933 1605 6465 10769 14045 11501 2876 -6000 -9754 -10120
1046a0120J028M078P966Q127J911l773m570l767n284n323n51N271O370M040K565
$$ -10120 -9092 -5014 2952 11079 12990 9217 4647 880 -4404 -9727 -10278 -5007 1363 5403 7968
1061G968K635p55o805q074m477J67J062K916O941P674L679k736n413n107n833
$$ 7968 10603 9848 3043 -5031 -9508 -9341 -8279 -5363 1578 9252 12931 10195 4782 -325 -6158
1076f158o317j740N436Q458O090L488J436j426o039q662n343j59K291L215N301
$$ -6158 -12475 -14215 -8779 -321 5769 9257 10693 9267 3228 -5434 -10777 -10936 -8645 -5430 -129
1091a29O679L785j797m999m957m048l723j462L224O979N799K755Q52j228m104
$$ -129 6550 10335 8538 3539 -1418 -5466 -9189 -10651 -7427 -448 5351 8106 8958 7730 3626
1106C626p323o144j513K657M145N447O725M934o61n660o679n087l553j490K482
$$ 3626 -3697 -9841 -11354 -8697 -4552 895 7620 12554 11893 6233 -446 -5533 -9086 -10576 -8094
1121h094O918O927L708K69j561l806n980n701j680K334M341M067M004L515R1m341
$$ -8094 -1176 5751 9459 9728 8167 4361 -1619 -7320 -9000 -6666 -2325 1742 5746 9261 9352 5011
1137E011n671m154k446j231J330N912O578M244L78k140m256o001o334k889K158
$$ 5011 -660 -4814 -7260 -8491 -7161 -1249 5329 9573 9951 7811 3555 -2446 -8780 -11669 -9511
1152i511M750N668N034M007K58m142o193n625l023q57K184M952N647L516O76j867
$$ -9511 -4761 907 5941 9948 10206 6064 -129 -5754 -8777 -9634 -7450 -2498 3149 6665 7341 5474
1168E474l307m559m095j562J028L340M074M379K482P9l009m536m617l450n64K220
$$ 5474 2167 -2392 -6487 -8049 -7021 -3681 393 4772 7254 7333 4324 -212 -4829 -8279 -8843 -6623
1184f623M931N215M194J923j437m124n781m810k539P25L478N199N191L196j80
$$ -6623 -1692 3523 7717 9640 8203 4079 -1702 -6512 -9051 -8326 -4848 351 5542 8738 8558
1199H558k617m222m413l447j054K100L573M154L067J617q36l263m433l710j758
$$ 8558 5941 1719 -2694 -6141 -7195 -5095 -1522 2632 5699 7316 6480 3217 -1216 -4926 -6684
1214f684N42K371M072M577L289J85k781m344m896l883j827J670M823N649L959
$$ -6684 -6142 -3771 301 4878 8167 8352 5571 1227 -3669 -7552 -9379 -7709 -2886 2763 6722
1229F722J910p19l325n487n018k154L92K418L911M299L711M31k512l801l695k526
$$ 6722 8632 7913 4588 -899 -5917 -8071 -7679 -5261 -1350 2949 6660 7091 4579 778 -2917 -5443
1245e443j330R15L516M415K576Q88n7k249m114m468k665R29K533L775M525L981
$$ -5443 -6773 -5858 -2342 2073 4649 5537 5480 3231 -883 -5351 -8016 -7087 -4554 -779 3746 7727
1261G727J356k739m925m624l297j930L83M331N790M360J547p53k213m103n085
$$ 7727 9083 6344 1419 -3205 -6502 -8432 -8049 -3718 2072 6432 7979 7226 5013 910 -4175
1276d175l096R05K897K900L147L223J408k341l757l504j977j264K85K625M890
$$ -4175 -7271 -6366 -3469 -569 2578 5801 7209 4868 1111 -2393 -4370 -5634 -5349 -2724 2166
1291B166L929Q04j152k122l444m601l190j34L143M250L475L380J853j620m440
$$ 2166 6095 6899 5747 3625 181 -4420 -7610 -7744 -4601 -351 3124 6504 8357 6737 2297
1306B297n260l165o85N16K336M515M158J593j332k264k175l501k805l52K343L713
$$ 2297 -2963 -6128 -6813 -6297 -3961 554 4712 6305 4973 2709 534 -2967 -5772 -6124 -3781 -68
1322f8K231J322J580n38l060m149k461k47O72J613L390M311K326r56k648k909
$$ -68 2163 3485 5065 4527 1467 -2682 -5143 -5390 -4718 -3105 285 4596 6922 5966 3318 409
1338D09l270l659j230K232M663L581K183J586k52k776m716l308o79P77J353K746
$$ 409 -2861 -6520 -7750 -5518 -855 2726 4909 6495 6243 3467 -1249 -4557 -5236 -4459 -3106 -360
1354c60L494K649m65k644k257k050j896j548J248L504L039J513N86j42j834m126
$$ -360 3134 5783 5318 2674 417 -1633 -3529 -5077 -3829 -325 2714 4227 4813 4671 2837 -1289
1370a289l283j057R01J577K898L655L147J25k582l304l224k733j385P76L461M045
$$ -1289 -4572 -5629 -4728 -3151 -253 3402 6549 6674 4092 788 -2436 -5169 -6554 -5778 -2317 1728
1386A728K672O74l37j780l235l447j633R05K047J813K458K170Q65k063k903k222
$$ 1728 4400 5074 4737 2957 -278 -3725 -5358 -4453 -2406 -593 1865 4035 4900 2837 -66 -2288
1402b288j511j211L13K721L705K691Q18p51j731l241l484k366L28K500K947L327
$$ -2288 -3799 -5010 -4697 -1976 1729 4420 5238 4487 2756 -485 -3969 -6335 -6007 -3507 -560 2767
1418B767K525R08j421l624l471k069r57P99K332L448K795J055j073j842k432k506
$$ 2767 5292 6200 4779 1155 -2316 -4385 -5342 -4543 -2211 1237 4032 5087 4014 2172 -260 -2766
1434b766j622J79K078K428K354J736M83j318k854l063j869n82J098K085L098L035
$$ -2766 -4388 -4209 -2131 297 2651 4387 4870 3552 698 -2365 -4234 -4816 -3718 -1633 1465 4500
1450D500J260q01k261l173l084j812r9J796L157L117J793L54j001k583k986k180
$$ 4500 5760 4959 2698 -475 -3559 -5371 -5470 -3674 -517 2600 4393 4747 3746 1163 -1823 -4003
1466d003n78Q78J878K408K126J398m78k105k184j964j269NJ269K305K516J524
$$ -4003 -4581 -3703 -1825 583 2709 4107 3629 1524 -660 -2624 -3893 -3888 -2619 -314 2202 3726
1482C726M42q71k114k864k445r48O58K320K751K709J463j36j712k902k867j353
$$ 3726 4168 3297 1183 -1681 -4126 -5074 -4416 -2096 655 3364 4827 4691 2979 77 -2790 -4143
1498d143j59J046K429K622J949M78j167j826j915j776j038N29J638K006J807Q76
$$ -4143 -4302 -3256 -827 1795 3744 4222 3055 1229 -686 -2462 -3500 -2971 -1333 673 2480 3356
1514C356K53j216k220k573j319k04J384J640K545K382Q09r79k046k669k177j642
$$ 3356 3609 2393 173 -2400 -3719 -3923 -2539 -899 1646 4028 4837 3858 1812 -857 -3034 -4676
1530d676P5J935L126K331J419n2j003k054l165j695NR70J509J970K065Q93o59
$$ -4676 -4601 -2666 460 2791 4210 4158 3155 1101 -2064 -3759 -3754 -2784 -1275 695 2760 3653 2994
1547B994j931k014j277j291o3J301K701K192O79J38q39j990k780k169j91J181
$$ 2994 1063 -951 -2228 -3519 -3582 -2281 420 2612 3291 3429 2590 600 -2180 -4349 -4540 -3359
1563c359J837K668K426J414r16k410k670j835j377n8J323K702K639J243p7r26
$$ -3359 -1522 1146 3572 4986 4070 1660 -1010 -2845 -4222 -4280 -2957 -255 2384 3627 3550 2624
1579B624j590k271k170o3J166J915J441J446J011j64k150k070j443p21o7R80K365
$$ 2624 1034 -1237 -3407 -3470 -2304 -389 1052 2498 3509 3345 1195 -875 -2318 -3039 -3106 -2126 239
1596B39K487J239k28j144j688k294k176r48J164K569J921J642J354j78j827k772
$$ 239 2726 3965 3737 2593 905 -1389 -3565 -4513 -3349 -780 1141 2783 4137 3959 2132 -640
1612f40j832n44p4P33J828K351J222k43j262r59j408j719p57R59J902J468P99
$$ -640 -2472 -3016 -3090 -2357 -529 1822 3044 2801 1539 580 -828 -2547 -3304 -2345 -443 1025 1824
1629A824R25J11j388k146k149l80Q6Q46J394K512J945O6j140j576k072j692j362
$$ 1824 2749 2860 1472 -674 -2823 -3203 -3117 -2271 -877 1635 3580 3646 2506 930 -1142 -2834 -4196
1646d196O27K068K188J351Q06L49r01k208j865o96J66O62R61J592J636K43j096
$$ -4196 -3569 -1501 687 2038 2844 3193 2292 84 -1781 -2477 -2311 -1649 -688 904 2540 2783 1687
1663A687j052j145j010j058m2J663K026J062M55J50k49k117k426j077Q7R19J444
$$ 1687 635 -510 -1520 -2578 -2620 -957 1069 2131 2586 2736 2487 370 -2056 -3133 -3046 -2127 -683
1680f83J889J884P93j008j999j461j193j251RJ098K418J279O15j06l46j261k011
$$ -683 1206 3090 3883 2875 876 -585 -1778 -3029 -3020 -1922 496 1775 2390 2284 1938 677 -1334
1697a334j132J04O75R45J247J147J159r96j523j287j088r15P7J249J941K046M26
$$ -1334 -2466 -2362 -1687 -742 505 1652 2811 1815 292 -995 -2083 -2998 -2921 -1672 269 2315 2741
1714B741Jp65j545k238j583j92J069J608J630J654R62n31j681j805j136m21k33
$$ 2741 2742 1977 432 -1806 -3389 -3581 -2512 -904 726 2380 3342 2811 1130 -675 -1811 -2232 -2465
1731b465Q68J672J669P41m88q64o48j364j345oO87J512J035J266N37j50j590j714
$$ -2465 -1597 75 1744 2485 1997 1133 485 -879 -2224 -2230 -1543 -31 1004 2270 2807 2657 1067 -647
1749f47j442o39K98R57J584K152P96j52j112j322j586j341l52O45J583J366R75
$$ -647 -2089 -2728 -2430 -1473 111 2263 3059 2907 1795 473 -1113 -2454 -2806 -2161 -578 788 1763
1766A763M35q0j152j342j201j41J6N12J190J072P67K8q30j193j000p05n12L63
$$ 1763 2198 2118 966 -376 -1577 -1718 -1702 -1190 0 1072 1839 1867 1037 -156 -1156 -1861 -2373 -2010
1784b010J276J435R91L99q3p84j663j647o71M4R22J210J682R33M80m76j733p92
$$ -2010 -734 701 1692 2091 2008 1224 -439 -2086 -2757 -2713 -1791 -581 1101 2034 2514 2038 305 -487
1802d87j243n73M00Q20J302J181L14M3r35p46r57n46j27O46J015R42O66J86j24
$$ -487 -1730 -2303 -1903 -1083 219 1400 1714 1757 822 76 -881 -1427 -1554 -908 107 1049 1715 1901 1777
1821A777r53j545j015l13l7R54J588J270P86j47p41j129j447j115k49P37J060
$$ 1777 824 -721 -1736 -2049 -2086 -1132 456 1726 2512 2365 1624 495 -952 -2067 -2316 -1579 -519
1838e19J466Q20K48k63p22j461q58m44K48O28P19J112M85Q1p06q16q76q70R6K36
$$ -519 947 1767 2015 1752 1030 -431 -1289 -1733 -1485 -857 -138 974 1459 1540 834 18 -858 -1728 -1632 -1396
1858a396Q58J289J052Q1l12q90j266j515n09K94Q76J403J258J072K53j224j242
$$ -1396 -538 751 1803 1884 1572 682 -584 -2099 -2608 -2314 -1438 -35 1223 2295 2548 1324 82
1875H2q97j202j31M38J052J127R93R9m08m94p84q80o95L93Q44O65R21L86K13n06
$$ 82 -815 -2017 -2148 -1710 -658 469 1462 1561 1153 659 -125 -1005 -1700 -1307 -463 202 1123 1509 1722 1216
1895A216j044p75r07n1L2J230J404J037J81l92p76r52j535p00L98P29R63Q73Q36
$$ 1216 172 -603 -1510 -1561 -1529 -299 1105 2142 2323 1931 1155 203 -1332 -2032 -1634 -905 58 931 1767
1914A767M3k89j236r94n25j57K61M33J334O02J1j71q44l65p67o00QO68R02O19
$$ 1767 1810 1521 285 -709 -1234 -1391 -1130 -697 637 1239 1250 1079 235 -130 -897 -1497 -1489 -821 81 700
1934G00N37K24m04r62j067q00j73M04L78J369J261M46k65q96r80q13p32j55P78
$$ 700 1237 1461 1057 95 -972 -1772 -1945 -1541 -1163 206 1467 1913 1648 752 -228 -1041 -1773 -1928 -1150
1953a150J048O82M12L45m7p88r21o78K18M7M18M32R32N65j53q20m36n95o58o3
$$ -1150 -102 580 992 1337 1290 502 -419 -1097 -879 -832 -414 18 950 1515 1362 542 106 -489 -1147 -1210
1973a210Q0J126R92O08J55l1r18j223q89m31K10P60R25Q64O71J18p46j019n50
$$ -1210 -1130 -4 988 1596 1751 1720 802 -421 -1310 -1741 -1531 -771 154 1018 1689 1807 1061 42 -508
1992e08m75m11K93O66Q72M76L04k37m02q05p06l22J33N22M12N19P43R2m09r81
$$ -508 -983 -1394 -1101 -435 437 913 1217 980 578 -227 -933 -1255 -1122 -600 -188 331 1074 1166 757 -224
2012b24o66n37k24L7J158P02Q88M71l35m75j180r62k95K69L47J002P47N28O4k07
$$ -224 -890 -1427 -1651 -1614 -456 246 1134 1605 1270 795 -385 -1347 -1642 -1373 -1026 -24 723 1251 1315 1108
2032A108j013o25k57k28L67N70N54M28K30k18m08m63p22m12K86M01Q51M32N49
$$ 1108 95 -530 -787 -1015 -648 -78 476 904 1134 916 508 45 -677 -1089 -803 -402 449 881 1430
2051A430L5l07r62p16m84k59J38P52P27R05J87k28n68n11p26o43J8O19N22N10
$$ 1430 1465 1158 196 -520 -1004 -1263 -1125 -373 354 1259 1446 1218 650 139 -587 -1230 -1212 -593 -71 439
2071D39L22L79m15n96n05l83l8K2N27M10M26J92o1m63n44m82m26j06N88N13O35
$$ 439 761 1140 725 129 -376 -759 -797 -775 -248 162 588 780 719 256 -288 -770 -1196 -1302 -714 -201 434
2092D34M77K14n34k62q49o92L4M7O83P24M25K51M3m77m16n77l84J16j15P01M89
$$ 434 911 1125 591 329 -520 -1212 -1178 -1131 -448 276 701 952 995 518 102 -475 -859 -743 -858 -157 332
2113C32L38J17j97k71n28j70k36K9K57O78N27M19j99l49n52p28m78R7N33J97O47
$$ 332 670 787 590 319 -209 -379 -615 -586 -329 349 876 1295 1096 747 195 -533 -1011 -914 -381 -184 463
2134D63L37L35r3k95q62p03l7K9K56N53N46K49Jl78n78k08m10p2L44L05M87K90
$$ 463 800 1135 1042 747 -115 -818 -855 -826 -570 -17 529 778 779 401 -177 -385 -795 -867 -523 -218 269 559
2156E59p6J02l27n77l67n37J54N21N38O17K64J21n84l46p97k93k52M23N61N24
$$ 559 483 585 258 -319 -686 -1223 -1069 -548 -10 607 871 992 408 62 -735 -1028 -1280 -857 -296 228
2176B28K80L53n0n29n60l02l17K12L04M12N55J43n7k05l05l48n25j3J78M71M62
$$ 228 508 861 811 282 -278 -580 -897 -685 -381 31 586 729 672 467 162 -186 -711 -724 -546 -75 387
2197C87M62K59n09j24o96l81j17r9L50M83N08M18J44m44k57n68n11k26M28L94
$$ 387 849 1108 599 475 -221 -602 -719 -818 -468 15 523 941 1085 641 384 -184 -695 -921 -493 -99
2217i9L15L44J95p5k59n06m52N6O1O7K72N21J84j36k95k07l31l22j84Q3L51N41
$$ -99 216 560 755 680 421 -85 -537 -481 -420 -353 -81 440 624 488 193 -14 -345 -667 -851 -768 -417 124
2239A24K79M99k56r5o24p07j60P6P0N65N88M09j13j90l14j03n16l43N9N13K49
$$ 124 403 902 646 551 -73 -780 -940 -864 -794 -229 359 768 655 465 151 48 -468 -811 -752 -239 10
2260A0L03P1M08j47o65k11k94O4L28P9L08M02L2l8m36k43m26j57j33O67L94L0
$$ 10 313 384 792 645 -20 -231 -525 -461 -133 -54 254 656 688 650 214 -29 -455 -612 -745 -78 316 346
2282C46M25J42k91n22m12l16q0L76K58L19M82J11j74n66l08k25J08k37J38O38
$$ 346 771 913 622 100 -312 -628 -708 -332 -74 245 727 838 664 98 -210 -435 -327 -564 -426 212
2302B12J79Q9Q5o7l71m67n99K40J53M67K6M93M28l37j43n98k98l64J45P9M60N65
$$ 212 391 480 565 498 127 -340 -939 -699 -546 -79 -53 440 868 531 388 -210 -508 -872 -727 -648 -188 377
2324C77N22k10k08m49m65l15O3K29J64K65M72K07j9n14m20m0K4j13J19M45K08
$$ 377 899 689 481 32 -433 -748 -685 -456 -292 -27 445 652 633 119 -301 -341 -317 -430 -311 134 342
2345C42L63j81q1l93k87k77JK4N52K90J29K31j31j89m64l64j90Q6K51K05L93M25
$$ 342 705 524 443 50 -237 -514 -513 -489 63 353 482 713 582 393 -71 -435 -625 -539 -288 -83 310 735
2367G35l4l20k66l38k33m5J33K35L09R7J34N3k20l37l21k42J53K58K6M56K35J11
$$ 735 701 381 115 -223 -456 -501 -368 -133 176 273 407 460 240 -97 -418 -660 -507 -249 -223 233 468 579
2389E79q4k07n27k69j72J0K72N91J18K81kl42l21j23n99L31R5K94J92K18l5N8
$$ 579 495 288 -239 -508 -680 -670 -398 193 311 592 590 248 -73 -196 -795 -464 -369 -75 117 335 300 358
2411C58l46j90Lm14L79n3L41J72O7K7j18l79O5m86P4J77N03J12K82k5j50L3m24
$$ 358 12 -178 -175 -589 -210 -263 78 250 317 344 226 -153 -88 -574 -500 -323 180 292 574 549 399 432 8
2434Hl76j80j9L8M33N94P1k12j49J6m26q5k88K51K23K35K79P6j49k08l12j41j45
$$ 8 -368 -548 -567 -529 -96 498 569 357 208 224 -202 -287 -575 -324 -101 134 413 489 340 132 -180 -321 -466
2457d66NJ66K08M00M04l46j8l34k91k70l0r0L08N50J52K60k91J52n54k85n2k8
$$ -466 -461 -295 -87 313 717 371 353 19 -272 -542 -572 -662 -354 196 348 608 317 469 -85 -370 -422 -450
2479d50J45L23J94J00N1J49m72k88n4l4J89K6L95R9PM4l23j19k01l48R5L16R1
$$ -450 -305 18 212 312 363 512 40 -248 -302 -336 -147 -121 274 373 380 424 101 -18 -219 -567 -472 -156 -65
2502f5J24K37L40m8m89k30k17o3K75p7M31J81Q0l9j96p7l42k18m9K67Q3L62Oj5
$$ -65 59 296 636 588 99 -131 -348 -411 -136 -213 218 399 479 440 244 167 -175 -393 -442 -175 -92 270 276 261
2526B61J56k89l84M2r8l1K19K8K62K74k46P5k86m05o5l9m1M41L79RJ32J65m77
$$ 261 417 128 -256 -214 -312 -343 -124 -96 166 440 194 269 -17 -422 -487 -526 -567 -126 253 262 394 559 82
2549H2m13k5n3R4L9L07J25K25j66j39l3k65n3J13j24J64O6J48j7J66j93r0n8k42
$$ 82 -331 -356 -409 -315 -276 31 156 381 215 76 43 -222 -275 -162 -286 -122 -56 92 75 241 48 -42 -100 -342
2573c42N9O4K22L65J23J49l40l36j14j23j88PN17N6K92l2M5m13k1k17m5j02J21
$$ -342 -283 -219 3 368 491 640 300 -36 -150 -273 -461 -454 63 119 411 379 424 11 -10 -227 -272 -374 -253
2596b53K63J32K7J8o9k70j8r9q4O7K82K87P9mj38k1k70k86j3J29J47K09R4J06
$$ -253 10 142 169 187 118 -152 -170 -269 -353 -286 -4 283 362 358 220 199 -71 -357 -370 -241 -94 115 209 315
2620C15L05k24m83P3m26j71J46K92K16J93O6l8R3m27j04q8p2L99k05L41J21Q1
$$ 315 620 396 -87 -14 -440 -611 -465 -173 43 236 302 264 357 -70 -174 -262 -334 65 -140 201 322 403
2642D03l74J15j79k16J23q0Q3K42K4J11J77k57j00k47j92j7K11K53K5K57P8k7
$$ 403 29 144 -35 -251 -128 -208 -125 117 141 252 429 172 72 -175 -367 -384 -173 80 105 362 440 413
2664D13k68l18n7j06lL90m4L46J06k56L4j0l94j65J1oL05J00PJ93k7j59j36j58
$$ 413 145 -173 -230 -336 -339 51 7 353 459 203 237 227 -167 -332 -321 -327 -22 78 85 278 251 92 -44 -202
2688b02k18R5K4L50K0K53J59j41l99Q1k29j78k6J10M18J17P4J36l00j23L4k64
$$ -202 -420 -325 -301 49 69 322 481 340 -59 22 -207 -385 -411 -301 117 234 308 444 144 21 55 -209
2710b09p2l0K59J55P9m1q7q4j31k33K90n2J97o7K65L7j24J74n25J14j64k08R6
$$ -209 -281 -311 -52 103 182 141 54 -30 -161 -394 -104 -156 41 -26 239 276 152 326 -199 -85 -249 -457 -361
2733c61L36J17L36j4p3j63j22k93k23L18m8K08K79Q0j73k2k05j30M3j2j12R5L20
$$ -361 -25 92 428 414 341 178 56 -237 -460 -142 -190 18 297 377 204 182 -23 -153 -110 -122 -234 -139 181
2756A81J6P2j63k78K3r4p5N7Q7J22J04M49l19R0j98k86j49MO2J87K15J28J43j20
$$ 181 197 269 106 -172 -149 -243 -318 -261 -174 -52 52 501 182 272 74 -212 -361 -357 -295 -108 107 235 378 258
2780B58j40j16k13k1M8N9K74pK17j19q5j42l12J36n4QM18R2j3Q8mj83k32j80k32
$$ 258 118 2 -211 -232 -184 -125 149 142 359 240 155 13 -299 -163 -217 -209 209 301 288 376 372 189 -43 -223 -455
2805d55K2L60M4J37L2K58j0l29k80r6J44j76J85K48K18k08J20j00k10j55J7K54
$$ -455 -433 -73 -29 108 140 398 388 59 -221 -317 -173 -349 -164 84 302 94 214 114 -96 -251 -234 20
2827B0K4j03Q4M9J09j26j53k23J32o1N0K61l2K43O0M8l03k06M0j20n4j4K32K11
$$ 20 44 -59 25 74 183 57 -96 -319 -187 -248 -198 63 31 274 334 382 79 -127 -87 -207 -261 -275 -43 168
2851A68K7J17j77n4j04l56J46P9j55L12J05J78k40L8j9r3n6l5k28J35K91k1J80
$$ 168 195 312 135 81 -23 -379 -233 -154 -309 3 108 286 46 84 65 -28 -84 -119 -347 -212 79 58 238
2874B38j26j0k68m1K7J49j84K97K24j12J71j15j43k35L7j26N7J21K90j8L3n0j25
$$ 238 112 102 -166 -207 -180 -31 -215 82 306 194 365 250 107 -128 -91 -217 -160 -39 251 233 266 216 91
2897I1j53j44p9K07m1j15K96M6J21O9k19q0j78N7r8R9L08R0K2p0m5l17k06j50
$$ 91 -62 -206 -285 -78 -119 -234 62 108 229 298 79 -1 -179 -122 -220 -121 187 277 299 229 184 -133 -339 -489
2921d89L02K2J58q3L53R9o8k24l27p2K53m7j0O2J91P8j9k5j16k49J34o1K0O4o9
$$ -489 -187 -165 -7 -90 263 362 294 70 -257 -329 -76 -123 -133 -71 120 198 179 154 38 -211 -77 -138 -118 -54 -123
2946a23M00q6Q7k67M0l72N7K21r4K96K42n2p2o6k18o7k54N8p6K94J02R9J52o5
$$ -123 277 191 278 11 51 -321 -264 -43 -137 159 401 349 277 211 -7 -74 -328 -270 -346 -52 50 149 301 236
2970B36j8j86k32j7J15J0Q6J33K10k66O9qk38j03m5J35K60Ok09L42Nn0m71Q6j99
$$ 236 218 32 -200 -217 -102 -92 -6 127 337 71 140 132 -106 -209 -254 -119 141 147 -62 280 285 235 -236 -150 -349
2995c49J80J23j70L61J53o8o7j46k47j52O0n6M94l4J62K8r6K5j24k40o8J70L0
$$ -349 -169 -46 -216 145 298 230 163 17 -230 -382 -322 -378 116 82 244 272 176 201 77 -163 -231 -61 -31
3018c1m8O0K36J26k05k90j00j0M9N8q8K03K19K06j15J09l85q3j26k40L66O9J14
$$ -31 -79 -19 217 343 138 -152 -252 -262 -213 -155 -243 -40 179 385 270 379 -6 -89 -215 -455 -89 -20 94
3041I4K27j4r5m9j39j44ql4J20N6J60j51J56n3r0j61J56j02l3J14J08J16j0O2
$$ 94 321 307 212 163 24 -120 -128 -162 -42 14 174 23 179 126 36 -125 31 -71 -104 10 118 234 224 286
3065B86k97j29p9r7j7P6J87K11J71j34m0j91P8l12j31K40n8L49K31J19l21j47
$$ 286 -11 -140 -219 -316 -333 -257 -70 141 312 178 138 -53 25 -287 -418 -178 -236 113 344 463 142 -5
3087ej51Q5k52n2K62K04J11j78K44j11k11k6j23j18J63O5M9K21K18j62m0l00j17
$$ -5 -156 -71 -323 -375 -113 91 202 24 268 157 -54 -80 -203 -321 -158 -93 -44 177 395 233 193 -107 -224
3110b24j88J53P2N2N66r0j8n6pl17j92r5L89p0l3J80J64l00L87l71n2j00k5o6
$$ -224 -412 -259 -187 -135 431 341 323 267 260 -57 -249 -344 45 -25 -58 122 286 -14 373 2 -50 -150 -175 -241
3134b41L31j0P6P8j18Q5k83j80M5j1LK53K32j13R2j18k58J0o9r1M0L26rK4J16
$$ -241 90 80 156 234 116 201 -82 -262 -217 -228 -225 28 260 147 239 121 -137 -127 -196 -287 -247 79 70 94 210
3159B10K3k33%j80J56q7K2R1J6K77j63lj92R1k21J06K0J56J85m7o3K7J3k80j87
$$ 210 233 0 0 -180 -24 -111 -89 2 18 295 132 129 -63 28 -193 -87 -67 89 274 227 164 191 204 -76 -263
3184b63q6O3J22N6K73J79Mp4j92j77m1k11K70N7R0K23j12p8q5m0j47M8j5Kj05
$$ -263 -349 -286 -164 -108 165 344 348 274 82 -95 -136 -347 -77 -20 70 293 181 103 18 -22 -169 -121 -136 -134 -239
3209b39L04J47j13O5j39k05j60O1j38L14M91p7K7r3j07j26j97%j54J13n5K24M63
$$ -239 65 212 99 164 25 -180 -340 -279 -417 -103 388 311 338 245 138 12 -185 -185 -339 -226 -281 -57 406
3232D06j44L9l09j30p2J07j34L41j30M47l08r9j33K20k89o9JJ32R9K70M0o7L0
$$ 406 262 301 -8 -138 -210 -103 -237 104 -26 421 113 14 -119 101 -188 -257 -256 -124 -25 245 285 218 248
3255B48j24l92J0m7J45P7J50K27m2N4j23j93k11n9J25r3n3L49J88j8j68LJ35m62
$$ 248 124 -268 -258 -305 -160 -83 67 294 252 306 183 -10 -221 -280 -155 -248 -301 48 236 218 50 53 188 -274
3279b74n9L10k12M10l6m0q5J0L8j94N6j66k30M14K21J38K20k21j20k23l27N8J31
$$ -274 -333 -23 -235 175 139 99 14 24 62 -132 -76 -242 -472 -58 163 301 521 300 180 -43 -370 -312 -181
3302a81M1J01J18Q0J14L4j86k65k16K58J6Q1J92J33j9J2k62k47J59j85j4K60K7
$$ -181 -140 -39 79 159 273 307 121 -144 -360 -102 -86 -5 187 320 301 313 51 -196 -37 -222 -236 24 51
3325E1J39m6Mn9k83J20j25L6p9L02m2L60q2k10R2j98j93J4k27K66K04l7j14N16
$$ 51 190 144 148 89 -194 -74 -199 -163 -242 60 18 378 296 86 178 -20 -213 -199 -426 -160 44 7 -107 409
3349D09k22%j35L7j63m2Q9jK5K91j51o3q6l41R3L7J17Q4OK74R0j67j39J0l22P2
$$ 409 187 187 52 89 -74 -116 -27 -28 -3 288 137 74 -12 -353 -260 -223 -106 -22 -16 258 348 181 42 52 -270 -198
3375a98pP9ML97M1k56R8k6k96L5q2n5J54J98P4p4J71k43J20l30l6K16OJ46m7j5
$$ -198 -205 -126 -122 275 316 60 158 132 -164 -129 -211 -266 -112 86 160 86 257 14 134 -196 -232 -16 -10 136 89 74
3401G4J67q7r3k48q6J70j01K36nK48J64k17p1j82j91r7OK58K22J19jo1k24J22
$$ 74 241 154 61 -187 -273 -103 -204 32 27 275 439 222 151 -31 -222 -319 -313 -55 167 286 285 224 0 122
3425A22l87J09J28P7j38J37K8J26k41P6j11L3k16J68O5O1n2L88l24j0j02j35p5
$$ 122 -265 -156 -28 49 -89 48 76 202 -39 37 -74 -41 -257 -89 -24 37 -15 373 49 39 -63 -198 -273
3448b73Q8L8Q2Q7L76j72j20k22j0lj26J06k6rJ97k9J71j00j69J65j83Q2l4k8J83
$$ -273 -185 -147 -65 22 398 226 106 -116 -126 -129 -255 -149 -175 -184 13 -16 155 55 -114 51 -132 -50 -84 -112 71
3473G1J5J27j07j07%j59K1P0q2J85R1K8J82j61j13k24J21j31n6K26o2L53Q2r2
$$ 71 86 213 106 -1 -1 -160 -139 -69 -151 34 125 153 335 174 61 -163 -42 -173 -229 -3 -65 288 370 278
3497B78k29R4k10o5L4%K9m8K18p9p4P8n8j98n8pK36J20K2J5N8o5k80J09k73J01
$$ 278 49 143 -67 -132 -98 -98 -69 -117 101 22 -52 26 -32 -230 -288 -295 -59 61 83 98 156 91 -189 -80 -353 -252
3523b52n1K92J33J00n5R1k08o0j83j91L35Q5j27K13l7Q7Q2l05k5n3o7L07j92l5
$$ -252 -303 -11 122 222 167 258 50 -10 -193 -384 -49 36 -91 122 85 172 254 -51 -76 -129 -196 111 -81 -116
3547a16M89r8q7k62j24J24j43r7L19%L18j00L29m37j81k4r9LL7J16L18Q0j36r1
$$ -116 373 275 188 -74 -198 -74 -217 -314 5 5 323 223 552 115 -66 -90 -189 -186 -149 -33 285 365 229 138
3571A38Oq7J2k72j07K30LJ98o9J45Q3m34p7K30l16J16K30J15oj68Q5j10K5j11
$$ 138 144 57 69 -203 -310 -80 -77 121 52 197 280 -154 -231 -1 -317 -201 29 144 138 -30 55 -55 -30 -141
3595a41M7j63J15J99J33L9J1j72m4q2k48p9J10J29K09L06k67Q5k00J42m58R4j9
$$ -141 -94 -257 -142 57 190 229 240 68 24 -58 -306 -385 -275 -146 63 369 102 187 -13 129 -329 -235 -254
3618b54K09J73j63Q8K86l11k6rk17Q6J77l9J44j9O4R4j54j17n4k28J16M4J93J73
$$ -254 -45 128 -35 53 339 28 2 -7 -224 -138 39 0 144 125 189 283 129 12 -42 -270 -154 -110 83 256
3642B56R5R6j77j15k52K1k99K11J89J00j4Lr9M7J06r8j70q2Q6K9J8O0R9j60J46
$$ 256 351 447 270 155 -97 -76 -375 -164 25 125 111 114 15 62 168 70 -100 -182 -96 -67 -49 11 110 -50 96
3667I6k11j0qo9J47K76j14j3J46j58K4l40M4o1j86L61K48J20j32J32j54j83j59
$$ 96 -115 -125 -133 -202 -55 221 107 94 240 82 106 -234 -190 -251 -437 -76 172 292 160 292 138 -45 -204
3690b04jL1l7L10J55r8j86j55L79r9k47r6J34J20K47M8j06J15l75j2k58mk8L54
$$ -204 -205 -174 -211 99 254 156 -30 -185 194 95 -152 -248 -114 6 253 301 195 310 -65 -77 -335 -339 -367 -13
3714a3N8J09K50q0k28K7k36p7Q7r8M9P3J30J89j69j17o3P8p1j47K12K64j29k7
$$ -13 45 154 404 324 96 123 -113 -190 -103 -201 -152 -79 51 240 71 -46 -109 -31 -102 -249 -37 227 98 71
3738G1o9L2k9l21J74q7J11J25k1KJ46N7j28n3m11J0J24oL71J23Mj7k53Pj38j00
$$ 71 2 34 5 -316 -142 -229 -118 7 -14 -12 134 191 63 10 -401 -391 -267 -273 98 221 225 208 -45 -38 -176 -276
3764b76J83q3j06L76K3Qll4Kk27k2K1L7M0J05q7K78kl32J09l28L8R8K01j34M84
$$ -276 -93 -176 -282 94 117 125 122 88 90 -137 -159 -138 -101 -61 44 -43 235 233 -99 10 -318 -280 -182 19 -115 369
3790C69J01l08O3m34J00j7j6J80O0J58r3k7M5p7q0j40O4j32N6J46J44o7j44J44
$$ 369 470 162 225 -209 -109 -126 -142 38 98 256 163 136 181 104 24 -116 -52 -184 -128 18 162 95 -49 95
3814I5l2n2j98L5j79Q8L71MJ01r0k14j33n3pK87J9j64L35P0j61K6K4l42j40J54
$$ 95 63 11 -187 -152 -331 -243 128 132 233 143 -71 -204 -257 -264 23 42 -122 213 283 122 148 172 -170 -310 -156
3839a56p6K12K36K24m27P3J5l01l7J0J16q6L11R7p5j86P0O5j76k91L05m8J59K0
$$ -156 -232 -20 216 440 13 86 101 -200 -237 -227 -111 -197 114 211 136 -50 20 85 -91 -382 -77 -125 34 54
3863E4K60l5j40p4j73j37N7M8J1J69J49m4qJ23k93m0j37J1J63O9l2Q2M1O5k46
$$ 54 314 279 139 65 -108 -245 -188 -140 -129 40 189 145 137 260 -33 -73 -210 -199 -36 33 1 83 124 189 -57
3888e7J5r8O5j20J42j4K11m1P2o8L3k67r4j25K94L6j11L69p6j41Nq9k16R1L9P0
$$ -57 -42 -140 -75 -195 -53 -67 144 103 175 107 140 -127 -221 -346 -52 -16 -127 242 166 25 30 -59 -275 -184 -145 -75
3914g5K45j91J97k5J49k19j21k49J94k22M18j75J16J43J29j43j81j71L0k00L06
$$ -75 170 -21 176 151 300 81 -40 -289 -95 -317 101 -74 42 185 314 171 -10 -181 -151 -351 -45
3935d5N9J28J5J63o6j90R3k79L0k4m4L67j8J00j16J05k54m9k31K48j06R3N7Q9
$$ -45 14 142 157 320 254 64 157 -122 -92 -116 -160 207 189 289 173 278 24 -25 -256 -8 -114 -21 36 125
3959A25PL2l41J09j0j7l9o1J73J28J02l5r3j58r0j46K12k9Q7J83L0jK4k15j31
$$ 125 132 164 -177 -68 -78 -95 -134 -195 -22 106 208 173 80 -78 -168 -314 -102 -131 -44 139 169 168 192 -23 -154
3984a54N6k29R0L13L6o2J28j36N3r4j86j6k6J22j04L92j83o5O6N3k14J12j84P5
$$ -154 -98 -327 -237 76 112 50 178 42 95 1 -185 -201 -227 -105 -209 183 0 -65 1 54 -160 -48 -232 -157
4008a57k06M31k3QK14r8l05L5j41J81n8J58j0K46R7k18k14L9r2n2R9k2R8p5K69
$$ -157 -363 68 45 53 267 169 -136 -101 -242 -61 -119 39 29 275 372 154 -60 -21 -113 -165 -66 -88 10 -65 204
4033B04j41Mj31J22k42n4L63M0k73K52p7L6K5l05r0J67P0k49K04R3J67r9q7n2
$$ 204 63 67 -64 58 -184 -238 125 165 -108 144 67 103 128 -177 -267 -100 -30 -279 -75 18 185 86 -1 -53
4057e3q2j73J90l3J16k4L54m9k2l45Q5r0m6n5J00K19k02O1K55k06j27O7n2j12
$$ -53 -135 -308 -118 -151 -35 -59 295 246 224 -121 -36 -126 -172 -227 -127 92 -110 -49 206 0 -127 -60 -112 -224
4081b24K69J4l4q6J51k6m8j8k16K41j57N2RK17qL9j14R1k79k9j2L0J40J53k5q0
$$ -224 45 59 25 -61 90 64 16 -2 -218 23 -134 -82 -73 144 136 175 61 152 -127 -156 -168 -138 2 155 130 50
4107E0J37j15j61R7n9m5l2J45R9j9kJ14k25k5m3q5Q1O5P0J56o3J9Q2k49j60Q2
$$ 50 187 72 -89 8 -51 -96 -128 17 116 97 95 209 -16 -41 -84 -169 -88 -23 47 203 140 159 241 -8 -168 -86
4133h6Q2l2l1j08K41R7j95L6j60j5M7J46R9m5m8J65j59k6p1p0O4j63O5L58k39
$$ -86 -4 -36 -67 -175 66 163 -32 4 -156 -171 -124 22 121 76 28 193 34 8 -63 -133 -69 -232 -167 191 -48
4158d8P3P3O4k70k4J44j68j5J24J12K99o0k14k5k2l19L56k88K67o2J84j86nj02
$$ -48 25 98 162 -108 -132 12 -156 -171 -47 65 364 304 90 65 43 -276 80 -208 59 -3 181 -5 -10 -112
4182a12O3N5k24rL33j15M6Q0j14N2Rj51L8j24M4J07J1l0K52k5l34J71j28q0l3
$$ -112 -49 6 -218 -227 106 -9 37 117 3 55 64 -87 -49 -173 -129 -22 -11 -41 211 186 -148 23 -105 -185 -218
4207b18K71j62j4J31K23j56q0j37K34j34J26k28P2K05m4j4Pp5j34l1J09p6j5K38
$$ -218 53 -109 -123 8 231 75 -5 -142 92 -42 84 -144 -72 133 89 75 82 7 -127 -158 -49 -125 -140 98
4231I8r2J85qj05J7j85j58K36m7J67O8p8J28k06K06k87r0p1Q9K37n9RM7J8Pj07
$$ 98 6 191 183 78 95 -90 -248 -12 -59 108 176 98 226 20 226 -61 -151 -222 -133 104 45 54 101 119 126 19
4257A9j01k59J79J3J19O0J28M4Q2k96Mj24J9o8M8K11r7P8Kj2j11j09J1m8L8K01
$$ 19 -82 -341 -162 -149 -30 30 158 202 284 -12 -8 -132 -113 -181 -133 78 -19 59 61 49 -62 -171 -160 -208 -170 31
4283C1k1n8L5L22l17J3p2j58K25n1Q5O6P8K0r3K8n5j93Q1P6k6R5k46L08Kk53J1
$$ 31 10 -48 -13 309 -8 5 -67 -225 0 -51 34 100 178 198 105 133 78 -115 -34 42 16 111 -135 173 175 -78 -67
4310f7j03J43k56L15JJ04m3J25p8m4k54J0p8L26n1M0K8r1p8N6L0p8Qj39J10J25
$$ -67 -170 -27 -283 32 33 137 94 219 141 97 -157 -147 -225 101 50 90 118 27 -51 5 35 -43 -35 -174 -64 61
4336F1J50k24pJ24j20j37J10M2j28O7R1N5L0Q5k06L7k34j54K77L6j6K38P3k55
$$ 61 211 -13 -20 104 -16 -153 -43 -1 -129 -62 29 84 114 199 -7 30 -204 -358 -81 -45 -61 177 250 -5
4360em6J31l90K89r0rK21j75J54j2j15QL2J36j91Q0j26L5J02rM5p9j57j5J34p9
$$ -5 -51 80 -310 -21 -111 -120 101 -74 80 68 -47 -39 -7 129 -62 18 -108 -73 29 20 65 -14 -171 -186 -52 -131
4386a31K30j01Q2Q6M4P9j44j55j99J49o5J02R6rK03j58p9Q8j56k2K79k24q2J38
$$ -131 99 -2 80 166 210 289 145 -10 -209 -60 -125 -23 73 64 267 109 30 118 -38 -60 219 -5 -87 51
4410E1q2r3R6M6l4R9k84J7J64J77k18L62mo5k31o1o3j74K16Q4R5j7J26n5j52j83
$$ 51 -31 -124 -28 18 -16 83 -201 -184 -20 157 -61 301 297 232 1 -60 -123 -297 -81 3 98 81 207 152 0 -183
4436a83J12m4R2r3j6K83n0MOk66J35M1j61M4j8J49J01M2j5k64j0J7k11R0L51k01
$$ -183 -71 -115 -23 -116 -132 151 101 105 111 -155 -20 21 -140 -96 -114 35 136 178 163 -101 -111 -94 -305 -215 136 -65
4462f5J65K32k83K04j49j96j20J51j87L34k07K94j17J47j92k57J31J28k4n3J7
$$ -65 100 332 49 253 104 -92 -212 -61 -248 86 -121 173 56 203 11 -246 -115 13 -11 -64 -47
4483d7P8Q8oj2r1L8n5p5P6n1P3L3Q2O6n7l9j26J39k17J7J37M7j19R4O9mj71Nj41
$$ -47 31 119 113 101 10 48 -7 -82 -6 -57 16 49 131 197 140 101 -25 114 -103 -86 51 98 -21 73 142 138 -33 -28 -169
4512a69M8P4P3j41J12J45j85j32K89m24K53n8L1P2J17l3j0o7Kn3j03M4N0K3K68
$$ -169 -121 -47 26 -115 -3 142 -43 -175 114 -310 -57 -115 -84 -12 105 72 62 -5 -3 -56 -159 -115 -65 -42 226
4537B26K1j07j42k5p3q6p5K31oM6J15n4l0n8j54J87j86L9L41k59J98k25M4R8R
$$ 226 247 140 -2 -27 -100 -186 -261 -30 -36 10 125 71 41 -17 -171 16 -170 -131 210 -49 149 -76 -32 66 75
4562G5j28N1P0j37L1K53j33j01J71q9j97P2l3j28K47J64j91np8K22k45L0j90j7
$$ 75 -53 -2 68 -69 -38 215 82 -19 152 63 -134 -62 -95 -223 24 188 -3 -8 -86 136 -109 -79 -269 -286
4586b86K23J9O9P0OJ4k2k32M2j7J2O9J64j10j03K7N7j01n7J21q0o7K47J77j29
$$ -286 -63 -44 25 95 101 115 93 -139 -97 -114 -102 -33 131 21 -82 -55 2 -99 -156 -35 -115 -182 65 242 113
4611A13L4k50Q2j66J30l1j87K62J48M3J33j04l4l5p4j54r6J20Q2J63k53rJ53m2
$$ 113 147 -103 -21 -187 -57 -88 -275 -13 135 178 311 207 173 138 64 -90 -186 -66 16 179 -74 -83 70 28
4635B8m2p8j32J02R3J59P1j86J49q2j31j63j8P6l3M5J52PL46q8j94j69N7k47K15
$$ 28 -14 -92 -224 -122 -29 130 201 15 164 82 -49 -212 -230 -154 -187 -142 10 17 363 275 81 -88 -31 -278 -63
4660f3j77L62j51q8K2J46J11l28J23l0m5J40J09m3K0k15J37l8j44K28j08r0K07
$$ -63 -240 122 -29 -117 -95 51 162 -166 -43 -73 -118 22 131 88 108 -107 30 -8 -152 76 -32 -122 85
4683H5j41K94k74l7K10l22p0K02o3J3K96j5n0M9l10n9q0L14o4o0J44j61K48M1
$$ 85 -56 238 -36 -73 137 -185 -255 -53 -116 -103 193 178 128 177 -133 -192 -272 42 -22 -82 62 -99 149 190
4707A90q7o9J30l26J28L5RJ41j64J51j57R8j94j09J33q3J65m1L24k19N5j08j96
$$ 190 103 34 164 -162 -34 1 10 151 -13 138 -19 79 -115 -224 -91 -174 -9 -50 274 55 110 2 -194
4730a94J94j35j41J71J82l9m0J50J10r2j58o1J90j47M2ln4O0J7j69J24j91K09
$$ -194 0 -135 -276 -105 77 38 -2 148 258 166 8 -53 137 -10 32 29 -25 35 52 -117 7 -184 25
4753B5k28K4Q4k5K68K3j19r2p1k4L9K26k21o1K04Kl1j21J52j59N3kK7k5pJ47q8
$$ 25 -203 -179 -95 -120 148 171 52 -40 -111 -135 -96 130 -91 -152 52 54 23 -98 54 -105 -52 -54 -27 -52 -59 88 0
4780@j92L08p4k07K07j5o3J41n9n4O4j65P9j12J64n2n2K4K20j6Mjj49N7k46M3
$$ 0 -192 116 42 -165 42 27 -36 105 46 -8 56 -109 -30 -142 22 -30 -82 -58 162 146 150 149 0 57 -189 -146
4806a46J67j63K93j20m3Q0j12J71k02k97K49N3J75qP4qJ09m34J14L5j1rk1J25
$$ -146 21 -142 151 31 -12 68 -44 127 -75 -372 -123 -70 105 97 171 163 272 -162 -48 -13 -24 -33 -54 71
4830G1j06J68J5o8j69J15j7o5o9n5J57K15l2J23m9j64k03J69lL6k61K39R6j0J33
$$ 71 -35 133 148 80 -89 26 9 -56 -125 -180 -23 192 160 283 234 70 -133 36 33 69 -192 47 143 133 266
4855B66k23qj9j1q3K33j60j31L76j81Q3Jj51j56K46j07K32j02k0p4j20N8k9K3
$$ 266 43 35 16 5 -78 155 -5 -136 240 59 142 143 -8 -164 82 -25 207 105 85 11 -109 -51 -80 -57
4879e7R2O6q2k44J23J84J38j78j13k2J16j77L05j99o7J31j15J12M4K5L9j76J7
$$ -57 35 101 19 -225 -102 82 220 42 -71 -93 23 -154 151 -48 -115 16 -99 13 57 82 121 -55 -38
4902c8P3o0N1M4O5j01j46R6R2q5j69L36j27Q0o3Q8J7k36J4L0p8P2K7K97k42J74
$$ -38 35 -25 26 70 135 34 -112 -16 76 -9 -178 158 31 111 48 136 153 -83 -69 -39 -117 -45 -18 279 37 211
4928B11j27j07jn1J18j39L3l1J01N9%m5M1k06J30p9K38k4J3J6j07l6MPk43j5K04
$$ 211 84 -23 -24 -75 43 -96 -63 -94 7 66 66 21 62 -144 -14 -93 145 121 134 150 43 7 11 18 -225 -240 -36
4955c6J06J80j59QJ13k01j27R4j33J75J64j86R3j22P4j94J62j17q2M62j48k43
$$ -36 70 250 91 99 212 11 -116 -22 -155 20 184 -2 91 -31 43 -151 11 -106 -188 274 126 -117
4977a17J72p2J91k66J10k00J71K1l8L3j54K13L7K3n1j85n0K6J9L3J18n8L00j00
$$ -117 55 -17 174 -92 18 -182 -11 10 -28 5 -149 64 101 124 73 -112 -162 -136 -117 -84 34 -24 276 176
5001A76j98Rll5m1J59n6j69O2J02J7J8L3p7p9j83M14j29L6lj0Q4m7j99K53j37
$$ 176 -22 -13 -16 -51 -92 67 11 -158 -96 6 23 41 74 -3 -82 -265 149 20 56 53 43 127 80 -119 134 -3
5027cj22Q1J33j22j8m2n2J98j47J0MP7p5K45J38j65j28j0o6M4j1R2k26L05q6k4
$$ -3 -125 -44 89 -33 -51 -93 -145 53 -94 -84 -80 -3 -78 167 305 140 12 2 -64 -20 -31 61 -165 140 54 30
5053C0N9j81J2j25K57j51J80j88k3K00n4J09j74j06N6p0p9J69J85M4o3j6Ql3o7
$$ 30 89 -92 -80 -205 52 -99 81 -107 -130 70 16 125 -49 -155 -99 -169 -248 -79 106 150 87 71 79 46 -21
5078b1j84k2R5N3m8J45j3J17k00kqo0oJ66J12j45M7J8m5oJ7j06J34j36l2O9K35
$$ -21 -205 -227 -132 -79 -127 18 5 122 -78 -80 -88 -148 -154 12 124 -21 26 44 -1 -7 10 -96 38 -98 -130 -61 174
5105A74J11l75J68k81P8J21q6J18np2M0J53j10k90k1K51j29j9J59O1m4Q2j98N1
$$ 174 285 -90 78 -203 -125 -4 -90 28 23 -49 -9 144 34 -256 -277 -26 -155 -174 -15 46 2 84 -114 -63
5129f3Q1k39J61J23j93K90j01P1m5j77qk4O5P6j65J92J19j33k7K89k79l6J26o0
$$ -63 18 -221 -60 63 -130 160 59 130 85 -92 -100 -124 -59 17 -148 44 163 30 3 292 13 -23 103 43
5153D3pq2K6N1q3P8l0K14k11o4J42m5J38j3j17j81J82N3o1j50N6L17k94J3K4k5
$$ 43 36 -46 -20 31 -52 26 -4 210 -1 -65 77 32 170 157 40 -141 41 94 33 -117 -61 256 -38 -25 -1 -26
5179b6J39j52K86k16k64J47J04p5Q6j69K92P6j97j17r1m9L66o5k74J72J8K54m3
$$ -26 113 -39 247 31 -233 -86 18 -57 29 -140 152 228 31 -86 -177 -226 140 75 -199 -27 -9 245 202
5202B02j69k8p4j05j4K00Q7n6Q8j17J03m4J3R0j85k40M09K6j61J01o1jk8j19j4
$$ 202 33 5 -69 -174 -188 12 99 43 131 14 117 73 86 176 -9 -249 160 186 25 126 65 64 36 -83 -97
5227i7mM4J42l4P5r9p7P1l8p5J39n8k4J32l2k82L40j01l9o7Q1Kq9k0J86j06K45
$$ -97 -101 -57 85 51 126 27 -50 21 -17 -92 47 -11 -35 97 65 -217 123 22 -17 -84 -3 -1 -90 -110 76 -30 215
5254B15n7J7K5l77J25o1K9r1K63J11j77q8K24k79R4N0j38J19j5P1k6k2J38r8l19
$$ 215 158 175 200 -177 -52 -113 -84 -175 88 199 22 -66 158 -121 -27 23 -115 4 -11 60 34 12 150 52 -267
5279b67K77P6q6K7j38M3r1R7l2Q7j41O4JQ9J68n0j77M0k25L87k20Jq4L20l35L06
$$ -267 10 86 0 27 -111 -68 -159 -62 -94 -7 -148 -84 -83 6 174 124 -53 -13 -238 149 -71 -70 -154 166 -169 137
5305A37j61Q1k1j51Q7L8j61J40j03o6J98Q8ro6N0k27P4J79j10Q9ql3R6k85N0K16
$$ 137 -24 57 36 -115 -28 10 -151 -11 -114 -180 18 106 97 31 81 -146 -72 107 -3 86 78 45 141 -144 -94 122
5331A22l44J49N2L9j93M30n4k29P4jk5L2N5k18o3K62R3j68p9k8P4j69J90J0p8
$$ 122 -222 -73 -21 18 -175 255 201 -28 46 45 20 52 107 -111 -174 88 181 13 -66 -94 -20 -189 1 11 -67
5356f7M9p6M0J04j00k0R7r2J95m9o7j16J52Kj27J3mo1M0K7jJ39o9R2j87J35K1
$$ -67 -18 -94 -54 50 -50 -70 27 -65 130 81 14 -102 50 52 -75 -62 -66 -127 -87 -60 -61 78 9 101 -86 49 70
5383G0l9Jk46J30l1J70j3j70J79J07q4j58KJ96k31L1O4J93k34K24k55J18J14j13
$$ 70 31 32 -214 -84 -115 55 42 -128 51 158 74 -84 -82 114 -117 -86 -22 171 -63 161 -94 24 138 25
5407B5j55J25K48k02J07j22o0O1n8j61K00J57O4j54m6r7J52j78J04J32k2o2q0
$$ 25 -130 -5 243 41 148 26 -34 27 -31 -192 8 165 229 75 29 -68 84 -94 10 142 120 58 -22
5430b2J2N3k6L9oj03l5j01J69M0J22k24J75nj33n1l2p6J71J0J02rL9lj31j77K72
$$ -22 -10 43 17 56 50 -53 -88 -189 -20 20 142 -82 93 88 -45 -96 -128 -204 -33 -23 79 70 109 106 -25 -202 70
5457G0l32K69n7j1m7K84j9k41J67M6j05j08J53k98K32r3J70k3j35N3m6Q0rP8j29
$$ 70 -262 7 -50 -61 -108 176 157 -84 83 129 24 -84 69 -229 3 -90 80 57 -78 -25 -71 9 0 78 -51
5482e1J00J5j31J22R0k36J7j71L1J65J10j85NK55mJ8j78J6j65O7J70j09M3J7K7
$$ -51 49 64 -67 55 145 -91 -74 -245 -214 -49 61 -124 -119 136 132 150 -28 -12 -177 -110 60 -49 -6 11 38
$$ [...]
8191b9
##END NTUPLES=NMR FID
##END=
