##TITLE=1H_IAMT-168
 CDCl3
 8 sc, 
 18.5.2023
##JCAMPDX= 6.0         $$ Bruker NMR JCAMP-DX V2.0
##DATA TYPE= NMR FID
##DATA CLASS= NTUPLES
##ORIGIN= UXNMR, Bruker Analytische Messtechnik GmbH
##OWNER= root
$$ XWIN-NMR		Version 3.5
$$ Thu May 18 14:23:37 2023 Russian Standard Time (UT+4h)  she@DPX200
##.OBSERVE FREQUENCY= 200.13150664
##.OBSERVE NUCLEUS= ^1H
##.DELAY= (6, 6)
##.ACQUISITION MODE= SIMULTANEOUS
##.ACQUISITION SCHEME= undefined
##.AVERAGES= 8
##.DIGITISER RES= 18
##SPECTROMETER/DATA SYSTEM= spect
##.PULSE SEQUENCE= zg30
##.SOLVENT NAME= CDCl3
##.SHIFT REFERENCE= (INTERNAL, CDCl3, 0, 15.7039)
##AUDIT TRAIL= $$ (NUMBER, WHEN, WHO, WHERE, WHAT)
$$ ##TITLE= Audit trail, XWIN-NMR		Version 3.5
$$ ##JCAMPDX= 5.01
$$ ##ORIGIN= Bruker BioSpin GmbH
$$ ##OWNER= she
$$ F:/spectra/data/she/nmr/H-F/1/audita.txt
$$ ##AUDIT TRAIL=  $$ (NUMBER, WHEN, WHO, WHERE, WHAT)
(   1,<2023-05-18 14:22:37.03 +0400>,<she>,<DPX200>,
      <created by zg, POWCHK disabled, PULCHK disabled
       configuration hash MD5:
       00 E9 B6 7A A2 85 ED C7 34 08 36 98 17 FE 4E 26
       data hash MD5: 16K
       F2 84 46 3D E7 A6 EE 6E 0A C3 61 0E 3E A2 E2 48>)
$$ ##END=
$$ 
$$ hash MD5
$$ 59 A5 E3 68 6F 10 9F 66 FD 76 15 8E 84 D5 78 37
##$RELAX= 
##$RELAX= 
##$RELAX= 
##$RELAX= 
##$RELAX= 
##$RELAX= 
$$ Bruker specific parameters
$$ --------------------------
##$DU= <F:/spectra>
##$EXPNO= 1
##$NAME= <H-F>
##$PROCNO= 1
##$TYPE= <nmr>
##$USER= <she>
##$AMP= (0..31)
100 100 100 100 100 100 100 100 100 100 100 100 100 100 100 100 100 100 
100 100 100 100 100 100 100 100 100 100 100 100 100 100 
##$AQSEQ= 0
##$AQ_mod= 1
##$AUNM= <au_zg>
##$AUTOPOS= <>
##$BF1= 200.13
##$BF2= 200.13
##$BF3= 200.13
##$BF4= 200.13
##$BF5= 200.13
##$BF6= 200.13
##$BF7= 200.13
##$BF8= 200.13
##$BYTORDA= 1
##$CFDGTYP= 0
##$CFRGTYP= 5
##$CHEMSTR= <none>
##$CNST= (0..31)
1 1 145 1 1 1 1 1 1 1 1 1 1 1 1 1 1 1 1 1 1 1 1 1 1 1 1 1 1 1 1 1 
##$CPDPRG= <>
##$CPDPRG1= <>
##$CPDPRG2= <>
##$CPDPRG3= <>
##$CPDPRG4= <mlev>
##$CPDPRG5= <mlev>
##$CPDPRG6= <mlev>
##$CPDPRG7= <mlev>
##$CPDPRG8= <mlev>
##$CPDPRGB= <>
##$CPDPRGT= <>
##$D= (0..31)
0 1.2 0 0 0 0 0 0 0 0.06 0 0.03 0 0 0 0 0.0002 0 0 0 0 0 0 0 0 0 0 0 0 
0 0 0 
##$DATE= 1684405356
##$DBL= (0..7)
120 120 120 120 120 120 120 120 
##$DBP= (0..7)
150 150 150 150 150 150 150 150 
##$DBP07= 0
##$DBPNAM0= <>
##$DBPNAM1= <>
##$DBPNAM2= <>
##$DBPNAM3= <>
##$DBPNAM4= <>
##$DBPNAM5= <>
##$DBPNAM6= <>
##$DBPNAM7= <>
##$DBPOAL= (0..7)
0.5 0.5 0.5 0.5 0.5 0.5 0.5 0.5 
##$DBPOFFS= (0..7)
0 0 0 0 0 0 0 0 
##$DE= 6
##$DECBNUC= <off>
##$DECIM= 24
##$DECNUC= <off>
##$DECSTAT= 4
##$DIGMOD= 1
##$DIGTYP= 9
##$DL= (0..7)
0 120 120 120 120 120 120 120 
##$DP= (0..7)
150 150 150 150 150 150 150 150 
##$DP07= 0
##$DPNAME0= <>
##$DPNAME1= <>
##$DPNAME2= <>
##$DPNAME3= <>
##$DPNAME4= <>
##$DPNAME5= <>
##$DPNAME6= <>
##$DPNAME7= <>
##$DPOAL= (0..7)
0.5 0.5 0.5 0.5 0.5 0.5 0.5 0.5 
##$DPOFFS= (0..7)
0 0 0 0 0 0 0 0 
##$DQDMODE= 0
##$DR= 18
##$DS= 0
##$DSLIST= <SSSSSSSSSSSSSSS>
$$ [...]
##$SUBNAM2= <"">
##$SUBNAM3= <"">
##$SUBNAM4= <"">
##$SUBNAM5= <"">
##$SUBNAM6= <"">
##$SUBNAM7= <"">
##$SUBNAM8= <"">
##$SUBNAM9= <"">
##$SW= 26.0245546579638
##$SWIBOX= (0..15)
0 0 2 0 0 0 0 0 0 0 0 0 0 0 0 0 
##$SW_h= 5208.33333333333
##$TD= 16384
##$TD0= 1
##$TE= 0
##$TE2= 300
##$TE3= 300
##$TEG= 300
##$TL= (0..7)
0 120 120 120 120 120 120 120 
##$TP= (0..7)
150 150 150 150 150 150 150 150 
##$TP07= 0
##$TPNAME0= <>
##$TPNAME1= <>
##$TPNAME2= <>
##$TPNAME3= <>
##$TPNAME4= <>
##$TPNAME5= <>
##$TPNAME6= <>
##$TPNAME7= <>
##$TPOAL= (0..7)
0.5 0.5 0.5 0.5 0.5 0.5 0.5 0.5 
##$TPOFFS= (0..7)
0 0 0 0 0 0 0 0 
##$TUNHIN= 0
##$TUNHOUT= 0
##$TUNXOUT= 0
##$USERA1= <user>
##$USERA2= <user>
##$USERA3= <user>
##$USERA4= <user>
##$USERA5= <user>
##$V9= 5
##$VALIST= <valist>
##$VCLIST= <CCCCCCCCCCCCCCC>
##$VD= 0
##$VDLIST= <DDDDDDDDDDDDDDD>
##$VPLIST= <PPPPPPPPPPPPPPP>
##$VTLIST= <TTTTTTTTTTTTTTT>
##$WBST= 1024
##$WBSW= 4
##$XGAIN= (0..3)
0 0 0 0 
##$XL= 0
##$YL= 0
##$YMAX_a= 36718
##$YMIN_a= -87014
##$ZGOPTNS= <>
##$ZL1= 120
##$ZL2= 120
##$ZL3= 120
##$ZL4= 120
##$ABSF1= 10
##$ABSF2= 0
##$ABSG= 5
##$ABSL= 3
##$ALPHA= 0
##$AQORDER= 0
##$ASSFAC= 0
##$ASSFACI= 0
##$ASSFACX= 0
##$ASSWID= 0
##$AUNMP= <proc_1d>
##$AZFE= 0.1
##$AZFW= 0.1
##$BCFW= 1
##$BC_mod= 2
##$BYTORDP= 1
##$COROFFS= 0
##$CY= 11.3945322036743
##$DATMOD= 1
##$DC= 2
##$DFILT= <>
##$DTYPP= 0
##$F1P= 15.7292609196834
##$F2P= 12.9074282941183
##$FCOR= 0.5
##$FTSIZE= 0
##$FT_mod= 4
##$GAMMA= 1
##$GB= 0.15
##$INTBC= 1
##$INTSCL= 1
##$ISEN= 128
##$LB= 0.24
##$LEV0= 0
##$LPBIN= 0
##$MAXI= 10000
##$MC2= 0
##$MEAN= 0
##$ME_mod= 0
##$MI= 1.114404
##$NCOEF= 0
##$NC_proc= 0
##$NLEV= 6
##$NOISF1= 3.799351
##$NOISF2= 2.8
##$NSP= 1
##$NTH_PI= 0
##$NZP= 0
##$OFFSET= 15.70392
##$PC= 1
##$PHC0= -20082.55
##$PHC1= 12.25272
##$PH_mod= 1
##$PKNL= yes
##$PPARMOD= 0
##$PSCAL= 0
##$PSIGN= 0
##$REVERSE= no
##$SF= 200.130013532006
##$SI= 16384
##$SIGF1= 3
##$SIGF2= 2
##$SINO= 400
##$SIOLD= 16384
##$SREGLST= <1H.CDCl3>
##$SSB= 0
##$STSI= 0
##$STSR= 0
##$SW_p= 3612.71676300578
##$SYMM= 0
##$S_DEV= 0
##$TDeff= 0
##$TDoff= 0
##$TI= <>
##$TILT= no
##$TM1= 0
##$TM2= 0
##$TOPLEV= 0
##$USERP1= <user>
##$USERP2= <user>
##$USERP3= <user>
##$USERP4= <user>
##$USERP5= <user>
##$WDW= 1
##$XDIM= 8192
##$YMAX_p= 0
##$YMIN_p= 0
$$ End of Bruker specific parameters
$$ ---------------------------------
##NTUPLES= NMR FID
##VAR_NAME=  TIME,          FID/REAL,        FID/IMAG
##SYMBOL=    X,             R,               I
##VAR_TYPE=  INDEPENDENT,   DEPENDENT,       DEPENDENT
##VAR_FORM=  AFFN,          ASDF,            ASDF
##VAR_DIM=   8192,          8192,            8192
##UNITS=     SECONDS,       ARBITRARY UNITS, ARBITRARY UNITS
##FACTOR=    0.000192,      1,               1
##FIRST=     0,             0,               0
##LAST=      1.572672,      0,               0
##MIN=       0,             -87014,          0
##MAX=       1.572672,      36718,           0
$$ Real data points
##PAGE= N=1
##DATA TABLE= (X++(R..R)), XYDATA
$$ plain form
0 0 0 0 0 0 0 0 0 0 0 0 0 0 0 0 0 0 0 0 0 0 0 0 0 0 0 0 -1 1 0 0 0 0 0 0 1 -1 1 0 3 -3 3 -3 3 -3 4 -4 4 -4 2 -2 2 2 -4 11 -22 41 -83 167
58 167 -386 1164 -6392 -73543 -47221 15242 -766 -40464 -13223 36367 16030 -45248 -58026
71 -58026 -20621 -4654 -25893 -24574 15529 29197 -11249 -38304 -10526 14056 -5995 -17826
83 -17826 12929 33759 11074 -10728 -589 12791 8030 2569 7888 14738 11785 3035 2227 12891
97 12891 16283 2571 -3895 7397 10724 -5239 -8922 10623 21715 7167 -9230 -10681 -8340
110 -8340 -10399 -13320 -7215 9048 16339 -768 -20048 -17214 -10698 -22228 -23023 8665 31211 12822
124 12822 -11409 -6858 1949 -9302 -19704 -1088 28847 36182 15086 -1762 4077 9124 -5201
137 -5201 -10099 16062 36718 20248 729 8659 14345 -3484 -14152 4444 23964 18342 2593
$$ packed form
0@%%%%%%%%%%%%%%%%%%%%%%%%%%jKj%%%%%JkKjLoOoOoPqQqOmM%oJ5l3O3j24K50
58A67n53J550p556o7151K6322O2463j6008l9698K7241M9590k0337o1278j2778
71e8026L7405J5967k1239J319M0103J3668m0446k7055K7778K4582k0051j1831
83a7826L0755K0830k2685k1802J0139J3380m761n461N319O850k953q750q08J0664
97A2891L392j3712o466J1292L327j5963l683J9545J1092j4548j6397j451K341
110h340k059k921O105J6263P291j7107j9280K834O516j1530p95L1688K2546j8389
124A2822k4231M551Q807j1251j0402J8616K9935P335k1096j6848N839N047j4325
137e201m898K6161K0656j6470j9519P930N686j7829j0668J8596J9520n622j5749
$$ plain form
150 2593 -132 7973 7345 -6869 -13495 2426 16811 4223 -11734 -2399 10241 -3245 -18063
163 -18063 -7488 4896 -3555 -15179 -8512 6011 6835 -5492 -11424 -2104 5656 -6663 -16267 1585
177 1585 23213 14724 -2395 3586 12739 -1116 -14595 -787 18863 16986 7436 8469 11318 751
191 751 -15781 -15937 2366 13762 4605 -3092 5242 5848 -15697 -27444 -10471 4041 -3150 -6455
205 -6455 4012 4538 -12812 -21848 -13176 -4106 -4013 -5329 153 6598 2025 -11612 -14692 -2192 3460
220 3460 -4489 -3714 10031 11650 -1496 -5291 2885 4143 -1772 -1514 4839 9214 7906 3108 702
235 702 4556 5253 -3950 -8524 1893 9384 2915 -962 4881 5765 -4495 -10770 -6761 -1819 469
250 469 1895 3050 4202 2367 -6459 -12908 -6826 1120 -438 -1054 8838 11661 -599 -8789 -3418
$$ packed form
150B593k725Q105o28j4214o626J5921J4385j2588j5957R335J2640j3486j4818
163a8063J0575J2384q451j1624O667J4523Q24j2327n932R320P760j2319r604J7852
177A585K1628q489j7119N981R153j3855j3479J3808J9650j877r550J033K849j0567
191G51j6532j56J8303J1396r157p697Q334O06k1545j1747J6973J4512p191l305
205f455J0467N26j7350r036Q672R070R3j316N482O445m573j3637l080J2500N652
220C460p949P75J3745J619j3146l795Q176J258n915K58O353M375j308m798k406
235G02L854O97r203m574J0417P491o469l877N843Q84j0260o275M009M942K288
250D69J426J155J152j835q826o449O082P946j558o16R892K823j2260q190N371
$$ plain form
265 -3418 1161 -570 2451 10069 12884 8810 2983 -1413 -803 2405 2473 3032 10410 13126 4705 -1653
281 -1653 743 240 -5864 -3831 4169 5833 1967 1367 441 -3303 -5590 -5108 -4677 -1118 3530 2858 -593
298 -593 1346 1298 -5433 -8139 -2776 880 -628 1199 4330 2410 -1713 -4297 -6030 -6148 -1872 399
314 399 104 2565 5505 -183 -7187 -4609 -1790 -3982 -2375 5019 7042 1604 -749 -1025 -3859 -5633
330 -5633 -3246 -473 2747 5394 2460 -2864 -3237 -2654 -6612 -7528 69 4628 1434 611 2370 -978
346 -978 -6285 -5020 -2000 -764 1972 4878 3637 813 -179 -3097 -6123 -3510 876 643 1302 5315
362 5315 3534 -2092 -3538 -1612 -2171 -1871 3824 6464 4914 4939 4003 -427 -1838 690 1846 1883 5872
379 5872 8307 4268 966 124 -2253 -5185 -2273 1686 1459 2044 3841 340 -4242 -4352 -3022 -3973
$$ packed form
265c418M579j731L021P618K815m074n827m396O10L208O8N59P378K716q421o358
281a653K396n03o104K033Q000J664l866o00r26l744k287M82M31L559M648o72l451
298e93J939m8o731k706N363L656j508J827L131j920m123k584j733j18M276K271
314C99k95K461K940n688p004K578K819k192J607P394K023n438k353k76k834j774
330e633K387K773L220K647k934n324l73N83l958r16P597M559l194q23J759l348
346i78n307J265L020J236K736K906j241k824r92k918l026K613M386k33O59M013
362E315j781n626j446J926n59L00N695K640j550K5r36m430j411K528J156L7L989
379E872K435m039l302q42k377k932K912L959k27N85J797l501m582j10J330r51
$$ plain form
395 -3973 -962 4212 4663 2275 2746 1835 -3104 -3377 302 1341 1685 4995 5760 1131 -1620 -2245 -4448
412 -4448 -5888 -1635 1238 -102 940 1893 -2137 -5904 -4874 -3615 -3658 -329 3925 2918 1000 1318
428 1318 -1085 -4733 -3673 336 749 1742 4599 3773 -691 -2059 -2341 -4924 -4414 403 2314 1040
444 1040 1170 1337 -3006 -5704 -3500 -2654 -2323 1649 3845 1790 -208 57 -2482 -5411 -2534 1037
460 1037 833 1912 4517 2362 -1886 -2102 -1144 -2570 -535 3681 5330 4124 4847 3495 -163 -278
476 -278 1957 1821 2702 6807 7918 4046 2398 3019 -308 -2558 781 3732 3099 3550 4755 1683 -2067
493 -2067 -1717 -1724 -2271 666 4176 3439 2559 3862 1165 -2966 -1884 1701 1369 2142 5792 6209 2606 740
511 740 17 -1658 -785 2394 3339 2667 4860 4161 -890 -2659 -192 -449 -1589 1290 5339 3100 611
$$ packed form
395c973L011N174M51k388M71r11m939k73L679J039L44L310P65m629k751o25k203
412d448j440M253K873j340J042R53m030l767J030J259m3L329M254j007j918L18
428A318k403l648J060M009M13R93K857q26m464j368k82k583N10M817J911j274
444A040J30J67m343k698K204Q46L31L972K196k055j998K65k539k929K877L571
460A037k04J079K605k155m248k16R58j426K035M216J649j206P23j352l658j15
476b78K235j36Q81M105J111l872j648O21l327k250L339K951o33M51J205l072l750
493b067L50pn47K937L510p37q80J303k697m131J082L585l32P73L650M17l603j866
511G40p23j675Q73L179R45o72K193o99n051j769K467k57j140K879M049k239k489
$$ plain form
528 611 553 -1195 -3041 -2390 -855 -186 1895 2917 -421 -2636 -1339 -2693 -6122 -4554 552 761 -2084
545 -2084 -702 457 -2732 -5390 -4540 -3197 -2458 -18 841 -350 598 290 -4234 -5082 -1285 169 -1334
562 -1334 1250 4839 2159 -2091 -2614 -1943 -2822 -1479 1218 2777 3064 2578 -1189 -3911 -2075 -1358 -3483
579 -3483 -949 5172 4404 -1770 -2689 -196 -1690 -4512 -1910 3212 4082 2005 -199 -851 223 -658
595 -658 -3350 -1214 5367 5059 -950 523 5472 1736 -4666 -1315 5258 3404 -906 1529 5712 4409
611 4409 -160 -1236 1641 3568 1376 -1370 2786 8221 4327 -1634 706 4886 199 -4665 632
626 632 6921 4242 -132 1224 1470 -1343 -4435 -3655 34 4031 3244 -184 127 926 -3362 -7209 -2022
643 -2022 4899 3663 186 2329 3035 -1486 -4985 -2713 1330 4073 4021 1728 1178 2032 -771 -5987
$$ packed form
528F11n8j748j846O51J535O69K081J022l338k215J297j354l429J568N106K09k845
545b084J382J159l189k658Q50J343P39K440Q59j191R48l08m524q48L797J454j503
562a334K584L589k680m250n23O71q79J343K697J559K87m86l767k722J836P17k125
579c483K534O121p68o174r19K493j494k822K602N122Q70k077k204o52J074q81
595f58k692K136O581l08o009J473M949l736o402L351O573j854m310K435M183j303
611D409m569j076K877J927k192k746M156N435l894n961K340M180m687m864N297
626F32O289k679m374J356K46k813l092P80L689L997p87l428L11P99m288l847N187
643b022O921j236l477K143P06m521l499K272M043K743n2k293n50Q54k803n216
$$ plain form
659 -5987 -3202 3516 2791 -1228 596 3363 -808 -5468 -2530 1666 375 -1886 -858 1317 1542 -1765
675 -1765 -4109 -368 3145 -623 -5471 -1836 3651 190 -4317 660 5229 -17 -5316 -2449 1931
690 1931 1357 -63 1849 4987 4921 -152 -4497 -1128 4665 3416 364 4860 8360 1684 -5610 -2764
706 -2764 2162 1785 271 4022 6645 3805 -2326 -6028 -2516 3108 2608 -87 4372 9933 2977 -5959
722 -5959 -3254 4987 3943 -176 3700 9387 6000 -1698 -2936 1553 4182 952 -345 4000 6877
737 6877 318 -5933 -341 6350 1686 -4591 1537 7277 1325 -5473 -93 6742 3962 -1567 -196
752 -196 3628 2364 -2970 -2694 4486 7543 397 -4460 9 2651 -3847 -6646 2280 7572 1076 -4356
768 -4356 -1753 -43 -4416 -5880 -663 5461 5222 -50 -3592 -1634 -663 -5360 -5333 3457 8216 1583
$$ packed form
659e987K785O718p25m019J824K767m171m660K938M196j291k261J028K175K25l307
675a765k344L741L513l768m848L635N487l461m507M977M569n246n299K867M380
690A931n74j420J912L138o6n073m345L369N793j249l052M496L500o676p294K846
706b764M926l77j514L751K623k840o131l702L512N624n00k695M459N561o956q936
722e959K705Q241j044m119L876N687l387p698j238M489K629l230j297M345K877
737F877o559o251N592O691m664o277O128N740n952o798N380O835k780n529J371
752a96L824j264n334K76P180L057p146m857M469K642o498k799Q926N292o496n432
768d356K603J710m373j464N217O124k39n272l542J958R71m697K7Q790M759o633
$$ plain form
784 1583 -4778 -1782 572 -4825 -6784 -398 5708 3777 -1209 -3389 -905 -1 -3686 -4435 2455 7052
800 7052 1126 -5227 -680 3564 -2028 -4946 1263 6152 1554 -4113 -1664 1829 988 -2102 -1340 3141
816 3141 3960 -2090 -4748 978 5659 1020 -1624 3716 5912 -325 -4373 1548 5690 3661 1825
831 1825 3578 4064 1463 -2257 -2467 2010 5684 3843 1255 3301 3583 -2474 -5123 752 5845 3661
847 3661 1720 4171 4032 -147 -3441 -1986 2795 5808 3383 1190 3254 4898 -1227 -5351 416
862 416 6656 3001 -967 2258 4837 -175 -4887 -1011 3926 3100 -411 -640 2446 2701 -2910 -4252
878 -4252 2186 5363 -460 -4756 1262 4212 -2348 -5461 1482 4775 -992 -4860 -1751 1521 -629
893 -629 -3056 -1296 3012 2228 -3578 -5292 -905 1717 -2652 -2749 3207 4259 -2490 -5563 -1478 303
$$ packed form
784A583o361K996K354n397j959O386O106j931m986k180K484R04l685p49O890M597
800G052n926o353M547M244n592k918O209M889m598n667K449L493q41l090P62M481
816C141Q19o050k658N726M681m639k644N340K196o237m048N921M142k029j836
831A825J753M86k601l720k10M477L674j841k588K046K82o057k649N875N093k184
847C661j941K451j39m179l294J455M781L013k425k193K064J644o125m124N767
862D16O240l655l968L225K579n012m712L876M937q26l511k29L086K55n611j342
878d252O438L177n823m296O018K950o560l113O943L293n767l868L109L272k150
893f29k427J760M308p84n806j714M387K622m369r7N956J052o749l073M085J781
$$ plain form
909 303 -2126 -1923 2060 3376 440 -3137 -3551 -1433 299 -1540 -1246 3121 3851 -2288 -4653 -1125
925 -1125 601 -2203 -1947 1898 3019 -31 -2075 -1717 -667 228 -546 -350 2253 3294 -304 -2711
941 -2711 1207 2791 -808 -1232 3196 3911 -362 -944 1906 2674 432 125 759 2004 1724 -710 -695
958 -695 2443 3499 -335 -1856 1673 2317 -1306 -1294 3114 3480 655 389 1633 733 -647 -223 1064
975 1064 2379 3200 1112 -603 211 1044 -1487 -1773 1693 2748 84 -885 258 -433 -1850 -1302 100
992 100 758 1177 159 -1349 -490 259 -1427 -2832 501 2190 -544 -2085 -209 445 -2163 -2387 -411
1009 -411 32 -836 -794 -541 -719 -254 -1520 -2047 -526 178 -1452 -2199 753 1371 -1665 -2619 386 51
1027 51 -2410 -1965 -124 26 -964 -523 -1061 -996 -562 -1650 -2401 204 1506 -616 -1203 1010 1123 -1576
$$ packed form
909C03k429K03L983J316k936l577m14K118J732j839K94M367P30o139k365L528
925a125J726k804K56L845J121l050k044L58J050Q95p74J96K603J041l598k407
941b711L918J584l599m24M428P15m273n82K850P68k242l07O34J245k80k434J5
958f95L138J056l834j521L529O44l623J2M408L66k825k66J244r00j380M24J287
975A064J315Q21k088j715Q14Q33k531k86L466J055k664r69J143o91j417N48J402
992A00O58M19j018j508Q59P49j686j405L333J689k734j541J876O54k608k24J976
1009d11M43q68M2K53j78M65j266n27J521P04j630p47K952O18l036r54L005l35
1027E1k461M45J841J50r90M41n38O5M34j088p51K605J302k122n87K213J13k699
$$ plain form
1045 -1576 -965 1374 1173 17 900 2023 289 -306 245 -22 207 1085 654 -115 1227 1417 -640 -1172
1063 -1172 1283 1629 -49 606 2465 1241 443 1007 1014 792 1547 2214 1379 1640 2187 1588 174 889 1917
1082 1917 86 229 2056 1183 -431 605 1375 -184 -677 415 519 -134 934 1234 114 283 1046
1099 1046 -95 -1037 678 1500 -29 -12 1105 -61 -1133 -206 68 -992 -732 516 -227 -1193 -465
1116 -465 -494 -1868 -1384 -564 -849 -1426 221 -303 -1981 -1484 -893 -1559 -2007 -868 -806 -2068 -1380 -827 -2386
1135 -2386 -2690 -1376 -1140 -2676 -1624 -412 -1674 -2268 -743 -968 -2047 -1177 40 -826 -1022 369 -134
1152 -134 -1281 -553 -85 -917 -823 202 -382 -1105 -334 77 -1521 -1526 170 -115 -1074 -114 811 -247 -697
1171 -697 476 -162 -804 278 671 -449 191 1242 94 -483 398 700 -249 170 1567 690 -186 662
$$ packed form
1045a576O11K339k01j156Q83J123j734n95N51k67K29Q78m31p69J342J90k057n32
1063a172K455L46j678O55J859j224p98N64Pk22P55O67q35K61N47n99j414P15J028
1082A917j831J43J827q73j614J036P70j559m93J092J04o53J068L00j120J69P63
1099A046j141r42J715Q22j529J7J117j166j072R27K74j060K60J248p43r66P28
1116d65k9j374M84Q20k85n77J647n24j678M97N91o66m48J139O2j262O88N53j559
1135b386l04J314K36j536J052J212j262n94J525k25j079Q70J217q66j96J391n03
1152a34j147P28M68q32R4J025n84p23P71M11j598nJ696k85r59R60R25j058m50
1171f97J173o38o42J082L93j120O40J051j148n77Q81L02r49M19J397q77q76Q48
$$ plain form
1189 662 1224 158 230 1716 768 449 1581 1626 489 1249 1619 856 544 2051 1772 395 982 1852 564
1208 564 -101 1148 985 -143 306 834 -388 -219 373 -307 -834 -177 407 -1017 -749 523 -330 -1394
1226 -1394 -679 685 -979 -1132 43 27 -692 -419 -90 -1029 -497 133 -775 -1115 260 228 -1679 -986 161
1245 161 -755 -1699 -469 217 -772 -1209 -359 -1210 -1468 -669 -660 -1605 -950 -265 -1662 -1840 -539 -649 -2237
1264 -2237 -1711 381 -850 -2051 -1233 -338 -1068 -1198 -963 -1041 -620 -214 -1152 -1496 238 447 -1087 -1049 1290
1283 1290 799 -1467 -586 1927 943 -244 784 1265 556 37 735 1113 1472 1222 168 102 1550 888
1301 888 -965 306 2609 896 -1200 287 1684 -181 -1684 236 1591 462 -86 107 246 367
1317 367 144 -347 374 2161 1042 -641 448 1791 55 -1090 926 2885 723 -217 944 838
$$ packed form
1189F62N62j066P2J486r48l19J132M5j137P60L70p63l12J507k79j377N87Q70j288
1208E64o65J249j63j128M49N28j222J69N92o80n27O57N84j424K68J272q53j064
1226a394P15J364j664j53J175j6p19K73L29r39N32O30r08l40J375l2j907O93J147
1245A61r16r44J230O86r89m37Q50q51k58P99Rr45O55O85j397j78J301j10j588
1264b237N26K092j231j201Q18Q95p30j30K35p8M21M06r38l44J734K09j534L8K339
1283A290m91k266Q81K513r84j187J028M81p09n19O98L78L59k50j054o6J448o62
1301H88j853J271K303j713k096J487J397j865j503J920J355j129n48J93J39J21
1317C67k23m91P21J787j119j683J089J343j736j145K016J959k162r40J161j06
$$ plain form
1333 838 253 -259 0 895 1778 799 -1241 -464 1441 -29 -1657 -70 1836 -222 -2449 -888 183
1350 183 -1127 -1924 -1201 -339 -562 -1328 -2319 -1581 -429 -1136 -2495 -1373 999 -1163 -3347 -1094 894
1367 894 -798 -1772 191 1060 -637 -2018 -1371 -106 613 287 -1005 -255 323 -992 -2907 -1240 1659
1384 1659 208 -1390 196 1141 -1285 -2439 -878 582 621 -86 81 -33 -25 -519 -1937 -406 2157
1401 2157 1271 -1198 122 1934 -580 -2727 -287 2538 1299 -772 346 1399 958 -594 -1153 1501
1417 1501 3503 1778 -735 902 3258 696 -1566 1664 4694 1713 -1003 845 3044 821 -904
1432 -904 764 3237 2245 -140 -1119 682 2019 -243 -1322 1906 4189 -489 -3102 158 2521 -482
1448 -482 -1557 1700 3511 473 -2141 -1350 182 832 -434 -97 1546 2053 -903 -3213 -889 1459
$$ packed form
1333H38n85n12K59Q95Q83r79k040P77J905j470j628J587J906k058k227J561J071
1350A83j310p97P23Q62k23p66r91P38J152p07j359J122K372k162k184K253J988
1367H94j692r74J963Q69j697j381O47J265P19l26j292P50N78j315j915J667K899
1384A659j451j598J586R45k426j154J561J460L9p07J67j14Qm94j418J531K563
1401B157q86k469J320J812k514k147K440K825j239k071J118J053m41j552n59K654
1417A501K002j725k513J637K356k562k262L230L030k981k716J848K199k223j725
1432i04J668K473r92k385r79J801J337k262j079L228K283m678k613L260K363l003
1448d82j075L257J811l038k614P91J532O50j266L37J643N07k956k310K324K348
$$ plain form
1464 1459 -685 -1062 1985 2649 -820 -3089 -943 585 93 -825 824 1363 789 -1869 -3289 -644
1480 -644 958 -874 -2712 631 1704 -2383 -4352 -1241 862 -1248 -2334 -403 522 -1026 -2732
1495 -2732 -2113 84 1139 -848 -1773 381 1025 -1912 -3003 834 2652 -574 -2400 579 1179 -1669
1511 -1669 -2627 99 1941 1271 -530 -1079 331 521 -1191 -1677 1609 3510 376 -1621 383 1208
1527 1208 -1026 -1588 1207 3354 1167 -99 58 429 -179 -956 -464 2461 3612 571 -1829 526
1543 526 1909 -958 -1589 2100 4017 1068 -941 450 1745 461 -972 256 2147 2265 93 -1297
1559 -1297 934 2216 -420 -1634 1908 2768 -905 -2269 914 2172 -784 -1326 1240 2101 -162 -1905
1575 -1905 -1012 1251 1499 -814 -908 1325 1592 -2731 -3083 702 2169 -771 -1392 1334 876 -2372 -3342
$$ packed form
1464A459k144l77L047O64l469k269K146J528m92r18J649N39n74k658j420K645
1480f44J602j832j838L343J073m087j969L111K103k110j086J931R25j548j706
1495b732O19K197J055j987r25K154O44k937j091L837J818l226j826K979O00k848
1511a669r58K726J842o70j801n49J410J90j712m86L286J901l134j997K004Q25
1527A208k234n62K795K147k187j266J57L71o08p77M92K925J151l041k400K355
1543E26J383k867o31L689J917k949k009J391J295j284j433J228J891J18k172j390
1559a297K231J282k636j214L542Q60l673j364L183J258k956n42K566Q61k263j743
1575a905Q93K263K48k313r4K233K67m323l52L785J467k940o21K726m58l248r70
$$ plain form
1592 -3342 -631 805 270 -642 -245 399 -694 -2725 -3026 -156 1305 -977 -1162 1056 795 -2824 -2994
1609 -2994 -42 967 -640 -673 644 612 -963 -2192 -1770 227 1255 -460 -1028 756 1387 -1770 -2316
1626 -2316 759 1689 -968 -1159 1067 869 -830 -905 295 794 742 -305 -884 1053 1177 -727 -682 2173
1644 2173 2433 -691 -1382 1232 1436 -514 288 2197 2023 180 -615 -265 521 1173 491 788 2162 2286
1662 2286 -154 -1283 621 1022 151 378 2519 2158 -73 -533 590 437 -229 545 706 1470 1416 -635
1680 -635 -1351 60 812 -899 -753 1337 1775 -661 -1163 -137 355 -1060 -947 129 399 385 -512 -1103
1698 -1103 -188 235 -1216 -1657 -27 592 -1421 -1848 668 389 -1744 -1710 -345 -101 -1340 -665 103 210
1716 210 -155 -1250 -1229 -495 -18 -1186 -1252 825 827 -1306 -1924 -264 -1104 -2094 -1368 251 -350 -831 -727
$$ packed form
1592c342K711J436n35r12L97O44j093k031l01K870J461k282j85K218k61l619j70
1609b994K952J009j607l3J317l2j575j229M22J997J028j715n68J784O31l157n46
1626b316L075R30k657j91K226j98j699p5J200M99n2j047n79J937J24j904M5K855
1644B173K60l124o91K614K04j950Q02J909j74j843p95L50P86O52o82K97J374J24
1662B286k440j129J904M01q71K27K141l61k231m60J123j53o66P74J61P64n4k051
1680f35p16J411P52j711J46K090M38k436n02J026M92j415J13J076K70j4q97n91
1698a103R15M23j451m41J630O19k013m27K516k79k133L4J365K44j239O75P68J07
1716B10l65j095K1P34M77j168o6K077Kk133o18J660q40r90P26J619o01m81J04
$$ plain form
1735 -727 -967 -1551 -1369 -1269 -1209 -31 502 -702 -1023 274 37 -1678 -624 1176 640 27 289 748
1753 748 13 -313 -198 -73 318 1016 521 -43 771 1069 -137 -474 690 789 -14 831 1464 1061 147 200
1773 200 211 233 165 784 398 594 1498 376 -642 341 338 -786 -400 1772 1165 -71 322 978 -32 -782
1793 -782 260 268 80 955 1401 64 40 317 -517 -934 703 619 -201 351 1126 -382 -948 -538 -356 -831
1813 -831 -314 760 -125 -532 -234 -715 -1352 -1108 -172 -689 -541 106 132 -1359 -1405 -170 -1526 -1452 -864 -491
1833 -491 -786 -384 -568 -1747 -1593 -896 -824 -1259 -261 335 -519 -441 -97 -494 -1332 -815 20 -242 -188 286 -117
1854 -117 -409 -637 -531 -909 -491 432 180 -346 240 255 -1191 -724 -228 -439 -689 405 897 -89 -437 3
1874 3 -339 -977 -294 510 132 541 911 149 -512 -21 -40 -233 266 1430 619 137 932 737 -492 -40
$$ packed form
1735g27k40n84J82J00O0J178N33j204l21J297k37j715J054J800n36o13K62M59
1753G48p35l26J15J25L91O98m95n64Q14K98j206l37J164R9q03Q45O33m03r14N3
1773B00J1K2o8O19l86J96R04j122j018R83lj124L86K172o07j236L93O56j010p50
1793g82J042Qj88Q75M46j337k4K77q34m17J637q4q20N52P75j508n66M10J82m75
1813h31N17J074q85m07K98m81o37K44R36n17J48O47K6j491m6J235j356P4N88L73
1833d91k95M02j84j179J54O97P2m35R98N96q54P8L44l97q38N17Q35k62N4M74m03
1854a17k92k28J06l78M18R23k52n26N86J5j446M67M96k11k50J094M92r86l48M40
1874Cl42o38O83Q04l78M09L70p62o61M91j9j93M99J164q11m82P95j95j229M52
$$ plain form
1894 -40 619 115 513 1165 1340 389 166 188 -165 -306 917 936 435 768 979 -228 -303 -150 -354 -611 177
1915 177 1045 134 220 266 -480 -1044 -389 -139 -442 -146 767 184 -1212 -564 -263 -1298 -728 287 190 -248
1935 -248 8 -23 -1273 -972 -207 -670 -806 -180 486 -496 -241 -262 -1105 -1509 -749 -108 -610 -225 -54 -536
1955 -536 -1238 -797 -1359 -1614 -740 -154 -296 -664 9 67 -1601 -1172 -198 -548 -909 358 397 -125 -379 -243
1975 -243 -1093 -840 188 -293 175 792 819 -346 -321 300 -131 -901 356 1361 713 111 624 813 -558
1994 -558 -509 263 471 964 954 501 130 686 339 -757 -119 1315 713 106 875 1121 22 -321 357 423
2014 423 -18 724 1350 691 617 640 -120 -253 593 267 -476 733 1541 483 -501 364 395 -585 -556 615
2034 615 1039 749 393 22 -447 26 74 -1042 -171 1275 374 -502 145 319 -973 -1661 -437 53 -187
$$ packed form
1894d0O59n04L98O52J75r51k23K2l53j41J223J9n01L33K11j207p5J53k04k57P88
1915A77Q68r11Q6M6p46n64O55K50l03K96R13n83j396O48L01j035N70J015r7m38
1935b48K56l1j250L01P65m63j36O26O66r82K55k1q43m04P60O41n02L85J71m82
1955e36p02M41n62k55Q74N86j42l68O73N8j668M29R74l50l61J267L9n22k54J36
1975b43q50K53J028m81M68O17K7j165K5O21m31p70J257J005o48o02N13J89j371
1994e58M9P72K08M93j0m53l71N56l47j096O38J434o02o07P69K46j099l43O78O6
2014D23m41P42O26o59p4K3p60j33Q46l26p43J209Q08j058r84Q65L1r80K9J171
2034F15M24k90l56l71m69M73M8j116Q71J446r01q76O47J74j292o88J224M90k40
$$ plain form
2053 -187 -474 233 -202 -564 -1191 -1306 -831 -108 -211 -778 -225 734 -1048 -1843 -728 -13 -743 -1031 -103
2072 -103 392 -670 -933 -518 -678 -518 -523 -1047 -280 455 -140 -1398 -735 97 -910 -1815 -232 780 -208
2091 -208 -700 223 261 -281 -882 -706 68 208 327 -351 252 1197 -248 -1735 -538 1069 337 -354 1175
2110 1175 1658 215 -1022 -598 486 450 358 676 1053 1508 209 -1151 290 1336 58 -364 1945
2127 1945 2585 196 -1402 674 1083 -239 -9 982 1403 771 -371 -269 432 893 -50 -813 712 1580
2145 1580 200 -966 507 1315 -662 -1150 475 690 -297 -455 572 647 243 -719 -965 126 566 -701
2163 -701 -911 978 1332 -630 -1502 -121 276 -838 -1038 671 1223 200 -801 -966 -451 -464 -1013 -802
2181 -802 583 1430 -719 -1954 -272 194 -1710 -1781 707 1340 -105 -1426 -182 16 -1305 -1321 -360
$$ packed form
2053a87k87P07m35l62o27j15M75P23j03n67N53R59j782p95J115P15p30k88R28
2072a03M95j062k63M15j60J60nn24P67P35n95j258O63Q32j007r05J583J012r88
2091b08m92R23L8n42o01J76P74J40J19o78O03R45j445j487J197J607p32o91J529
2110A175M83j443j237M24J084l6r2L18L77M55j299j360J441J046j278m22K309
2127A945O40k389j598K076M09j322K30R91M21o32j142J02P01M61r43p63J525Q68
2145A580j380j166J473Q08j977m88J625K15r87j58J027P5m04r62k46J091M40j267
2163g01k10J889L54j962q72J381L97j114k00J709N52j023j001j65N15j3n49K11
2181h02J385Q47k149j235J682M66j904p1K488O33j445j321J244J98j321j6R61
$$ plain form
2198 -360 549 478 -276 -625 210 329 -1218 -1436 326 1156 -409 -1057 644 820 -572 -905 160 470
2216 470 146 -236 91 716 973 285 -717 633 844 -440 -493 1132 1964 377 -367 963 1023 -729
2234 -729 -716 238 1298 1533 222 -170 940 707 -888 -1448 959 2244 475 -574 1097 1440 -741
2251 -741 -1042 630 1260 653 348 689 799 287 -880 -771 896 1447 -282 -352 1444 1179 -1211 -1515
2269 -1515 564 756 -427 -639 891 805 -261 -920 -177 430 330 -768 -657 598 668 -1029 -1206 325
2287 325 428 -1258 -1408 353 483 -728 -752 291 386 -510 -1520 -903 -16 14 -449 -468 697 638 -1609
2306 -1609 -2210 -348 451 -1001 -549 895 709 -925 -1248 -967 -94 32 -248 153 1045 675 -762 -1449
2324 -1449 -246 -37 -920 -632 1350 993 -706 -925 102 -47 -705 -248 1011 953 848 -176 -129 463
$$ packed form
2198c60R09p1p54l49Q35J19j547k18J762Q30j565o48J701J76j392l33J065L10
2216D70l24l82L27O25K57o88j002J350K11j284n3J625Q32j587p44J330O0j752
2234g29J3R54J060K35j311l92J110k33j595n60K407J285j769j049J671L43k181
2251g41l01J672O30o07l05L41J10n12j167J09J667N51j729p0J796k65k390l04
2269a515K079J92j183k12J530q6j066o59P43O07j00j098J11J255P0j697j77J531
2287C25J03j686j50J761J30j211k4J043R5q96j010O17Q87L0m63j9J165n9k247
2306a609o01J862P99j452M52J444j86j634l23K81Q73J26k80M01Q92l70j437o87
2324a449J203K09q83K88J982l57j699k19J027j49o58M57J259n8j05j024M7N92
$$ plain form
2342 463 536 -637 -102 1214 1175 30 -314 953 690 -498 -490 896 747 139 558 627 811 684 -215 -256
2362 -256 610 1198 -85 225 1757 1252 -318 -313 492 629 -279 58 847 1250 399 -136 -182 -144 298 -194
2382 -194 -631 931 1198 -461 -365 631 244 -1012 -433 1068 913 133 -240 26 -89 -646 -902 -159 413
2401 413 490 -222 -416 185 43 -1406 -1226 472 315 -722 -299 339 -35 -1036 -571 -374 -188 -344 -411
2420 -411 -444 309 12 -809 -965 -254 -313 -773 -895 359 271 -743 -404 -121 -434 -988 -115 144 316 134
2440 134 -83 -316 217 48 -624 -334 655 1030 121 261 814 -228 -808 -346 25 124 418 882 314 258
2460 258 134 -578 -234 460 283 275 622 1409 386 -263 167 432 311 100 443 799 710 292 189 -178 274
2481 274 460 -230 9 1002 1057 -59 21 519 183 -470 468 666 360 382 451 369 -311 16 -4 -219 -201 693
$$ packed form
2342D63P3j173N35J316l9j145l44J267k63j188QJ386j49o08M19O9J84j27q99m1
2362b56Q66N88j283L10J532n05j570NQ05J37r08L37P89M03q51n35m6L8M42m92
2382a94m37J562K67j659R6R96l87j256N79J501j55p80l73K66j15n57k56P43N72
2401D13P7p12j94O01j42j449J80J698j57j037M23O38l74j001M65J97J86j56o7
2420d11l3P53k97q21j56P11n9m60j22J254q8j014L39K83l13n54Q73K59J72j82
2440A34k17k33N33j69o72K90R89L75r09J40N53j042n80M62L71R9K94M64n68n6
2460B58j24p12L44O94j77qL47P87j023o49M30K65j21k11L43L56q9m18j03l67M52
2481B74J86o90K39R93N5j116Q0M98l36o53R38J98l06K2O9q2o80L27k0k15J8Q94
$$ plain form
2503 693 54 140 424 -314 -960 -610 235 41 -480 132 291 -233 -430 -337 -586 -842 22 -28 -517 193 117
2524 117 -355 -1143 -163 -392 -1016 -263 395 114 -685 -475 -430 -738 -799 -297 -339 -23 -85 -356 -612 -614 -554 -724
2546 -724 -547 399 3 -401 11 251 -368 -1029 -114 -228 -261 97 96 24 -215 -4 -246 -377 -19 326 -14
2567 -14 352 489 282 -288 -151 67 -340 159 1101 657 192 636 366 -434 254 571 216 115 1175 394
2587 394 330 104 580 332 -303 215 611 177 601 720 -28 -283 273 145 -243 496 760 451 264 480
2607 480 138 -534 -201 395 -134 186 175 112 -96 101 124 -197 -334 368 104 -267 322 266 -545 -663 -154
2628 -154 -785 -414 21 418 -219 -520 104 -527 -950 -363 89 -545 113 346 -381 -544 -251 -589 -834 -538
2648 -538 117 -401 -464 -24 42 -557 -414 -367 -335 -383 170 95 -618 -319 -59 -814 -955 -51 -10 -538 -88 74
$$ packed form
2503F93o39Q6K84p38o46L50Q45j94n21O12J59n24j97R3k49k56Q64n0m89P10p6
2524A17m72p88R80k29o24P53O58k81p99K10M5l08o1N02m2L16o2k71k56kO0j70
2546g24J77R46l96m04M12K40o19o61R15j14l3L58jp2k39K11k42j31L58L45l40
2567a4L66J37k07n70J37K18m07M99R42m44m65M44k70q00O88L17l55j01J060p81
2587C94o4k26M76k48o35N18L96m34M24J19p48k55N56j28l88P39K64l09j87K16
2607D80l42o72L33N96n29L20j1o3k08J97K3l21j37P02k64l71N89n6q11j18N09
2628a54o31L71M35L97o37l01O24o31m23N87M52o34O58K33p27j63K93l38k45K96
2648e38O55n18o3M40O6n99J43M7L2m8N53p5p13K99K60p55j41R04M1n28M50J62
$$ plain form
2670 74 -237 -495 -412 -127 -523 -119 214 256 -15 -76 -208 -455 33 -80 -264 366 909 406 -79 86 251
2691 251 -287 -307 385 107 365 364 306 41 -118 78 134 297 1064 547 44 199 820 -97 -21 330 328 61 391
2714 391 996 570 -138 569 -28 -258 176 570 235 281 817 303 -551 46 564 186 -139 389 537 77
2734 77 138 171 -124 -273 109 -107 210 168 228 -91 -351 93 -261 -515 20 283 -189 -582 101 2 -599 -612
2756 -612 -82 -189 -207 -268 -239 -241 94 -326 -869 -532 -333 -315 -836 -63 407 -646 -656 -286 -389 -670 -82 218
2778 218 -12 61 110 -582 -613 101 -243 -514 27 795 8 -668 260 228 -172 -244 217 286 215 88 -131 -142 20
2801 20 -2 -333 21 575 116 2 677 713 -346 -503 201 365 -8 225 661 869 294 198 177 134 220 401
2823 401 -13 796 1163 233 -335 232 813 111 -12 691 776 52 305 262 177 -275 128 -250 258 648 396
$$ packed form
2670G4l11k58Q3K85l96M04L33M2k71o1j32k47M88j13j84O30N43n03m85J65J65
2691B51n38k0O92k78K58jn8k65j59J96N6J63P67n17n03J55O21r17P6L51kk67L30
2714C91O05m26p08P07n97k30M34L94l35M6N36n14q54N97N18l78l25N28J48m60
2734G7O1L3k95j49L82k16L17m2O0l19k60M44l54k54N35K63m72l93O83r9o01j3
2756f12N30j07j8o1K9kL35m20n43L37J99J8n21P73M70j053j0L70j03k81N88L00
2778B18k30P3M9o92l1P14l44k71N41P68p87o76R28l2m00p2M61O9p1j27k19j1J62
2801B0k2l31L54N54m59j14O75L6j059j57P04J64l73K33M36K08n75r6k1m3Q6J81
2823D01m14Q09L67r30n68N67N81p02j23P03Q5p24K53m3q5m52M03l78N08L90k52
$$ plain form
2844 396 -513 83 591 -375 -386 439 666 55 -353 486 259 -314 -498 -162 314 62 -239 -317 14 457 -184
2865 -184 -687 -24 682 -328 -583 327 374 -411 -740 3 -142 -400 -563 -257 -163 50 -155 -693 -286 -163
2885 -163 -754 -956 44 551 -416 -572 247 -266 -786 -527 53 165 -35 -168 -348 -113 106 -237 -411 -119
2905 -119 617 -112 -536 366 368 -310 -616 327 350 123 -106 367 76 124 -77 -211 432 540 213 -114 751
2926 751 1034 -269 -476 800 667 -317 -260 747 665 333 207 320 253 273 64 0 657 1040 -15 107
2946 107 877 537 -235 -269 733 750 -160 -30 920 366 -72 -127 -79 526 345 -145 -130 644 486 -364 -748
2967 -748 337 493 -237 -701 568 757 -239 -466 186 -13 -443 -270 -80 189 -169 -507 -954 155 224
2986 224 -381 -808 331 249 -530 -524 47 -21 -746 -666 228 -46 -275 -298 -487 97 31 -713 -593 -100 228 -683
$$ packed form
2844C96r09N96N08r66j1Q25K27o11m08Q39k27n73j84L36M76k52l01p8L31M43o41
2865a84n03O63P06j010k55R10M7p85l29P43j45k58j63L06R4K13k05n38M07J23
2885a63n91k02J000N07r67j56Q19n13n20K59N80J12k00j33j80K35K19l43j74K92
2905a19P36p29m24R02Ko78l06R43K3k27k29M73k91M8k01j34O43J08l27l27Q65
2926G51K83j303k07J276j33r84N7J007q2l32j26J13o7K0k09o4O57L83j055J22
2946A07P70l40p72l4J002J7r10J30R50n54m38n5M8O05j81m90J5P74j58q50l84
2967g48J085J56p30m64J269J89r96k27O52j99m30J73J90K69l58l38m47J109O9
2986B24o05m27J139q2p79ON71o8p25Q0Q94k74k29k3j89N84o6p44J20M93L28r11
$$ plain form
3008 -683 -436 339 375 -381 -394 424 11 -497 -316 152 159 61 -213 -608 107 62 -329 11 608 342 -380 -336
3030 -336 432 138 -335 151 789 408 -47 237 -130 -31 -285 2 475 904 606 304 132 639 217 -336
3050 -336 472 800 632 152 447 859 235 60 120 37 567 619 144 116 480 904 -295 43 469 732 -47
3071 -47 -157 910 400 -248 47 410 351 35 51 78 459 244 123 -142 310 295 -391 -306 587 561 -543 -439
3093 -439 368 -169 -629 -220 187 -129 -188 -287 -71 -145 -184 -464 -478 131 193 -598 -227 520 58 -661 -569 116
3115 116 -264 -383 6 53 -145 -71 -94 -397 -62 53 -300 -401 514 -47 -770 -538 354 -175 -696 -184 233
3136 233 -89 152 280 73 -144 265 76 -306 221 481 -291 -90 286 -191 -503 23 344 201 -278 136
3156 136 412 42 85 113 -131 349 291 32 7 743 573 -95 32 359 479 167 649 827 309 90 503
$$ packed form
3008f83K47P75L6p56j3Q18m13n08J81M68Pr8k74l95P15m5l91L40N97k66p22M4
3030c36P68k94m73M86O38l81m55K84l67R9k54K87M73M29k98l02j72N07m22n53
3050c36Q08L28j68m80K95M12o24j75O0q3N30N2m75k8L64M24j199L38M26K63p79
3071d7j10J067n10o48K95L63n9l16J6K7L81k15j21k65M52j5o86Q5Q93k6j104J04
3093d39Q07n37m60M09M07l16n9r9K16p4l9k80j4O09O2p91L71P47m62p19R2O85
3115A16l80j19L89M7j98P4k3l03L35J15l53j01R15n61p23K32Q92n29n21N12M17
3136B33l22K41J28k07k17M09j89l82N27K60p72K01L76m77l12N26L21j43m79M14
3156A36K76l70M3K8k44M80n8k59k5P36j70o68J27L27J20l12M82J78n18k19M13
$$ plain form
3177 503 -41 548 298 599 294 22 381 276 180 27 201 -185 152 495 226 -262 366 213 -155 -269
3197 -269 -9 220 144 128 -4 -121 117 173 -222 -277 452 442 -489 -69 263 181 -419 -58 59 -573 -19 141
3219 141 -193 -541 -199 -278 -447 -240 -28 -99 -378 56 72 -832 -428 -4 -630 -612 -205 -191 -447 -228 -147 -395
3241 -395 -291 71 -121 -311 -151 206 -417 57 -33 -265 -541 65 352 -38 124 267 66 -13 123 78 -359
3262 -359 222 301 -88 143 490 340 -272 103 583 143 -93 292 193 -352 99 522 -136 72 341 326 -120
3283 -120 526 198 -20 -7 639 115 67 -23 634 179 85 516 230 -107 106 299 169 306 420 169 159 -132
3305 -132 227 -92 -27 142 194 118 252 396 -31 -105 71 41 -408 294 94 -181 -23 512 -28 -60 121 211
3327 211 -37 -45 0 -104 -329 162 -147 -168 -367 28 -172 -293 -188 -187 -328 -423 -42 -376 -307 -189 146 -438 -253
$$ packed form
3177E03n44N89k50L01l05k72L59j05r6j53J74l86L37L43k69m88O28j53l68j14
3197b69K60K29p6j6j32j17K38N6l95n5P29j0r31M20L32q2o00L61J17o32N54J60
3219A41l34l48L42p9j69K07K12p1k79M34J6r04M04M24o26J8M07J4k56K19Q1k48
3241c95J04L62j92j90J60L57o23M74r0k32k76O06K87l90J62J43k01p9J36m5m37
3262c59N81P9l89K31L47j50o12L75M80m40k36L85r9n45M51M23o58K08K69j5m46
3283a20O46l28k18J3O46n24m8r0O57m55r4M31k86l37K13J93j30J37J14k51j0k91
3305a32L59l19O5J69N2p6J34J44m27p4J76l0m49P02k00k75J58N35n40l2J81R0
3327B11k48qM5j04k25M91l09k1j99L95k00j21J05Jj41r5L81l34O9J18L35n84J85
$$ plain form
3350 -253 180 -336 -490 98 -387 -503 -335 206 -653 -462 -227 -315 -413 -261 -48 -194 -142 265 108 -92 -245
3371 -245 248 58 -271 278 100 -252 -146 -85 90 -147 388 235 -139 277 170 186 91 360 -8 -213 261
3392 261 219 -114 149 281 45 -251 328 431 -15 181 436 454 135 147 177 57 41 424 375 116 597 427
3414 427 -82 209 481 200 74 485 214 -247 251 254 25 149 88 436 -145 -55 60 -74 -252 9 249
3435 249 -20 238 214 8 -222 32 128 -254 -47 176 -340 -279 -87 -225 -191 -117 125 93 -577 -16 132 -468
3457 -468 -72 -132 -331 -37 238 -200 -660 -285 -12 -234 -226 -101 -277 -219 -108 130 -629 -179 -229 -38 -130 -126 -158
3480 -158 -335 -322 70 -222 -398 -84 18 -509 -195 39 -23 -382 221 294 -326 29 188 212 -164 168 -13
3501 -13 -39 -70 320 -129 -110 73 260 -287 -11 309 175 88 471 533 29 -85 320 194 -7 356 222 2
$$ packed form
3350b53M33n16j54N88m85j16J68N41q59J91K35q8r8J52K13j46N2M07j57k00j53
3371b45M93j90l29N49j78l52J06O1J75k37N35j53l74M16j07J6r5K69l68k05M74
3392B61m2l33K63J32k36k96N79J03m46J96K55J8l19J2L0j20j6L83m9k59M81j70
3414D27n09K91K72k81j26M11k71m61M98Lk29J24o1L48n81R0J15j34j78K61K40
3435B49k69K58k4k06k30K54R6l82K07K23n16O1J92j38L4P4K42l2o70N61J48o00
3457d68L96o0j99K94K75m38m60L75K73k22QJ25j76N8J11K38p59M50n0J91r2Ml2
3480a58j77J3L92k92j76L14J02n27L14K34o2l59O03P3o20L55J59K4l76L32j81
3501a3k6l1L90m49J9J83J87n47K76L20j34q7L83O2n04j14M05j26k01L63j34k20
$$ plain form
3523 2 183 271 -150 462 415 8 -260 274 446 195 193 525 363 -155 249 275 323 53 19 84 18 318 132 -272
3547 -272 148 234 -13 -180 99 17 30 -231 393 207 -137 -41 2 -20 -36 -106 -227 -99 222 -132 -381 -21 184
3570 184 -342 -411 108 83 -367 -479 -7 -310 -471 -157 -195 -391 -222 -253 -281 -124 -114 -177 -527 -1 188 -368
3592 -368 -544 122 153 -239 -98 -32 79 -319 -72 -114 8 -233 1 -472 -303 -36 -22 -635 184 351 69
3613 69 -85 394 69 103 59 323 14 -54 -67 -29 -132 121 138 -143 160 330 -10 -483 548 283 193 86
3635 86 493 334 107 292 183 403 281 213 52 549 179 209 -89 259 338 71 -178 274 288 -235 -157 527
3657 527 124 -96 -41 266 46 42 13 -15 64 260 45 -305 -45 69 -464 -36 390 94 -499 -432 16 -107
3679 -107 -388 -170 -22 284 -226 -160 -336 -115 151 -485 -275 -46 171 -410 -410 245 10 -745 -554 -42 -87
$$ packed form
3523BJ81Q8m21O12m7m07k68N34J72k51kL32j62n18M04K6M8k70l4O5o6L00j86m04
3547b72M20Q6k47j67K79q2J3k61O24j86l44R6M3k2j6p0j21J28L21l54k49L60K05
3570A84n26o9N19k5m50j12M72l03j61L14l8j96J69l1k8J57J0o3l50N26J89n56
3592c68j76O66L1l92J41O6J11l98K47m2J22k41K34m73J69K67J4o13Q19J67k82
3613F9j54M79l25L4m4K64l09o8j3L8j03K53J7k81L03J70l40m73J031k65r0j07
3635H6M07j59k27J85j09K20j22o8j61M97l70L0k98L48P9k67k49M52J4n23P8O84
3657E27m03k20N5L07k20mk9k8P9J96k15l50K60J14n33M28M26k96n93O7M48j23
3679a07k81K18J48L06n10O6j76K21K66o36K10K29K17n81%O55k35p55J91N12m5
$$ plain form
3700 -87 -96 -124 -172 -100 -25 -106 -283 199 231 -525 -285 109 52 -336 -129 474 -192 -428 69 -86 144 -181 -58
3723 -58 -89 119 225 -210 -305 -127 235 -48 109 263 225 -122 29 461 255 93 19 298 42 221 55 52
3745 52 -238 160 -50 57 400 432 -215 -52 569 106 19 61 357 238 -242 80 269 89 469 236 52
3766 52 255 181 -193 -192 488 502 -405 -81 430 -116 -168 -43 236 73 71 111 22 159 269 -277 -207 239 174 -430
3790 -430 -32 234 169 -539 -285 -202 -189 -585 69 -128 -294 52 -30 -92 -39 19 -198 -476 36 -90 -457 -359 153
3813 153 135 -357 32 -161 -383 99 -157 117 1 -139 -79 -279 -37 -161 -227 -382 1 70 -427 -544 167
3834 167 -20 -346 59 176 -123 -199 279 -389 135 186 -119 208 275 154 -303 242 219 57 -226 91 213
3855 213 -83 9 87 222 214 218 279 88 300 422 95 44 311 271 253 -64 344 111 113 244 381 22 145 376
$$ packed form
3700h7rk8m8P2P5q1j77M82L2p56K40L94n7l88K07O03o66k36M97j55K30l25J23
3723e8l1K08J06m35r5J78L62k83J57J54l8l47J51M32k06j62p4K79k56J79j66l
3745E2k90L98k10J07L43L2o47J63O21m63q7M2K96j19m80L22J89j80L80k33j84
3766E2K03p4l74JO80J4r07L24N11n46n2J25K79j63kM0q9J37J10n46P0M46o5o04
3790d30L98K66o5p08K54Q3J3l96O54j97j66L46q2o2N3N8k17k78N12j26l67R8N12
3813A53j8m92L89j93k22M82k56K74j16j40O0k00K42j24o6j55L83O9m97j17P11
3834A67j87l26M05J17k99p6M78o68N24N1l05L27O7j21m57N45k3j62k83L17J22
3855B13k96R2P8J35qMO1j91K12J22l27n1K67m0j8l17M08k33KJ31J37l59J23K31
$$ plain form
3879 376 238 -18 320 361 -35 23 173 28 -4 581 326 -189 -82 204 -132 -274 -1 379 -59 122 8
3900 8 155 -127 326 164 -492 -127 218 -169 -152 225 46 28 -30 -115 -81 -340 -161 75 -119 -33 190 -101 -23
3923 -23 -56 -345 -235 47 -49 -203 -223 -3 -113 -405 -104 -108 -97 208 -37 256 53 55 209 28 -139 -40 -172
3946 -172 -276 -26 -155 -24 114 30 -179 -497 58 -67 -15 -198 37 -104 10 -149 188 -177 34 231 28
3967 28 36 125 398 4 -253 -24 141 -119 173 150 -34 -1 119 269 -71 81 337 322 -84 168 226 93 175
3990 175 206 140 201 261 293 98 563 343 -167 -40 294 193 270 632 19 -160 47 246 -146 170 186 -84
4012 -84 -226 77 74 -57 -90 120 -23 -251 -69 -201 64 -152 185 -261 -91 -133 248 -267 -137 295 -129 -342
4034 -342 101 67 -418 -81 -432 -51 -710 -95 -227 -370 -208 53 -186 -484 -278 345 -55 -274 29 -174
$$ packed form
3879C76j38k56L38M1l96N8J50j45l2N85k55n15J07K86l36j42K73L80m38J81j14
3900HJ47k82M53j62o56L65L45l87J7L77j79j8n8q5L4k59J79K36j94Q6K23k91P8
3923b3l3k89J10K82r6j54k0K20j10k92L01mJ1L05k45K93k03KJ54j81j67R9j32
3946a72j04K50j29J31J38q4k09l18N55j25N2j83K35j41J14j59L37l65K11J97k03
3967B8QQ9K73l94k57K29J65k60K92k3j84L3J20J50l40J52K56j5m06K52N8j33Q2
3990A75L1o6O1O0L2j95M65k20n10J27L34j01P7L62o13j79K07J99l92L16J6k70
4012h4j42L03lj31l3K10j43k28J82j32K65k16L37m46J70m2L81n15J30M32m24k13
4034c42M43l4m85L37l51L81o59O15j32j43J62K61k39k98K06O23m00k19L03k03
$$ plain form
4054 -174 -72 -269 -123 -132 -136 303 -447 -159 -148 -331 -20 97 -25 -44 -65 -4 -261 -473 13 -1 -92 94 392
4077 392 207 14 83 177 -102 -40 7 247 38 425 -22 -23 -259 269 -104 46 294 32 69 167 243 181 -86
4100 -86 93 279 27 70 611 500 121 -1 318 67 28 328 50 341 36 216 121 18 183 39 113 376
4122 376 82 -343 -3 239 -38 -40 -107 -11 44 154 412 150 -133 196 -254 -196 -69 43 -234 -42 8 -138
4144 -138 77 165 -12 40 -56 -82 -96 -394 -66 22 -337 -117 239 -128 21 -243 -156 -150 -23 -242 -128 -246 -154
4167 -154 -58 -402 -68 -263 -134 -199 44 -19 -226 -244 -113 -194 -437 -296 -30 -79 48 -105 -186 -215 193 65 -54
4190 -54 61 319 -148 -107 -4 65 -150 -65 350 -196 -161 395 90 90 226 170 40 -350 292 249 -64 381 358
4213 358 136 -39 416 242 -120 226 122 158 138 383 519 -41 277 180 124 112 -64 355 -342 270 215 -266
$$ packed form
4054a74J02j97J46rmM39p50K88J1j83L11J17j22j9k1O1k57k12M86j4r1J86K98
4077C92j85j93O9R4k79O2M7K40k09L87m47jk36N28l73J50K48k62L7R8P6o2k67
4100h6J79J86k52M3N41j11l79j22L19k51l9L00k78K91l05J80r5j03J65j44P4K63
4122C76k94m25L40K42k77ko7R6N5J10K58k62k83L29m50N8J27J12k77J92N0j46
4144a38K15Q8j77N2r6k6j4k98L28Q8l59K20L56l67J49k64Q7OJ27k19J14j18R2
4167a54R6l44L34j95J29o5K43o3k07j8J31q1k43J41K66m9J27j53q1k9M08j28j19
4190e4J15K58m67M1J03O9k15Q5M15n46L5N56l05%J36n6j30l90O42m3l13M45k3
4213C58k22j75M55j74l62L46j04L6k0K45J36n60L18r7n6j2j76M19o97O12n5m81
$$ plain form
4235 -266 6 228 236 -93 332 253 127 -32 -208 -86 124 310 5 -177 69 21 14 -236 176 132 -158 223
4257 223 327 202 -40 -89 2 -8 -38 -9 -12 -106 80 -72 251 126 195 -89 -156 93 -79 -289 -270 -107 -392 -647
4281 -647 -422 71 -501 -299 -203 -388 -194 -133 -240 -112 -19 114 -412 -18 44 -105 -210 92 157 -114 16 254
4303 254 -79 -392 218 -99 -134 -147 73 47 -329 180 -117 -95 -158 290 149 -67 284 6 157 -209 107 156
4325 156 146 -118 45 -78 -36 487 -113 -122 743 202 85 261 552 340 -295 264 446 73 83 271 -328 125
4347 125 -108 -27 112 154 613 62 0 -209 75 -215 -105 218 209 -62 216 209 65 -125 -170 -76 297 126 -109
4370 -109 -126 259 106 -359 6 70 177 -322 -83 27 -116 -268 381 -371 -333 115 -68 -82 11 192 -136 -346
4392 -346 134 -3 -273 229 236 -374 -354 5 118 -93 -92 171 -65 -191 -10 76 -50 136 -100 -255 -219 -53
$$ packed form
4235b66K72K22Ql29M25p9j26j59j76J22K10J86l05j82K46m8pk50M12m4k90L81
4257B23J04j25k42m9R1j0l0K9lr4J86j52L23j25O9k84o7K49j72k10J9J63k85k55
4281f47K25M93n72K02R6j85J94O1j07J28R3J33n26L94O2j49j05L02O5k71J30K38
4303B54l33l13O10l17l5j3K20k6l76N09k97K2o3M48j41k16L51k78J51l66L16M9
4325A56j0k64J63j23M2N23o00rQ65n41j17J76K91k12o35N59J82l73J0J88n99M53
4347A25k33Q1J39M2M59n51o2k09K84k90J10L23rk71K78pj44j90m5R4L73j71k35
4370a09j7L85j53m65L65O4J07m99K39J10j43j52O49p52L8M48j83j4R3J81l28k10
4392c46M80j37k70N02Po10K0L59J13k11JK63k36j26J81Q6j26J86k36j55L6J66
$$ plain form
4414 -53 -24 -65 -58 103 -33 -412 -58 -38 -136 321 -156 183 91 71 20 -300 513 -20 -37 -287 216 174 -309 101
4438 101 343 189 -61 30 95 -21 82 -259 101 114 377 -63 356 301 57 -55 281 182 394 -17 164 67
4460 67 -13 275 394 310 194 288 214 64 454 242 148 -51 127 369 -218 -67 336 149 -173 107 -108 13
4482 13 -121 342 -85 282 -14 42 202 -2 -74 -154 -233 128 59 -170 37 143 98 -447 -124 -19 -222 -52
4504 -52 -120 36 -290 178 24 -235 -43 212 -370 -82 22 -267 -256 94 -505 -281 -361 -279 -246 -262 -125 -129 -114
4527 -114 -157 121 -235 11 -13 -301 -174 134 343 -48 -24 430 -35 -265 -112 260 -130 -40 -135 20 -12 -68
4549 -68 79 -32 -319 113 111 -239 58 126 -158 277 -288 252 165 62 130 -223 172 253 2 -18 -39 212 -71
4572 -71 22 260 88 271 283 249 -150 -31 153 31 -81 145 167 8 -101 179 -118 -90 366 52 38 -240
$$ packed form
4414e3K9m1PJ61j36l79L54K0r8M57m77L39r2k0n1l20Q13n33j7k50N03m2m83M10
4438A01K42j54k50R1O5j16J03l41L60J3K63m40M19n5k44j12L36r9K12m11J81r7
4460F7q0K88J19q4j16R4p4j50L90k12r4j99J78K42n87J51M03j87l22K80k15J21
4482A3j34M63m27L67k96N6J60k04p2q0p9L61o9k29K07J06m5n45L23J05k03J70
4504e2o8J56l26M68j54k59J92K55n82K88J04k89J1L50n99K24q0Q2L3j6J37mJ5
4527a14m3K78l56K46k4k88J27L08K09l91K4M54m65k30J53L72l90R0r5J55l2n6
4549f8J47j11k87M32kl50K97O8k84M35n65N40q7j03O8l53L95Q1k51k0k1K51k83
4572g1R3K38j72J83J2l4l99J19J84j22j12K26K2j59j09K80k97K8M56l14j4k78
$$ plain form
4594 -240 231 -159 -188 292 20 -246 68 277 -266 -439 87 52 -187 20 242 60 -71 46 -184 -420 -135
4615 -135 -186 -402 -22 164 84 -367 -1 124 110 -259 -20 -84 -362 13 -194 -109 -261 313 220 -83 -47 -2 -76
4638 -76 -281 -95 17 -247 12 147 26 -150 153 -4 -422 110 135 -366 -101 -87 -314 -24 69 70 57 -123
4660 -123 326 82 -174 163 167 43 -21 310 -83 66 -8 -146 141 111 168 112 145 250 11 -283 206 206 72
4683 72 -118 361 55 -184 192 82 26 -70 172 74 77 97 281 -43 -280 64 51 -212 213 112 -25 -169 97
4706 97 64 -86 -336 240 29 -97 24 -273 164 -110 11 -244 -49 -307 -317 -208 21 -108 -65 -328 -13
4727 -13 -200 -189 79 -112 62 70 -51 -145 -150 128 302 -98 65 -24 -41 -74 -3 -73 -19 -16 -1 -131 -193 -183 -195 -455
4753 -455 -423 138 -103 79 -11 -54 140 11 42 -163 -45 371 -61 -163 113 94 -307 127 -17 67 234 24
$$ packed form
4594b40M71l90k9M80k72k66L14K09n43j73N26l5k39K07K22j82j31J17k30k36K85
4615a35n1k16L80J86q0m51L66J25j4l69K39o4k78L75k07Q5j52N74r3l03L6M5p4
4638g6k05J86J12k64K59J35j21j76L03j57m18N32K5n01K65J4k27K90R3Jj3j80
4660a23M49k44k56L37Mj24o4L31l93J49p4j38K87l0N7n6L3J05k39k94M89%j34
4683G2j90M79l06k39L76j10n6r6K42r8LK0J84l24k37L44j3k63M25j01j37j44K66
4706I7l3j50k50N76k11j26J21k97M37k74J21k55J95k58j0J09K29j29M3k63L15
4727a3j87J1K68j91J74Qj21r4nK78J74m00J63q9j7l3P1p0N4LJ5j30o2J0j2k60
4753d55L2N61k41J82r0m3J94j29L1k05J18M16m32j02K76j9m01M34j44Q4J67k10
$$ plain form
4775 24 255 302 -110 141 67 -59 216 176 -209 5 103 69 43 -104 24 -8 204 225 103 -236 -89 364 -67
4798 -67 35 139 114 16 257 275 -92 90 68 205 160 383 245 -62 2 101 9 -92 -80 43 28 60 146 -158
4822 -158 -105 84 152 34 -31 104 -234 -147 104 355 -276 153 416 152 -116 -32 135 143 133 217 -87 -206 -128
4845 -128 89 -201 78 399 -131 -40 -32 -163 -27 108 -196 -133 -80 223 -207 110 -27 -36 -135 32 14 -34 -115 66
4869 66 -428 -190 -194 70 -308 -126 -60 -130 -134 284 -39 -303 -80 97 -115 33 -8 221 204 -309 21 -51 -294
4892 -294 52 -69 65 213 92 -151 -239 -13 76 154 -44 47 14 -149 -169 242 -148 168 67 -38 31 191
4914 191 44 192 70 260 -51 -18 154 75 95 138 657 -350 34 149 169 -93 -99 135 -19 55 414 -5
4936 -5 -252 107 348 116 100 -106 431 224 19 212 75 6 -78 184 -195 138 235 -173 -126 108 260 127
$$ packed form
4775B4K31M7m12K51p4j26K75m0l85K14R8l4k6j47J28l2K12K1j22l39J47M53m31
4798f7J02J04k5r8K41J8l67J82k2J37m5K23j38l07O4R9r2j01J2J23j5L2Q6l04
4822a58N3J89O8j18o5J35l38Q7K51K51o31M29K63k64k68Q4J67Qj0Q4l04j19P8
4845a28K17k90K79L21n30R1Qj31J36J35l04O3N3L03m30L17j37rr9J67j8m8q1J81
4869F6m94K38mK64l78J82O6p0mM18l23k64K23J77k12J48m1K29j7n13L30p2k43
4892b94L46j21J34J48j21k43q8K26Q9P8j98R1l3j63k0M11l90L16j01j05O9J60
4914A91j47J48j22J90l11L3J72p9K0M3N19j007L84J15K0k62oK34j54P4L59m19
4936ek47L59K41k32j6k06N37k07k05J93j37o9q4K62l79L33R7m08M7K34J52j33
$$ plain form
4958 127 438 97 -67 -105 122 41 -73 192 181 173 -94 -265 35 -187 -88 61 -289 -473 -74 -163 -81 0 -350
4981 -350 -224 -9 51 -62 203 36 -131 -147 -326 -40 25 -311 82 -65 -55 83 52 -54 -52 88 319 -113
5003 -113 -232 95 -68 -153 155 -94 -111 106 312 10 46 -191 -146 456 -72 230 354 -86 345 155 -76
5024 -76 175 202 260 -90 151 231 -262 43 322 177 105 181 22 -344 69 316 260 172 301 278 95 -54 375
5047 375 171 -221 196 129 18 263 -111 62 197 53 106 72 136 111 37 251 182 121 -235 239 186 -255 -285
5070 -285 24 8 -340 224 114 -158 -200 147 -80 -134 -66 48 -23 -140 63 138 -88 -287 77 -183 -42 221
5092 221 -114 -133 -6 -39 -1 48 -23 -196 -177 -130 -210 -185 -76 116 -26 -182 10 -141 -292 123 29 -102 185
5115 185 -97 33 -390 -75 91 -173 76 80 -395 -418 31 -142 -57 -176 -95 367 5 254 159 143 -118 293
$$ packed form
4958A27L11l41j64l8K27q1j14K65j1qk67j71L00k22R9J49l50j84L99q9Q2Q1l50
4981c50J26K15O0j13K65j67j67j6j79K86O5l36L93j47J0J38l1j06KJ40K31m32
5003a13j19L27j63q5L08k49j7K17K06l02L6k37M5O02n28L02J24m40M31j90k31
5024g6K51K7N8l50K41Q0m93L05K79j45p2P6j59l66M13K47n6q8J29k3j83j49M29
5047C75k04l92M17o7j11K45l74J73J35j44N3l4O4k5p4K14o9o1l56M74n3m41l0
5070b85L09j6l48N64j10k72m2L47k27n4O8J14p1j17K03P5k26j99L64k60J41K63
5092B21l35j9J27l3L8M9p1j73J9M7q0K5J09J92j42j56J92j51j51M15r4j31K87
5115A85k82J30m23L15J66k64K49Mm75k3M49j73Q5j19Q1M62l62K49r5j6k61M11
$$ plain form
5137 293 30 -123 130 70 -64 -171 365 101 -281 -19 341 129 49 -80 14 168 187 338 47 51 357 27
5159 27 -88 299 290 147 62 231 86 122 -78 99 -130 -21 227 18 -82 65 79 -69 35 147 -264 105
5181 105 -238 -29 -197 -105 -85 -206 110 179 208 8 145 20 230 283 213 -39 -182 -10 -28 -245 -300 163 -7
5204 -7 -19 -200 -312 -172 -53 -139 -126 -214 110 269 -252 -255 -71 -341 -134 56 -23 -123 -384 -99 -71 -178 -22
5227 -22 -166 48 33 113 -5 -77 300 145 -331 -129 -74 -197 -136 -251 -46 -82 311 56 -193 239 43 11 33
5250 33 27 415 67 58 205 76 -283 -31 243 189 -87 254 257 32 -24 252 105 342 344 330 102 272 6 89
5274 89 -50 225 -135 314 42 354 -286 -223 253 58 150 223 335 -296 164 41 -87 -205 59 253 -68
5295 -68 -143 -172 28 283 -42 -481 -470 -215 -109 -134 -72 -263 -33 -308 -98 31 20 -22 132 354 157 50 -210
$$ packed form
5137B93k63j53K53o0j34j07N36k64l82K62L60k12q0j29R4J54J9J51k91ML06l30
5159B7j15L87rj43q5J69j45L6k00J77k29J09K48k09j00J47J4j48J04J12m11L69
5181A05l43K09j68R2K0j21L16O9K9k00J37j25K10N3p0k52j43J72j8k17n5M63j70
5204gj2j81j12J40J19q6J3q8L24J59n21lJ84k70K07J90p9j00k61K85K8j07J56
5227b2j44K14j5Q0j18p2L77j55m76K02N5j23O1j15K05l6L93k55k49M32j96l2K2
5250C3oL88l48rJ47j29l59K52K74n4k76L41Lk25n6K76j47K37Kj4k28J70k66Q3
5274H9j39K75l60M49k72L12o40O3M76j95R2P3J12o31M60j23j28j18K64J94l21
5295f8p5k9K00K55l25m39J1K55J06k5O2j91K30k75K10J29j1m2J54K22j97j07k60
$$ plain form
5318 -210 161 -89 167 -51 -443 -115 -93 -158 157 -136 24 -203 2 356 -160 -133 -289 -130 -26 30 240
5339 240 -63 368 209 71 -270 -221 -106 -194 -36 -180 -25 -232 84 122 -206 -248 -236 28 19 15 -100 -41 -23 68
5363 68 279 -31 -298 -12 -111 13 -169 -260 12 156 -101 -167 166 233 178 63 305 540 111 89 101 -20 -22
5386 -22 -70 375 77 -120 50 -138 -34 283 -99 -7 106 498 -174 -35 -14 238 107 -18 -213 186 178 -6
5408 -6 16 292 63 202 -179 -240 368 305 -27 228 166 -191 -129 -328 -242 -98 -154 113 198 10 -49 -109 31 38 25
5433 25 -36 83 105 -385 -319 159 -148 -320 -24 339 -69 -174 -121 88 40 -151 -81 -172 -330 -117 98 -129 -370
5456 -370 192 -92 -98 167 -182 -286 -27 85 -183 -91 121 -145 63 135 145 206 -2 340 186 79 33 -158
5478 -158 54 -85 19 2 115 92 7 102 23 3 36 242 294 195 86 126 285 -29 -16 67 -70 -159 -8 224
$$ packed form
5318b10L71k50K56k18l92L28K2o5L15k93J60k27K05L54n16K7j56J59J04N6K10
5339B40l03M31j59j38l41M9J15q8J58j44J55k07L16L8l28m2J2K64rmj15N9J8R1
5363F8K11l10k67K86r9J24j82r1K72J44k57o6L33O7n5j15K42K35m29k2J2j21k
5386b2m8M45k98j97J70j88J04L17l82R2J13L92o72J39K1K52j31j25j95L99qj84
5408fK2K76k29J39l81o1O08o3l32K55o2l57O2j99Q6J44n6K67Q5j88n9o0J40Pj3
5433B5o1J19K2m90O6M78l07j72K96L63m08j05N3K09m8j91P0r1j58K13K15k27k41
5456c70N62k84oK65l49j04K59J12k68R2K12k66K08P2J0O1k08L42j54j07m6j91
5478a58K12j39J04j7J13k3q5R5p9k0L3K06N2r9j09M0J59l14J3Q3j37q9J51K32
$$ plain form
5502 224 -93 -135 -22 -122 276 221 258 -114 -110 -40 -37 28 203 269 -296 56 173 245 -78 31 -79 -372 267 12
5526 12 64 79 174 189 124 42 -42 123 -181 87 27 15 -214 127 48 23 -186 -169 -102 -176 4 -201 -246 -37 146
5551 146 -112 97 136 -346 -50 -29 61 -380 -308 155 -9 -85 -102 7 -367 -324 148 -64 -170 -11 30 64 67 31
5575 31 -84 -187 206 -130 69 -226 58 105 -69 58 118 -181 187 176 50 44 60 71 -252 102 12 -55 197
5598 197 -74 -98 -420 -255 -43 96 41 59 230 -60 201 104 -206 257 165 51 -128 -23 271 111 119 167 203
5621 203 -229 -184 165 -112 92 -69 -36 -80 -128 132 -207 4 -86 -22 402 148 -163 -22 -66 2 -90 -11 -271
5644 -271 -50 -38 -113 255 -137 -62 244 318 -84 -119 232 -49 -110 -32 230 -22 26 30 -16 -28 -16 -197 -63 -270
5668 -270 -28 -119 -190 -256 -77 323 3 38 -130 -245 -32 216 -111 210 257 70 122 -122 5 -137 30 458
$$ packed form
5502B24l17m2J13j00L98n5L7l72MP0LO5J75O6n65L52J17P2l23J09j10k93O39k55
5526A2N2J5R5J5o5q2q4J65l04K68o0j2k29L41p9k5k09J7O7p4J80k05m5K09J83
5551A46k58K09L9m82K96K1R0m41P2M63j64p6j7J09l74M3M72k12j06J59M1L4Ll6
5575C1j15j03L93l36J99k95K84M7j74J27O0k99L68j1j26oJ6J1l23L54r0o7K52
5598A97k71k4l22J65K12J39n5J8J71k90K61r7l10M63r2j14j79J05K94j60QM8L6
5621B03m32M5L49k77K04j61L3m4m8K60l39K11r0O4M24k54l11J41m4O8r2P9k60
5644b71K21J2p5L68l92P5L06P4m02l5L51k81o1P8K62k52M8Mm6j2J2j81J34k07
5668b70K42r1p1o6J79M00l20L5j68j15K13K48l27L21M7j87N2k44J27j42J67M28
$$ plain form
5690 458 -62 4 -54 -25 -278 -201 -62 -117 10 106 140 -47 116 68 -118 -55 4 -148 -326 35 61 98 -38 405
5714 405 -215 155 -139 140 215 -189 257 -217 -329 7 -40 -198 79 46 30 56 189 29 -45 220 -160 -59
5736 -59 24 381 134 189 -75 314 -47 55 -210 -60 110 38 293 -102 -35 213 109 -169 138 295 -74 192
5758 192 193 49 -227 -94 -80 53 -237 -89 272 -101 -76 79 -173 -346 13 -86 207 -1 -128 -102 -12 177
5780 177 -102 -171 -58 174 -210 4 -27 79 -36 141 264 -40 28 -249 283 14 10 -190 -195 137 150 152 172 71
5804 71 40 -228 -48 -314 149 -68 22 -216 -91 -162 -374 -79 105 -99 76 -180 -40 -124 31 78 105 -103
5826 -103 -288 -2 -39 -308 -186 50 -147 -107 132 122 -166 248 151 100 40 115 256 -16 -230 165 294 0
5848 0 116 163 -7 131 188 -245 25 90 62 43 47 -36 -344 -39 122 -163 290 -84 -5 -30 154 157 150 -70 -92 56
$$ packed form
5690D58n20O6n8K9k53P7J39n5J27R6L4j87J63m8j86O3N9j52j78L61K6L7j36M43
5714D05o20L70k94K79P5m04M46m74j12L36m7j58K77l3j6K6J33j60p4K65l80J01
5736e9Q3L57k47N5k64L89l61J02k65J50J70p2K55l95O7K48j04k78L07J57l69K66
5758A92Jj44k76J33J4J33k90J48L61l73K5J55k52j73L59r9K93k08j27K6R0J89
5780A77k79o9J13K32l84K14l1J06j15J77J23l04O8k77N32k69mk00nL32J3KK0j01
5804G1l1k68J80k66M63k17R0k38J25p1k12K95J84k04J75k56J40q4J55M7K7k08
5826a03j85K86l7k69J22K36j97M0K39j0k88M14r7n1o0P5J41k72k14L95J29k94
5848@J16M7j70J38N7m33K70O5k8j9Mq3l08L05J61k85M53l74P9k5J84Lpk20k2J48
$$ plain form
5874 56 -143 -62 -17 317 99 -42 11 -91 181 207 65 -49 -224 -94 154 -151 253 149 -200 -141 -140 47 -138
5897 -138 -141 -12 -351 -400 4 19 -10 90 88 -334 -53 -39 368 -491 226 99 62 -208 -180 208 253 -92 -214 48
5921 48 183 -92 -196 -101 -24 -26 -294 237 -43 -317 205 146 344 -143 -31 -26 -80 -92 221 -34 1 -312 -126 81
5945 81 -205 2 -163 32 93 -46 -136 -197 237 -24 -54 30 -107 -121 425 133 -220 -39 171 69 15 101 -135
5968 -135 32 42 121 91 -115 -68 98 92 155 -100 -177 -82 195 -93 -55 56 71 75 -90 -71 -76 75 -107 -36 -189 19
5994 19 303 -126 22 -14 -46 383 -137 -204 -20 -226 46 191 -5 96 -127 -41 -163 125 -217 43 -89 -289
6016 -289 -70 133 -4 54 -208 -327 81 -87 -173 -202 -4 -155 -160 -87 -101 -131 -169 -227 -136 -70 222 -60 -265 -292
6040 -292 103 -141 -9 188 -181 -42 188 -115 -300 64 171 -188 -7 11 -101 61 -204 10 101 -174 -150
$$ packed form
5874E6j99Q1M5L34k18j41N3j02K72K6j42j14j75J30K48l05M04j04l49N9JJ87j85
5897a38lJ29l39m9M04J5k9J00km22K81J4M07q59P17j27l7k70K8L88M5l45j22K62
5921D8J35k75j04R5P7kk68N31k80k74N22n9J98m87J12Nn4j2L13k55L5l13J86K07
5945H1k86K07j65J95O1j39r0o1M34k61l0Q4j37j4N46k92l53J81K10j02n4Q6k36
5968a35J67J0P9l0k06M7J66oO3k55p7R5K77k88L8J11J5Mj65J9nJ51j82P1j53K08
5994A9K84m29J48l6l2M29n20o7J84k06K72J45j96J01k23Q6j22K88l42K60j32k00
6016b89K19K03j37N8k62j19M08j68q6k9J98j51nP3j4l0l8n8R1O6K92k82k05k7
6040b92L95k44J32J97l69J39K30l03j85L64J07l59J81J8j12J62k65K14R1k75K4
$$ plain form
6061 -150 -44 -201 -162 -72 -73 43 30 53 136 -119 -59 -80 -205 -94 -230 88 -292 174 -170 5 201 -319 -1
6084 -1 114 85 -133 -222 455 -76 213 186 154 61 -137 60 45 -43 140 -43 43 169 -35 -34 -34 -141 -77 54 114
6109 114 -284 -101 -211 -27 -10 -60 -48 -13 -280 -172 -441 -246 24 -110 -112 -136 -70 79 -142 103 -91 98 -179
6132 -179 -193 -51 -183 295 150 -203 -114 239 -220 -57 -85 165 -131 -316 66 9 -98 -125 185 145 -110 210
6154 210 -89 57 -20 -12 44 -114 -232 184 -133 78 -56 -54 116 33 -37 -163 55 -174 25 7 27 -65 175 204
6178 204 -4 -196 -180 -154 21 290 30 -99 40 230 498 203 158 -102 204 23 -100 -62 -185 30 -143
6199 -143 -4 -96 11 164 287 -67 -105 -106 290 -140 -57 263 163 62 -50 -18 81 -179 -174 -125 59 51 192 -113
6223 -113 141 57 -177 -84 -127 71 -239 232 -165 241 303 -59 73 -229 88 35 -210 195 60 144 -206 -176
$$ packed form
6061a50J06j57L9R0jJ16j3K3Q3k55O0k1j25J11j36L18l80M66l44J75J96n20L18
6084aJ15k9k18q9O77n31K89k7l2r3j98J97j5q8J83j83Q6J26k04J%j07O4J31O0
6109A14l98J83j10J84J7n0J2L5k67J08k69J95K70j34kk4O6J49k21K45j94J89k77
6132a79j4J42j32M78j45l53Q9L53m59J63k8K50k96j85L82n7j07k7L10m0k55L20
6154B10k99J46p7QN6j58j18M16l17K11j34KJ70q3p0j26K18k29J99j8K0r2K40K9
6178B04k08j92J6K6J75K69k60j29J39J90K68k95m5k60L06j81j23L8j23K15j73
6199a43J39r2J07J53J23l54l8jL96m30Q3L20j00j01j12L2R9k60NM9J84qJ41l05
6223a13K54q4k34R3m3J98l10M71l97M06O2l62J32l02L17n3k45M05j35Q4l50L0
$$ plain form
6245 -176 133 40 -42 -199 6 -74 225 -81 -181 -21 -366 48 328 -20 143 -363 218 252 -164 -231 0 -145
6267 -145 30 -161 116 -279 -166 83 -106 -274 27 -67 122 20 137 79 160 -19 75 80 -4 -127 28 -32 -56
6290 -56 -290 150 -175 -22 163 -86 102 -90 39 -18 235 -67 225 108 106 -5 26 308 171 -98 -179 163
6312 163 8 -237 98 -34 -32 -70 -52 124 -3 220 44 78 220 186 -105 185 79 -115 -90 131 181 -90 116
6335 116 -263 119 -128 -26 -39 -10 91 -26 158 -21 109 132 -70 92 -113 55 -22 203 -80 -168 47 -178
6357 -178 70 -238 112 114 124 -121 130 107 -87 15 152 139 237 -110 255 -56 91 65 -21 36 -126 247 1
6380 1 284 -245 64 -65 377 182 21 74 161 -199 311 -67 -11 59 56 221 -292 -148 -263 -29 -121 94 -147
6403 -147 -113 -34 150 104 -133 -143 202 11 -197 161 -233 52 -109 68 -152 170 155 -83 20 128 300 -191
$$ packed form
6245a76L09r3q2j57K05q0K99l06j00J60l45M14K80l48J63n06N81L4m16o7K31j45
6267a45J75j91K77l95J13K49j89j68L01r4J89j02J17n8Q1j79R4Nq4j23J55o0k4
6290e6k34M40l25J53J85k49J88j92J29n7K53l02K92j17kj11L1K82j37k69q1L42
6312A63j55k45L35j32Kl8J8J76j27K23j76L4J42l4k91K90j06j94K5K21N0k71K06
6335A16l79L82k47J02j3K9J01j17J84j79J30K3k02J62k05J68p7K25k83q8K15k25
6357a78K48l08L50KJ0k45K51k3j94J02J37j3R8l47L65l11J47k6q6N7j62L73k46
6380AK83n29L09j29M42j95j61N3Q7l60N10l78N6P0lJ65n13J44j15K34r2K15k41
6403a47L4P9J84m6k37j0L45j91k08L58l94K85j61J77k20L22j5k38J03J08J72m91
$$ plain form
6425 -191 -22 -239 -233 -164 -97 97 2 127 179 -8 -14 -71 83 -32 106 69 -215 -218 160 -143 -202 371 89 -161
6449 -161 42 -214 -95 -52 -131 -113 75 134 123 -12 -23 44 -243 -3 6 326 -7 35 17 -83 -112 364 -30 -73
6473 -73 -69 -227 -24 57 -42 -46 30 119 -103 -134 249 21 -667 -71 23 -117 93 -143 61 56 -241 -178 -70 -3 -86
6498 -86 75 29 100 -215 -151 350 -405 -107 127 -38 -142 -124 -29 -204 -86 -222 -34 -23 44 170 -74 -42 14
6521 14 -91 -155 -239 -93 122 68 -287 76 210 229 -72 326 76 94 -183 230 -84 -65 -185 80 103 -128 0
6544 0 -379 65 -28 59 200 -56 108 87 -45 183 -39 -132 97 318 192 14 -67 -237 -148 -103 -333 256 -247
6567 -247 -88 172 221 63 -73 40 150 203 164 -318 -165 241 145 35 -17 216 293 -74 265 -118 -289 126
6589 126 -218 191 -3 23 -162 10 93 353 55 -75 6 -238 374 65 -20 44 -41 27 117 179 175 -71 -38 -31 34
$$ packed form
6425a91J69k17OO9O7J94r5J25N2j87on7J54j15J38l7k84lL78l03n9N73k82k50
6449a61K03k56J19M3p9J8J88N9j1j35j1O7k87K40RL20l33M2j8j00k9M76l94m3
6473g3Mj58K03Q1r9mP6Q9k22l1L83k28o88N96R4j40K10k36K04nk97O3J08O7q3
6498h6J61m6P1l15O4N01p55K98K34j65j04J8R5j75J18j36J88J1O7J26k44L2N6
6521A4j05o4q4J46K15n4l55L63J34J9l01L98k50J8k77M13l14J9j20K65K3k31J28
6544@l79M44r3Q7J41k56J64k1j32K28k22r3K29K21j26j78q1j70Q9M5k30N89n03
6567b47J59K60M9j58j36J13J10N3l9m82J53M06r6j10n2K33P7l67L39l83j71M15
6589A26l44M09j94K6j85J72Q3K60k98j30Q1k44O12l09q5O4q5O8R0O2mk46L3PO5
$$ plain form
6614 34 -6 132 -9 106 -88 52 171 38 195 199 20 252 -160 -50 -142 -52 -109 191 35 -121 62 162
6636 162 -43 8 -30 -212 -133 -229 -6 210 212 216 149 24 220 6 -165 -57 -75 314 155 -162 -114 208 -71 318
6660 318 -102 -127 -118 -120 -20 20 -93 -84 -14 -307 -392 -124 158 45 -105 89 49 -50 169 -94 4 -35 45 239 -74
6685 -74 -118 97 3 296 194 -15 -112 144 307 196 -41 166 -88 -169 -149 53 26 -228 100 -188 -105 66 -114
6708 -114 -49 -274 -206 80 129 -42 30 -51 -281 -118 -396 -33 222 -267 -382 -211 145 -35 -149 -242 -206 -44
6730 -44 -125 0 -172 186 75 202 -48 -189 -190 51 107 -75 -18 -134 18 -163 -306 -259 27 -253 -70 146
6752 146 -296 86 -279 -88 -85 -124 -218 45 181 13 127 173 -27 -239 95 -92 215 -143 -47 -52 345 -65 55
6775 55 245 189 -70 149 -55 108 158 -32 49 67 -179 -141 235 38 0 -75 199 82 -29 90 25 -70 -137 56
$$ packed form
6614C4m0J38j41J15j94J40J19j33J57Mj79K32m12J10r2R0n7L00j56j56J83J00
6636A62k05N1l8j82P9r6K23K16KMo7j25J96k14j71J08j8L89j59l17M8L22k79L89
6660C18m20k5RkJ00M0j13RP0k93q5K68K82j13j50J94m0r9K19k63R8l9Q0J94l13
6685g4m4K15r4K93j02k09r7K56J63j11k37K07k54q1K0K02k7k54L28k88Q3J71j80
6708a14O5k25O8K86M9j71P2q1k30J63k78L63K55m89j15J71L56j80j14r3L6J62
6730d4q1J25j72L58j11J27k50j41jK41N6j82N7j16J52j81j43M7K86k80J83K16
6752A46m42L82l65J91Ll9r4K63J36j68J14M6k00k12L34j87L07l58R6nL97m10J20
6775E5J90n6k59K19k04J63N0j90Q1J8k46L8L76j97l8p5K74j17j11J19o5r5o7J93
$$ plain form
6799 56 -98 246 94 -140 -79 9 191 68 -3 -50 -128 -195 455 60 -113 174 106 -66 -125 36 -172 2 51
6822 51 -193 -228 319 207 94 22 -133 -6 -96 243 265 -178 210 -11 47 -300 -211 -79 -9 32 -22 -87 35 -95
6846 -95 -8 -44 340 -32 -181 123 39 344 86 396 5 -381 -57 213 14 40 -242 -182 246 -19 97 -164
6868 -164 -117 -75 -34 -274 -116 135 -60 228 152 -215 9 -113 -24 220 -150 -256 59 95 18 -287 -72 -171 11
6891 11 -91 381 -252 -48 -54 8 224 202 312 192 198 92 -178 129 5 82 -143 147 185 134 65 194 -41 -34
6915 -34 10 10 -120 -30 44 42 -34 18 -82 79 -282 -210 -78 -120 -72 -43 -310 38 -23 -151 -240 144 -186 -124 52 -118
6941 -118 -163 -188 -117 -157 -38 126 3 -149 -303 -194 -9 -31 -135 260 32 131 -12 -124 -206 -39 -67 131 475
6964 475 -241 -31 -84 -85 -34 139 -79 51 74 17 -96 -32 -143 -45 -92 -27 87 -21 90 -224 81 184 35
$$ packed form
6799E6j54L44j52k34O1Q8J82j23p1m7p8o7O50l95j73K87o8j72n9J61k08J74M9
6822E1k44l5N47j12j13p2j55J27r0L39K2m43L88k21N8l47Q9J32P0M1n4o5J22j30
6846i5Q7l6L84l72j49L04q4L05k58L10l91l86L24K70j99K6k82O0M28k65J16k61
6868a64M7M2M1k40J58K51j95K88p6l67K24j22Q9K44l70j06L15L6p7l05K15r9J82
6891A1j02M72o33K04oO2K16k2J10j20Oj06k70L07j24P7k25K90L8n1o9J29k35P
6915c4M4%j30R0P4kp6N2j00J61l61P2J32m2M8K9k67L48o1j28q9L84l30O2J76j70
6941a18m5k5P1m0J19J64j23j52j54J09J85k2j04L95k28R9j43j12q2J67k8J98L44
6964D75p16K10n3jN1J73k18J30K3n7j13O4j11R8m7O5J14j08J11l14L05J03j49
$$ plain form
6987 35 157 125 -280 -225 196 111 238 279 -10 -11 -117 -115 17 -181 -85 199 149 22 -163 69 -220 17 273 3
7011 3 37 371 -119 -119 11 -9 123 -43 433 -128 -107 -215 -56 205 -47 -24 -110 -42 -65 238 171 -289 134 38
7035 38 51 -75 0 24 -47 39 70 17 5 -142 133 -351 182 159 -211 163 95 -218 181 -141 -198 28 446 -8
7059 -8 83 51 208 142 115 -293 -120 116 -246 212 -70 -85 99 -287 103 -123 205 26 118 -23 -224 -19 51
7082 51 -205 13 -57 -13 64 -102 22 -409 94 252 -208 395 -100 145 -140 -49 295 -228 -35 -156 -180 14
7104 14 24 53 139 -74 -184 305 -29 -136 22 -227 78 -122 55 65 -50 -43 -370 25 139 41 19 -3 28 129
7128 129 -73 -100 50 71 -40 -191 -67 -13 102 -68 -1 -33 79 -21 64 286 -125 215 223 124 -210 132 35
7151 35 46 52 155 180 -145 -33 141 169 -175 -26 262 407 93 -119 125 96 385 -109 127 -61 -138 67 -17
$$ packed form
6987C5J22l2m05N5M21q5J27M1k89jj06KJ32j98R6K84n0j27j85K32k89K37K56k70
7011CL4L34m90%J30k0J32j66M76n61K1j08J59K61k52K3q6O8k3L03o7m60M23r6
7035C8J3j26P5K4p1Q6L1n3j2j47K75m84N33k3l70L74o8l13L99l22n7K26M18m54
7059hR1l2J57o6k7m08J73K36l62M58k82j5J84l86L90k26L28j79R2j41k01K05P0
7082E1k56K18p0M4P7j66J24m31N03J58m60O03m95K45k85R1L44n23J93j21k4J94
7104A4J0K9Q6k13j10M89l34j07J58k49L05k00J77J0j15Pl27L95J14r8k2k2L1J01
7128A29k02k7J50K1j11j51J24N4J15j70O7l2J12j00Q5K22m11L40Qr9l34L42r7
7151C5J1OJ03K5l25J12J74K8l44J49K88J45l14k12K44k9K89m94K36j88p7K05q4
$$ plain form
7174 -17 185 -16 107 183 -86 -178 218 258 -191 -133 105 -124 199 -48 -419 55 42 -98 -67 -108 -216 -113 -16
7197 -16 -47 255 -24 163 -18 -139 -68 195 44 -102 45 76 -405 -93 4 -134 96 468 281 -62 -83 159
7219 159 -65 162 -98 -324 198 -43 71 -187 -7 -15 162 159 -22 -8 -104 -221 -429 -253 97 -111 121 -6
7241 -6 62 -195 -91 -38 37 -37 66 -121 -182 109 -197 -31 21 66 78 64 -158 38 147 -1 -259 190 149 -242
7265 -242 -316 352 157 -47 270 123 -84 -41 -128 -153 419 224 292 -212 96 13 177 91 41 56 329 -170 -9
7288 -9 184 182 -124 79 156 -115 -104 11 -128 -104 343 76 124 -200 64 -337 11 -90 -14 -72 80 190 7
7311 7 -54 177 -276 -201 -116 -260 117 -101 50 -108 -90 -278 29 -98 -86 106 -152 46 318 9 222 169 -70
7334 -70 -107 -258 -9 65 -136 21 220 191 -300 96 -46 228 -61 -93 -88 63 -44 -30 -61 106 83 -340 153
$$ packed form
7174a7K02k01J23P6k69r2L96M0m49N8K38k29L23k47l71M74j3j40L1m1j08J03R7
7197a6l1L02k79J87j81j21P1K63j51j46J47L1m81L12R7j38K30L72j87l43k1K42
7219A59k24K27k60k26N22k41J14k58J80qJ77lj81J4r6j17k08J76L50k08K32j27
7241fO8k57J04N3P5p4J03j87o1K91l06J66N2M5J2j4k22J96J09j48k58M49m1l91
7265b42p4O68j95k04L17j47k07M3q7k5N72j95O8n04L08q3J64q6n0J5K73m99J61
7288iJ93kl06K03P7k71J1J15j39K4M47k67M8l24K64m01L48j01P6n8J52J10j83
7311Go1K31m53P5Q5j44L77k18J51j58J8j88L07j27J2J92k58J98K72l09K13n3k39
7334g0l7j51K49P4k01J57J99k9m91L96j42K74k89l2NJ51j07J4l1J67k3m23M93
$$ plain form
7357 153 224 35 104 149 -25 -77 -141 -71 -186 128 94 74 -176 220 -25 -84 49 -43 -98 230 -91 -67 9 91 -257
7382 -257 -50 -157 61 191 -196 80 -13 96 254 -89 -91 -76 -116 -149 -79 14 6 145 -83 152 36 11 140 116
7406 116 -70 88 40 -84 -161 -26 24 -106 -146 -20 -233 -105 13 -220 -94 1 -172 89 -209 47 -32 -30 73
7429 73 -249 -135 -120 -231 -275 265 216 15 -4 -179 121 26 -83 -232 -83 153 -259 163 -181 101 166 -39
7451 -39 -162 -26 47 224 150 56 173 210 -79 242 48 -211 -209 -21 88 -19 -92 259 -241 -168 -307 -86 -203
7474 -203 297 298 6 142 37 202 -36 286 31 339 -73 160 -108 -71 15 -88 240 12 -118 -5 -64 -155
7496 -155 -23 109 89 -127 145 -73 41 44 299 -38 -288 -368 84 64 82 -3 50 103 69 27 313 -132 -160 380
7520 380 -133 3 -225 -26 113 88 178 22 237 7 19 -3 -276 19 -71 172 174 12 -81 -331 -171 -91 -107
$$ packed form
7357A53P1j89O9M5j74n2o4P0j15L14l4k0k50L96k45n9J33r2n5L28l21K4P6Q2l48
7382b57K07j07K18J30l87K76r3J09J58l43kJ5m0l3P0R3qJ39k28K35j16k5J29k4
7406A16j86J58m8j24p7J35N0j30m0J26k13J28J18k33J26R5j73K61k98K56p9KJ03
7429G3l22J14J5j11m4N40m9k01j9j75L00r5j09j49J49K36m12M22l44K82O5k05
7451c9j23J36P3J77p4r4J17L7k89L21j94k59KJ88J09j07p3L51n00P3j39K21j17
7474b03N00Jk92J36j05J65k38L22k55L08m12K33k68L7Q6j03L28k28j30J13n9r1
7496a55J32J32k0k16K72k18J14LK55l37k50q0M52k0J8q5N3N3l4m2K86m45k8N40
7520C80n13J36k28J99J39k5R0j56K15k30J2k2k73K95r0K43Kj62r3k50J60Q0j6
$$ plain form
7543 -107 265 106 290 242 185 -341 -255 -140 -345 -12 -67 -40 -80 160 -73 75 -98 72 39 88 -405 -340 198
7566 198 122 -127 7 -68 44 168 -45 -38 -223 -11 113 65 -158 -112 -43 12 -134 -3 -30 -260 59 -125 -263
7589 -263 -149 73 69 -153 -65 51 43 -151 -12 -47 -130 -149 89 -177 -307 59 210 -5 -96 -46 72 310 83
7612 83 195 204 54 218 17 -33 297 125 7 -114 54 -23 175 106 -254 263 -179 -44 107 -171 -99 190
7634 190 -77 -105 105 -235 0 130 -68 -190 181 -66 -215 -168 157 217 78 179 124 126 122 118 -38 227 -137
7657 -137 45 -116 -89 91 -71 50 -152 -120 -66 261 -31 89 303 202 -142 -221 -12 83 14 148 -119 -189
7679 -189 45 -47 -66 -353 50 -139 -116 147 204 203 -24 322 169 170 -387 256 18 213 41 160 -62 34 -45
7702 -45 117 -165 -78 107 -93 21 -227 -87 -62 35 19 -11 105 82 52 173 38 126 -190 -18 252 177 117 46
$$ packed form
7543a07L72j59J84m8n7n26Q6J15k05L33n5K7m0K40k33J48j73J70l3M9m93O5N38
7566A98p6k49J34p5J12J24k13Pj85K12J24m8k23M6O9N5j46J31k7k30L19j84j38
7589b63J14K22mk22Q8J16qj94J39l5q3j9K38k66j30L66J51k15r1N0J18K38k27
7612H3J12Rj50J64k01n0L30j72j18j21J68p7J98o9l60N17m42J35J51k78P2K89
7634A90k67k8K10l40K35J30j98j22L71k47j49M7L25O0j39J01n5Kmmj56K65l64
7657a37J82j61K7J80j62J21k02L2N4L27k92J20K14j01l44p9K09R5o9J34k67p0
7679a89K34r2j9k87M03j89K3K63N7jk27L46j53Jn57O43k38J95j72J19k22R6p9
7702d5J62k82Q7J85k00J14k48J40K5R7j6l0J16k3l0J21j35Q8l16J72K70p5o0p1
$$ plain form
7726 46 187 81 261 -42 -35 391 13 116 363 548 92 -47 40 149 -55 159 -51 -89 -147 -135 -83 -188 -53
7749 -53 142 53 116 252 -53 252 33 -112 224 -2 235 -90 -174 137 -63 -21 34 20 -102 7 -179 -107 37
7772 37 49 187 124 -60 27 43 -63 -236 -175 -195 233 111 -172 57 -41 -207 -104 131 -108 -19 -172 -225 125
7795 125 -53 267 -7 227 43 72 106 -123 -156 -105 160 23 193 -48 -58 -36 -19 -330 418 156 7 91 108
7818 108 330 -180 62 53 275 118 -89 -79 74 106 -156 7 63 -156 25 201 164 -6 -176 -10 -37 63
7840 63 176 -10 119 2 -189 -88 -43 -101 -8 108 -9 -30 81 -135 136 116 -73 241 -84 0 317 195
7862 195 160 -93 -346 181 -183 -267 -237 86 94 73 63 -97 11 238 227 6 -21 167 -116 -149 -127 -84 14 -26 -213
7887 -213 -230 -46 41 -8 -226 -14 -241 -87 -65 80 99 -131 -214 72 -41 -62 4 73 -14 208 -125 -133 119 -235
$$ packed form
7726D6J41j06J80l03PM26l78J03K47J85m56j39Q7J09k04K14k10l8n8J2N2j05J35
7749e3J95q9O3J36l05L05k19j45L36k26K37l25q4L11k00M2N5j4j22J09j86P2J44
7772C7J2J38o3j84Q7J6j06j73O1k0M28j22k83K29r8j66J03K35k39Q9j53n3L50
7795A25j78L20k74K34j84K9L4k29l3N1K65j37J70k41j0K2J7l11P48k62j49Q4J7
7818A08K22n10K42rK22j57k07J0J53L2k62J63N6k19J81J76l7j70j70J66k7J00
7840F3J13j86J29j17j91J01M5n8R3J16j17k1J11k16K71k0j89L14l25Q4L17j22
7862A95l5k53k53N27l64q4L0L23Qk1j0j60J08K27j1k21k7J88k83l3K2M3R8m0j87
7887b13j7J84Q7m9k18K12k27J54K2J45J9k30q3K86j13k1O6O9q7K22l33qK52l54
$$ plain form
7911 -235 152 -407 20 115 -78 -249 -179 -4 3 -201 -57 -95 48 -39 -195 -30 -178 4 -134 124 34 -11 -168
7934 -168 65 86 -153 -441 249 178 -133 15 55 -148 17 -34 27 -37 -61 -5 252 172 -92 153 67 67 111 199 50
7959 50 93 5 98 -194 -171 -22 -140 79 -140 106 5 -210 258 75 -30 12 -42 144 308 -277 130 88 -71
7982 -71 260 -19 -117 -147 120 64 -41 180 -14 42 23 -103 140 -284 -64 -203 -88 8 246 11 112 -149
8004 -149 148 -94 -39 -212 111 -49 -156 -209 -167 24 103 -85 -84 -239 39 343 -85 -87 -20 7 -88 -12 -132 83
8028 83 260 -1 -125 -147 -96 21 -101 -86 257 226 44 197 185 154 -215 -218 153 105 -244 -6 22 60 208 -35
8052 -35 -84 -181 8 138 -161 17 -292 -24 -162 157 54 -217 64 231 -155 28 -76 58 -112 -70 -408
8073 -408 -164 87 -85 -52 73 40 134 -27 47 -251 -23 31 -26 199 145 161 -76 175 37 -18 -375 45 -158
$$ packed form
7911b35L87n59M27R5j93j71P0J75Pk04J44l8J43q7j56J65j48J82j38K58r0m5j57
7934a68K33K1k39k88O90p1l11J48M0k03J65n1O1o4k4N6K57q0k64K45q6%M4Q8j49
7959E0M3q8R3k92K3J49j18K19k19K46j01k15M68j83j05M2n4J86J64n85M07m2j59
7982g1L31k79r8l0K67n6j05K21j94N6j9j26K43m24K20j39J15R6K38k35J01k61
8004a49K97k42N5j73L23j60j07n3M2J91P9j88Jj55K78L04m28kO7K7r5P6j20K15
8028H3J77k61j24k2N1J17j22J5L43l1j82J53j2l1l69lL71m8l49K38K8L8J48k43
8052c5m9r7J89J30k99J78l09K68j38L19j03k71K81J67l86J83j04J34j70M2l38
8073d08K44K51j72L3J25l3R4j61P4k98K28N4n7K25n4J6k37K51j38n5l57M20k03
$$ plain form
8096 -158 10 -38 -173 -33 -84 -324 -153 -60 -91 293 44 227 -65 69 -17 -264 -73 -118 -150 225 188 -289 -164
8119 -164 158 62 -8 -38 45 -318 -27 -12 -26 -257 -129 66 352 -138 94 -181 208 -125 -79 -134 130 18 55
8142 55 -257 -49 238 11 123 -69 212 -253 -18 -99 82 -100 94 -246 199 177 -168 61 -174 165 -320
8163 -320 54 73 -219 -278 224 342 -8 279 261 -95 -251 276 -50 -135 -104 -299 -26 227 2 15 134 -115
8185 -115 77 68 17 68 98 -82
$$ packed form
8096a58J68m8j35J40n1k40J71R3l1L84k49J83k92J34q6k47J91m5l2L75l7m77J25
8119a64L22r6p0l0Q3l63K91J5j4k31J28J95K86m90K32k75L89l33M6n5K64j12L7
8142E5l12K08K87k27J12j92K81m65K35q1J81j82J94l40M45k2l45K29k35L39m85
8163c20L74J9k92n9N02J18l50K87j8l56j56N27l26q5L1j95K73K53k25J3J19k49
8185a15J92rn1N1L0j80
8191h2
$$ Imaginary data points
##PAGE= N=2
##DATA TABLE= (X++(I..I)), XYDATA
$$ plain form
0 0 0 0 0 0 0 0 0 0 -8 8 -8 8 -8 16 -16 16 -24 24 -32 40 -43 48 -56 67 -80 88 -101 115 -131 147 -165 187
32 187 -211 235 -261 291 -325 360 -399 442 -490 542 -601 665 -737 817 -907 1012 -1130 1267
50 1267 -1431 1627 -1868 2169 -2565 3106 -3899 5168 -7542 13565 -62795 -87014 14687 -12882
64 -12882 -48623 -33125 15342 -16486 -69889 -68674 -10978 8152 -11721 -17533 15356 17608 -23613
77 -23613 -46635 -10053 17836 -1933 -19353 6925 20875 -8013 -32168 -16113 1514 -4519
89 -4519 -14002 -8826 -4102 -9290 -18152 -17646 -8274 -6474 -19640 -25284 -12914 -7351 -20728 -23510 -4722
104 -4722 1366 -17677 -32610 -27159 -16310 -13812 -12842 -5592 4217 3659 -15178 -30363 -19892 -3453
118 -3453 -5631 -4232 20530 32355 4373 -23310 -13634 3480 -1964 -7335 11167 32274 23983
$$ packed form
0@%%%%%%%%qJ6j6J6j6K4l2L2m0M8n6P2q3R1j04J23j47J68j89K16k46K78l12L52
32A87l98M46m96N52o16O85p59Q41r32J032j143J266j402J554j724J919k142K397
50A267k698L058l495M037m734N671p005R067j2710K1107p6360k4219J01701k7569
64a2882l5741J5498M8467l1828n3403J215N7696J9130j9873n812L2889K252m1221
77b3613k3022L6582K7889j9769j7420K6278J3950k8888k4155J6055J7627o033
89d519r483N176M724n188q862N06R372J800j3166n644J2370N563j3377k782J8788
104d722O088j9043j4933N451J0849K498R70P250R809n58j8837j5185J0471J6439
118c453k178J399K4762J1825k7982k7683R676J7114n444n371J8502K1107q291
$$ plain form
131 23983 -5787 -22471 -11527 -221 -8201 -11000 11032 23151 -1008 -24845 -15601 -4239 -17127
144 -17127 -23351 -2422 13161 -525 -20011 -20995 -10245 -9585 -20104 -21817 -5572 5107 -9096
157 -9096 -24955 -14647 -896 -11861 -24655 -11846 3195 -5165 -16428 -7575 5946 3163 -10155
170 -10155 -14440 -3310 4546 -5012 -12183 4150 19950 5957 -16168 -11463 275 -9773 -19816
183 -19816 -4102 12932 4366 -12068 -14429 -11360 -18841 -27524 -20317 -455 7100 -6579 -18725
196 -18725 -12258 -9486 -24797 -29249 -6607 9990 -778 -10287 -2213 -1882 -16659 -20125 -5059 6005
210 6005 4314 401 2899 5574 -616 -11363 -9879 4587 10637 1546 -519 9752 8900 -5976
224 -5976 -9180 1259 3894 -2810 -2610 3871 5325 920 -4993 -6686 -3852 -2358 -8316 -10414 -37
$$ packed form
131B3983k9770j6684J0944J1306p980k799K2032J2119k4159k3837R244J1362j2888
144a7127o224K0929J5583j3686j9486r84J0750O60j0519j713J6245J0679j4203
157i096j5859J0308J3751j0965j2794J2809J5041q360j1263Q853J3521k783j3318
170a0155m285J1130P856r558p171J6333J5800j3993k2125M705J1738j0048j0043
183a9816J5714J7034q566j6434k361L069p481q683P207J9862P555j3679j2146
196a8725O467K772j5311m452K2642J6597j0768r509Q074L31j4777l466J5066J1064
210F005j691l913K498K675o190j0747J484J4466O050r091k065J0271q52j4876
224e976l204J0439K635o704K00O481J454m405n913j693K834J494n958k098J0377
$$ plain form
239 -37 6970 -1368 -8646 -3282 -1883 -10715 -14125 -5183 2055 2464 1470 187 -1201 -4038 -9255 -11064
255 -11064 -2091 7301 4841 791 6161 6205 -6603 -12668 -3042 4474 2189 2526 6821 5214 -2325
270 -2325 -8279 -10030 -6470 -2103 -1157 -1700 1113 708 -8684 -14654 -10132 -7166 -10218 -7416 328 306
286 306 -6516 -8158 -7560 -9618 -10135 -6722 -3815 -1065 1526 -957 -5935 -5339 -4336 -8567 -9257 -1879
302 -1879 2050 -783 -2121 -133 -2610 -7622 -7926 -5898 -3768 437 2738 715 261 947 -3955 -9262
318 -9262 -4913 1093 -298 211 5488 5192 -2842 -5923 -3985 -3964 -4000 -193 2935 3633 3198 -581 -5569
335 -5569 -4658 -1172 -2345 -1891 5830 8546 2885 -691 729 -707 -4591 -1066 4247 4956 5157 5824
351 5824 2899 -1352 -1475 -2134 -2413 1657 6255 5437 3521 4974 2790 -2699 -2788 1756 2700 3223 7411
$$ packed form
239c7P007q338p278N364J399q832l410Q942P238M09r94j283j388k837n217j809
255a1064Q973R392k460m050N370M4j2808o065R626P516k285L37M295j607p539
270b325n954j751L560M367R46n43K813m05r392n970M522K966l052K802P744k2
286C06o822j642N98k058n17L413K907K750K591k483m978N96J003m231o90P378
302a879L929k833j338J988k477n012l04K028K130M205K301k023m54O86m902n307
318i262M349O006j391N09N277k96q034l081J938K1l6L807L128O98m35l779m988
335e569R11L486j173M54P721K716n661l576J420j436l884L525N313P09K01O67
351E824k925m251j23o59k79M070M598q18j916J453k184n489q9M544R44N23M188
$$ plain form
368 7411 7699 3558 1070 -144 -2531 -3761 712 2779 1824 2701 2912 -2029 -6267 -5042 -4850 -5297 -1665
385 -1665 2611 1133 -452 -358 -3069 -6535 -4648 -994 -453 1341 4662 3268 -1635 -2617 -3171 -5927
401 -5927 -5195 -405 1062 -459 91 -758 -5852 -8478 -6926 -6409 -5577 -1059 1436 -1250 -2852 -2631 -5295
418 -5295 -8232 -4359 -710 -207 1392 3573 1085 -3061 -3361 -3680 -5557 -3172 1621 1830 -20 605
434 605 -772 -5690 -6518 -4056 -3838 -2398 2217 3124 146 -1500 -1382 -4278 -4921 -1482 1562 1617 3690
451 3690 4653 740 -2392 -1164 -1299 -2287 1320 5411 4166 3196 4320 1958 -2096 -1230 2041 2436 3807
468 3807 7408 6912 3544 2408 1316 -932 -424 2954 3739 3453 5395 4602 -599 -2984 -1081 -1931 -2532
485 -2532 1372 4054 2726 837 1345 -1413 -4033 -2124 246 859 3203 5654 3431 929 1011 -357
$$ packed form
368G411K88m141k488j214k387j230M473K067r55Q77K11m941m238J225J92m47L632
385a665M276j478j585R4k711l466J887L654N41J794L321j394m903r82n54k756
401e927P32M790J467j521N50q49n094k626J552N17Q32M518K495k686j602K21k664
418e295k937L873L649N03J599K181k488m146l00l19j877K385M793K09j850O25
434F05j377m918q28K462K18J440M615R07k978j646J18k896o43L439L044N5K073
451C690R63l913l132J228j35r88L607M091j245r70J124k362m054Q66L271L95J371
468C807L601m96l368j136j092k248N08L378P85k86J942p93n201k385J903q50o01
485b532L904K682j328j889N08k758k620J909K370O13K344K451k223k502Q2j368
$$ plain form
501 -357 -3319 -893 3620 3631 2247 3902 2893 -1771 -3484 -2311 -2086 -636 2397 2289 465 534 -522
518 -522 -4252 -5458 -1254 446 -948 735 2786 -39 -4120 -3760 -3387 -4009 -2444 114 79 176 377
535 377 -3003 -5256 -3109 -2196 -4200 -2268 2818 2374 -1753 -1678 162 -2364 -4078 -1090 1406 2057 2764
552 2764 3050 1119 533 -34 -2842 -2904 2326 4172 1858 1944 4241 859 -3917 -3054 -168 314 1012 3354
570 3354 3514 2013 138 -2645 -4185 -1296 1810 528 1844 5655 3533 -2913 -4058 906 911 -1290
586 -1290 1366 6089 4793 753 -1223 -1226 555 504 -658 1611 6389 4778 -1677 -1725 3387 1085 -4517
603 -4517 -1192 5776 3480 -1864 -100 3783 1133 -3247 -3303 249 1971 -660 -2392 694 4576 -134
619 -134 -6875 -4003 1032 -2668 -7014 -1258 4525 -22 -5679 -4857 -2787 -4699 -6153 -3327 594 2798
$$ packed form
501c57k962K426M513J1j384J655j009m664j713J173K25J450L033j08j824O9j056
518e22l730j206M204J700j394J683K051k825m081L60L73o22J565K558l5R7K01
535C77l380k253K147R13k004J932N086m44m127P5J840k526j714K988K496O51P07
552B764K86j931n86n67k808o2N230J846k314Q6K297l382m776Q63K886M82O98K342
570C354J60j501j875k783j540K889L106j282J316L811k122o446j145M964Nk201
586a290K656M723j296m040j976lJ781n1j162K269M778j611o455m8N112k302n602
603d517L325O968k296n344J764L883k650m380n6L552J722k631j732L086L882m710
619a34o741K872N035l700m346N756N783m547n657Q22K070j912j454K826L921K204
$$ plain form
635 2798 292 -4199 -4382 -2311 -4368 -6309 -498 5744 2076 -3242 -2243 -919 -4503 -6801 -2541 1605
651 1605 2541 367 -3399 -4191 -2892 -4480 -7032 -3418 3114 1740 -4208 -3226 -308 -3775 -7319 -3071
667 -3071 1674 7 -2685 -2032 8 -199 -3246 -4126 -635 2511 -669 -4735 -954 4906 1098 -3940
683 -3940 573 4719 -146 -5181 -791 4832 3511 852 1783 3871 1911 -2811 -4572 342 5354
698 5354 3657 -388 1551 4006 -2554 -7869 -2833 3788 3243 581 2555 3779 -115 -5016 -5146 169
714 169 5812 4824 528 2667 5467 -779 -8156 -3335 6216 5067 -1146 1233 4933 727 -6834 -5636
730 -5636 669 2975 -105 -2133 798 2634 -3374 -7865 -1431 5315 317 -6191 -965 4744 -1429
745 -1429 -7468 -1210 5295 1084 -5129 -3529 457 -955 -5063 -4014 1974 3441 -4102 -8506 -3509
$$ packed form
635B798k506m491j83K071k057j941N811O242l668n318R99J324l584k298M260M146
651A605R36k174l766p92J299j588k552L614O532j374n948R82K918l467l544M248
667c071M745j667k692O53K040k07l047q80L491L146l180m066L781N860l808n038
683c940M513M146m865n035M390N623j321k659R31K088j960m722j761M914N012
698E354j697m045J939K455o560n315N036O621n45k662J974J224l894m901j30N315
714A69N643r88m296K139K800o246p377M821R551j149o213K379L700m206p561J198
730e636O305K306l080k028K931J836o008m491O434O746m998o508N226N709o173
745a429o039O258O505m211o213J600L986j412m108J049N988J467p543m404M997
$$ plain form
760 -3509 740 -4319 -6410 1844 6156 -1962 -8643 -4488 -609 -3187 -4257 1379 5483 1983 -4506
775 -4506 -7026 -3590 -761 -3516 -2893 4193 6540 -1920 -8527 -4279 338 -3217 -4463 2015 6221
790 6221 1772 -4639 -5317 -1798 543 -1554 -1975 3307 5934 -997 -6991 -1611 3403 -927 -4289 1602
806 1602 5425 -337 -5628 -2047 2896 1523 -1762 -674 3079 3009 -2195 -3698 2353 6162 1013 -2610
822 -2610 2062 4364 -2142 -4927 1640 6161 2364 -1451 -259 898 -1881 -3999 -2214 2804 4847
837 4847 1423 -2460 -1281 -153 -4238 -5161 1848 5942 2479 -1507 -42 366 -3373 -4735 -1308 3437
853 3437 4772 902 -2459 -1335 -139 -3976 -6580 119 5706 885 -4615 -1670 848 -3524 -6390
868 -6390 -1607 3244 1166 -2890 -3325 -139 -256 -3905 -4544 1284 3566 -2534 -6347 -356 3055 -3551
$$ packed form
760c509M249n059k091Q254M312q118o681M155L879k578j070N636M104l500o489
775d506k520L436K829k755O23P086K347q460o607M248M617l555j246O478M206
790F221m449o411o78L519K341k097m21N282K627o931n994N380N014m330l362N891
806A602L823n762n291L581M943j373l285J088L753p0n204j503O051L809n149l623
822b610M672K302o506k785O567M521l797l815J192J157k779k118J785N018K043
837D847l424l883J179J128m085r23P009M094l463l986J465M08l739j362L427M745
853C437J335l870l361J124J196l837k604O699N587m821n500K945K518m372k866
868f390M783M851k078m056m35L186j17l649o39N828K282o100l813N991L411o606
$$ plain form
884 -3551 -6110 869 4208 -2287 -6395 -1812 2129 -192 -2769 -695 2155 997 -4314 -4864 433
899 433 3396 -512 -1743 2955 3277 -3579 -5705 198 2648 -63 -269 2542 2244 -1295 -3995 -3007
915 -3007 348 2088 607 380 3260 2877 -2993 -4902 497 3111 406 -46 3304 3205 -767 -2349
931 -2349 -420 1138 2149 1352 827 2636 2947 -561 -2258 1643 3682 382 -1308 3023 3039 -1490
947 -1490 -1845 1681 2152 -319 -1172 -13 1102 853 -1171 -1044 1953 2511 -1586 -2600 797 1698 -1257
964 -1257 -1719 2519 2351 -1497 -2289 -691 -689 -1688 -658 460 841 554 -1869 -3371 -1766 -374 -1854
981 -1854 -2064 1007 1145 -2128 -3485 -1202 -1400 -2684 -1793 254 159 -346 -1505 -2356 -2085 -455 -1590
998 -1590 -2590 -53 1713 -1396 -3572 -1099 -58 -2473 -2561 -161 590 -853 -1192 -478 -708 -701 -1189 -1385
$$ packed form
884c551k559O979L339o495m108M583L941k321k577K074K850j158n311n50N297
899D33K963l908j231M698L22o856k126N903K450k711k06K811k98l539k700R88
915c007L355J740j481k27K880l83n870j909N399K614k705m52L350r9l972j582
931b349J929J558J011p97n25J809L11l508j697L901K039l300j690M331J6m529
947a490l55L526M71k471q53J159J115k49k024J27K997N58m097j014L397R01k955
964a257m62M238j68l848p92J598Kr99J030J118L81k87k423j502J605J392j480
981a854k10L071J38l273j357K283j98j284Q91K047r5n05j159q51K71J630j135
998a590j000K537J766l109k176K473J041k415q8K400P51j443l39P14k30Pm88j96
$$ plain form
1016 -1385 -130 905 -973 -2003 1000 1240 -2102 -2557 744 932 -1663 -1378 1406 1090 -397 -338 -77
1033 -77 210 95 469 242 1683 2897 887 -318 1575 1770 -383 25 2710 2332 261 1099 1856 386
1051 386 -598 349 864 790 1575 1290 155 862 1412 -328 -687 2017 2601 778 798 2525 1551 -17 687
1070 687 1280 563 1020 1461 837 303 921 94 -1037 -250 618 -475 -1083 865 729 -866 -607 672
1088 672 -185 -926 602 725 42 179 609 -357 -584 649 63 -818 296 1120 -671 -1379 -53 -389
1106 -389 -1764 -735 141 -1103 -552 515 -600 -1561 -818 -339 -1338 -1176 436 -67 -1218 478 127
1123 127 -1715 -903 247 -522 -1308 58 331 -1049 -392 431 -312 -1171 768 951 -203 531 1712 794
1141 794 -158 1153 1512 240 721 2181 1063 448 1569 1107 -25 566 1438 604 344 1316 889 -259
$$ packed form
1016a385J255J035j878j030L003K40l342m55L301J88k595K85K784l16j487N9K61
1033g7K87j15L74k27J441J214k010j205J893J95k153M08K685l78k071Q38P57j470
1051C86r84R47N15p4P85k85j135P07N50j740l59K704N84j823K0J727r74j568P04
1070F87N93p17M57M41o24n34O18q27j131P87Q68j093o08J948j36j595K59J279
1088F72q57p41J528J23o83J37M30r66k27J233n86q81J114Q24j791p08J326l36
1106c89j375J029Q76j244N51J067j115r61P43M79r99J62J612n03j151J696l51
1123A27j842Q12J150p69p86J366K73j380O57Q23p43q59J939J83j154P34J181r18
1141G94r52J311L59j272M81J460j118o15J121m62j132N91Q72q34k60R72m27j148
$$ plain form
1159 -259 580 1003 -459 -567 1334 1263 -112 792 1525 812 -56 1365 1250 273 1386 1566 573 708 1644
1178 1644 857 -118 1127 1686 379 325 1655 767 -98 1076 1236 207 398 1539 933 -201 629 639
1196 639 -413 -217 967 -242 -428 281 449 -983 -496 99 -872 -1476 -253 -314 -1265 -821 -222 -1037 -1861
1215 -1861 -437 -731 -1200 -814 277 -1016 -888 249 -197 -1327 -671 837 -626 -1233 66 266 -928
1232 -928 -575 219 -298 -649 315 -168 -763 313 532 -1247 -829 759 23 -1359 -174 900 -477 -938
1250 -938 64 106 -815 277 639 -402 9 610 -212 -691 868 954 -620 -178 1218 797 -670 547
1268 547 1733 723 574 1075 1393 1114 1289 952 352 2200 2028 862 360 2658 2303 142 923 2843
1286 2843 1820 -169 1168 1731 844 387 884 1477 1108 827 -395 -513 1096 712 -1205 -70 2181
$$ packed form
1159b59Q39M23j462j08J901p1j375R04P33p13q68J421j15r77J113J80r93J35R36
1178A644p87r75J245N59j307n4J330q88q65J174J60j029J91J141o06j134Q30J0
1196F39j052J96J184j209j86P09J68j432M87N95r71o04J223o1r51M44N99q15q24
1215a861J424k94m69L86J091j293J28J137m46j130O56J508j463o07J299K00j194
1232i28L53P94n17l51R64m83n95J076K19j779M18J588p36j382J185J074j377m61
1250i38J002M2r21J092L62j041M11O01q22m79J559Q6j574M42J396m21j467J217
1268E47J186j010j49N01L18k79J75l37o00J848j72j166n02K298l55k161P81J920
1286B843j023j989J337N63q87m57M97N93l69k81j222j18J609l84j917J135K251
$$ plain form
1303 2181 870 -1943 -452 1662 80 -1148 748 1918 471 -380 144 47 538 649 170 734 1630
1320 1630 898 -1125 -224 1263 -159 -1437 795 1946 -188 -1412 -442 90 -348 -869 -113 170 -59
1337 -59 -512 -2250 -1423 245 -356 -2606 -826 1097 -874 -3089 -1302 211 -1014 -1580 -461 -47 -765
1354 -765 -1181 -1585 -206 1022 397 -1540 -141 1824 -320 -2064 587 2583 549 -1155 716 2032
1370 2032 -386 -1152 -63 1328 1066 518 -544 33 673 -727 -1813 290 2822 899 -877 324
1386 324 1466 -565 -1206 987 1996 1393 437 305 238 271 -392 -491 970 3187 1613 -1480 120 2252
1404 2252 -28 -2095 972 3193 2006 -504 405 1373 822 -503 446 2181 3184 1062 -985 313
1420 313 2177 309 -2003 1080 3863 386 -3072 -561 1645 -343 -2210 -44 1535 346 -2638
$$ packed form
1303B181j311k813J491K114j582j228J896J170j447q51N24r7M91J11m79N64Q96
1320A630p32k023R01J487j422j278K232J151k134j224R70N32m38n21P56K83k29
1337e9m53j738Q27J668o01k250J780J923j971k215J787J513j225n66J119M14p18
1354g65m16m04J379J228o25j937J399J965k144j744K651J996k034j704J871J316
1370B032k418p66J089J391k62n48j062N77O40j400j086K103K532j923j776J201
1386C24J142k031o41K193J009o03r56j32o7L3o63r9J461K217j574l093J600K132
1404B252k280k067L067K221j187k510R09R68n51j325R49J735J003k122k047J298
1420C13J864j868k312L083K783l477l458K511K206j988j867K166J579j189k984
$$ plain form
1435 -2638 -2328 67 1334 -808 -1718 1233 2258 -1810 -4055 -271 2166 -427 -1956 1193 2020 -1393
1451 -1393 -3323 -1509 871 491 -201 -395 569 683 -2140 -3523 -191 2355 373 -1000 1322 1749
1467 1749 -1951 -3618 -399 1554 174 -243 332 860 -499 -2520 -2661 126 1877 -93 -1770 577
1483 577 1765 -1575 -3422 408 2697 260 -1188 685 1617 -222 -1258 207 2210 2251 107 -663
1499 -663 912 1871 -689 -1663 2254 3731 -125 -1916 1019 2040 -677 -1197 1859 3250 1373 -685
1515 -685 -741 646 1171 174 -65 2438 3498 -216 -2294 22 2037 -464 -1018 2109 3154 408 -1727
1532 -1727 -843 130 -21 -276 363 1980 2157 -721 -2636 -334 1371 -958 -1638 1748 3342 -250 -2850
1549 -2850 -1007 918 -603 -1423 100 1518 712 -1651 -2689 -267 818 -1324 -2332 711 1678 -2241
$$ packed form
1435b638L10K395J267k142r10K951J025m068k245L784K437k593j529L149Q27l413
1451a393j930J814K380l80o92j94R64J14k823j383L332K546j982j373K322M27
1467A749l700j667L219J953j380m17N75N28j359k021j41K787J751j970j677K347
1483E77J188l340j847L830K289k437j448J873R32j839j036J465K003M1k144p70
1499f63J575R59k560r74L917J477l856j791K935J021k717n20L056J391j877k058
1515f85n6J387N25r97k39K503J060l714k078K316K015k501n54L127J045k746k135
1532a727Q84R73j51k55O39J617J77k878j915K302J705k329o80L386J594l592k600
1549b850J843J925j521q20J523J418q06k363j038K422J085k142j008L043R67l919
$$ plain form
1565 -2241 -3277 -216 1648 -1212 -2213 201 934 -1876 -2695 -734 1028 881 -1367 -1713 261 236
1581 236 -2636 -2846 877 2454 -935 -2112 522 495 -2609 -2711 367 1722 301 -873 -340 317 -629
1598 -629 -1838 -1421 1510 2565 -40 -1161 524 713 -2355 -1920 2061 2700 594 -201 857 648 -487
1615 -487 -821 159 1847 2169 142 -807 864 1565 -982 -1510 1789 2389 -200 -928 1420 1312 -198
1632 -198 -650 836 1546 895 -230 -231 1358 1604 -142 -324 1811 1733 -1214 -1343 1410 1659 -382 -188
1650 -188 2010 1145 -619 -1080 -229 692 931 490 88 1086 956 -1151 -1741 221 1552 -36 101 1620
1668 1620 685 -1989 -1635 -67 156 -453 127 386 -92 -182 -1610 -2037 -499 628 -973 -1061 885 656
1686 656 -1791 -2136 -250 60 -1358 -1083 -27 232 -624 -1005 -1260 -367 231 -981 -1108 542 1122 -1082
$$ packed form
1565b241j036L061J864k860j001K414P33k810q19J961J762j47k248l46J974k5
1581B36k872k10L723J577l389j177K634k7l104j02L078J355j421j174N33O57r46
1598f29j209M17K931J055k605j121J685J89l068M35L981O39k106p95J058k09j135
1615d87l34R80J688L22k027r49J671P01k547n28L299O00k589p28K348j08j510
1632a98m52J486P10o51j125jJ589K46j746j82K135p8k947j29K753K49k041J94
1650a88K198q65j764m61Q51R21K39m41m02R98j30k107n90J962J331j588J37J519
1668A620r35k674L54J568K23o09N80K59m78r0j428m27J538J127j601q8J946k29
1686F56k447l45J886L10j418K75J056K59q56l81k55Q93N98j212j27J650N80k204
$$ plain form
1704 -1082 -1353 823 739 -1468 -943 736 393 -768 226 684 537 -324 -957 -898 54 487 -412 -496 1026
1723 1026 1281 -1048 -1493 76 200 -941 266 1459 977 23 175 219 -139 327 733 696 1455 1726 221
1742 221 200 882 803 -536 97 1937 1696 247 532 1035 -72 -191 512 621 843 1294 630 -84 508
1761 508 706 -364 -550 584 1082 -275 -105 781 273 -1276 -521 -35 -583 -129 551 142 -41 215 -667
1780 -667 -1331 -639 56 -890 -311 1112 503 -955 -564 299 -761 -1182 -108 334 -66 -174 114 -829 -860
1799 -860 -546 -1013 -1168 364 384 -577 -924 -233 -1110 -1729 -816 -189 -932 -386 396 -560 -1083 -997 -825 -1043
1819 -1043 -445 334 -162 -634 200 140 -1331 -982 -1 124 -304 520 719 220 356 195 -545 -535 510 753
1839 753 214 784 1576 158 -321 401 288 -273 443 1249 699 437 726 270 -662 34 79 305 413 1108
$$ packed form
1704a082k71K176q4k207N25J679l43j161R94M58j47q61o33N9R52M33q99q4J522
1723A026K55k329m45J569J24j141J207J193m82r54J52M4l58M66M06l7P59K71j505
1742B21k1O82p9j339O33J840k41j449K85N03j107j19P03J09K22M51o64p14N92
1761E08J98j070j86J134M98j357J70Q86n08j549P55M86n48M54O80m09j83K56q82
1780f67o64O92O95r46N79J423o09j458L91Q63j060m21J074M42m00j08K88r43l1
1799h60L14m67j55J532K0r61l47O91q77o19R13O27p43N46P82r56n23Q6J72k18
1819a043N98P79m96m72Q34o0j471L49R81J25m28Q24J99m99J36j61p40J0J045K43
1839G53n39N70P92j418m79P22j13n61P16Q06n50k62K89m56r32O96M5K26J08O95
$$ plain form
1859 1108 722 -178 390 639 -605 -136 976 733 575 1206 1109 179 -413 670 383 -206 943 1293 640
1878 640 523 789 215 -419 269 509 -46 413 1364 483 -613 180 272 -428 -358 483 516 75 406 333 -724
1899 -724 -757 -122 -628 -746 203 183 -590 -647 -387 -1025 -1641 -646 -340 -551 -144 200 -460 -1315 -465 -767 -1358
1920 -1358 -515 360 -320 -175 452 -239 -1614 -780 -204 -872 -687 496 55 -421 -343 -462 -1187 -786 -128
1939 -128 85 -93 191 531 -539 -697 -285 -654 -1126 177 733 285 247 405 51 -634 -126 -49 64 581
1959 581 1096 615 87 738 474 -599 -138 863 600 89 1125 1513 -24 -247 353 271 211 1034 1089 520
1979 520 1133 821 -450 -156 884 747 149 1070 1901 537 99 109 137 -410 -186 571 960 390 567 92
1999 92 -499 87 71 -578 -139 1200 551 -466 189 905 -683 -647 150 51 -283 404 652 -63 -180 -401
$$ packed form
1859A108l86r00N68K49j244M69J112k43j58O31r7r30n92J083k87n89J149L50o53
1878F40j17K66n74o34O88K40n55M59R51q81j096P93R2p00P0Q41L3m41L31p3j057
1899g24l3O35n06j18R49k0p73n7K60o38o16R95L06k11M07L44o60q55Q50l02n91
1920a358Q43Q75o80J45O27o91j375Q34N76o68J85J183m41m76P8j19p25M01O58
1939a28K13j78K84L40j070j58M12l69m72J303N56m48l8J58l54o85N08P7J13N17
1959E81N15m81n28O51k64j073M61J001k63n11J036L88j537k23O00q2o0Q23N5n69
1979E20O13l12j271K94J040j37n98R21Q31j364m38J0K8n47K24P57L89n70J77m75
1999I2n91N86j6o49M39J339o49j017O55P16j588L6P97r9l34O87K48p15j17k21
$$ plain form
2019 -401 -874 -889 86 -67 -361 -53 833 -326 -1566 -867 234 -937 -916 563 472 -244 -468 -778 -949
2038 -949 -871 -431 -613 -190 818 288 -1289 -836 -330 -1409 -1693 -89 914 -58 -218 260 -340 -974 -784
2057 -784 -209 77 1052 494 -131 -92 629 -394 -1374 97 1140 73 -256 653 835 -378 -743 -91 383
2076 383 97 374 -153 569 1242 463 -691 3 1002 160 -256 754 1979 846 -90 782 967 -172
2094 -172 -341 588 699 1381 715 47 528 783 -305 -1188 269 2000 963 -634 781 1406 -213 -997
2112 -997 -82 1104 815 542 750 634 748 -745 -1316 -232 1236 122 -707 739 1297 -1056 -1868 51
2130 51 864 -366 -871 382 854 -102 -904 -1103 -80 126 -311 -913 158 610 -353 -1891 -305 415
2148 415 -1309 -1904 -187 521 -832 -936 32 126 -706 -1344 -1320 -542 458 -556 -1030 469 675 -862
$$ packed form
2019d01m73j5R75j53k94L08Q86j159j240O99J101j171K1J479r1p16k24l10j71
2038i49P8M40j82M23J008n30j577M53N06j079k84J604J003r72j60M78o00o34J90
2057g84N75K86R75n58o25L9P21j023r80J471J043j067l29R09J82j213l65O52M74
2076C83k86K77n27P22O73p79j154O94R99q42m16J010J225j133r36Q72J85j139
2094a72j69R29J11O82o66o68M81K55j088q83J457J731j037j597J415O25j619p84
2112i97R15J186k89k73K08j16J14j493n71J084J468j114q29J446N58k353q12J919
2130E1Q13j230n05J253M72r56q02j99J023K06m37o02J071M52r63j538J586P20
2148D15j724n95J717P08j353j04R68R4q32o38K4P78J000j014m74J499K06j537
$$ plain form
2166 -862 -2253 -261 668 -554 -809 907 1044 -192 -1351 -1073 -226 224 -141 57 1055 792 -628 -1654
2184 -1654 -246 676 -535 -311 1371 2019 -215 -1366 -99 581 -255 -237 805 1238 911 -47 -672 900
2202 900 683 -151 -586 1282 1899 40 -520 1040 1049 -210 -334 953 1034 811 388 454 1138 1239 108
2221 108 -598 631 1018 -182 -802 1276 1706 -118 -986 573 415 -704 -432 575 1453 682 -416
2238 -416 -575 28 260 -1197 -1008 1100 1905 135 -1195 296 366 -1359 -1573 769 1719 249 -518 -64
2256 -64 280 -1104 -1473 -872 711 882 -483 -1234 150 124 -1945 -1711 517 849 -570 -866 362 358 -1248
2275 -1248 -1609 -428 230 67 -888 -733 413 453 -1163 -1284 -35 681 -1171 -1382 591 868 -843 -398
2293 -398 361 477 -573 -900 -191 394 623 -351 -138 684 376 -1226 -1277 1008 1764 -216 271 1131 860
$$ packed form
2166h62j391J992R29j222k55J716J37j236j159K78Q47M50l65J98R98k63j420j026
2184a654J408R22j211K24J682O48k234j151J267O80q36J8J042M33l27r58o25J572
2202I00k17q34m35J868O17j859n60J560Rj259j24J287Q1k23m23O6O84J01j131
2221A08p06J229L87j200o20K078M30j824q68J559j58j119K72J007Q78p71j098
2238d16j59O03K32j457J89K108Q05j770j330J491P0j725k14K342R50j470p67M54
2256f4L44j384l69O01J583J71j365p51J384k6k069K34K228L32j419k96J228mj606
2275a248l61J181O58j63r55J55J146M0j616j21J249P16j852k11J973K77j711M45
2293c98P59J16j050l27P09N85K29r74K13Q22l08j602n1K285P56j980M87Q60k71
$$ plain form
2312 860 -890 -1078 285 1012 1059 355 735 657 316 -677 -841 601 1130 281 325 1336 915 -948 -742
2331 -742 834 980 -303 111 1251 828 370 -263 -410 416 573 18 -93 1375 1064 -434 -792 833
2349 833 535 -749 -179 787 546 -274 18 402 264 -290 -302 -622 395 437 -90 -585 678 80 -1441
2368 -1441 -1231 111 -46 -709 -393 444 103 -664 -1038 -1070 -450 -116 -494 -463 704 499 -1220 -1415 -242
2387 -242 130 -641 -613 1024 286 -740 -844 -626 -652 -894 -463 -333 447 309 -861 -903 -10 -41 -1062 -898
2407 -898 581 475 -614 -761 518 -29 -932 -260 444 80 -146 7 192 471 -5 -403 -711 320 644
2426 644 -305 115 1050 476 -435 -299 674 81 67 728 998 614 747 139 -49 443 525 34 270 1404
2446 1404 1277 -78 194 749 -29 -729 55 1080 835 491 310 91 -181 190 -201 -168 754 911 426
$$ packed form
2312H60j750j88J363P27M7p04L80p8l41r93j64J442N29q49M4J011m21j863K06
2331g42J576J46j283M14J140m23m58o33j47Q26J57n55j11J468l11j498l58J625
2349H33k98j284N70R66k41q20K92L84j38n54j2l20J017M2n27m95J263n98j521
2368a441K10J342j57o63L16Q37l41p67l74l2O20L34l78L1J167k05j719j95J173
2387b42L72p71K8J637p38j026j04K18k6k42M31J30P80j38j170m2Q93l1j021J64
2407h98J479j06j089j47J279n47r03O72P04l64k26J53J85K79m76l98l08J031L24
2426F44r49M20R35n74r11J36R73n93j4O61K70l84J33o08j88M92Q2m91K36J134
2446A404j27j355K72N55p78p00P84J025k45l44j81k19k72L71l91L3R22J57m85
$$ plain form
2465 426 27 668 -112 -878 -314 415 -154 -89 501 604 -463 -88 93 -708 -281 140 312 -149 489 239
2485 239 -1046 -821 4 -435 -853 -406 353 -152 -485 -62 -531 -1124 -847 -6 -803 -352 -11 -360 -818 -324
2505 -324 -590 -1024 -679 116 -141 -238 -227 -280 -694 -1119 -538 -235 -187 -51 367 -355 -82 -14 -549 -902 -51 -80
2527 -80 -428 123 426 384 -560 -60 -331 -399 -276 362 571 -6 242 166 -505 33 323 -408 327 569 383
2548 383 -200 219 341 -163 -363 542 518 362 814 636 212 212 248 116 188 429 981 358 630 810 -2 38
2570 38 215 791 325 400 1037 514 140 220 31 -417 57 353 250 186 597 219 -459 -324 -65 -148 -315 358
2592 358 279 150 -188 124 -416 -462 -303 -165 -222 -102 464 -89 -276 -167 12 -833 117 271 -116 -125 94 -138
2614 -138 -820 -648 -314 -430 -537 169 19 -455 -340 -152 -987 -975 -13 -263 -736 -2 398 -494 -467 -463 -566
$$ packed form
2465D26l99O41p80p66N64P29n69O5N90J03j067L75J81q01M27M21J72m61O38k50
2485B39j285K25Q25m39m18M47P59n05l33M23m69n93K77Q41p97M51L41l49m58M94
2505c24k66m34L45P95k57r7J1n3m14m25N81L03M8J36M18p22K73O8n35l53Q51k9
2527h0l48N51L03m2r44N00k71o8J23O38K09n77K48p6o71N38K90p31P35K42j86
2548C83n83M19J22n04k00R05k4j56M52j78m24%L6j32P2K41N52o23K72J80q12M0
2570C8J77N76m66P5O37n23l74Q0j89m48M74K96j03o4M11l78o78J35K59q3j67O73
2592C58p9j29l38L12n40m6J59J38n7J20N66n53j87J09J79q45R50J54l87rK19k32
2614a38o82J72L34j16j07P06j50m74J15J88q35J2R62k50m73P34M00q92K7Mj03
$$ plain form
2635 -566 -643 -217 234 -72 22 83 -315 -536 -653 -266 -441 46 549 416 -174 -87 158 -438 -61 140 71 164
2657 164 654 88 68 -286 325 -14 -259 502 820 441 560 620 151 -242 11 473 302 491 890 644 139
2678 139 470 265 -2 405 412 507 606 620 313 -421 109 641 103 -33 757 533 -80 404 306 -32 108 174
2700 174 20 127 368 604 -62 125 173 -379 -536 -8 235 -181 -317 418 94 -616 -404 -184 -310 -202
2720 -202 180 16 -435 53 -338 -888 -577 27 10 -450 -130 -100 -396 -741 -243 -483 -558 -281 14 -439 -49
2741 -49 208 -753 -740 -206 -287 -624 27 558 -396 -467 -121 -124 -786 -584 58 31 5 188 -172 -374 32 -20 -554
2764 -554 124 634 50 -98 291 668 -453 -740 110 425 119 110 307 158 40 66 -263 -164 474 387 -34
2785 -34 382 1109 503 -337 140 751 12 -142 546 817 313 362 103 173 491 292 -27 195 1042 300 -244
$$ packed form
2635e66p7M26M51l06R4O1l98k21j17L87j75M87N03j33n90Q7K45n96L77K01o9R3
2657A64M90n66k0l54O11l39k45P61L18l79J19O0m69l93K53M62j71J89L99k46n05
2678A39L31k05k67M07PR5R9J4l07p34N30N32n38j36P90k24o13M84r8l38J40O6
2700A74j54J07K41K36o66J87M8n52j57N28K43m16j36P35l24p10K12K20j26J08
2720b02L82j64m51M88l91n50L11O04j7m60L20L0k96l45M98k40p5K77K95m53L90
2741d9K57r61J3N34q1l37O51N31r54p1L46lo62K02O42k7k6J83l60k02M06n2n34
2764e54O78N10n84j48L89L77j121k87Q50L15l06rJ97j49j18K6l29R9O38q7m21
2785c4M16P27o06q40M77O11p39j54O88K71n04M9k59P0L18j99l19K22Q47p42n44
$$ plain form
2806 -244 282 567 -30 -246 650 879 523 57 385 199 57 -109 -507 171 312 300 -237 346 460 -388
2826 -388 -697 -368 464 -191 -615 247 567 -462 -681 -93 -73 -76 -115 -59 43 23 -528 -888 -466 -320 -372 -779
2848 -779 96 399 -498 -698 -42 35 -719 -631 154 -258 -251 -351 -617 -305 -126 -574 -889 -50 610 -467 -833
2869 -833 60 143 -479 -591 -39 22 -156 -231 94 240 182 -301 -609 -160 114 176 -97 559 803 -108 -402 604
2891 604 762 -229 -86 745 906 230 61 222 123 625 63 -59 685 914 285 -380 624 252 88 -67
2911 -67 571 831 100 211 573 592 -58 129 336 295 332 477 144 699 451 -423 -651 533 586 -695 -329
2932 -329 401 540 -350 -195 -84 246 314 -379 -105 445 465 -134 -532 445 405 -549 -445 500 550 -339 -292 384
2954 384 290 -723 -598 -446 12 -129 -452 -173 -416 -12 -798 -831 31 521 -407 -699 51 -34 -882 -717 -140
$$ packed form
2806b44N26K85n97k16Q96K29l56m66L28j86j42j66l98O78J41j2n37N83J14q48
2826c88l09L29Q32o55m24Q62L20j029k19N88K0ll9N6J02k0n51l60M22J46n2m07
2848g79Q75L03q97k00O56P7p54Q8P85m12Pj00k66L12J79m48l15Q39O60j077l66
2869h33Q93Q3o22j12N52O1j78p5L25J46n8m83l08M49K74O2k73O56K44r11k94J006
2891F04J58r91J43Q31J61o76j69J61r9N02n62j22P44K29o29o65J004l72j64j55
2911f7O38K60p31J11L62J9o50J87K07m1L7J45l33N55k48q74k28J184N3j281L66
2932c29P30J39q90J55J11L30O8o93K74N50K0n99l98R77m0r54J04R45N0q89M7O76
2954C84r4j013J25J52M58j41l23K79k43M04p86l3Q62M90r28k92P50q5q48J65N77
$$ plain form
2975 -140 -112 -221 -114 69 -108 -343 -601 -731 17 438 -508 -522 565 181 -1130 -726 341 378 -752 -115
2995 -115 424 330 -207 -224 -58 121 41 -68 -328 445 486 -168 -86 837 488 -496 63 706 481 16 405 592
$$ packed form
2975a40K8j09J07J83j77k35k58j30P48M21r46j4J087l84j311M04J067L7j130O37
2995a15N39r4n37j7J66J79q0j09k60P73M1o54Q2R23l49r84N59O43k25m65L89J87
$$ [...]
8191A60
##END NTUPLES=NMR FID
##END=
