##TITLE=1H_IAMT-163
 DMSO-d6
 8 sc, 
 24.3.2023
##JCAMPDX= 6.0         $$ Bruker NMR JCAMP-DX V2.0
##DATA TYPE= NMR FID
##DATA CLASS= NTUPLES
##ORIGIN= UXNMR, Bruker Analytische Messtechnik GmbH
##OWNER= root
$$ XWIN-NMR		Version 3.5
$$ Fri Mar 24 16:05:38 2023 Russian Standard Time (UT+4h)  she@DPX200
##.OBSERVE FREQUENCY= 200.1317
##.OBSERVE NUCLEUS= ^1H
##.DELAY= (6, 6)
##.ACQUISITION MODE= SIMULTANEOUS
##.ACQUISITION SCHEME= undefined
##.AVERAGES= 8
##.DIGITISER RES= 18
##SPECTROMETER/DATA SYSTEM= spect
##.PULSE SEQUENCE= zg30
##.SOLVENT NAME= D2O
##.SHIFT REFERENCE= (INTERNAL, D2O, 0, 15.7039)
##AUDIT TRAIL= $$ (NUMBER, WHEN, WHO, WHERE, WHAT)
$$ ##TITLE= Audit trail, XWIN-NMR		Version 3.5
$$ ##JCAMPDX= 5.01
$$ ##ORIGIN= Bruker BioSpin GmbH
$$ ##OWNER= she
$$ F:/spectra/data/she/nmr/H-F/1/audita.txt
$$ ##AUDIT TRAIL=  $$ (NUMBER, WHEN, WHO, WHERE, WHAT)
(   1,<2023-03-24 16:04:28.03 +0400>,<she>,<DPX200>,
      <created by zg, POWCHK disabled, PULCHK disabled
       configuration hash MD5:
       00 E9 B6 7A A2 85 ED C7 34 08 36 98 17 FE 4E 26
       data hash MD5: 16K
       1F B5 B4 04 95 0C 45 10 43 2C C9 E9 96 5D FE 80>)
$$ ##END=
$$ 
$$ hash MD5
$$ F2 00 E8 F0 7E D2 DB 93 2B 94 88 5F 2B 03 60 D4
##$RELAX= 
##$RELAX= 
##$RELAX= 
##$RELAX= 
##$RELAX= 
##$RELAX= 
$$ Bruker specific parameters
$$ --------------------------
##$DU= <F:/spectra>
##$EXPNO= 1
##$NAME= <H-F>
##$PROCNO= 1
##$TYPE= <nmr>
##$USER= <she>
##$AMP= (0..31)
100 100 100 100 100 100 100 100 100 100 100 100 100 100 100 100 100 100 
100 100 100 100 100 100 100 100 100 100 100 100 100 100 
##$AQSEQ= 0
##$AQ_mod= 1
##$AUNM= <au_zg>
##$AUTOPOS= <>
##$BF1= 200.13
##$BF2= 200.13
##$BF3= 200.13
##$BF4= 200.13
##$BF5= 200.13
##$BF6= 200.13
##$BF7= 200.13
##$BF8= 200.13
##$BYTORDA= 1
##$CFDGTYP= 0
##$CFRGTYP= 5
##$CHEMSTR= <none>
##$CNST= (0..31)
1 1 145 1 1 1 1 1 1 1 1 1 1 1 1 1 1 1 1 1 1 1 1 1 1 1 1 1 1 1 1 1 
##$CPDPRG= <>
##$CPDPRG1= <>
##$CPDPRG2= <>
##$CPDPRG3= <>
##$CPDPRG4= <mlev>
##$CPDPRG5= <mlev>
##$CPDPRG6= <mlev>
##$CPDPRG7= <mlev>
##$CPDPRG8= <mlev>
##$CPDPRGB= <>
##$CPDPRGT= <>
##$D= (0..31)
0 1.2 0 0 0 0 0 0 0 0.06 0 0.03 0 0 0 0 0.0002 0 0 0 0 0 0 0 0 0 0 0 0 
0 0 0 
##$DATE= 1679659467
##$DBL= (0..7)
120 120 120 120 120 120 120 120 
##$DBP= (0..7)
150 150 150 150 150 150 150 150 
##$DBP07= 0
##$DBPNAM0= <>
##$DBPNAM1= <>
##$DBPNAM2= <>
##$DBPNAM3= <>
##$DBPNAM4= <>
##$DBPNAM5= <>
##$DBPNAM6= <>
##$DBPNAM7= <>
##$DBPOAL= (0..7)
0.5 0.5 0.5 0.5 0.5 0.5 0.5 0.5 
##$DBPOFFS= (0..7)
0 0 0 0 0 0 0 0 
##$DE= 6
##$DECBNUC= <off>
##$DECIM= 24
##$DECNUC= <off>
##$DECSTAT= 4
##$DIGMOD= 1
##$DIGTYP= 9
##$DL= (0..7)
0 120 120 120 120 120 120 120 
##$DP= (0..7)
150 150 150 150 150 150 150 150 
##$DP07= 0
##$DPNAME0= <>
##$DPNAME1= <>
##$DPNAME2= <>
##$DPNAME3= <>
##$DPNAME4= <>
##$DPNAME5= <>
##$DPNAME6= <>
##$DPNAME7= <>
##$DPOAL= (0..7)
0.5 0.5 0.5 0.5 0.5 0.5 0.5 0.5 
##$DPOFFS= (0..7)
0 0 0 0 0 0 0 0 
##$DQDMODE= 0
##$DR= 18
##$DS= 0
##$DSLIST= <SSSSSSSSSSSSSSS>
$$ [...]
##$SUBNAM2= <"">
##$SUBNAM3= <"">
##$SUBNAM4= <"">
##$SUBNAM5= <"">
##$SUBNAM6= <"">
##$SUBNAM7= <"">
##$SUBNAM8= <"">
##$SUBNAM9= <"">
##$SW= 24.9336809714795
##$SWIBOX= (0..15)
0 0 2 0 0 0 0 0 0 0 0 0 0 0 0 0 
##$SW_h= 4990.01996007984
##$TD= 16384
##$TD0= 1
##$TE= 0
##$TE2= 300
##$TE3= 300
##$TEG= 300
##$TL= (0..7)
0 120 120 120 120 120 120 120 
##$TP= (0..7)
150 150 150 150 150 150 150 150 
##$TP07= 0
##$TPNAME0= <>
##$TPNAME1= <>
##$TPNAME2= <>
##$TPNAME3= <>
##$TPNAME4= <>
##$TPNAME5= <>
##$TPNAME6= <>
##$TPNAME7= <>
##$TPOAL= (0..7)
0.5 0.5 0.5 0.5 0.5 0.5 0.5 0.5 
##$TPOFFS= (0..7)
0 0 0 0 0 0 0 0 
##$TUNHIN= 0
##$TUNHOUT= 0
##$TUNXOUT= 0
##$USERA1= <user>
##$USERA2= <user>
##$USERA3= <user>
##$USERA4= <user>
##$USERA5= <user>
##$V9= 5
##$VALIST= <valist>
##$VCLIST= <CCCCCCCCCCCCCCC>
##$VD= 0
##$VDLIST= <DDDDDDDDDDDDDDD>
##$VPLIST= <PPPPPPPPPPPPPPP>
##$VTLIST= <TTTTTTTTTTTTTTT>
##$WBST= 1024
##$WBSW= 4
##$XGAIN= (0..3)
0 0 0 0 
##$XL= 0
##$YL= 0
##$YMAX_a= 94972
##$YMIN_a= -162693
##$ZGOPTNS= <>
##$ZL1= 120
##$ZL2= 120
##$ZL3= 120
##$ZL4= 120
##$ABSF1= 10
##$ABSF2= 0
##$ABSG= 5
##$ABSL= 3
##$ALPHA= 0
##$AQORDER= 0
##$ASSFAC= 0
##$ASSFACI= 0
##$ASSFACX= 0
##$ASSWID= 0
##$AUNMP= <proc_1d>
##$AZFE= 0.1
##$AZFW= 0.1
##$BCFW= 1
##$BC_mod= 2
##$BYTORDP= 1
##$COROFFS= 0
##$CY= 11.3945322036743
##$DATMOD= 1
##$DC= 2
##$DFILT= <>
##$DTYPP= 0
##$F1P= 2.36226072786647
##$F2P= -0.459571619588291
##$FCOR= 0.5
##$FTSIZE= 0
##$FT_mod= 4
##$GAMMA= 1
##$GB= 0.15
##$INTBC= 1
##$INTSCL= 1
##$ISEN= 128
##$LB= 0.24
##$LEV0= 0
##$LPBIN= 0
##$MAXI= 10000
##$MC2= 0
##$MEAN= 0
##$ME_mod= 0
##$MI= 1.114404
##$NCOEF= 0
##$NC_proc= 0
##$NLEV= 6
##$NOISF1= 3.799351
##$NOISF2= 2.8
##$NSP= 1
##$NTH_PI= 0
##$NZP= 0
##$OFFSET= 15.70392
##$PC= 1
##$PHC0= -19312.08
##$PHC1= 40.6008
##$PH_mod= 1
##$PKNL= yes
##$PPARMOD= 0
##$PSCAL= 0
##$PSIGN= 0
##$REVERSE= no
##$SF= 200.130013532006
##$SI= 16384
##$SIGF1= 3
##$SIGF2= 2
##$SINO= 400
##$SIOLD= 16384
##$SREGLST= <1H.CDCl3>
##$SSB= 0
##$STSI= 0
##$STSR= 0
##$SW_p= 3612.71676300578
##$SYMM= 0
##$S_DEV= 0
##$TDeff= 0
##$TDoff= 0
##$TI= <>
##$TILT= no
##$TM1= 0
##$TM2= 0
##$TOPLEV= 0
##$USERP1= <user>
##$USERP2= <user>
##$USERP3= <user>
##$USERP4= <user>
##$USERP5= <user>
##$WDW= 1
##$XDIM= 8192
##$YMAX_p= 0
##$YMIN_p= 0
$$ End of Bruker specific parameters
$$ ---------------------------------
##NTUPLES= NMR FID
##VAR_NAME=  TIME,          FID/REAL,        FID/IMAG
##SYMBOL=    X,             R,               I
##VAR_TYPE=  INDEPENDENT,   DEPENDENT,       DEPENDENT
##VAR_FORM=  AFFN,          ASDF,            ASDF
##VAR_DIM=   8192,          8192,            8192
##UNITS=     SECONDS,       ARBITRARY UNITS, ARBITRARY UNITS
##FACTOR=    0.0002004,     1,               1
##FIRST=     0,             0,               0
##LAST=      1.6414764,     0,               0
##MIN=       0,             -162693,         0
##MAX=       1.6414764,     94972,           0
$$ Real data points
##PAGE= N=1
##DATA TABLE= (X++(R..R)), XYDATA
0 0 0 0 0 0 0 0 0 -8 8 -8 8 -9 16 -16 24 -25 32 -40 48 -56 64 -73 86 -97 113 -129 147 -169 191 -217 243
31 243 -274 307 -342 381 -426 474 -526 585 -648 718 -795 879 -976 1080 -1196 1332 -1481
48 -1481 1657 -1856 2093 -2376 2725 -3163 3730 -4506 5628 -7414 10707 -18842 84223 73404
62 73404 -59355 10212 13023 -11123 5576 15130 -65136 -73768 -25739 -19300 -22595 26101 12637
75 12637 -30108 4648 42004 -18066 -38121 14413 2456 -55566 -29569 -4702 -52735 -56163
87 -56163 13532 30268 8368 18121 9225 -13849 40304 94972 38731 -26599 -6603 -758 -29294
100 -29294 -2458 28105 -22320 -62196 -26813 -3358 -7755 17320 27738 -6541 -7210 21408 4330
113 4330 -14212 15726 12474 -33566 -21217 18941 -11065 -44043 968 40311 23828 15057 19768
126 19768 4326 13799 52775 44766 5187 260 -3651 -30228 -15758 22893 -554 -44631 -28303
139 -28303 -4489 -18257 -9079 21192 7925 -18923 -8549 2373 -5874 875 1923 -23768 -23008
152 -23008 6979 -3914 -33780 -10826 24259 12722 1727 17366 12013 -2932 16842 35708
164 35708 18328 2322 -1304 -14515 -13458 10847 9522 -15312 -12348 -840 -15412 -13366 20216
177 20216 23276 -9938 -14392 3783 2236 -3101 963 -5416 -12269 -2074 -1539 -15749 -7618 12892
191 12892 7870 970 14940 13087 -6483 1035 24230 17862 -859 -2307 -4012 -12332 -5440 4971
205 4971 -77 -3827 -4314 -14473 -14177 10471 18617 -3085 -11750 1174 -118 -8547 -1127 4554 -4264
220 -4264 -7916 -2299 -5104 -4935 4832 7048 4169 9089 8193 -4229 -1688 14540 11818 -2074 -829
235 -829 2576 -8040 -11606 821 7258 1533 -4431 -9043 -9412 1836 9388 1266 -5142 -1330 -4193
250 -4193 -10255 -2774 5952 -303 -6818 -1717 615 -3790 52 7988 8553 5396 2542 -1305 298
265 298 7800 6524 -398 1533 4526 -4447 -9512 544 9525 4563 -1876 -2879 -3147 -1497 2981
280 2981 4066 1139 -1602 -5568 -8250 -3065 3181 69 -3468 102 579 -5634 -4211 5446 7925
295 7925 1264 -2861 -2234 -807 247 -373 -569 1529 1057 -5072 -7260 -364 5218 2501 -50 762
311 762 -1637 -4404 -772 4593 3123 -1714 -4034 -3238 -1497 278 1086 2512 4380 1421 -3354 -1125
327 -1125 6126 7670 2301 -374 450 -460 -1779 -113 2041 2881 470 -2541 -3110 -172 2509 2499 2697
344 2697 1871 -1839 -4728 -1732 2357 1630 -2526 -3759 -2282 -2857 -3708 -1453 2590 3217 -833 -4174
360 -4174 -2159 1841 2490 301 -429 -559 -2689 -4399 -2080 1326 1370 -541 -1450 -800 -740 281 2821
377 2821 4906 3090 -984 -2364 169 2600 1691 43 1022 1189 -1325 -2322 1010 4351 4438 1138 -1002
394 -1002 -96 759 919 1587 1884 134 -2766 -3861 -1560 271 135 -145 387 -675 -2779 -2174 1545
411 1545 3641 1483 -1963 -2538 -953 -325 -990 -201 1274 448 -2528 -2646 165 2476 1851 1154 243
428 243 -545 -1735 -1109 1524 1581 -143 -2070 -2221 -1120 -748 -92 1527 2062 477 -2209 -1387 2023 2810
446 2810 1549 -166 -344 -234 -728 -261 1366 2492 1374 -605 -827 520 1708 1747 1687 1080 -824 -2484
464 -2484 -1397 764 492 -863 -1372 -1428 -1718 -2014 -544 1178 2032 -56 -2443 -1540 435 938 329 -145
482 -145 242 -1255 -1808 -254 1642 2045 1175 731 80 121 949 1201 1897 1341 -938 -1879 -1271 336 -313
501 -313 -584 -271 -16 -1912 -2050 -77 1397 1835 367 -858 -1754 -323 219 324 857 82 -1218 -1642
519 -1642 -7 1272 1199 1407 1754 590 -354 540 1543 1210 613 -573 -1637 -1235 -470 -1032 -973 174
537 174 397 -1376 -1657 -184 970 982 1087 484 -1030 -1538 -79 -50 390 561 -583 -1179 -365 1235 847
556 847 1455 2271 744 -691 189 1796 942 49 -162 -1198 -1713 -1267 -915 -1495 -244 653 -778 -1434
574 -1434 -145 204 -23 559 1432 -836 -1872 -394 -218 -187 323 338 -1024 -957 632 1203 1685 2427 1678
593 1678 -543 309 1713 1239 -233 489 -254 -1393 -1036 -337 -816 -1033 641 143 -922 356 575 -350
611 -350 495 1547 220 -1839 -725 312 -946 -604 770 -358 -1260 -350 462 982 1822 1627 -323
628 -323 -346 1155 664 -379 -269 -299 -2012 -1802 -30 -384 -1295 -136 479 -602 -76 530 -157 -140 810
647 810 579 -834 -847 -310 -1151 -850 1500 779 -955 -531 821 732 1366 2272 645 -771 572 1274 92
666 92 167 369 -983 -1794 35 -66 -1127 -539 561 -391 -652 749 335 -770 62 733 -561 -858 -175
685 -175 -1220 -1679 447 1143 -771 -800 306 289 771 1847 1389 -442 -342 213 52 142 496 -222 -1589
704 -1589 -317 366 -303 -370 699 -97 -970 409 694 -140 -352 583 350 -413 -141 -182 -1111 -164 1370
723 1370 99 -490 234 199 117 1277 1879 -63 -1131 156 210 -452 682 371 -1140 -1146 -6 40 -18 786
743 786 -15 -1089 -266 892 155 -473 -24 -46 -653 -358 407 -899 -720 789 756 -527 -66 300 -746
762 -746 504 1573 645 -872 108 110 -142 360 906 -405 -1034 -334 -69 86 264 384 -581 -516 347 446
782 446 -740 10 207 -497 -476 488 -188 -921 271 822 80 -283 178 -107 -134 950 993 -432 -15 77
802 77 -492 -168 814 372 -979 -157 217 48 273 542 -146 -891 193 354 -340 98 341 -529 -318 569
822 569 14 -578 -21 519 -188 -283 338 71 -408 366 819 333 -140 82 -353 -602 435 720 -260 -517
842 -517 -127 -93 96 420 346 -646 -426 176 -78 -540 71 349 -520 -162 458 -197 -152 320 51 -230 147
863 147 201 -265 -30 396 104 -307 -50 -258 -253 205 465 -31 -212 -339 88 -277 183 589 -94 -185 123 106
885 106 -195 125 -76 -222 -265 119 16 -21 129 20 -263 124 416 -270 -441 251 64 -186 -132 -165 -396 -168
907 -168 186 207 -23 0 -151 -123 203 312 277 -264 78 -96 -27 -100 473 -127 -101 167 -192 -18 422 402 -182
930 -182 29 430 -154 -281 -1 186 310 -8 -116 -361 177 260 92 108 -85 232 -169 15 254 330 -377
951 -377 -308 174 59 -115 4 307 -31 -158 168 -64 -75 286 -62 -19 -79 -142 -265 294 275 -55 -86 124 -30
974 -30 2 -130 228 45 -506 47 -76 -262 285 294 44 29 17 -256 -90 139 171 169 253 -256 55 -52 234 -53
998 -53 -195 60 -307 13 89 64 -214 -191 -93 76 -183 219 256 -195 -253 -104 -178 -103 -123 12 145 20 -146 -115
1022 -115 45 1 111 -26 -198 -55 -246 -11 2 -269 -61 -37 222 -87 -15 -26 -33 215 -253 269 57 -270
1044 -270 204 -79 -64 73 -143 117 60 -16 79 -127 -58 166 -69 107 146 125 -50 -11 -288 157 259 41 -249
1067 -249 -284 -151 -47 -113 -43 241 346 135 -340 -238 -93 8 -36 -205 157 102 11 -3 -94 -86 139 126 -108 43
1091 43 118 182 75 -77 323 -93 -50 79 139 78 -158 11 -158 -25 11 271 178 151 -116 -192 2 -344 94
1114 94 154 -139 -188 -110 -240 48 -10 97 64 -145 -28 2 154 127 51 -169 -82 45 -236 -215 -57 110 -268 -147
1138 -147 182 -75 3 -96 453 -12 -177 102 -86 112 -61 -88 -20 -134 109 195 210 111 -100 -31 210 249 -195
1161 -195 161 -12 -13 232 -101 -137 44 -150 25 71 -250 37 33 -69 -21 36 189 -284 -384 137 393 200 -45
1184 -45 190 -243 -184 -96 31 -78 45 14 475 159 196 17 -510 -31 266 -153 -131 269 -252 -43 31 -264
1206 -264 -214 100 -81 131 -60 -62 175 72 -10 275 265 -102 -298 -241 84 243 337 13 -215 42 51 153 177
1229 177 226 49 -37 -227 -66 166 -218 189 131 -23 54 34 444 -262 441 -76 -359 257 -299 -319 25 47
1251 47 -20 -154 -190 -70 -236 -66 -8 175 26 99 105 -22 -278 290 276 200 211 -241 164 217 115 -95 137 -21
1275 -21 80 -421 122 -254 -389 -120 -1 -161 115 -143 -193 -185 -121 91 -220 -216 28 -84 -172 202 -45 -120 317
1298 317 -30 345 97 82 46 -222 78 -18 -119 262 134 -73 109 40 131 260 -94 -12 82 -47 62 137 17
1321 17 68 161 175 -32 103 118 -180 -150 93 69 20 0 -32 24 39 -20 -59 -118 -4 99 312 -143 -111 -18 -47 173
1347 173 226 27 -223 -117 116 -72 4 175 51 179 224 83 93 248 13 304 332 -188 -91 -154 -122 -117 288
1370 288 110 -167 -371 306 114 -177 22 73 179 207 -49 -254 -18 78 -111 -232 -53 46 -163 28 -39 174
1392 174 -152 -172 -78 166 260 293 71 -161 -113 -77 -44 -91 -145 99 -62 -30 163 -18 136 147 -134 -207 78 389
1416 389 -37 49 203 209 149 40 104 -230 80 -104 -290 14 -25 -158 59 247 39 -361 -30 105 -95 -100 133
1439 133 -92 -36 -2 -259 130 -133 39 6 -236 276 381 38 5 130 -52 -309 102 228 -166 -174 84 49
1461 49 -53 -30 37 -266 -195 121 170 -130 -170 260 9 72 35 -144 -86 390 161 -44 -24 -323 198 -220 -118
1484 -118 25 226 70 35 -64 -176 51 -121 -196 9 37 -160 -103 99 98 36 147 -148 -209 -99 -151 -172 192 30
1508 30 -209 -28 -46 55 -35 39 -99 -228 -26 55 -243 3 -192 124 -98 -159 147 -242 42 212 -76 -113
1530 -113 -266 -131 -38 -110 -46 -125 81 6 -267 -209 -35 -123 75 -36 -15 -63 -91 -334 -161 -86 -283 191 -127 -52
1554 -52 -65 -128 -173 56 -171 -42 -191 -270 103 -101 31 102 167 77 -126 9 -9 -164 126 -252 80 158 -137
1577 -137 71 -253 109 89 227 -161 163 -272 170 45 -290 6 -188 179 -60 -27 111 249 101 141 39
1598 39 309 -143 -13 -89 -190 112 106 225 -474 -160 -193 55 151 -100 -98 52 102 -123 -110 73 104 -142 458 -69
1622 -69 124 37 -41 0 -152 -16 227 61 152 134 -139 -155 -83 119 5 128 -40 27 233 221 139 -208 -58 -129
1646 -129 -201 406 51 213 161 -166 60 -195 49 -133 -24 16 -181 -120 -208 -183 89 -302 -102 84 36 -148
1668 -148 -25 -28 -194 220 -89 -49 -130 -59 -96 -412 -283 -36 3 -246 311 -45 53 -127 -293 -122 -16 83 -237
1691 -237 89 87 -217 129 91 -33 5 -6 -169 -81 -135 -177 195 -81 -23 191 322 -263 -57 13 56 56 136 222 15
1716 15 -259 -120 -130 10 -271 202 -76 198 142 90 -91 -109 -53 33 286 72 -66 -269 -207 -23 -196 202 262
1739 262 48 260 -164 113 259 133 -17 283 158 171 12 123 32 -208 -187 173 -90 -11 116 30 -276 105
1761 105 -53 18 -153 241 -140 -135 -36 -120 -163 20 -89 304 109 208 89 -91 55 -9 159 -2 223 -71 312
1784 312 -105 -364 -87 -34 62 -5 123 -101 -124 -24 -56 -78 -383 347 14 161 -119 -81 56 -56 83 320
1806 320 25 260 -90 107 316 -433 -160 160 -101 -157 182 204 37 -120 -61 117 40 -15 -9 -73 168 -13 83
1829 83 147 -80 -76 -90 -160 301 15 -74 -136 -74 245 253 136 -219 133 -55 197 116 -187 -157 177 76 -31 -43 162
1854 162 173 182 77 -61 -158 -285 17 -10 35 -236 -403 74 -218 -247 81 -15 -12 368 -195 111 416 113 -163
1877 -163 72 171 57 111 34 -74 124 -49 249 221 -162 -195 -239 -266 206 244 -145 386 59 37 197 16 244
1900 244 -45 135 46 -177 17 -54 348 146 5 69 342 114 -139 -122 -7 397 -162 -6 214 2 161
1921 161 56 -5 200 -24 251 136 113 37 -123 -163 406 42 177 118 137 39 -40 210 392 -54 -92 158 -201
1944 -201 228 -161 -67 17 58 11 172 105 -10 26 -11 23 -251 -32 -148 161 206 -129 -81 158 197 -90 286 -142
1968 -142 115 65 -76 87 -95 111 264 332 -100 101 98 -23 -83 212 111 85 -65 -134 -126 214 -145 -146 56 51
1992 51 -34 -47 -34 -312 193 -41 -332 10 -300 393 24 28 135 -154 -107 52 222 -61 80 135 414 -125 251
2015 251 133 -106 85 -83 -220 -138 74 97 -32 -3 -2 -300 226 283 -28 211 231 -102 -53 45 -10 -63 -24 94
2039 94 22 -80 5 -258 82 49 -85 9 -72 -237 48 92 -103 -32 -49 22 -81 96 21 -168 79 -3 35 301
2063 301 -164 71 -143 106 -9 157 52 39 23 -133 -198 213 167 -48 -64 -72 -235 11 115 -207 -200 21 387
2086 387 79 -3 -73 179 -114 -33 -60 279 37 114 4 -127 -86 76 140 81 -154 107 -27 257 -29 53 -12
2109 -12 114 74 -228 184 -70 -12 46 -25 253 110 134 207 15 -61 63 -257 -70 -67 -105 -424 59 165 -129 125
2133 125 -22 235 -21 244 55 153 101 -53 -10 173 -86 -252 -32 -368 -160 40 -107 48 82 43 107 125
2155 125 -147 -39 251 10 185 17 82 -8 -12 237 64 -163 -138 -55 18 236 79 -27 -50 250 -120 -33 -49
2178 -49 -104 46 23 -60 -12 221 236 85 167 130 -121 -3 -157 -8 80 -65 325 23 -56 243 -100 -219 62
2201 62 -93 54 251 97 -286 72 102 -143 56 205 -187 -116 -230 -208 81 17 -54 -222 -113 -107 -15 139 -271
2224 -271 -2 -87 -227 77 8 -27 -24 -45 123 57 97 -107 19 320 9 -56 -21 52 -8 119 -253 -277 232 -87
2248 -87 136 -59 -29 161 98 -31 16 -278 -4 -371 28 177 -49 -138 -224 -152 -79 57 13 -90 42 168 -97
2271 -97 -164 -98 -160 -147 71 -210 -8 218 -74 -58 -208 -41 -59 -74 53 -73 -71 32 109 -238 -14 93 -22 -269
2295 -269 -266 -199 117 199 121 -114 68 -53 98 -3 49 -40 -77 312 -179 -206 151 3 330 -236 -98 -74 99
2318 99 152 317 -72 -76 99 -17 375 -221 30 -371 -168 110 141 -202 161 -198 -87 9 218 116 -78 364
2340 364 64 -94 226 373 -115 -36 143 279 73 147 -78 89 -163 182 -104 118 291 118 73 34 -29 199
2362 199 62 -76 69 73 -87 -307 217 158 14 116 198 -85 -122 -169 -74 147 -37 180 -269 -24 -50 -215 9
2385 9 -43 381 -203 229 124 -376 107 134 -406 11 70 31 153 -115 56 -162 -111 -20 -136 43 -31 -300 48
2408 48 -142 115 236 101 105 148 298 -147 201 178 92 -146 -36 -139 182 94 68 262 33 -37 -404 -40 -42 -124
2432 -124 -6 -44 19 -42 26 101 241 -42 30 -189 -204 117 3 242 -36 15 107 92 185 -85 161 -190 -388 -158
2456 -158 55 318 319 -89 -22 -135 -69 15 190 100 239 -174 -118 324 15 -27 -185 -18 19 225 182 404 -4
2479 -4 -217 215 -35 109 -27 -44 236 219 -79 160 24 -27 -89 -391 -129 130 192 -79 38 -60 10 -184 -29
2502 -29 87 -70 10 -96 -31 22 -330 -71 38 -179 -36 5 140 -119 -45 71 32 -34 -166 320 -126 -316 -130
2525 -130 61 -141 37 -23 127 71 -25 188 -277 160 106 70 -163 62 -12 99 6 55 351 -42 -37 82 88 20
2549 20 -95 119 -84 196 184 97 325 -47 87 230 -110 -73 -121 27 97 -56 123 132 70 -38 142 -108 -95
2572 -95 -79 110 117 -181 34 87 35 110 182 -142 -120 -246 -52 -103 -66 -33 55 -15 -391 274 35 55 -79 60 11
2597 11 107 28 -62 75 -268 270 -128 105 -43 -9 -71 -222 42 119 -86 194 249 -110 32 203 14 -47 184
2620 184 148 27 169 109 84 -79 75 279 65 -57 123 -109 85 -98 10 136 43 -114 35 108 60 -221
2642 -221 -56 60 198 -4 36 87 283 99 238 235 -7 -103 -66 235 -94 40 -3 51 -42 -123 -238 98 -171
2665 -171 37 311 -90 358 -97 -140 -30 -191 68 -117 -174 -165 -135 15 49 -108 -113 -198 -24 -125 182 -106 226
2688 226 -146 -215 -1 221 195 91 -42 305 -84 -138 77 -21 42 -271 -45 -1 193 101 199 -153 -1 -54 -4
2711 -4 -104 227 14 -419 127 -49 67 72 -40 48 -56 -157 94 -147 -99 -95 422 179 -28 36 -18 120 -308
2734 -308 148 186 -52 -56 -266 -71 -66 2 -126 493 -188 -4 173 216 -92 185 353 -305 58 129 -73 -132 251
2757 251 -55 151 79 267 93 83 -240 16 176 137 -274 -180 205 20 62 31 204 -14 104 7 60 282 -86
2780 -86 -154 102 -98 172 -55 -163 -158 25 300 -46 -231 22 108 -227 -39 60 -137 20 536 110 -44 242
2802 242 -31 -41 -130 -409 -158 -94 -41 99 38 -313 -7 -278 112 -135 -168 -226 -13 124 93 -131 166 28 -191
2825 -191 -134 -192 -199 58 -181 -275 20 45 -107 76 -136 -14 189 161 -59 -48 128 -10 39 -47 -142 -207 -80 -173
2849 -173 18 87 -25 302 115 137 57 -6 48 -262 -171 -426 247 232 85 -40 -316 -110 92 -41 37 258 -316
2872 -316 124 -167 -327 -26 15 -79 -356 -22 -77 -131 -134 -36 224 -101 -72 280 206 37 -10 -2 -42 -214 -276 -69 129
2897 129 260 -18 -280 -13 -36 36 82 -107 -70 -217 170 179 -41 17 160 -188 181 92 194 36 -128 83 41
2920 41 -257 -351 -163 -84 177 -293 162 -287 -116 -43 234 -118 193 13 -163 -91 -192 -42 -218 -47 20 253
2942 253 -27 -10 -217 -107 -243 99 -223 -127 -346 201 173 -163 142 -248 -55 -56 2 177 -47 50 259 113
2964 113 89 -94 16 6 -73 -199 -229 156 191 48 52 -192 15 29 139 3 47 -58 -48 208 -229 -55 -52 42
2988 42 9 -138 155 52 -64 -182 -16 84 -152 428 147 -308 -52 106 375 -33 25 -139 215 -161 -160 62
3010 62 74 234 399 132 -46 -162 501 -4 79 -245 -15 -91 -24 86 -54 -27 -343 151 89 101 -59 34 -244
3033 -244 78 -215 69 -10 5 -197 -76 75 106 -106 162 190 283 -231 -76 139 24 221 6 41 25 120 98
3056 98 55 373 -229 201 -40 -118 -5 -65 -293 -45 -89 40 -118 126 -121 165 -109 -79 -173 106 -39 44 -140
3079 -140 26 169 138 35 242 -121 40 -3 148 -41 -226 -481 -177 -230 -127 107 63 279 -1 -181 -32
3100 -32 -77 -6 93 -50 -19 94 264 58 -57 -3 -9 -74 164 -53 -1 -119 69 58 -1 3 -274 -5 -224 222 -140
3125 -140 17 141 -23 90 -49 79 -28 50 259 -65 136 -131 156 -153 394 -228 -230 52 -141 -55 256
3146 256 63 129 -120 -193 83 -127 -136 23 5 -217 176 -537 125 -196 -75 157 11 25 -224 -195 242 -282
3168 -282 -13 202 70 -59 -119 -327 312 57 -89 -41 -49 -59 146 143 400 -109 22 -25 -52 132 -104 87 -31
3191 -31 -131 102 -84 -37 -85 -50 -10 -104 153 -32 57 25 -83 -29 24 -282 -79 -33 262 -10 103 -44 198 -161
3215 -161 135 81 -47 -18 143 -42 -119 272 86 -337 146 -219 -40 101 113 202 -44 -35 152 106 186 -250 -157
3238 -157 34 -83 32 -277 -38 106 -407 -252 63 -378 -190 196 -143 75 6 -32 -120 -125 342 144 -3 -310
3260 -310 -5 -146 -114 194 32 207 8 -137 -10 217 -325 57 -53 61 32 224 152 -155 60 42 -64
3281 -64 -221 -63 423 82 62 -28 -350 -39 -168 99 0 100 81 -92 -12 -18 -73 -20 36 342 -138 -23 115 31
3305 31 -347 113 -174 197 33 -167 -343 181 9 32 -199 118 -25 73 203 -95 99 13 -263 72 257
3326 257 -63 -139 -193 -63 -26 -128 -315 99 172 39 83 -3 -73 -127 -182 -187 -20 -152 -104 116 62 73 -56 -68 113
3351 113 345 130 -101 101 10 -131 -132 -313 -87 -181 -313 -175 38 221 395 -22 171 -19 106 -77 -61 -90
3373 -90 56 163 246 79 -123 68 172 257 201 25 -87 -254 72 417 -115 73 156 -78 164 -19 53 -119
3395 -119 -19 32 73 -160 244 -36 110 101 -129 167 39 -110 29 124 -28 -123 25 25 309 -146 77 257 19
3418 19 38 -6 25 -73 64 -1 -124 -124 -48 -125 -56 -144 -205 -207 118 123 179 -13 186 10 -71 -46 -179 75 234 69 -270
3445 -270 -13 85 -86 -135 207 347 148 4 89 -72 249 207 140 -190 -9 271 154 -267 -240 49 -105 -348
3467 -348 159 -48 -60 29 104 -119 -398 47 -295 214 -77 -155 -404 -225 84 273 -122 -129 245 166 -36 -147
3489 -147 -139 -39 -104 54 18 -45 187 253 -58 122 -259 -49 -54 216 281 76 218 77 -65 118 8 -5 218
3512 218 25 -225 -76 156 362 6 124 -157 180 -135 97 124 -80 129 124 268 132 -157 153 123 -92
3533 -92 72 25 -27 1 -273 32 224 -58 -196 -32 358 -140 13 -225 26 114 124 20 107 172 -74 19 31
3556 31 -27 94 -16 -53 -53 161 -15 428 181 -58 -383 -215 230 247 -76 -153 115 38 147 35 367 -134 220
3579 220 217 -323 172 5 -222 62 47 166 -229 -78 -170 178 24 -183 182 -45 -330 123 10 -22 86 255
3601 255 187 -204 88 123 87 17 101 230 -99 11 4 -130 -107 -81 304 -278 67 -239 169 31 132 -192 -89
3624 -89 124 45 -56 -58 -27 -46 -132 -280 -92 -98 -79 31 88 -193 6 -73 -62 5 -127 -432 -109 223 2 -96 -142
3649 -142 -265 -30 -206 -152 398 148 -6 -256 68 244 -234 204 104 9 178 -65 -158 -53 -46 335 68 122
3671 122 -38 -127 121 -213 -100 -200 -262 -77 46 192 37 -184 52 132 -42 14 93 -55 -42 -34 -168 -198 56
3694 56 38 -373 248 -117 1 -315 48 -154 -9 -31 -3 24 20 -125 -195 -176 -120 -56 -4 364 97 -148 72 -45
3718 -45 -57 4 66 136 -271 -54 15 22 -27 -270 -108 264 235 -56 -146 -25 124 -1 -256 149 -103 220 -51 -114
3742 -114 -233 137 -44 52 -86 19 156 -63 -188 247 -78 -105 -42 14 88 -35 -204 112 -81 96 -321 194
3764 194 -298 -149 -220 -87 145 -48 117 170 48 -175 11 -259 -114 -15 47 110 -330 102 82 -127 -77 269
3786 269 169 312 -8 -105 116 -158 165 206 193 143 -1 134 -57 14 -76 -181 24 166 102 51 150 161 -101
3809 -101 217 -219 -81 144 27 -155 -83 39 -171 -4 -97 -106 -270 15 -5 -67 -151 -136 -186 -49 89 -264 241
3832 241 -16 -224 -67 101 38 -156 -122 242 -217 79 81 36 289 -40 -107 6 259 -110 -254 201 11 192
3854 192 129 -93 -6 228 371 -86 199 -96 48 -28 -262 -276 51 -193 273 252 -82 -236 -109 54 176 -6
3876 -6 64 -107 110 163 -149 -157 44 -327 97 -21 86 -27 -35 223 -121 96 127 -146 -44 -301 -155 23 102
3899 102 -2 89 -325 29 -156 56 -67 -121 -225 173 170 -7 -171 -6 18 125 -146 -52 195 212 189 -205 -149
3922 -149 193 -98 -89 -2 124 162 -69 -203 48 -70 177 -164 71 179 37 214 -126 -13 9 103 -228 145
3944 145 95 -81 23 262 -58 15 -118 172 96 -118 -256 138 273 -123 -36 102 456 -45 -129 22 95 108
3966 108 -175 153 150 279 -227 275 -86 185 -106 10 19 46 -159 -133 72 -3 -93 -217 187 -135 42 -144 191
3989 191 8 91 37 -2 551 -37 150 -339 305 -21 2 -208 -283 -37 -133 11 52 -140 284 38 -178 -8
4011 -8 120 -262 -203 156 55 265 69 -229 124 -77 -56 213 -83 -76 -191 260 -46 -81 51 17 -5 -127 -113
4034 -113 -36 -100 -137 -64 77 154 -2 91 -169 -287 253 -100 161 97 -140 -439 -69 -275 -152 -350 105 258
4056 258 -95 203 -155 -91 -134 -34 26 -191 152 -287 342 25 152 -71 98 92 212 50 24 134 -188 131
4078 131 -37 0 -87 -24 -213 -58 179 84 -10 -21 107 -64 76 25 93 -91 -424 118 14 -64 312 214 35
4101 35 9 -74 25 117 -374 183 362 -245 34 42 178 -71 -15 276 -401 -441 242 152 -107 -39 -482 17 -223 -75
4125 -75 -190 -149 304 11 145 -144 -198 55 -150 -160 22 -139 127 -39 -48 -286 -119 -21 -273 39 193 108 -148
4148 -148 138 -164 5 64 145 93 -101 182 97 267 49 -245 132 123 -106 -44 -38 8 129 193 -54 -124 292 2
4172 2 14 -147 3 -3 225 -130 17 248 35 100 129 -123 21 -281 13 -22 -2 73 -253 58 -112 -239 10
4195 10 59 -335 37 121 -171 -86 54 26 157 -103 -272 -86 121 395 122 -11 274 -65 -108 0 -38 -53 -169
4218 -169 -40 -123 -4 297 -94 -60 207 -367 459 264 171 -154 -238 160 -264 -78 287 -77 221 101 3 97
4240 97 326 375 73 23 22 -35 16 167 -41 156 183 41 79 388 -58 9 -5 127 419 -226 78 40 -240 -15
4264 -15 -142 53 139 433 98 51 62 51 136 -349 115 -152 100 -271 -59 60 153 168 15 38 -249 83 -26
4287 -26 5 22 201 162 78 -135 36 -116 -81 7 85 33 -324 -38 264 208 -72 513 189 -33 169 43 -244
4310 -244 92 -103 -5 -238 -376 -51 -58 218 -95 65 25 241 115 15 -138 -79 -15 333 -57 5 -101 -386
4332 -386 -265 -106 -156 48 -15 22 31 135 118 -73 144 71 240 -41 -117 22 -212 -31 32 -135 -81 247 -186
4355 -186 -42 117 -45 -274 163 146 -156 87 77 67 -106 45 246 105 -97 214 85 55 45 -51 193 -227
4377 -227 -245 193 -30 189 222 -12 -132 30 83 -5 -225 -173 290 -7 288 -227 206 85 228 24 -101 -308
4399 -308 -159 -116 -20 107 214 28 -178 303 -82 56 -116 -12 269 236 28 -169 -173 453 -134 199 -73 52
4421 52 49 97 302 74 -324 180 -56 -118 94 1 5 1 154 -126 17 -172 160 -113 92 5 -70 -37 -53 37 -43
4446 -43 -186 -63 284 -150 110 -43 -151 -39 11 -7 25 108 196 64 290 -344 174 -157 70 81 22 33 26 -100
4470 -100 218 21 59 -230 398 -39 93 -83 -12 36 -47 -392 95 -165 -179 -71 40 122 -37 -176 -336 76
4492 76 -317 103 -96 -230 -22 128 -105 -63 -163 -11 -66 -37 28 65 -119 102 -315 -255 -190 -52 94 -130 -95
4515 -95 48 87 80 -107 -165 -113 190 -103 -30 153 80 210 -296 70 117 42 -65 -180 72 -139 -27 16 226 125
4539 125 122 -59 -91 -19 -270 278 -10 96 -324 163 -85 21 47 -22 -169 371 -114 14 -56 -66 -38 -39 -22 -309
4563 -309 93 -8 227 41 -34 57 209 73 337 -144 -122 -83 -44 -76 -128 133 -18 99 -175 -39 3 -156 -195
4586 -195 148 -244 42 106 277 -12 -148 108 8 -307 -170 -57 130 527 -164 66 -50 40 13 -274 -429
4607 -429 186 123 -114 171 -312 309 -212 -353 -97 210 107 -34 294 -257 195 -35 226 277 36 246 128
4628 128 101 -257 -3 104 39 46 -221 97 98 133 -85 -63 -52 -138 -17 -97 54 -82 -73 126 -35 98 -288 -113
4652 -113 -6 307 175 -77 -62 -96 41 -118 2 -214 208 -194 -25 108 238 198 -197 -81 -20 -11 227 -274
4674 -274 153 7 356 113 -52 -46 -55 -333 -199 -194 18 100 114 21 -13 219 -176 223 137 82 291 -66 -92 13
4698 13 -138 -211 -121 -109 -31 -220 2 416 87 -46 174 -143 156 -38 -83 -25 -105 13 -101 107 -82 78 -31
4721 -31 203 -22 -207 114 116 -96 221 -33 65 -149 76 -132 -183 -25 -75 14 -26 20 29 -138 30 -1 42 112 93
4746 93 19 -67 162 152 129 219 -83 -195 83 202 20 172 248 -82 -239 -103 -179 -265 75 -29 -200 166 135
4769 135 116 36 -427 46 -56 -246 123 -132 197 -31 -47 211 -111 312 44 10 -318 -45 98 -140 -188 90
4791 90 141 59 -3 -160 164 34 -34 168 -227 267 -47 29 -42 -106 -58 -46 148 48 268 -7 31 62 -180 141
4815 141 81 14 84 110 -22 218 17 -58 -143 131 91 166 36 13 68 74 116 -198 -129 118 -320 -96 102 -72 106
4840 106 97 -152 124 14 84 -328 -54 129 -28 -63 -305 -150 -55 -301 -149 -87 7 -76 131 6 29 -122 -396
4863 -396 52 -95 -319 -81 11 -190 132 131 32 -37 9 -38 81 160 -131 79 -205 -1 -68 5 -103 145 17
4886 17 268 -200 329 -156 -233 -75 -212 -142 93 57 214 -234 -33 275 150 148 199 -44 297 -16 -52 -27 -72
4909 -72 -178 182 66 -181 -193 47 128 218 8 330 -97 -170 219 -9 157 -187 203 -270 -160 139 35 29
4931 29 -57 93 -119 -403 -272 -92 -228 -235 54 -3 100 188 -230 104 -12 -279 -359 43 -12 7 -40 271 37
4954 37 65 48 148 -17 43 -243 -119 5 237 315 91 89 11 132 -72 195 -65 82 -46 156 -95 23 -35
4977 -35 -198 -71 -81 -81 -107 -152 203 117 74 6 118 10 122 193 61 49 -124 -137 4 84 -115 33 113 141 -260
5002 -260 -162 -98 -81 128 -159 248 -213 90 54 -26 88 -105 107 -87 -28 151 48 66 -21 -92 149 -168 116
5025 116 -98 -45 -2 75 22 107 -154 29 -48 -14 -264 44 195 -244 64 491 -82 -63 -22 119 19 -38 57 -1
5049 -1 -131 -57 360 48 175 32 28 33 94 -65 48 -330 192 -222 -269 -217 187 -39 -212 92 -69 -245 -10
5072 -10 -29 59 135 244 28 -117 -143 -177 7 -44 -171 -177 93 -137 177 -8 140 -52 243 160 -121 -176 -71 -174
5096 -174 -15 138 124 131 -144 343 1 150 -85 -20 -65 28 5 49 -214 0 -160 188 52 164 244 193 84
5119 84 -244 -38 188 -34 -245 -45 178 148 -71 65 -58 -166 18 72 -9 84 -85 153 171 146 -94 94
5141 94 12 145 132 187 -2 -90 33 -92 155 -70 61 228 -148 21 181 23 -78 160 -195 -141 191 299
5163 299 16 -87 58 -242 -37 231 31 142 -203 -195 26 37 -257 -184 65 -211 118 193 81 -202 97 -9
5185 -9 177 43 -54 79 -81 203 137 94 -161 73 -154 -129 237 248 -254 -217 -304 -228 209 11 -22 173 -174 -167
5209 -167 -123 52 165 -66 100 104 76 87 123 135 221 -95 -240 129 -34 104 63 -46 108 -4 -290 211 -75
5232 -75 -125 117 -151 -5 -72 47 -113 163 33 183 68 -20 -26 142 155 -79 10 -370 125 145 107 211 -118
5255 -118 -172 -51 -188 71 -78 185 7 -147 150 67 -45 0 40 7 143 22 -17 -388 33 -424 -178 255
5277 255 44 26 -122 -84 44 51 229 -128 15 -34 -271 71 178 78 -202 -128 -205 65 -104 234 55 14 131
5300 131 113 -55 -219 147 62 -153 -161 -50 -201 61 171 11 -130 104 38 -145 123 -35 165 62 61 -313
5322 -313 23 234 -150 -247 238 231 -96 61 24 -22 53 -21 -324 -86 -301 74 -112 159 -158 -179 -85 -186 138
5345 138 -89 -30 380 -168 -12 -307 -182 82 -171 -226 -134 169 -47 99 -22 450 94 -100 -259 -50 -101
5366 -101 131 -110 -118 -108 9 74 -98 13 -91 -127 213 233 -36 110 -117 29 59 208 -26 -133 -93 -171 -56
5389 -56 -179 -3 140 -164 -128 129 -36 -205 -38 -98 36 50 36 84 -110 -17 -203 313 51 142 -14 60 180
5412 180 313 108 13 128 -97 -24 96 241 292 116 49 63 -121 94 116 88 -238 22 204 18 -4 -58 -76
5435 -76 49 204 -254 3 313 -149 230 -317 145 63 36 -114 -92 50 2 357 -40 140 -119 -46 154 4
5457 4 213 -191 132 90 -3 -261 181 58 227 -159 17 44 159 25 -78 -27 -84 -214 199 -149 -152 126 21
5480 21 -169 -70 190 159 -208 214 -143 -127 40 98 -134 -92 181 -21 -107 14 -220 311 153 -91 42 84 -36
5503 -36 121 12 39 66 -271 -201 318 -79 -77 29 -150 128 -155 -182 310 144 -141 15 -194 89 39 215 -89
5526 -89 196 -16 -69 149 88 133 15 169 -439 -16 -93 -99 -75 1 72 64 -66 -355 -163 72 -113 -114 59 16 -8
5551 -8 244 -60 -111 -391 -45 -201 -137 -128 -56 277 128 -20 -76 172 77 -10 151 96 236 35 -243 -87 -115 128
5575 128 -210 65 -55 -226 132 -168 -328 26 -284 40 -62 -111 15 283 57 41 -70 68 248 355 16
5596 16 -97 -174 241 -43 -84 -200 -112 -89 192 -180 59 94 12 47 -9 -298 -14 248 -24 -100 127 18 20 -48
5620 -48 206 -300 -57 35 -55 236 42 249 31 -117 114 5 232 -72 86 -248 -186 85 99 133 124 -25 252
5643 252 -44 463 193 113 196 -58 95 -128 -37 -137 -205 122 371 -44 -40 80 -125 65 39 -36 -32 -182 -119 4
5667 4 -28 125 98 55 -60 103 34 138 195 121 286 -98 -88 -251 58 -240 92 -153 2 -18 -71 -19 -44 52 19
5692 19 300 -45 -272 -46 232 260 4 -271 -149 264 90 126 -70 -347 -107 26 156 -41 75 60 216
5713 216 -167 205 22 -44 70 -23 -173 123 -409 7 -64 -143 17 125 329 -21 8 -53 -111 145 91 -244 -112
5736 -112 -107 58 -361 -128 -330 351 -22 -21 -35 141 -81 194 -34 -42 117 -30 -34 -75 345 17 32 57 -248 114
5760 114 13 122 -173 -255 170 -91 73 -7 -243 -88 -205 161 -54 -348 154 58 49 -281 128 -355 -38 -118
5782 -118 165 -98 308 183 -38 -183 -187 -96 117 348 -29 -274 -30 25 364 -32 -95 202 -156 -171 -103 128
5804 128 -134 81 94 68 -40 -9 102 -115 -42 -141 -148 278 28 -153 20 -98 -103 257 -120 -86 359 -231 -144 -45
5828 -45 -204 -248 13 -223 -410 19 340 -43 -116 66 -6 -124 -189 -178 -131 160 -72 -198 19 205 -22 -334
5850 -334 -319 63 -5 -38 -4 199 -368 -29 52 -175 -174 -232 108 -495 181 -286 1 -31 -11 75 41 -209 196 -21
5874 -21 -131 -113 54 -71 -52 -213 138 -104 -49 87 190 -56 104 -327 -120 50 -159 206 -159 -390 141
5895 141 131 -66 -111 -375 134 -89 -122 -29 170 114 165 -191 56 -68 -79 132 -250 84 75 28 -102 316 346 129
5919 129 -51 -6 -152 -140 -4 -260 44 5 -91 -97 147 3 9 20 -32 -213 -297 -46 -2 283 308 406 208 70 -222
5944 -222 -25 -264 -240 103 245 -5 17 -290 -224 -22 219 -110 -261 -35 -202 107 71 -69 -274 153 -151
5965 -151 -39 -219 182 272 -404 -94 -122 63 1 87 72 47 -29 107 20 69 48 -99 64 -217 -8 -244 -132
5988 -132 -15 15 -153 -184 -36 -102 -58 104 -161 -80 233 33 -64 54 -19 511 -180 -3 -19 -139 -56 229 7
6011 7 -192 -109 -192 -199 93 35 41 -159 127 148 -74 150 -71 170 -59 195 66 354 -97 92 138 240 -31 -73
6035 -73 -127 183 233 40 -61 6 -106 -35 178 204 -222 89 -42 -318 125 28 -118 -62 136 -252 -52 123 44
6058 44 141 -284 129 -20 -55 203 -81 256 -3 -85 168 -89 159 -212 -5 125 -167 82 -237 -151 -8 -301
6080 -301 -32 -83 290 10 231 191 172 -19 165 292 194 430 -185 239 69 -225 311 -66 -65 8 -64 -43 403
6103 403 235 -189 -21 -192 294 319 284 -273 -110 92 -90 -77 22 205 -203 41 118 -344 -12 -62 -234 89
6125 89 80 -92 51 110 91 -4 198 94 22 -168 25 60 -47 54 127 226 -54 -263 185 37 31 -5 54 -17 -146
6150 -146 -162 -117 -94 -347 -8 -153 347 74 -209 -35 -383 -104 -77 -84 -112 -77 -147 -122 -250 141 58 -78 25 -62
6174 -62 -345 -33 -13 -261 127 -217 -83 -104 204 -101 147 67 77 215 -187 67 20 36 -24 76 210 -3 218
6197 218 -105 24 43 -230 -19 -118 201 126 -245 155 0 152 219 -251 138 -61 -242 -193 -48 -145 142 237
6219 237 180 -118 -173 200 -142 22 0 -129 283 -39 -90 120 30 268 60 -147 -279 41 -146 66 -70 -172
6241 -172 -183 286 97 85 78 237 72 104 128 153 -25 -57 21 226 72 98 154 196 -41 -103 261 395 10 260
6265 260 82 -24 -347 -61 -56 181 -7 -41 -12 117 -145 -193 3 -322 59 -137 -229 -215 150 12 153 -245
6287 -245 39 1 -4 -13 38 -164 -4 18 -17 -14 100 110 -136 -233 161 -76 215 204 -120 -59 -61 353 79 59 26 372
6313 372 -128 -95 76 -165 300 217 -66 148 5 14 220 -316 -109 230 -53 -212 177 -290 -12 -77 126 -23
6335 -23 377 -122 -90 67 -19 -183 -348 159 -266 183 206 -106 152 299 -170 -21 -215 -87 205 41 -185
6356 -185 -157 42 35 -104 -87 -41 166 96 438 3 111 202 -91 313 -50 251 -32 -14 -127 80 101 -74 88
6379 88 280 57 -15 -81 69 115 -190 -26 30 -162 -87 269 -28 -90 -247 -95 146 -59 -113 0 304 -318 -292
6402 -292 -145 -258 33 -234 -10 256 -152 -20 -222 53 -20 -179 -100 76 -5 172 165 -7 -83 -244 -81 -91
6424 -91 198 78 40 26 -153 -197 -20 -126 51 -310 217 -11 -78 -2 24 -32 -139 -52 -70 -294 -97 -17 222 -31
6448 -31 -278 -73 9 12 -60 64 -168 79 -35 62 -117 -259 68 171 -95 111 411 19 -181 -204 -19 -172
6470 -172 -27 29 194 360 -33 -147 442 -20 200 -209 44 -220 350 -66 -41 -319 159 -20 48 -52 -299
6491 -299 -198 92 389 -57 109 -66 -140 -74 492 -40 48 -108 -32 157 -62 52 19 85 152 -3 229 -165
6513 -165 -308 -74 -222 -243 48 35 79 54 9 -177 -74 -64 26 -176 178 -198 69 81 213 260 108 106 -132 8
6537 8 50 149 122 71 -136 -151 77 66 -27 109 264 -258 25 35 -81 175 -19 91 -83 196 60 -171 191
6560 191 133 5 475 150 0 134 -72 47 143 -131 5 -86 58 146 81 1 24 -252 116 -254 148 111 -212
6583 -212 -113 9 -193 -322 -21 37 2 286 347 -143 28 28 -11 254 470 -59 188 -172 159 -102 -87 338 -113
6606 -113 143 22 -277 3 -51 157 51 229 191 -21 156 132 -119 -20 -272 262 166 -82 -147 -110 167 387
6628 387 -7 222 156 -155 -244 48 -333 172 -94 38 252 -289 -200 127 -39 -220 -220 -166 33 175 -45 101
6650 101 68 -52 -169 156 160 73 29 138 44 179 40 -21 93 -233 96 88 -12 292 22 -118 -200 111 113 182
6674 182 -187 -114 43 -2 131 52 -264 156 -86 -11 -162 -136 -287 -85 47 75 -69 26 -70 -392 141 151 55
6697 55 303 87 -62 125 -150 170 -129 -101 -88 -7 -389 -156 59 186 254 18 -116 43 -14 136 -138 79
6719 79 -45 -190 -251 99 169 -114 28 -261 -358 22 214 97 -78 42 -183 163 -71 142 -54 67 12 -43
6741 -43 -200 -72 163 -282 -56 303 47 -46 77 -29 -79 46 60 -290 -85 73 -154 -26 14 -219 86 -118
6763 -118 -60 -188 80 135 -197 -28 5 -53 28 19 173 -104 190 232 151 138 157 -93 -90 -71 -55 -3 -245 -41 -159
6788 -159 147 -205 -65 16 -115 -110 -29 -254 170 136 35 -12 118 100 -139 221 -264 -1 208 176 -242 -12 -265
6811 -265 41 265 260 138 -204 118 92 98 -196 108 -29 36 77 2 -113 -104 -78 72 -10 -73 226 72 -23 149 168
6836 168 174 83 244 -179 -14 59 -283 10 132 -13 -46 -124 -135 90 -381 175 142 5 292 -303 -31 -89 -213
6859 -213 3 -311 -24 -321 -66 125 144 129 50 -28 89 -107 -181 -93 171 44 -155 194 82 188 -142 52
6881 52 21 118 133 -129 -259 120 164 -80 62 114 -37 -408 -308 401 238 -22 -44 -84 7 46 -124 93 -187
6904 -187 321 -148 -335 163 -20 -114 229 189 -398 -139 214 196 -97 -14 202 -96 117 -110 130 35 -89 -136
6926 -136 192 51 200 -304 152 26 -139 122 -146 48 114 54 160 139 -72 78 -174 51 -80 -52 83
6947 83 179 119 177 122 -251 50 -46 210 -86 -238 247 -41 289 -83 185 -298 149 190 -122 125 28 -51 91
6970 91 -61 171 -52 -20 288 127 -217 -298 294 19 81 -33 41 -161 291 -22 22 168 263 323 152 137 -130
6993 -130 167 -99 89 110 -26 -9 -355 -273 88 284 133 -32 -12 146 -81 -332 422 87 181 77 5 16
7015 16 -115 35 -100 202 89 -194 91 192 -324 0 -189 81 157 196 286 134 500 -180 181 288 -6
7036 -6 384 -304 -32 -108 -135 165 -78 -71 71 108 295 -81 -50 -192 -39 -236 -62 63 261 -202 -101 157 -237
7059 -237 164 -236 12 406 -124 191 261 -69 -125 -151 175 -184 -251 124 -382 -128 -18 -92 191 216 -248 133
7081 133 294 -62 170 -32 -326 -49 -83 -166 -75 98 181 -285 -38 -111 -129 148 -49 -125 444 -146 105 -92
7103 -92 292 -159 -149 -108 80 30 -57 309 65 25 131 189 -103 253 23 43 -370 81 134 57 141 -104 66 -5
7127 -5 -18 -38 17 -84 157 -249 -53 289 82 -138 117 -37 38 -52 244 234 -58 41 72 -126 62 -181 -82 49
7151 49 25 62 4 -215 -187 -275 0 41 -68 143 -272 95 90 -134 -175 -191 320 -111 77 -219 413 184 -121 -42
7175 -42 -95 61 -34 14 22 -61 -97 24 -117 38 223 -143 300 110 -101 -151 -156 42 87 103 119 -64 77 -161 -26
7200 -26 72 197 146 92 -320 -167 -149 -77 -105 -30 333 -90 -202 246 37 -114 127 158 -255 5 -62 168 79 -48
7224 -48 19 168 -43 -9 177 -178 139 33 -259 -36 -109 7 235 -90 66 135 -83 214 -22 10 56 110 80
7247 80 -39 -34 -136 -40 -74 197 165 68 32 124 49 -26 -264 -131 78 -57 46 -444 120 41 -24 -68 -129 -75 -224
7272 -224 -271 133 13 283 -4 113 336 81 -140 357 140 17 202 31 172 -253 17 -152 -18 -33 -333
7293 -333 -139 33 -241 178 170 -143 93 -10 -8 -115 417 -120 -134 -51 -14 -32 -329 -178 -181 146 130 143 113 -171
7317 -171 -183 40 217 -420 -67 33 106 -364 -131 -8 150 6 -249 -155 -306 13 172 -185 -72 -68 67 161
7339 161 386 -253 -170 -152 142 -131 -228 136 -14 197 -56 70 174 -81 3 33 33 148 -3 -130 39 -61
7361 -61 -13 -57 -226 -84 -40 267 -80 -4 -108 190 182 -333 -222 269 -72 142 112 -37 76 71 26 81 -72 -177
7385 -177 331 -70 162 -135 0 -105 -110 148 -32 90 85 63 -265 -379 -163 -135 -101 -273 56 -62 -37 53 231
7408 231 180 -34 -162 -120 -123 -153 383 -171 -7 125 -215 29 -188 19 145 169 19 158 -55 225 184 -23
7430 -23 -127 -56 29 -226 45 219 -310 -158 -125 -89 207 27 21 -140 72 120 67 197 89 42 281 26 241
7453 241 -58 -75 93 -21 -61 -230 -67 235 144 132 460 -111 33 118 -157 255 38 -174 -194 -123 9 -119
7475 -119 115 60 367 57 -129 14 -78 -125 261 93 82 10 129 91 -12 82 -136 -371 52 -224 182 -25
7497 -25 -115 -59 -58 75 58 -260 96 173 -42 -72 35 231 164 119 117 223 -251 267 -32 280 -12 -345 26 -72
7521 -72 35 -60 73 238 150 -75 -23 -229 -53 225 -251 240 162 358 -119 -80 59 18 112 9 373 -87 252
7544 252 -324 -267 66 -323 -113 163 251 13 177 -186 -34 -25 -117 -14 -10 1 -130 125 127 13 -63 42 241 -124
7568 -124 154 -75 219 -14 58 118 43 207 121 225 46 -247 -170 104 -22 133 127 185 -278 -124 90 36 -41
7591 -41 85 55 -121 -25 -65 65 39 -52 100 -32 -178 -129 172 7 170 -47 -91 161 384 100 -91 -50 -156
7614 -156 261 -5 150 -9 198 23 -216 85 -122 175 181 -73 -275 3 61 -218 403 104 45 -122 96
7635 96 257 -30 -41 102 103 -46 128 -212 89 50 -342 328 -132 -125 -18 -126 139 170 54 -8 271 109 61
7658 61 0 -58 -28 -102 -54 -25 130 63 -65 140 -8 -211 136 202 -328 133 -254 -61 74 -225 -109 66 84
7681 84 195 -143 133 -162 -186 -103 362 -136 149 178 -134 -44 215 24 284 360 -42 -232 391 -47 -36 -192
7703 -192 45 -89 -104 -144 -36 -315 -140 190 -39 -277 -210 -88 12 190 139 -2 23 95 -76 -59 -72 -72 112
7726 112 234 150 -6 84 -67 -131 136 -132 163 126 -175 -371 -372 161 -142 -149 97 -34 -143 -10 -95 -34 26 -232
7750 -232 169 72 122 123 59 151 -84 -170 126 13 -319 -145 -23 25 435 -73 -149 -183 -225 50 150 -96 63 335
7774 335 169 -2 264 -50 -134 32 128 -91 -45 324 -104 -98 249 6 92 -14 94 428 -162 136 24 -54
7796 -54 -56 10 280 200 101 68 -103 -60 214 238 -67 -133 -78 92 264 234 145 83 256 -91 159 104 -151 -248 -46
7821 -46 -192 206 -205 -60 -340 -20 136 0 468 69 40 166 -224 -68 163 195 -42 -105 232 172 264 -11
7843 -11 44 -243 85 0 2 39 265 0 -284 -54 10 149 86 12 84 -102 97 76 -66 90 66 31 8 235 -84
7868 -84 -91 -8 296 -71 -117 106 -60 261 -232 -36 62 -204 -179 -158 141 -49 -338 7 -37 -23 -326 89 -9 -34
7892 -34 46 -100 314 -127 229 247 270 -66 -47 22 77 171 -26 -1 -157 -48 -40 215 161 117 -67 300 -149 -147 -19
7917 -19 -2 58 114 122 -278 -164 -118 137 40 -62 -78 -326 111 45 67 35 -242 237 88 164 50 312 -52 345
7941 345 -202 74 -63 -270 94 23 7 26 73 -209 -63 -112 266 460 1 -379 191 -118 213 -54 130 191
7963 191 12 -104 -61 34 -93 -175 -81 66 -285 217 67 -323 -110 -3 122 -153 -130 27 -53 147 -165 -220
7985 -220 418 -1 513 -78 188 120 112 118 -57 188 -32 -300 107 -29 315 -28 -32 157 50 -19 41 200 20
8008 20 109 -242 251 -255 129 112 -261 185 -36 -132 151 -281 -76 -215 -61 -283 46 -70 -14 -236 -32 -209
8030 -209 -138 -188 112 139 -45 -227 -329 -100 292 -3 12 32 56 -147 -25 5 -406 277 256 3 -229 -120 -215
8053 -215 58 -235 24 -283 68 -60 -266 284 262 -45 172 213 113 123 -8 60 107 143 45 155 -9 -149
8075 -149 219 -75 -143 37 53 225 122 -119 0 -273 -80 176 106 -3 -46 20 59 -116 224 35 279 256
8097 256 74 118 -266 107 -127 94 111 219 -141 -87 -15 -145 44 -79 -231 39 195 -83 -20 171 -70 -149
8119 -149 -158 148 196 -22 120 -47 49 110 28 -40 -80 -8 -78 109 191 38 336 6 108 45 -54 3 94 -221 265
8144 265 154 -101 199 -43 -81 -135 -129 34 -96 -93 39 35 -131 -133 -14 -125 22 32 63 -213 -8 -177 356 -30
8168 -30 207 -71 -47 138 -109 -15 68 -123 173 -47 -95 -51 366 -127 -145 -330 -223 -137 -108 263 170 62 -65
8191f5
$$ Imaginary data points
##PAGE= N=2
##DATA TABLE= (X++(I..I)), XYDATA
0 0 0 0 0 0 0 0 0 0 0 0 0 7 -8 8 -8 8 -10 16 -16 18 -24 25 -32 34 -40 46 -51 59 -67 75 -83 95 -107 118 -132
35 -132 148 -163 184 -201 223 -247 273 -302 334 -371 412 -458 511 -572 644 -731 837 -967 1135
54 1135 -1357 1676 -2154 2962 -4582 9053 -44819 -162693 -65765 -10614 -45980 -40270 -18352
67 -18352 -70051 -69252 5668 25632 4357 30670 23272 -26379 -6226 33204 -18737 -49520 6756
80 6756 11510 -44104 -20998 26241 -4098 -10838 57046 69594 20787 13518 18051 -1322 27796
93 27796 61203 -5283 -76683 -42507 -5153 -26172 -11638 19951 -19463 -52582 -2236 36837
105 36837 21366 24170 29584 -5428 -14052 16609 7123 -18843 4158 11898 -26979 -17945 29097
118 29097 11325 -21956 20216 59451 26499 -1700 5365 -1555 -1521 23203 8564 -38788 -43095
131 -43095 -25900 -34967 -22357 14199 -4422 -45391 -22047 17361 6373 2069 24766 10878
143 10878 -20675 -8934 10488 758 -1267 3609 -12856 -12028 18397 15238 -12553 7852 42727
156 42727 24817 161 11581 11850 -5425 6244 20323 -2852 -24629 -19835 -18312 -13833 7818
169 7818 7706 -17612 -15303 5109 -1235 -3618 21700 20850 -15365 -20182 5242 6960 -4250 -1429
183 -1429 -1903 -7397 1843 7616 -3006 2870 21904 14858 95 7959 8897 -9387 -5745 14859
197 14859 5716 -18174 -17328 -9361 -11548 -4639 6437 364 -7098 -4455 -6362 -4259 14978 18760
211 18760 -6436 -16543 485 4776 -5493 283 7625 -1401 -5190 3118 4238 2559 10040 11055
225 11055 3691 3612 3397 -6736 -5271 8824 5354 -11578 -10539 -2635 -8029 -10267 3066 8829 -1002
240 -1002 -7502 -7026 -3098 6376 10654 325 -8526 -2411 -401 -4502 1970 10348 3113 -4349 1575
255 1575 5977 2597 4204 10197 7628 613 -2357 -3562 -1440 4361 2492 -5280 -4595 -166 -5533
270 -5533 -9103 2015 9554 1059 -7316 -5890 -2511 -851 2561 1784 -2773 -4984 -5289 -5084 615 6049
286 6049 2213 -2677 683 2385 -2282 -950 7367 7230 -1901 -5815 -2580 -87 391 259 -229 472
302 472 398 -3429 -3798 3235 7794 2403 -2039 -740 -947 -2270 1324 5191 2409 -3078 -3373 -552 2138
319 2138 3840 3299 2865 2865 232 -2749 -495 5683 5067 -1980 -4896 -2435 -1676 -2567 -798 1184 715
336 715 -1790 -3662 -2583 862 2761 1514 -689 -1655 -3676 -4830 -1616 2810 673 -3859 -3696 -974
352 -974 -87 -354 1583 4308 2939 -988 -3594 -638 3655 2961 -446 -1888 -693 -1523 -2027 902 4215
369 4215 3185 384 -295 1098 1521 2117 3427 3787 903 -2656 -3004 805 2861 1037 -1160 -264 167
386 167 -1162 -1921 1605 4259 2317 -2167 -3296 -1552 18 -209 -798 -870 -2044 -3931 -3468 -354 1875
403 1875 969 -169 -4 -368 -1485 -503 2721 3301 -68 -3333 -2583 80 1007 352 540 1176 618 -1846
421 -1846 -1102 1677 3359 1628 -505 -1249 -1269 -1374 -234 1352 1218 -884 -2082 -890 896 1385 1429
438 1429 1980 1896 28 -1951 -279 2535 3129 333 -1383 -1093 -458 -461 178 1620 1480 -191 -1899 -1568
456 -1568 264 1301 5 -484 -1406 -2461 -3091 -1298 938 81 -1133 -1612 -835 -209 -220 808 2289
473 2289 1764 -564 -2182 -905 1718 1964 239 206 338 -394 -762 1195 2566 1710 419 -266 -698 -373
491 -373 127 628 253 -815 -2453 -2734 -890 585 58 -890 74 669 -1073 -732 1196 2145 1334 28
509 28 -948 -919 209 1351 485 544 679 -645 -738 1095 2294 1183 412 375 -473 -1624 -620 347 6
528 6 -1014 -2052 -2521 -1267 186 192 -436 681 801 -735 -707 1132 1770 538 189 -118 -1332 -1044 584
547 584 1081 503 492 -116 -1071 415 1883 1091 684 734 -210 -2061 -751 819 -654 -1835 -1310 -1299 -1592
566 -1592 -634 88 -81 333 1200 141 -512 735 1299 593 440 677 -906 -1762 190 1224 746 563
584 563 1008 -390 -71 1461 2068 1215 1119 624 -1701 -901 644 -441 -2073 -1523 -979 -1599 -1031 584
602 584 -53 -137 959 847 -491 305 583 -154 -23 805 -555 -2192 -573 775 -132 469 1507 386
620 386 -922 481 1800 1392 1017 501 -980 -1593 414 577 -1170 -1202 -279 -1227 -1181 512 794 -126 446
639 446 1423 440 -192 657 459 -146 730 670 -1048 -690 359 -174 132 1959 1349 -977 -434 1236 1096
658 1096 823 787 -581 -2094 -593 780 -591 -1168 -720 -1344 -1512 298 701 -455 -135 1048 47
675 47 -361 605 586 -963 -294 277 -677 -694 151 122 -551 1074 2090 103 -444 767 1075 429 1246 613
695 613 -1606 -987 730 306 -860 -12 -659 -1354 -617 1199 253 -231 745 252 -459 439 1125 -480 -640
714 -640 453 181 -653 -384 65 -673 196 1435 774 -754 -30 770 256 696 1038 -1040 -1971 -304 294
733 294 -496 -330 91 -1314 -977 633 755 13 186 234 -542 203 1071 68 -655 -155 375 -148 -138 381
753 381 -503 -207 1362 953 -33 -79 606 349 294 1101 158 -1236 -437 126 -485 143 686 -764 -1663 99
773 99 698 104 288 259 -294 -456 838 359 -550 -151 231 -296 -311 433 -112 -838 545 969 87 -251 317
794 317 5 -33 501 631 -765 -611 -110 -535 -136 322 26 -1337 -683 205 319 112 722 -19 -660 -10
814 -10 583 15 -390 329 -227 -199 520 438 -259 45 699 257 -483 78 241 -155 94 573 -246 -533 -421
835 -421 -220 -290 311 553 -430 -768 338 443 -159 380 217 -359 -368 278 -114 2 233 -51 -412 -105 586
856 586 -41 126 496 456 -361 153 100 -272 181 359 -103 -580 -118 -70 -346 121 568 -399 -679 -140 -33
877 -33 212 323 65 -169 -813 127 -26 -281 201 308 -422 -286 462 189 188 417 466 -181 -87 458 82 -343
899 -343 -3 113 48 -299 -21 42 -208 612 358 -342 -110 38 -139 14 231 172 -492 27 20 -165 204 407
921 407 -229 -19 100 172 -186 139 238 93 29 112 36 -423 -7 -7 -123 -427 -119 -63 -298 100 161 -156 -504
944 -504 52 -248 -249 211 -171 -397 -239 33 -274 122 124 141 -148 43 -47 -201 67 -61 70 92 -20 170 -176
967 -176 325 312 384 -75 39 157 -142 284 101 78 -215 -5 32 -251 101 315 -171 -180 159 -165 -156 195 -226
990 -226 -107 -22 -176 129 153 -165 -270 -154 -136 16 -23 -141 134 106 -185 -18 -104 -384 -21 -44 -81 -1 26 -14
1014 -14 166 61 47 -133 65 57 -22 212 66 347 -176 215 -113 -179 -52 -241 -19 -189 -157 179 2 85 -63
1037 -63 201 162 213 -178 58 75 49 -188 43 -226 -194 -161 -172 -227 -66 -281 7 347 -126 -210 429 -218 -398
1060 -398 -184 -29 -87 142 -122 70 -178 388 71 -159 -28 272 -96 113 298 7 233 -139 -90 -102 -57
1081 -57 -222 150 -253 25 29 -129 210 80 -58 55 -71 93 150 -149 -235 -166 129 -31 -75 -305 -382 73 162
1104 162 128 -133 39 189 -361 175 123 183 -78 75 -133 400 7 -156 -1 197 186 -221 8 -396 120
1125 120 32 -149 59 299 178 5 -10 -16 -151 -46 37 -179 355 171 248 27 38 215 13 -30 238 -14 -178
1148 -178 -170 14 248 76 0 53 -120 230 -36 -209 -21 231 268 -6 -165 35 -111 60 21 -43 -81 65 -84
1171 -84 -68 147 94 89 -60 139 -186 -116 -40 228 185 -18 -116 52 129 -73 92 98 130 -137 -68 17 -292 -107 -22
1196 -22 -132 -53 166 -263 339 14 -33 -236 -93 237 -87 243 -51 -20 255 -13 -382 211 127 -9 9 -173
1218 -173 -267 -72 0 -43 -258 -214 -92 -100 -244 -69 -101 -86 -135 258 -269 -307 -145 163 291 -185 -120 94 -138 100
1242 100 309 33 -50 -166 173 -196 64 89 -86 -243 -90 -204 -434 -69 61 63 -280 124 -80 -215 29
1263 29 37 33 156 58 189 7 -34 48 94 -8 258 54 82 190 -222 256 -62 -29 -146 13 219 137 -92 94
1287 94 37 -144 -130 -80 46 -109 -410 -93 -130 -326 -377 357 -230 -264 -13 -94 83 -85 -23 -59 -90 225 28 -71
1311 -71 -75 -202 21 -7 136 210 -152 -272 194 -167 39 59 -261 -404 -245 193 39 -52 195 36 225 106
1333 106 -199 -112 -150 -247 270 381 -79 -331 171 -172 42 263 -248 -136 79 24 -68 -25 92 -41 -53 -212
1355 -212 164 -40 -35 55 3 -351 55 -213 81 -271 24 110 39 -244 -203 -15 -186 100 32 -258 -48 -64 189
1378 189 -117 107 191 -85 92 -18 178 -6 224 -264 -167 -78 85 72 -56 105 -269 -106 67 21 -47 -34
1400 -34 288 -10 -131 -114 -139 -88 -47 -47 63 -126 16 75 -179 133 195 -147 -180 63 -276 -189 -183 0 265 220 147
1425 147 78 -201 -84 43 -105 115 307 -278 5 105 65 9 108 -272 102 97 256 269 -28 22 103 -264 180
1448 180 195 -78 -63 -273 257 537 -84 -220 -96 190 404 -15 46 39 265 5 118 -123 -130 118 61 -150 -81
1471 -81 -20 7 252 65 -131 14 -182 -75 -208 83 -159 -78 18 -54 84 -136 -175 -243 106 -165 -70 -42 -332
1494 -332 -37 97 86 -30 -196 -24 -114 264 54 -279 1 40 -111 88 179 -158 -31 -78 29 80 25 -200
1516 -200 234 90 -294 -15 -64 140 -48 -232 306 -136 -17 338 -311 274 -62 -81 121 -211 -3 -25 -391
1537 -391 -32 -259 120 243 -36 303 79 30 -268 -21 -61 -220 -31 -44 172 92 -24 -167 93 131 -121 -76
1559 -76 -138 33 -10 -86 198 -224 201 78 -72 -275 119 -52 276 -114 148 -179 -104 71 -119 238 -101 -23
1581 -23 247 -248 -177 64 56 -120 -132 100 -186 -106 156 102 71 16 136 295 -98 -62 133 168 -70 30 -48 47
1605 47 134 140 -70 180 317 42 190 -15 156 301 164 211 126 -239 -283 420 62 330 120 -312 5 113
1627 113 50 -73 134 -41 -18 -116 49 179 222 116 -125 25 -104 -101 127 -205 315 35 -135 -30 -93 -37 -180
1650 -180 87 -132 -334 -291 177 -160 110 -55 -35 146 204 -3 -8 257 -268 -188 -91 -160 103 16 49 165 -30
1673 -30 467 -144 178 -123 218 243 20 -238 -15 219 211 286 128 6 -297 -12 -115 -382 98 -62 165 -78
1695 -78 42 78 -94 -223 61 143 53 -166 46 -82 262 97 91 336 142 96 55 -308 -22 169 46 -95 -175
1718 -175 143 202 -109 -305 221 -34 -31 82 212 207 262 49 -85 -92 75 211 203 -83 250 17 268 -21 126
1741 126 120 -104 126 -64 121 229 67 85 29 11 162 54 -7 -27 -88 -275 -18 -73 -152 -19 164 66 290 -82
1765 -82 -16 -28 -161 90 -206 -40 85 115 -434 -294 -157 -278 -51 95 65 -222 272 -215 284 -95 -77 -123
1787 -123 120 60 -162 -225 87 119 -64 97 -40 1 91 476 -121 65 -155 -35 47 121 -262 187 -39 -120 -223
1810 -223 45 -175 -11 101 18 27 -207 -37 158 122 -96 -13 -93 92 126 -6 -38 -84 173 13 -224 -56 260
1833 260 106 33 34 135 267 141 240 18 240 81 112 -9 -158 -228 58 -166 74 -40 -4 230 -54 229
1855 229 -52 -54 50 153 -68 26 -145 -44 -131 105 230 110 57 -166 18 -222 -16 161 -127 98 -34 -101
1877 -101 169 -149 -93 -363 60 -55 -258 169 -126 -72 123 42 170 69 -98 -129 -156 37 102 -40 -119 103
1899 103 1 95 19 -197 -59 515 42 -68 -7 -56 -97 161 -169 -235 70 73 -13 -198 87 142 244 -162 208
1922 208 265 11 187 37 3 129 116 -4 -42 -36 -187 -78 256 87 -182 -209 -13 32 198 0 -229 -2 -31
1945 -31 -188 132 -250 -188 -6 18 -9 -145 -213 105 150 24 77 -253 60 -24 58 -28 60 17 41 230 13 -112
1969 -112 -286 -81 221 5 45 36 -225 302 112 -35 -66 133 -29 192 -26 414 46 205 180 -188 285 285
1991 285 -7 -28 -242 66 -403 104 -23 -243 84 -114 -173 -50 -201 -121 -212 -126 31 -99 -187 388 -193 49
2013 49 74 78 161 86 -302 22 -46 137 -171 60 80 -7 105 -132 165 129 259 131 -255 -53 112 102 -132 -127
2037 -127 -152 -28 -48 -117 -107 47 34 -70 39 -123 31 147 162 44 50 -71 88 -28 -108 89 0 -179 -33
2060 -33 83 122 189 21 194 -237 -15 233 139 -106 -64 -250 -391 113 225 -152 39 59 -252 -100 121 93
2082 93 -192 -322 -26 138 -39 19 -75 18 -147 140 -245 -103 213 -37 -181 -75 -80 74 145 -270 167 92 96
2105 96 101 46 -109 -25 -177 -257 -156 135 -89 108 -133 -115 -31 238 61 36 343 -66 -9 -49 63 -228 22 -119
2129 -119 247 -268 99 184 141 -404 2 123 -65 -55 2 -130 -214 31 -67 96 177 114 -85 -104 135 197 -144
2152 -144 82 -30 -166 -254 142 28 -43 83 42 -89 114 363 -102 158 -206 -33 2 103 81 416 -64 -99
2174 -99 102 574 -299 9 105 25 -28 -137 -275 191 64 -62 18 11 318 -53 16 10 -206 203 -208 -97 -99 265
2198 265 10 263 206 -114 -226 20 172 -142 -97 182 357 82 178 106 -49 -80 129 225 -322 -33 162 -26
2220 -26 185 -98 -226 -64 -21 21 42 -48 -199 29 -180 -131 -114 58 -106 461 217 -126 -5 -97 -185 -2 335
2243 335 -1 -61 -354 166 149 50 6 -139 -134 97 -107 121 -281 -91 112 324 142 24 3 -141 134 6
2265 6 391 173 47 95 -86 113 -82 56 21 270 18 -357 52 21 -170 263 86 170 -27 126 -108 -379
2287 -379 -152 -237 -29 125 -175 -133 -225 -62 325 -107 -28 -18 -22 -24 99 -63 -85 157 109 -142 138 235 -154 100
2311 100 122 220 -71 235 -56 -12 -5 -97 228 -27 -314 -96 54 -134 86 -34 243 -169 -71 -140 -43 102 -223
2334 -223 -39 -211 -361 124 90 156 122 278 -46 62 -207 128 79 141 275 156 -127 -109 -66 69 -58 297
2356 297 -142 -76 85 -105 -35 -213 162 -103 225 6 48 137 -216 -199 111 -469 34 111 -119 125 -51 -245
2378 -245 -194 -260 -69 44 -54 -197 164 -283 58 165 -92 -227 152 -26 80 -229 -64 155 -35 249 232
2399 232 -25 -1 48 31 -273 43 366 57 -83 -127 72 -89 0 -131 -112 335 -251 173 230 -94 -281 -213 257
2422 257 198 -185 -70 -182 -103 4 -98 -191 -261 208 -193 -165 -99 91 -165 31 136 -357 40 -79 -38 27 -111
2445 -111 23 -75 139 -77 103 39 9 311 -120 -60 -166 324 19 170 92 -219 -313 -62 -223 92 -171 -94
2467 -94 -276 207 -92 145 63 226 7 -1 -304 -73 -218 33 -100 -14 -197 -7 -15 113 -211 -107 55 -10 -8
2490 -8 -301 -337 33 -240 160 277 141 -48 531 -452 -25 -88 -142 -26 -98 -26 123 18 55 173 66 92 45
2513 45 62 81 -83 -78 -43 -271 55 -514 23 59 -48 -202 226 142 471 -151 -134 82 165 107 -295 15 -35 87
2537 87 -96 104 62 -6 -275 171 -25 -521 295 247 59 20 111 -99 -76 -86 44 242 -112 -64 201 -105 142
2560 142 -6 122 -331 136 55 39 366 65 -81 -215 -36 1 -42 -102 23 64 143 151 81 117 316 -25 -218 308
2584 308 -45 -241 147 -105 -147 -105 -9 47 -185 191 114 164 45 53 -400 94 -37 60 -270 -54 -8 -48 -77 -155
2608 -155 -153 31 -69 -236 4 62 -83 148 -192 -65 -55 -171 -102 -68 173 103 -176 39 -69 -224 -28 12 18
2631 18 -99 93 -106 -240 -236 -109 63 135 187 -17 -172 -61 96 118 0 -10 -69 -126 215 -22 -35 -118 4 -89
2655 -89 1 191 80 229 1 -79 -52 -33 44 120 78 10 134 0 -12 187 276 295 -129 -23 202 -121 157 56
2679 56 346 -8 -17 -198 80 -66 -313 -123 -122 -110 -110 -129 181 -69 -55 202 127 -69 76 8 198 -29 -146 54
2703 54 -18 282 -130 81 -28 -170 -75 259 154 68 -90 221 38 -31 56 67 75 125 -40 -158 55 -158 157
2726 157 24 128 -319 -178 -50 186 -207 356 27 -425 -155 -81 -241 148 107 45 -440 2 31 119 39 123
2748 123 -31 -65 68 5 174 87 -35 82 -155 -64 19 -195 6 -108 -230 -226 -38 267 -231 -6 -118 -208 45
2771 45 125 -33 71 -294 -247 149 -55 85 -12 8 -21 152 256 40 -282 3 -25 -5 -74 -89 58 200 -81
2794 -81 -26 9 72 71 -111 111 -82 -55 -103 -62 19 57 -127 -28 228 -24 -78 -379 -65 118 -43 -98 342 274 2
2819 2 -21 -130 -237 -177 19 75 -156 -141 255 -241 -68 -122 -2 -19 -89 121 21 -52 76 -272 11 16 44 58 52
2844 52 98 131 207 303 75 -338 -54 -36 78 46 45 143 -112 172 -346 -24 52 -105 -1 -155 14 -142 432 78
2868 78 -323 103 -248 -190 68 -76 48 69 280 -297 -23 -237 -1 239 -118 167 -101 387 53 -52 187
2889 187 18 178 -12 -8 -36 -224 153 119 -300 -203 183 -14 177 387 38 77 174 -54 39 215 -268 -121 -126
2912 -126 -450 177 56 -19 -363 -87 -131 -125 9 -125 158 77 -26 12 367 19 113 296 228 61 -356 -243 246
2935 246 -66 -254 96 94 -98 162 97 149 131 110 74 -236 31 -18 139 249 -99 120 43 -207 -222 196 -46
2958 -46 -36 -220 -151 -5 80 -12 -171 -144 6 270 21 -184 -233 -143 -121 66 -281 -59 -81 162 102 247 109 -37
2982 -37 -211 159 49 24 58 -38 17 -311 323 132 16 -70 37 133 21 98 -147 10 35 53 160 14 -43 159
3006 159 47 66 62 190 -29 -372 114 -140 186 -41 -26 -22 115 92 -64 188 -64 -102 227 140 46 -231 -296 -87
3030 -87 -189 8 -314 -28 -40 -100 41 80 336 27 146 -16 366 -139 -233 -297 -183 -26 -105 18 18 -228 -176
3053 -176 302 -105 306 133 72 1 -147 46 -27 21 -82 241 -63 94 192 -46 121 -224 -25 -174 239 118
3075 118 -241 33 -8 161 12 112 -16 237 77 -41 -56 190 -23 -78 185 -51 -4 0 -301 99 121 -118
3097 -118 1 -162 20 -28 -27 62 -107 -294 -254 24 -37 -105 -87 -38 448 136 153 143 -154 194 114 137 -57 -157
3121 -157 -319 -59 -106 -109 -10 74 55 -110 -55 -67 -23 -79 -139 56 43 -141 156 215 -210 245 -24 146 -83 58
3145 58 300 -109 -11 54 166 -191 72 10 -85 -62 -84 64 122 -35 -159 -16 -155 190 -1 62 -20 -37 -87 -171
3169 -171 -58 -192 30 121 -92 279 -237 99 -25 -63 -36 -68 201 293 -81 137 110 25 18 58 -37 -150 137 -101
3193 -101 -26 -76 -29 166 27 12 -274 -183 10 -34 186 103 -257 25 -31 150 124 45 66 -11 121 208 187 179 -174
3218 -174 143 123 44 -150 -50 88 -160 54 -49 -229 -183 -11 43 -113 128 197 -55 -33 303 -84 95 -94
3240 -94 71 261 28 60 7 132 164 -73 -178 105 98 -184 59 128 -123 -230 129 209 -125 204 299 -223 41
3263 41 71 98 -137 -35 -60 366 206 -10 129 7 -53 314 111 243 8 295 98 -138 61 -27 -173 -42
3285 -42 -165 225 163 -131 35 19 70 -86 -25 170 -59 -89 34 31 283 69 -242 -50 -162 -88 -128 46 -138
3308 -138 -125 40 43 -77 -22 154 6 37 -122 139 89 -149 14 -134 -116 159 -143 47 139 -60 58 131 142
3331 142 29 -101 66 -254 -437 75 89 65 -97 -79 -104 298 -14 7 -265 30 7 165 157 -93 110 -5 -25
3354 -25 -53 -105 -57 -125 -30 8 -20 -51 105 -219 221 114 -11 49 -90 355 -171 -81 27 369 -186 -239 -51 -136
3378 -136 14 -72 -122 101 206 65 247 64 -108 -219 -1 54 367 139 37 187 -173 -142 121 -51 -390
3399 -390 148 172 -94 -156 -35 17 -22 -77 -90 -169 -344 -61 113 197 -65 24 293 -500 104 -75 300 202 -232
3422 -232 110 139 -21 116 0 127 -45 65 -63 172 399 -68 101 -112 -296 -192 140 -200 111 59 -214
3443 -214 -104 39 -250 7 -49 -5 -126 -401 -155 130 132 126 75 232 -14 51 88 173 -101 326 -321 45 104 88
3467 88 74 -82 287 32 -233 102 -32 -188 -62 46 209 -360 -41 18 -5 -36 87 -66 72 2 -47 143
3489 143 -80 -79 55 -129 -121 42 285 -230 -104 38 4 -207 139 10 -28 44 -114 20 -170 11 -233 16
3511 16 -366 20 -45 25 -205 16 -92 231 54 52 123 -404 -94 53 -23 -27 1 125 14 70 -94 -219 307 -162
3535 -162 -86 46 -172 -333 -264 88 26 -110 -130 -333 -63 -204 -190 -41 27 183 216 -398 -4 240 262 -10 -108
3558 -108 -378 -64 -322 -187 -40 -15 -14 60 81 -47 150 -109 -159 55 -316 190 -90 -226 118 67 -211 -88
3580 -88 16 88 48 -131 -165 -22 16 -126 273 -227 -1 -219 102 27 -102 -1 -57 92 -115 -264 -310 -218 52
3603 52 -33 -235 280 4 -50 -77 -166 -110 -127 195 272 -15 44 -115 -290 -35 -136 -73 71 -116 -21 217 25 103
3627 103 104 -58 53 176 68 157 -104 86 35 108 -62 73 193 -58 -18 166 -103 -52 241 41 -212 -311 -3
3650 -3 206 -68 85 51 -278 -253 -201 106 155 18 2 91 112 -157 -205 -215 -152 -57 -73 94 26 127 -29 -50 -140 127
3676 127 -79 -85 276 -273 -4 43 95 -203 231 -52 -170 -138 181 169 84 -19 -160 80 132 -303 197 106 -36
3699 -36 112 -23 24 -236 47 347 -50 261 270 25 79 -359 -428 -71 -42 -49 -97 144 -6 -199 -36 125 173 -138
3723 -138 43 8 328 222 199 -17 156 -121 78 -132 -331 -33 87 195 88 -193 -111 -95 -62 65 -93 128
3745 128 153 78 32 -2 -271 69 -165 135 -89 -139 -180 49 18 -544 109 96 82 -174 291 -14 -17 -17 -29 -16 72
3770 72 -118 240 111 16 -90 -32 75 -216 15 -294 -93 129 -97 115 -83 261 191 27 -242 -257 90 -82
3792 -82 -112 73 188 319 -199 -74 173 -201 45 86 -358 -39 34 -48 -31 113 -15 -26 44 -175 149 247 269
3815 269 -256 -86 48 120 225 -243 -130 147 53 71 -22 -134 69 108 -14 -125 307 -139 331 193 179 -104
3837 -104 -138 -129 -99 385 -147 29 60 -258 -76 -92 -216 110 158 -200 4 -208 35 -167 220 -50 64 -94
3859 -94 -92 128 180 -65 -297 118 -51 210 122 -111 135 183 10 176 78 -209 121 -80 -5 -21 148 -147 -122
3882 -122 112 -237 -390 -75 -305 53 83 -63 98 110 -59 -259 -15 115 156 -80 213 221 -117 -289 -76 192
3904 192 -36 55 -256 -312 86 -35 -74 198 203 -78 327 110 206 -173 196 291 69 -192 280 -199 130 246
3926 246 3 -51 -18 -254 -54 159 10 114 41 51 52 -103 -98 -110 -244 -218 389 -207 133 -95 -118 -82 -162 89
3950 89 183 48 -259 -159 45 -79 -147 106 261 47 171 -227 -55 191 -32 43 -385 -120 226 318 -11 27
3972 27 -91 -36 128 -155 51 34 -224 403 136 -66 -24 93 303 -92 192 165 -47 -215 -213 96 -180 90
3994 90 -291 174 -203 -3 259 -150 395 -16 208 -32 -184 3 287 85 -86 156 -161 241 85 -21
4014 -21 97 -4 -24 1 -197 -90 -118 -25 -307 -75 203 -311 360 78 -135 -139 257 98 117 94 -35 44 131 -37
4038 -37 152 -210 -147 -59 120 144 -225 178 83 -44 -267 -127 78 -140 469 -155 -38 131 -140 122 -241 -16
4060 -16 -98 -207 -98 -128 -256 158 -334 -72 85 95 -179 -99 214 -72 24 -202 -119 -246 179 -311 -309 -137 -43
4083 -43 32 -151 208 30 -109 30 22 178 301 172 -132 -178 47 38 72 125 -107 30 6 51 -215 -155 31 146
4107 146 -97 -140 91 -253 -17 111 132 298 193 16 -38 -137 23 -357 -301 1 -176 116 157 -120 -56 46
4129 46 -7 22 3 3 -120 -177 -50 10 -36 -71 195 233 61 -178 527 -50 364 96 33 -244 7 -8 -118 167
4153 167 245 -6 125 67 -266 47 176 142 -100 7 -81 -149 92 263 -95 -95 -40 221 -211 -113 203 26 -55
4176 -55 150 -80 -146 84 -144 -167 -226 248 -164 -105 53 35 -319 -274 -49 -8 -69 22 82 -2 -95 -198 -27 64 104
4201 104 -38 4 -88 -94 -201 -79 -92 -128 -56 -106 172 162 -86 -133 37 145 123 114 234 119 0 -103 -7 259 210
4226 210 -128 -55 -2 -89 -174 52 207 5 -2 -91 47 17 79 -212 -147 86 -101 223 -159 58 -182 37 67 51
4250 51 35 -347 -113 -187 135 12 110 -71 95 -352 -137 -22 -54 55 53 0 209 -134 205 16 44 -67 87
4273 87 49 1 -114 29 114 -280 -27 34 287 -74 305 -164 -234 43 40 187 185 62 -134 -207 -40 170 -64 -8
4297 -8 -54 -30 66 -72 -351 -26 -300 -134 -48 240 203 2 -235 -114 83 -6 -89 -6 -10 9 108 27 134 -169 -307
4322 -307 -100 -15 121 -4 132 -94 -50 306 -81 7 -277 -93 -112 -132 124 -132 -62 121 -235 -93 277 194
4344 194 72 -327 108 -30 -327 -74 1 116 9 -95 -40 -185 231 22 113 30 -69 252 -82 -372 -42 -3
4366 -3 -244 194 -476 42 -61 330 43 -205 -225 369 319 -106 -111 213 -308 -107 77 -21 272 37 -230 -282 13
4389 13 -91 205 209 221 -152 107 -356 336 -119 -139 166 81 297 -17 139 -10 29 165 -151 269 -33 -30 403
4412 403 46 66 20 -70 -145 -119 -55 -34 -222 -141 41 97 -24 -181 -292 -117 367 -47 -10 81 75 -218 100 197 260
4437 260 -131 -315 94 30 -152 45 76 74 71 -50 -3 158 -86 283 -107 -86 -179 10 -133 -26 -288 -193 -219 -239
4461 -239 -89 -84 -10 222 -186 25 83 51 279 6 94 104 156 46 137 102 0 -70 34 -143 276 -93 46 140
4485 140 -325 -304 -130 47 14 -87 15 -31 114 -18 -302 76 220 -175 -74 -68 276 -125 -282 269 -83 -136
4507 -136 135 -32 -101 -46 58 -65 113 -12 69 -312 188 84 -22 4 -95 165 -84 124 215 -69 -25 108
4529 108 -48 235 141 186 -366 234 181 -236 -277 -65 -60 43 -165 -106 -120 -161 -305 -42 -173 63 -118 125 25
4552 25 -162 -1 9 57 -44 36 -30 251 -100 141 2 63 212 -297 -182 132 -156 -77 5 2 58 125 -38 -29 177
4577 177 -60 -344 93 42 197 -184 119 -260 -101 -164 -452 -305 198 268 77 367 -197 51 -153 58 91
4598 91 78 -127 -122 -272 77 87 166 -51 30 -69 -315 -102 -152 -85 158 -183 -235 -168 364 172 -4 -87 -106 36 70
4623 70 293 -112 -167 289 66 -61 -49 -199 -277 -86 -323 47 368 247 -260 238 139 106 -163 19 -66 -200
4645 -200 -156 -27 189 -257 -69 -216 143 -337 29 -158 -83 -42 102 37 -22 -231 4 -187 -85 -101 -242 112
4667 112 -135 -292 -21 104 -42 296 -32 244 205 -88 204 168 172 255 27 139 206 -104 -118 -238 -20 -133
4689 -133 210 197 197 -20 31 -82 18 -168 -2 53 59 0 -82 259 -120 144 0 -4 48 71 -106 140 58 -84 115
4714 115 81 117 264 -209 -218 -246 -3 -101 431 -111 -215 131 193 319 -55 -128 -114 23 -354 -168 143 -61 55
4737 55 -320 32 -9 -28 93 4 3 108 -232 151 -183 -137 131 17 178 235 54 -211 -139 119 142 -122 113
4760 113 -201 44 -89 -257 116 -64 75 -36 78 -222 -202 -99 157 41 -20 -55 -17 -81 -193 -136 65 -181
4782 -181 -11 -217 -339 -96 -133 155 192 251 164 -122 -166 -131 -105 -201 -4 48 -72 39 118 83 -73 -580 -147 152
4806 152 100 -129 30 -35 102 -62 84 24 -258 -53 68 -181 157 119 41 -144 -123 16 -148 -176 266 80
4828 80 -172 98 167 -207 -102 30 -33 -60 152 350 276 189 -201 104 16 10 -60 -33 -239 13 -49 -41 -119 -128 -116 -87
4854 -87 84 -326 153 5 -148 392 240 -158 192 46 -152 435 38 -26 -45 -118 -52 -78 35 -327 -295 58
4876 58 -40 27 -219 44 -114 179 130 -281 -144 -199 -43 45 64 150 -150 -6 -66 111 87 -261 5 10 36 78 173
4901 173 48 20 84 145 -295 -76 187 63 148 -26 145 59 289 62 3 6 199 -125 90 60 123 15 57 -128
4925 -128 269 -137 212 -87 -13 -79 -172 136 -107 -115 -67 -128 104 -37 -189 113 -125 40 81 161 -52 126 -60
4948 -60 97 -45 -94 325 103 79 9 -79 -19 175 -45 -138 -15 67 88 175 -234 141 71 -242 117 -145 -257 -71
4972 -71 -275 168 -90 122 100 73 -97 -263 -42 79 -202 -143 -119 131 -294 86 72 141 -35 116 206 151 97
4995 97 -45 -10 18 36 19 -11 -167 150 38 295 -291 -173 -112 -31 -56 176 212 11 27 -43 -93 -2 158 315 126
5020 126 -36 199 -121 119 -171 -254 208 122 135 197 17 261 -124 -38 -99 -95 108 0 33 341 -265 -261 108 9
5044 9 103 -174 318 -130 25 15 133 -477 -148 75 133 -347 33 133 186 151 -68 141 -134 52 132 -209 110
5067 110 88 103 214 -12 -197 14 -102 15 98 -53 13 -200 51 -369 221 -79 291 190 181 -11 -119 -25
5089 -25 -105 -344 -131 112 -72 -185 -316 209 -39 106 -92 -65 163 198 -52 -211 425 102 32 185 -117 77
5111 77 40 -205 13 -65 -65 -265 -65 -274 -253 -77 -23 80 -53 -240 15 215 -101 383 -119 -96 157 -85 -74
5134 -74 -97 -135 -236 94 7 58 -193 14 127 -16 -17 -90 -121 101 -119 42 473 -180 63 242 -402 72 407
5157 407 250 50 -454 321 -218 26 3 95 -83 -106 -66 68 -202 -266 2 116 -20 -140 -63 -20 -185 -27
5179 -27 16 156 29 17 298 -118 -111 150 112 132 -226 -5 104 -310 -124 110 -119 69 -11 91 -1 -74 -1 -90
5203 -90 -12 -221 145 141 1 -42 -65 281 91 51 93 120 406 45 238 -224 -8 -340 135 237 325 360 169 -8
5227 -8 -189 -41 251 -101 -145 53 -296 47 -33 -151 180 143 -10 -179 169 20 -149 21 -143 10 -382 38
5249 38 -154 -88 -71 32 106 -126 -362 -223 -352 -59 -366 -139 -70 -441 -194 -93 -141 -133 -48 258 4 73 -194
5272 -194 -124 -57 -1 -74 -2 -93 -130 -294 -131 -292 170 -166 123 -472 -269 135 57 21 -6 -98 51 256 42 -7
5296 -7 -82 -42 77 -152 -21 86 220 152 -137 184 -8 32 98 -268 41 -46 105 96 -144 -136 -310 -68 311 74
5320 74 -145 90 -114 258 13 -33 268 -215 -47 242 -31 -323 64 -86 139 -52 -30 73 -126 31 98
5341 98 109 -5 -83 4 315 -94 -214 -327 -276 180 197 96 -81 -79 43 -160 -36 196 -78 15 -59 9 -202 -60
5365 -60 -139 -80 162 176 -189 69 24 -331 -59 -25 70 -60 -184 357 -65 -90 -63 143 -141 -189 132 59 2 36
5389 36 94 42 -73 -9 153 -82 -96 126 161 -48 -91 51 -148 104 351 221 93 211 3 -48 -223 -162 -3
5412 -3 108 248 234 -43 62 36 156 268 -28 -28 -57 -216 201 -171 -291 -397 301 -111 230 -18 258 -195
5434 -195 24 111 8 -102 268 -20 34 300 -4 123 -23 -70 190 186 55 -1 -243 94 260 40 409 -8
5456 -8 -82 264 55 -169 -146 -279 172 -181 245 35 -137 22 192 0 -182 -95 153 68 10 -45 -109 86 -17
5479 -17 -41 0 67 -110 11 -136 217 -247 99 106 -89 -30 146 118 -98 -116 -102 -183 99 240 -233 -207 68 -36
5503 -36 -58 197 -135 -260 -159 -21 -125 -208 161 300 169 -149 105 145 -24 -39 -213 67 101 -161 255 158
5525 158 46 102 -19 -47 -230 11 90 -60 -60 -150 -96 -70 -380 125 197 282 -46 -61 -85 -41 -41 -152 -4 -34 168
5550 168 94 115 30 -2 -212 209 -80 99 -89 -87 -26 25 44 217 118 -160 -88 99 210 -55 -151 147 157 -65
5574 -65 150 96 0 68 63 -184 200 134 64 -161 -252 433 -19 -51 5 -133 109 -285 -87 60 33 107 180 -139 -186
5599 -186 -150 112 365 -112 61 56 216 216 -235 166 -84 70 -104 -161 3 -102 -114 -167 -187 -185 119 -95 79 298
5623 298 175 109 -250 71 69 -31 -70 -66 271 -101 109 -160 66 77 61 -308 126 34 -116 136 115 -19 10 -257
5647 -257 -22 192 -124 -124 -318 -139 381 494 67 -209 109 -54 34 -270 158 121 21 178 -146 171 277
5668 277 -4 -161 72 -209 250 -110 -105 128 196 -122 150 -177 -355 17 184 145 31 -19 210 -171 5 217
5690 217 -403 263 -275 20 -230 -19 65 11 89 -40 -267 -293 -263 -206 90 66 -58 181 65 123 -81 -105 -48
5713 -48 90 -41 -228 -112 55 175 -109 66 -69 49 -2 -179 201 88 -79 -15 -76 198 64 -59 -85 34
5735 34 65 -73 184 -177 -209 224 12 -246 207 -39 -85 76 -14 -44 -31 70 -23 261 27 -311 -203 -72 -199
5758 -199 249 -151 -148 -273 -68 -74 -84 -98 10 -208 62 87 180 213 15 -90 -8 42 1 122 22 -52 77 -74
5782 -74 -243 95 29 -214 -64 -21 -148 111 -66 -13 178 -40 36 246 -118 74 61 -52 -23 -312 224 -117
5804 -117 -28 -189 152 319 99 68 -148 227 199 -362 105 86 12 -35 -82 133 123 143 3 -235 -272 -5 314
5827 314 -240 -52 -148 -14 -17 -276 -11 -259 -2 -189 -70 198 -8 94 135 -104 -28 206 145 29 -70 -41 50
5850 50 224 -296 49 296 -13 244 -159 -99 46 -58 -42 -88 -77 204 -74 -98 -118 138 -88 -63 -121 198 69
5873 69 -36 81 -17 198 -337 54 -25 73 -118 141 40 72 -234 -129 25 148 69 62 -279 -125 64 -215 47
5896 47 -96 90 100 -163 -80 73 -199 241 138 39 206 19 -65 -78 2 167 106 129 137 -113 -140 210 -177 -21
5920 -21 325 241 66 -151 87 -56 -121 72 39 81 -284 146 59 -56 -10 53 -211 -41 -139 66 -142 -29 198
5943 198 55 125 -97 79 -169 241 -92 263 -259 -43 -69 -174 -3 -343 -86 151 -210 453 -16 86 -9
5964 -9 121 -25 -84 371 -35 -59 -127 -112 22 88 -85 263 46 -76 -233 226 191 -130 -79 -183 -142 70 91 -21
5988 -21 156 167 -308 61 82 -95 22 -146 20 192 68 -278 189 -167 56 243 -49 -67 -36 32 50 148 317
6011 317 159 -4 -85 -291 -57 -99 -54 49 -24 -69 -58 -91 269 -170 2 47 221 -187 -19 -46 -71 -130 -145 63
6035 63 -80 93 226 53 -42 248 96 -25 298 -412 -316 250 51 -5 -398 -7 165 26 -177 126 173 -69
6057 -69 -71 384 95 -227 -48 -50 -55 -237 100 -24 206 -338 -6 42 -16 -125 -14 285 -36 51 51 -233 -42 155
6081 155 -11 -403 -8 60 25 29 124 60 -28 -62 -210 17 246 -145 -38 132 -226 -40 -16 134 -318 59 -230
6104 -230 205 -146 -9 21 -84 -130 114 -134 131 -269 37 -67 -64 96 -220 -82 19 -183 -50 394 -204
6125 -204 -167 395 -9 165 -165 -143 21 114 -143 89 -68 238 199 -30 33 -97 -368 30 219 348 -43 -23
6147 -23 -102 -162 -97 44 -169 57 -107 -330 110 49 143 42 -101 32 356 153 -280 77 -291 -66 105 112 52
6170 52 -111 188 182 -150 25 -236 -220 164 56 74 87 -69 119 -143 193 -70 140 134 -47 140 -22 -14 90
6193 90 -22 44 -60 3 -378 143 180 60 187 251 -215 -44 -154 102 86 79 -326 158 175 -336 -9 -39 487
6216 487 145 43 -145 -126 -112 37 158 19 210 -124 -266 248 -113 -158 -347 64 37 -8 11 -64 -20 -148 -67
6239 -67 76 -198 26 0 22 -128 128 116 28 -97 58 250 -30 29 4 -282 31 10 -264 86 -220 -74 191
6262 191 77 73 199 -141 154 243 -314 -54 -22 -21 204 85 18 194 98 213 -11 -276 -448 -203 -105 -121 252
6285 252 257 159 -140 368 -156 -349 65 -75 179 -167 57 -28 156 -131 158 -124 145 92 211 137 -216 151
6307 151 49 -59 242 -170 223 355 119 -196 157 117 177 -47 233 60 -252 -362 -110 -150 -94 -7 -34 -123
6329 -123 -229 -151 -109 183 74 434 -102 182 161 -131 -137 -70 213 -51 -79 -171 135 264 -184 222 304 -175 15
6352 15 -190 -106 -117 -176 -133 -22 -50 -29 187 -74 192 91 -11 37 -197 88 77 149 -6 25 -307 -174 -3 162
6376 162 -198 -29 -206 -32 -26 -200 22 -247 -173 -116 34 -96 42 -120 229 74 -9 -128 -213 48 155 101
6398 101 -311 -48 -234 -264 -103 279 64 -31 -224 -150 -228 -398 -160 -135 180 7 202 153 227 171 -41 169 -210
6421 -210 -122 -110 170 46 22 -51 -73 -159 298 -144 402 -56 124 82 -91 -78 151 -240 -168 -192 72 120 366 345
6445 345 155 249 125 -251 107 133 20 46 160 -142 86 401 -11 180 150 -172 -148 260 156 -37 -46 -80 -217
6468 -217 273 -67 74 -49 -135 105 -249 26 -212 112 -69 -71 -118 317 -46 104 1 -87 148 -41 -43 179
6490 179 474 -83 109 -108 265 -253 -148 111 12 197 77 41 -73 -105 -169 -62 151 -78 21 -89 44 264
6512 264 2 -61 -213 345 -461 -85 301 -114 148 -16 -54 -189 -176 -111 80 113 48 -287 -85 -1 -75 221 -117
6535 -117 235 -107 -202 243 146 227 -57 -208 -253 -143 209 -16 -60 295 -45 14 -117 -107 118 180 326 -41 -94
6558 -94 85 3 9 159 -16 -11 -203 60 -188 455 42 -213 81 225 -66 -182 171 -168 -63 -64 -117 28 107
6581 107 -123 -115 -58 -47 -60 -21 -26 234 58 -297 -30 -273 303 -7 -231 159 12 49 -42 24 37 116 212 -10 106
6606 106 -95 -51 -210 -111 22 138 -5 -55 13 168 -38 52 96 87 32 -360 148 -166 85 -61 -155 -35 -42 -269
6630 -269 76 126 -22 -196 3 -54 -190 -158 58 -22 -45 53 -309 -66 -125 -236 10 -15 146 173 164 171 432 -254
6654 -254 -223 88 278 10 53 45 62 346 44 1 -118 70 -116 -267 -219 -209 136 -95 199 260 -68 -159 70
6677 70 36 186 40 -82 25 203 96 -46 83 -133 7 35 203 46 -231 -206 173 -61 200 167 -97 -78
6699 -78 297 -112 151 -43 59 117 118 122 -216 250 257 -86 -34 -2 264 99 185 -301 66 -55 204 23 -158 87
6723 87 -201 49 170 -130 -150 -25 27 204 -19 69 -86 -254 -189 158 -120 3 -90 96 80 -272 -199 62 83
6746 83 103 -182 59 151 177 181 -184 1 95 -9 -96 164 -27 87 148 22 14 -14 327 -157 -113 111 97 126 -115
6771 -115 407 -257 18 -135 -96 73 36 116 315 -58 -258 38 113 62 40 214 149 -25 30 126 -26 76 15
6794 15 122 21 -66 -64 84 -42 -275 244 45 349 155 -182 33 142 -166 142 98 42 -49 -66 227 92 38
6817 38 -212 20 -254 -143 -416 -21 -137 98 60 -251 -115 -203 -206 -54 181 240 228 -183 221 137 309 -79 -156
6840 -156 113 364 88 359 31 242 -42 258 226 147 331 -74 -266 101 35 39 56 -65 298 51 -65 -237
6862 -237 -138 22 212 -128 262 -235 77 -136 -127 -6 -102 112 -19 -69 -67 -218 64 -127 -3 -47 36 -120 -55
6885 -55 -60 -185 -8 -114 317 158 -155 135 -5 295 -38 -28 7 -42 138 191 0 -17 -198 -362 -119 151 174
6908 174 -68 -249 148 298 13 81 95 -218 -247 102 -105 153 7 438 48 -90 72 -106 155 -102 65
6929 65 195 -92 129 -210 -51 79 246 42 -30 96 282 -135 108 -45 110 -162 -42 63 -64 164 119
6950 119 217 202 -149 -170 -259 -237 90 59 88 -188 -61 97 -141 -291 199 -64 210 11 30 163 -124 -60 37
6973 37 -103 -31 -8 -59 194 -19 -153 -21 -70 54 -3 261 -210 -311 -138 -34 -29 9 168 -106 90 -259 198
6996 198 -134 -205 -410 7 -142 73 71 -154 -64 -111 -310 -38 -71 160 120 58 -97 118 -108 95 198 -3 -108
7019 -108 -128 -17 -278 135 -97 -116 -5 28 -86 79 -147 -250 -66 130 -103 96 54 -41 129 -74 -121 -102
7041 -102 -147 -49 168 260 52 232 -16 -85 251 -76 -372 -84 160 121 -54 -265 -54 156 -65 -44 -14 -161
7063 -161 60 -178 43 105 50 -109 114 -142 -64 -133 185 -208 -265 -14 -9 -328 -57 141 272 37 41 148 46
7086 46 40 -346 -170 307 199 -104 244 46 172 109 -124 -79 -120 -235 11 261 -308 159 413 105 -48 163
7108 163 39 44 -152 -178 35 140 23 -68 -182 -58 -82 66 200 -82 49 -199 119 76 48 -40 -216 15 159
7131 159 235 -156 -22 104 -263 286 83 -295 -209 204 -183 -74 -451 -44 178 -210 218 -37 19 58 257
7152 257 192 -85 108 111 38 -113 -198 56 150 242 -143 405 -124 -278 -218 38 -249 -71 -162 -192 -106 -172 -200 53
7176 53 -126 -237 -54 -68 366 128 -12 159 -76 170 -202 16 185 122 -250 65 -44 144 117 -72 368
7197 368 277 66 124 102 132 -90 -138 101 -226 82 258 -255 -104 200 131 -46 35 -43 -206 131 -79 72 156
7220 156 -46 3 -36 -346 23 -55 -55 4 147 -160 120 -254 86 -180 -351 117 -344 -73 27 -320 -116 224
7242 224 147 138 117 74 -188 -196 31 -243 252 150 -180 -192 -59 -118 -150 59 -86 17 128 -132 -67 -397 92 -72
7266 -72 -137 -19 23 131 -143 52 37 137 -26 151 -214 -104 -286 -74 -40 -234 -77 -152 -136 -251 186 -185
7288 -185 -141 -96 34 17 107 -158 -71 -265 119 115 25 -276 -178 196 -190 34 46 -40 -152 121 -213 92 172 160
7312 160 18 -63 178 153 -29 -11 -196 -226 -132 76 -26 167 47 75 230 -74 90 15 133 188 34 -223 266
7335 266 -275 -244 -130 27 -140 148 -46 418 -181 -79 -123 213 53 219 265 152 88 35 50 -38 134 -70
7357 -70 222 -229 18 137 -326 108 -193 -136 -62 -308 77 -47 -124 119 -59 247 55 58 202 66 -88 -80 -11
7380 -11 -262 30 91 -183 50 -70 -246 -101 89 231 -218 -33 -11 440 -48 223 -116 68 -207 -18 150
7401 150 124 -17 225 -77 -110 -160 196 -153 -105 -22 -73 -82 -197 76 25 -22 50 -88 -378 -26 -204 174 -57 -238
7425 -238 -81 23 140 248 108 148 56 -58 -11 -128 -141 -89 -32 242 -122 105 87 -154 10 67 -322 242 212
7448 212 -79 280 -151 28 -169 -142 -241 -22 -119 156 152 -2 11 47 -7 -194 218 -217 -48 -53 94 -16 119
7471 119 351 -75 -31 1 45 -195 111 93 -219 -100 115 -6 -300 -145 -116 -193 144 -20 5 -7 85 -104 -10
7494 -10 -63 90 126 332 125 -32 30 -43 -64 -141 5 25 77 -252 1 179 -1 -254 135 151 -13 -52 -57 178
7518 178 14 135 -98 142 99 148 -33 76 227 326 388 -196 139 -176 256 31 51 251 310 -4 122 -12
7540 -12 1 -68 -4 225 51 -36 34 383 92 39 -195 235 -124 206 -88 -5 -119 88 -15 -63 -145 -87 203 -299
7564 -299 -97 -44 388 -98 23 -47 -247 5 553 -105 71 -22 78 315 290 -75 -112 53 -81 -49 67 52
7586 52 -111 -57 83 128 -131 67 -68 -61 231 244 153 -176 -93 62 -285 209 146 156 -191 -162 -166 206 -138 -23
7610 -23 149 -265 70 -233 148 145 -103 -31 9 80 8 -26 -19 31 -5 -169 -55 -59 -53 -111 -10 -61 144 6 -198 109
7636 109 -67 -2 250 236 -91 -84 -66 -131 311 84 -37 292 -49 145 -82 -60 60 -236 -72 -137 16 17 -283
7659 -283 -84 -128 -86 304 206 -84 -20 -67 118 151 10 -220 -66 -63 250 342 -265 -119 -17 -102 87 -114 -132 -156
7683 -156 -47 -193 -25 -89 -194 30 33 -213 -47 125 -43 20 -125 -9 -26 210 165 55 -79 -44 -235 -259 223
7706 223 -37 -30 126 -26 -128 -122 -1 65 -231 -37 -196 -63 128 15 213 430 -139 52 -27 -64 101 -51
7728 -51 -283 -142 190 -97 -95 -74 109 106 -317 -103 -239 -155 384 -11 -120 -192 -61 183 126 133 44 -345 -164 328
7752 328 24 -128 -203 132 -260 -21 21 -66 52 19 -308 -287 105 -64 -110 26 -258 24 62 92 -135 -57 -111
7775 -111 276 -191 43 -17 35 13 -32 -52 -198 169 404 -52 -9 -55 54 -299 41 19 -162 -45 70 222 -47
7798 -47 136 -270 -2 -52 204 128 103 198 -7 73 401 94 72 252 -311 0 121 253 -401 189 83 -362
7820 -362 -74 -236 -90 -69 -24 -124 -61 194 56 113 26 346 36 386 83 121 -45 -24 75 231 -190 -124 90
7843 90 -1 -26 -148 -68 103 29 47 -203 -262 28 -63 -64 293 311 -158 226 59 100 -78 -110 174 159 -83 -48 42
7868 42 315 -6 41 227 226 159 134 101 27 -87 -101 257 207 -69 -14 99 -266 58 -4 216 79 277 -168 228
7892 228 -11 -320 332 -30 72 163 71 183 -196 -123 -215 -214 199 119 151 -4 -114 -69 1 -99 -160 -49 12 -348
7916 -348 63 -20 285 118 -58 -233 -103 -30 232 109 -174 -60 125 -71 84 400 116 60 19 -298 -204 217
7938 217 -92 48 10 -357 -86 -111 -161 85 -130 118 203 85 84 62 37 405 34 -285 118 193 -152 89 33
7961 33 206 15 195 -24 211 -137 265 -199 -48 -120 -73 -40 121 -79 14 -107 -152 185 -152 -44 5 -23 -99
7984 -99 66 -69 -264 -61 -64 -36 -37 -4 3 9 142 -64 -164 -245 -8 -242 -125 154 -117 -93 -140 -246 -90 -36 38
8009 38 285 269 -110 -123 -85 -33 -54 -293 173 -219 72 -126 -265 -47 292 64 39 25 49 242 222 218 -7 -117
8033 -117 3 392 24 -122 281 -136 124 136 -135 -98 -94 119 -183 -268 72 82 -223 -30 -70 119 -199 -4
8055 -4 -20 -171 82 190 -123 140 111 -253 157 89 40 -53 62 73 -207 108 66 -9 -60 172 -154 200 -208 -216
8079 -216 -10 -96 128 2 185 113 138 -105 -128 346 -124 89 -8 -333 113 -119 -42 -108 106 -75 -157 196 139
8102 139 -133 63 49 363 -44 121 -50 -104 -238 -255 -161 66 86 -151 84 179 103 55 -12 78 -39 -186 17
8125 17 193 -30 -99 354 86 13 -23 -152 -79 -257 43 -33 -90 26 -84 322 94 89 27 -25 135 55 135 114 -211
8150 -211 133 243 -76 199 243 28 -18 242 150 77 296 99 182 32 54 -207 9 17 185 110 -171 233 151
8173 151 218 56 0 178 -83 -270 32 109 -97 79 106 -60 302 -104 46 -62 165 25
8191B5
##END NTUPLES=NMR FID
##END=
