##TITLE=1H_IAMT-161
 DMSO-d6
 108 sc, 
 12.05.2022
##JCAMPDX= 6.0         $$ Bruker NMR JCAMP-DX V2.0
##DATA TYPE= NMR FID
##DATA CLASS= NTUPLES
##ORIGIN= UXNMR, Bruker Analytische Messtechnik GmbH
##OWNER= root
$$ XWIN-NMR		Version 3.5
$$ Thu May 12 15:56:10 2022 Russian Standard Time (UT+4h)  she@DPX200
##.OBSERVE FREQUENCY= 200.1313499996
##.OBSERVE NUCLEUS= ^1H
##.DELAY= (6, 6)
##.ACQUISITION MODE= SIMULTANEOUS
##.ACQUISITION SCHEME= undefined
##.AVERAGES= 108
##.DIGITISER RES= 18
##SPECTROMETER/DATA SYSTEM= spect
##.PULSE SEQUENCE= zg30
##.SOLVENT NAME= DMSO
##.SHIFT REFERENCE= (INTERNAL, DMSO, 0, 15.7039)
##AUDIT TRAIL= $$ (NUMBER, WHEN, WHO, WHERE, WHAT)
$$ ##TITLE= Audit trail, XWIN-NMR		Version 3.5
$$ ##JCAMPDX= 5.01
$$ ##ORIGIN= Bruker BioSpin GmbH
$$ ##OWNER= she
$$ F:/spectra/data/she/nmr/H-F/1/audita.txt
$$ ##AUDIT TRAIL=  $$ (NUMBER, WHEN, WHO, WHERE, WHAT)
(   1,<2022-05-12 15:54:39.20 +0400>,<she>,<DPX200>,
      <continue with go, POWCHK disabled, PULCHK disabled
       configuration hash MD5:
       00 E9 B6 7A A2 85 ED C7 34 08 36 98 17 FE 4E 26
       data hash MD5: 16K
       3B 71 7F E0 E0 43 BA DC 59 66 E6 C2 F3 0B 2C 57>)
$$ ##END=
$$ 
$$ hash MD5
$$ 67 EF F2 14 EC 45 07 34 88 0A 3C C2 6A 36 43 82
##$RELAX= 
##$RELAX= 
##$RELAX= 
##$RELAX= 
##$RELAX= 
##$RELAX= 
$$ Bruker specific parameters
$$ --------------------------
##$DU= <F:/spectra>
##$EXPNO= 1
##$NAME= <H-F>
##$PROCNO= 1
##$TYPE= <nmr>
##$USER= <she>
##$AMP= (0..31)
100 100 100 100 100 100 100 100 100 100 100 100 100 100 100 100 100 100 
100 100 100 100 100 100 100 100 100 100 100 100 100 100 
##$AQSEQ= 0
##$AQ_mod= 1
##$AUNM= <au_zg>
##$AUTOPOS= <>
##$BF1= 200.13
##$BF2= 200.13
##$BF3= 200.13
##$BF4= 200.13
##$BF5= 200.13
##$BF6= 200.13
##$BF7= 200.13
##$BF8= 200.13
##$BYTORDA= 1
##$CFDGTYP= 0
##$CFRGTYP= 5
##$CHEMSTR= <none>
##$CNST= (0..31)
1 1 145 1 1 1 1 1 1 1 1 1 1 1 1 1 1 1 1 1 1 1 1 1 1 1 1 1 1 1 1 1 
##$CPDPRG= <>
##$CPDPRG1= <>
##$CPDPRG2= <>
##$CPDPRG3= <>
##$CPDPRG4= <mlev>
##$CPDPRG5= <mlev>
##$CPDPRG6= <mlev>
##$CPDPRG7= <mlev>
##$CPDPRG8= <mlev>
##$CPDPRGB= <>
##$CPDPRGT= <>
##$D= (0..31)
0 1.2 0 0 0 0 0 0 0 0.06 0 0.03 0 0 0 0 0.0002 0 0 0 0 0 0 0 0 0 0 0 0 
0 0 0 
##$DATE= 1652356106
##$DBL= (0..7)
120 120 120 120 120 120 120 120 
##$DBP= (0..7)
150 150 150 150 150 150 150 150 
##$DBP07= 0
##$DBPNAM0= <>
##$DBPNAM1= <>
##$DBPNAM2= <>
##$DBPNAM3= <>
##$DBPNAM4= <>
##$DBPNAM5= <>
##$DBPNAM6= <>
##$DBPNAM7= <>
##$DBPOAL= (0..7)
0.5 0.5 0.5 0.5 0.5 0.5 0.5 0.5 
##$DBPOFFS= (0..7)
0 0 0 0 0 0 0 0 
##$DE= 6
##$DECBNUC= <off>
##$DECIM= 24
##$DECNUC= <off>
##$DECSTAT= 4
##$DIGMOD= 1
##$DIGTYP= 9
##$DL= (0..7)
0 120 120 120 120 120 120 120 
##$DP= (0..7)
150 150 150 150 150 150 150 150 
##$DP07= 0
##$DPNAME0= <>
##$DPNAME1= <>
##$DPNAME2= <>
##$DPNAME3= <>
##$DPNAME4= <>
##$DPNAME5= <>
##$DPNAME6= <>
##$DPNAME7= <>
##$DPOAL= (0..7)
0.5 0.5 0.5 0.5 0.5 0.5 0.5 0.5 
##$DPOFFS= (0..7)
0 0 0 0 0 0 0 0 
##$DQDMODE= 0
##$DR= 18
##$DS= 0
$$ [...]
##$SUBNAM2= <"">
##$SUBNAM3= <"">
##$SUBNAM4= <"">
##$SUBNAM5= <"">
##$SUBNAM6= <"">
##$SUBNAM7= <"">
##$SUBNAM8= <"">
##$SUBNAM9= <"">
##$SW= 26.0245750270697
##$SWIBOX= (0..15)
0 0 2 0 0 0 0 0 0 0 0 0 0 0 0 0 
##$SW_h= 5208.33333333333
##$TD= 16384
##$TD0= 1
##$TE= 0
##$TE2= 300
##$TE3= 300
##$TEG= 300
##$TL= (0..7)
0 120 120 120 120 120 120 120 
##$TP= (0..7)
150 150 150 150 150 150 150 150 
##$TP07= 0
##$TPNAME0= <>
##$TPNAME1= <>
##$TPNAME2= <>
##$TPNAME3= <>
##$TPNAME4= <>
##$TPNAME5= <>
##$TPNAME6= <>
##$TPNAME7= <>
##$TPOAL= (0..7)
0.5 0.5 0.5 0.5 0.5 0.5 0.5 0.5 
##$TPOFFS= (0..7)
0 0 0 0 0 0 0 0 
##$TUNHIN= 0
##$TUNHOUT= 0
##$TUNXOUT= 0
##$USERA1= <user>
##$USERA2= <user>
##$USERA3= <user>
##$USERA4= <user>
##$USERA5= <user>
##$V9= 5
##$VALIST= <valist>
##$VCLIST= <CCCCCCCCCCCCCCC>
##$VD= 0
##$VDLIST= <DDDDDDDDDDDDDDD>
##$VPLIST= <PPPPPPPPPPPPPPP>
##$VTLIST= <TTTTTTTTTTTTTTT>
##$WBST= 1024
##$WBSW= 4
##$XGAIN= (0..3)
0 0 0 0 
##$XL= 0
##$YL= 0
##$YMAX_a= 3785683
##$YMIN_a= -4640949
##$ZGOPTNS= <>
##$ZL1= 120
##$ZL2= 120
##$ZL3= 120
##$ZL4= 120
##$ABSF1= 10
##$ABSF2= 0
##$ABSG= 5
##$ABSL= 3
##$ALPHA= 0
##$AQORDER= 0
##$ASSFAC= 0
##$ASSFACI= 0
##$ASSFACX= 0
##$ASSWID= 0
##$AUNMP= <proc_1d>
##$AZFE= 0.1
##$AZFW= 0.1
##$BCFW= 1
##$BC_mod= 2
##$BYTORDP= 1
##$COROFFS= 0
##$CY= 11.3945322036743
##$DATMOD= 1
##$DC= 2
##$DFILT= <>
##$DTYPP= 0
##$F1P= 2.36226072786647
##$F2P= -0.459571619588291
##$FCOR= 0.5
##$FTSIZE= 0
##$FT_mod= 4
##$GAMMA= 1
##$GB= 0.15
##$INTBC= 1
##$INTSCL= 1
##$ISEN= 128
##$LB= 0.24
##$LEV0= 0
##$LPBIN= 0
##$MAXI= 10000
##$MC2= 0
##$MEAN= 0
##$ME_mod= 0
##$MI= 1.114404
##$NCOEF= 0
##$NC_proc= 0
##$NLEV= 6
##$NOISF1= 3.799351
##$NOISF2= 2.8
##$NSP= 1
##$NTH_PI= 0
##$NZP= 0
##$OFFSET= 15.70392
##$PC= 1
##$PHC0= -17890.04
##$PHC1= 66.20075
##$PH_mod= 1
##$PKNL= yes
##$PPARMOD= 0
##$PSCAL= 0
##$PSIGN= 0
##$REVERSE= no
##$SF= 200.130013532006
##$SI= 16384
##$SIGF1= 3
##$SIGF2= 2
##$SINO= 400
##$SIOLD= 16384
##$SREGLST= <1H.CDCl3>
##$SSB= 0
##$STSI= 0
##$STSR= 0
##$SW_p= 3612.71676300578
##$SYMM= 0
##$S_DEV= 0
##$TDeff= 0
##$TDoff= 0
##$TI= <>
##$TILT= no
##$TM1= 0
##$TM2= 0
##$TOPLEV= 0
##$USERP1= <user>
##$USERP2= <user>
##$USERP3= <user>
##$USERP4= <user>
##$USERP5= <user>
##$WDW= 1
##$XDIM= 8192
##$YMAX_p= 0
##$YMIN_p= 0
$$ End of Bruker specific parameters
$$ ---------------------------------
##NTUPLES= NMR FID
##VAR_NAME=  TIME,          FID/REAL,        FID/IMAG
##SYMBOL=    X,             R,               I
##VAR_TYPE=  INDEPENDENT,   DEPENDENT,       DEPENDENT
##VAR_FORM=  AFFN,          ASDF,            ASDF
##VAR_DIM=   8192,          8192,            8192
##UNITS=     SECONDS,       ARBITRARY UNITS, ARBITRARY UNITS
##FACTOR=    0.000192,      1,               1
##FIRST=     0,             0,               0
##LAST=      1.572672,      0,               0
##MIN=       0,             -4640949,        0
##MAX=       1.572672,      3785683,         0
$$ Real data points
##PAGE= N=1
##DATA TABLE= (X++(R..R)), XYDATA
$$ [...]
$$ plain form
2918 11165 -5736 -17360 -12431 5657 17002 13877 -3177 -15385 -13555 451 14138 14036 -37
2931 -37 -14412 -14246 -2781 12186 15408 2836 -12895 -14862 -3547 11566 15287 4744 -10836
2944 -10836 -16140 -5836 10113 17352 8144 -8528 -17458 -9421 5994 17087 10022 -5318 -16444
2957 -16444 -11772 3964 15923 13237 -1893 -15870 -13358 929 14110 12923 1513 -13404 -13598
2970 -13598 -835 12631 14159 3813 -10692 -14181 -4054 11930 15072 6152 -9338 -15505 -6415
2983 -6415 8569 15607 7874 -5858 -14863 -9286 4698 15229 10992 -3929 -15094 -10940 2415
2996 2415 13845 12937 -1828 -13284 -12438 117 13241 13690 942 -12355 -12381 -2679 10158 13555
3010 13555 3719 -9697 -13343 -4992 8154 13494 5666 -7556 -13853 -5375 7564 15283 6380 -7603
$$ packed form
2918A1165j6901j1624M929J8088J1345l125j7054j2208J830J4006J3687j02j4073
2931c7j4375J66J1465J4967L222j2572j5731j967J1315J5113L721j0543j5580
2944a0836n304J0304J5949P239r208j6672q930Q037J5415J1093p065j5340j1126
2957a6444M672J5736J1959k686j5130j3977K512J4287J3181j187j1410j4917j94
2970a3598J2763J3466J528j0346j4505l489J0127J5984L142q920j5490o167R090
2983f415J4984P038p733j3732r005N577J3984J0531m237j4921j1165M154J3355
2996B415J1430r08j4765j1456Q46J2555J3124M49j2748j3297k6R702J2837L397
3010A3555r836j3416l646Q351J3146N340p828j3222o297Q478J2939P719q903j3983
$$ plain form
3024 -7603 -13929 -9318 5409 13686 9218 -4290 -13652 -9874 2776 12554 11243 -398 -13470 -11984
3038 -11984 -576 12137 11857 2290 -10240 -12962 -1986 10494 12066 3115 -8091 -13832 -5375
3051 -5375 8401 12706 4918 -7136 -13423 -6234 6620 14423 7602 -5260 -12261 -7528 4343 11937
3065 11937 9448 -2073 -10875 -9249 1552 10399 10608 -1134 -11434 -11719 93 9944 11400 783
3079 783 -9768 -11387 -2453 9797 12395 3358 -7836 -12919 -4741 6495 12204 5593 -6407 -10420
3093 -10420 -5254 5961 11798 6284 -4664 -11962 -6097 4208 11842 7975 -3037 -12004 -8143 1313
3107 1313 11922 10418 -526 -9429 -10081 -629 9727 11014 2280 -7855 -10505 -2412 7452 9629
3121 9629 3277 -6918 -9976 -3840 6273 9357 4328 -6501 -10762 -4724 4297 10774 5948 -4373
$$ packed form
3024g603o326M611J4727Q277m468j3508r362L778J2650R778j311j1641j3072J486
3038a1984J1408J2713k80r567j2530k722J0976J2480J572q951j1206n741Q457
3051e375J3776M305p788j2054o287P189J2854P803o821j2862p001M733J1871P594
3065A1937k489j1521q802J626J0801Q847K09j1742j0300k85J1812R851J456j0617
3079G83j0551j619Q934J2250K598r037j1194n083Q178J1236N709o611j2000m013
3093a0420N166J1215N837n514j0948p298N865J0305P634l867j1012q967L861R456
3107A313J0609j504j0944q903o52R452J0356J287q734j0135k650Q093R864K177
3121I629o352j0195l058O136J0113L084n029j0829m261O038R021O477m826j0321
$$ plain form
3135 -4373 -11699 -7426 2523 10073 7413 -1876 -9713 -8731 -171 9304 8689 -260 -8354 -8156 -952 8475
3151 8475 9201 1057 -7542 -8324 -1527 5898 9740 3472 -7324 -10575 -4573 5593 9236 4407 -5025
3166 -5025 -9336 -4561 3738 8852 5610 -2700 -10024 -6078 2664 8908 6879 -986 -8322 -7923 557
3181 557 8234 7263 -1333 -7532 -8041 534 7305 7898 2378 -7041 -9350 -2547 6891 9549 2379 -4305
3197 -4305 -9907 -3896 4140 8464 4251 -3549 -8298 -4051 3795 7067 4409 -2702 -8452 -5554 2923
3212 2923 8654 6113 -1417 -7967 -7433 224 8384 7213 974 -5626 -6655 -1461 5760 8056 1665
3227 1665 -4869 -7319 -2514 4723 7537 2337 -4084 -6376 -2459 3131 7244 4576 -3804 -8005 -4227
3242 -4227 3326 6870 6055 -1207 -7707 -5504 1400 6709 6011 -366 -5867 -5777 -914 6073 5086 125
$$ packed form
3135d373p326M273R949P550k660r289p837R82Q560R475o15q949q094J98P204R427
3151H475P26q144q599p82O797P425L842o268j0796l251O002J0166L643m829r432
3166e025m311M775Q299N114l242q310p324L946Q742O244k029p865p336L99Q480
3181E57P677r71q596o199n09Q575O771N93n520r419k309O803R438K658p170o684
3197d305n602O011Q036M324m213p800m749M247P846L272k658p111n750K898Q477
3212B923N731k541p530o550N34P657Q160j171o239o600j029N194P221K296o391
3227A665o534k450M805P237K814n200o421k292L917N590M113k668q380m201L778
3242d227P553L544q15p262o500K203O904N309o98o377n501R0M863O987r87m961
$$ plain form
3258 125 -6162 -5789 -904 5594 5742 1287 -5096 -5612 -499 4955 7140 3084 -3471 -6079 -3553 2287
3274 2287 5897 3908 -2524 -5670 -3086 1644 5320 3701 -2614 -6430 -3292 1369 5197 3213 -644
3289 -644 -6297 -4549 504 5663 6860 1440 -5192 -5743 -2092 4766 4938 1820 -3008 -5900 -1586 3064
3305 3064 4324 2688 -881 -4660 -959 3265 5169 2491 -1934 -5766 -2343 2020 5385 3547 -1061
3320 -1061 -5853 -4550 1438 4953 3456 -1416 -2706 -4352 -230 3952 4023 -26 -3193 -4129 -1537 3984
3336 3984 3840 1535 -3238 -4226 -322 3745 3717 2323 -3146 -4764 -2495 916 4774 3041 -2227 -3517
3352 -3517 -2683 1118 4703 3022 -599 -3596 -3917 114 3534 3623 46 -5075 -3001 -339 2584 3718
3368 3718 173 -2908 -3983 115 3776 3829 1350 -2686 -4626 -955 1815 4123 2272 -2125 -4053
$$ packed form
3258A25o287L73M885O498J48m455o383n16N113N454K185m056o555k608K526N840
3274B287L610j989o432l146K584M730L676j619o315l816L138M661L828j984l857
3289f44n653J748N053N159J197n420o632n51L651O858J72l118m828k892M314M650
3305C064J260j636l569l779L701M224J904k678m425l832L423M363L365j838m608
3320a061m792J303N988L515j497m872j290j646M122M182P1m049l167r36K592N521
3336C984j44k305m773r88L904M067k8j394n469j618K269L411L858j733n268j290
3352c517Q34L801L585j681l621k997l21M031L420Q9l577n121K074K662K923J134
3368C718l545l081j075M098L661N3k479m036j940L671K770K308j851m397j928
$$ plain form
3383 -4053 -1072 1500 3294 2374 -1817 -2246 -2588 1156 3136 2843 -774 -3779 -2660 1038 2587 2932
3399 2932 17 -3199 -2196 -465 2327 2050 1079 -2840 -3035 -1469 2197 2580 13 -1668 -3044 -955
3415 -955 1169 3379 1256 -1978 -1472 -1501 637 2318 2249 -493 -2255 -1316 1297 2731 2206 -1299 -1196
3432 -1196 -3376 692 2275 709 854 -2376 -2024 -139 1846 2738 1252 -2178 -3135 -1084 1359 2637
3448 2637 642 -1948 -3266 -2666 369 2617 2178 277 -1459 -2494 1566 1580 716 -743 -2428 -970
3464 -970 1318 2214 2018 -911 -2323 -2577 147 2093 2240 898 -2487 -1930 -834 1860 1698 235 -1978
3481 -1978 -1894 -821 1209 2828 569 -1157 -2398 -826 1077 1733 799 -776 -1781 -1026 750 2240
3497 2240 126 -65 -344 -979 251 1588 917 -463 -401 -2079 -685 2297 1114 -79 -936 -1899 -194
$$ packed form
3383d053K981K572J794r20m191m29l42L744J980k93l617l005J119L698J549L45
3399B932k915l216J003J731K792k77r71l919j95J566L666L83k567j681j376K089
3415i55K124K210k123l234N06k9K138J681o9k742j762R39K613J434n25l505J03
3432a196k180M068J583j566J45l230L52J885J985Q92j486l430r57K051K443J278
3448B637j995k590j318O00L035K248m39j901j736j035M060J4q64j459j685J458
3464i70K288Q96j96k929j412k54K724J946J47j342l385N57J096K694j62j463k213
3481a978Q4J073K030J619k259j726j241J572J903O56r34j575j005P55J776J490
3497B240k114j91k79o35J230J337o71j380O2j678J394K982j183j193q57r63J705
$$ plain form
3514 -194 1733 1654 794 -1020 -1085 217 893 1400 1594 -613 -1097 -316 75 1435 920 -324 -1613 272
3532 272 -534 543 1137 -511 -998 -1312 886 656 1442 438 -1405 -1739 318 846 835 -331 -441 -1441
3550 -1441 257 1657 985 793 -608 -828 -1219 563 1062 603 66 -1226 358 521 1240 625 -620
3567 -620 -1114 -1037 568 42 -16 -841 -944 -137 -413 1166 710 674 127 -1327 276 855 706 370 -165 -661
3587 -661 261 -49 77 368 -531 -82 -741 362 151 287 -710 -610 -941 1562 793 1343 380 -851 -1165
3606 -1165 -477 4 524 263 -898 -414 -420 883 -538 592 -648 -680 341 911 3 -387 -439 -1219 -146
3625 -146 102 919 -171 -273 -738 405 773 -177 -585 729 -883 -331 -263 199 74 -49 87 -1048 721
3644 721 -258 345 -43 -594 -446 -961 332 390 895 -455 50 -783 508 259 -440 -1112 400 855 -199
$$ packed form
3514a94J927p9q60j814o5J302O76N07J94k207m84P81L91J360n15j244j289J885
3532B72q06J077N94j648m87l14K198k30P86j004j843l34K057N28j1j166j10j000
3550a441J698J400o72j92j401k20l91J782M99m59n37j292J584J63P19o15j245
3567f20m94P7J605n26n8q25j03Q07k76J579m56l6n47j454J603N79j49l36n35m96
3587f61R22l10J26K91q99M49o59J103k11J36r97J00l31K503p69N50r63j231l14
3606a165O88M81N20k61j161M84oJ303j421J130j240l2J021N70r08l90n2p80J073
3625a46K48Q17j090j02m65J143L68r50m08J314j612N52O8M62j25j23J36j135J769
3644G21r79O03l88n51J48n15J293N8N05j350N05q33J291k49o99o72J512M55j054
$$ plain form
3663 -199 1477 291 906 -565 344 630 309 548 414 -673 -620 -507 -24 -266 -778 -853 -6 -241 1093
3682 1093 -310 -6 -466 188 -192 804 945 -1340 -1899 -922 8 -379 69 -71 348 -492 300 -800 -312
3701 -312 -293 -285 -900 -239 337 429 292 -525 -251 -364 -535 830 -379 -85 -2 -1376 152 -160 -187 -335 433
3722 433 369 -464 242 393 -333 23 -295 362 -527 44 -673 -1083 -453 384 -97 759 -655 -1641 439 -372
3742 -372 -1402 -887 587 -100 -355 715 -264 610 1147 338 -614 -123 -254 3 -93 -463 -181 501 116
3761 116 -154 -331 -1039 -773 -692 -389 -498 360 27 258 -238 369 21 1221 -277 -347 -561 -451 -320 706
3781 706 -241 -428 -8 782 -92 234 1234 -1180 -947 -890 1167 -260 -35 -177 -432 -394 -657 99 289
3800 289 475 -610 330 519 -360 24 -1205 -1004 393 -362 -388 524 -81 -749 245 -171 481 -155 -1071
$$ packed form
3663a99J676j186O15j471R09K86l21K39j34j087N3J13M83k42n12p5Q47k35J334
3682A093j403L04m60O54l80R96J41k285n59R77R30l87M48j40M19q40P92j100M88
3701c12J9Qo15O61N76R2j37q17K74j13j71J365j209K94Q3j374J528l12k7j48P68
3722D33o4q33P06J51p26L56l18O57q89N71p17m10O30Q37m81Q56j414r86K080q11
3742c72j030N15J474o87k55J070r79Q74N37q09r52M91j31K57r6l70K82O82l85
3761A16k70j77p08K66Q1L03j09Q58l33K31m96O07l48J200j498p0k14J10J31J026
3781G06r47j87M20P90q74L26J000k414K33N7K057j427K25j42k55L8k63P56J90
3800B89J86j085R40J89q79L84j229K01J397p55k6R12o05o68R94m16O52o36r16
$$ plain form
3819 -1071 -92 -2016 1150 935 1171 19 536 39 -489 -485 197 -37 -89 515 2399 1106 -298 33 -780
3838 -780 -468 86 25 779 717 -32 -755 -180 55 233 245 -421 -137 -236 -292 -486 -315 1013 262 1431 -674
3859 -674 -437 -861 1121 601 680 -56 408 58 -209 548 -588 394 -594 890 20 -6 -863 -473 -483 76
3879 76 -101 781 66 -657 332 -330 390 -574 235 74 -180 180 2 929 -954 -257 1092 920 222 -613
3899 -613 -300 750 -223 499 -229 385 129 351 417 -1050 -872 449 -1271 -71 166 528 402 -1195
3917 -1195 -394 -657 -221 813 531 787 -935 -728 -393 567 1130 327 -409 283 367 424 -299 306 591 -607
3937 -607 834 -442 409 -953 301 -102 385 345 -524 326 217 190 -331 -135 1393 -688 716 -17
3955 -17 583 -655 -284 -107 -103 -606 60 -284 -750 -538 -385 144 -197 691 714 -130 -118 30 -935 -457 -862
$$ packed form
3819a071R79j924L166k15K36j152N17m97n28MO82k34n2O04J884j293j404L31q13
3838g80L12N54o1P54o2p49p23N75K35J78J2o66K84r9n6j94J71J328p51J169k105
3859f74K37m24J982n20P9p36M64l50k67P57j136R82r88J484q70k6q57L90j0N59
3879G6j77Q82p15p23R89o62P20r64Q09j61k54L60j78R27j883O97J349j72o98q35
3899f13L13J050r73P22p28O14k56K22O6j467J78J321j720J200K37L62j26j597
3917a195Q01k63M36J034k82K56j722K07L35R60N63q03p36O92Q4N7p23O05K85j198
3937f07J441j276Q51j362J254m03M87m0q69Q50j09k7n21J96J528k081J404p33
3955a7O00j238L71J77Mn03O66l44m66K12J53N29l41Q88K3q44J2J48r65M78m05
$$ plain form
3976 -862 -260 -1015 219 -213 -355 -374 37 -6 -1040 -1190 6 471 1134 -867 501 -65 321 -169 -414
3995 -414 677 772 244 -148 -908 -442 -568 1163 712 1411 127 -582 455 538 1676 444 47 264 -257
4014 -257 1088 -114 60 357 164 240 -50 -300 624 106 201 588 282 -580 1 -48 -339 573 710 21
4034 21 -217 174 -1245 274 -663 559 -684 -186 997 -359 4 682 846 230 470 -474 -217 599
4052 599 18 444 -211 760 -57 -811 276 -43 -1157 -161 242 -163 596 -543 -934 -397 -829 -439 -11
4071 -11 498 570 -795 -1179 -515 58 -287 -175 537 -198 -756 29 273 -195 -110 -456 -412 674 486 154 387
4092 387 441 -831 594 -567 -659 -454 0 -930 -100 -288 1120 144 -1576 -26 -931 -437 611 -1068
4110 -1068 406 809 -610 228 -101 2386 -280 588 -654 196 479 -956 972 -1891 -427 391 710
$$ packed form
3976h62O02p55J234m32j42j9M11m3j034j50J196M65O63k001J368n66L86m90k45
3995d14J091R5n28l92p60M66j26J731m51O99j284p09J037Q3J138j232l97K17n21
4014b57J345j202J74K97j93P6k90k50R24n18R5L87l06q62N81m9k91R12J37o89
4034B1k38L91j419J519r37J222j243M98J183j356L63O78J64o16K40r44K57Q16
4052E99n81M26o55R71q17p54J087l19j114R96M03m05P59j139l91N37m32L90M28
4071a1N09P2j365l84O64N73l45J12P12p35n58P85K44m68Q5l46M4J086j88l32K33
4092C87N4j272J425j161r2K05M54r30Q30j88J408r76j720J550r05M94J048j679
4110a068J474M03j419Q38l29K487k666Q68j242Q50K83j435J928k863J464Q18L19
$$ plain form
4127 710 91 -136 190 -90 -462 502 401 1218 -496 161 748 437 1107 780 3 -431 1615 904 461
4146 461 -684 -882 -401 343 153 440 -328 -299 -1020 -1180 -749 1610 1550 341 -445 262 -9 -163 371 353
4166 353 -539 -111 -203 -1069 66 59 -529 -20 1374 1025 593 -135 -1037 -171 156 107 421 177 -728 -1273 153
4187 153 101 -499 178 -162 -574 244 219 355 -414 -16 -230 1342 -69 618 725 1326 -267 1380 -33
4206 -33 204 757 616 275 -78 390 -1014 -421 -146 -136 -72 351 182 -36 -104 -331 -195 -528 806 -274
4226 -274 -859 354 -1047 246 16 98 45 1456 -1381 1689 -58 310 -526 -30 -218 334 774 -448
4244 -448 -152 -250 -165 274 -548 748 43 -584 -864 -627 -56 904 -414 66 -404 48 175 878 1639 717
4264 717 78 -601 -117 53 915 1014 1001 372 1872 1055 -528 226 -575 -99 -1188 -133 444 -1009 -1138
$$ packed form
4127G10o19k27L26k80l72R64j01Q17j714O57N87l11O70l27p77m34K046p11m43
4146D61j145j98M81P44j90K87p68K9p21j60M31K359o0j209p86P07k71j54N34j8
4166C53q92M28r2q66J135pn88N09J394l49m32p28r02Q66L27m9L14k44r05n45J426
4187A53n2o00O77l40m12Q18k5J36p69L98k14J572j411O87J07O01j593J647j413
4206c3K37N53j41l41l53M68j404N93K75J0O4M23j69k18o8k27J36l33J334j080
4226b74n85J213j401J293k30Q2n3J411k837L070j747L68q36M96j88N52M40j222
4244d48K96r8Q5M39q22J296p05o27k80K37N71R60j318M80m70M52J27P03P61r22
4264G17o39o79M84J70Q62R9j3o29J500q17j583P54q01M76j089J055N77j453j29
$$ plain form
4283 -1138 134 -157 101 163 -489 -373 -1319 -517 156 1371 936 -1557 -95 1341 -1274 -113 508 992
4301 992 361 572 -292 -615 -65 -480 543 385 67 15 -402 953 167 130 -138 -545 1027 15 188
4320 188 124 -585 688 -164 43 444 -853 -829 714 79 -97 -1182 1618 -76 438 846 557 833 -13
4339 -13 -640 62 442 -586 -455 301 205 223 -496 -456 599 -516 171 -159 460 -1346 -1050 -200 91 2
4359 2 242 769 -193 888 -1133 63 -211 -788 -841 264 737 60 -753 582 89 241 244 590 -817 -159
4379 -159 -93 295 -323 -140 -192 360 -563 -422 -669 -356 -142 -941 -236 231 -976 25 -286 -329 1138 612
4399 612 -407 -664 402 -973 -37 -42 -54 -501 -1014 171 144 -329 138 436 715 -212 777 -1237 -634 -134
4419 -134 1194 557 -342 490 637 690 -194 -364 -176 1098 78 110 711 770 -838 -666 -279 -140 -120 -236
$$ packed form
4283a138J272k91K58O2o52J16r46Q02O73J215m35k493J462J436k615J161O21M84
4301I92o31K11q64l23N50m15J023j58l18n2m17J355p86l7k68m07J572j012J73
4320A88o4p09J273q52K07M01j297K4J543o35j76j085K800j694N14M08k89K76q46
4339a3o27P02L80j028J31P56r6J8p19M0J055j115O87l30O19j806K96Q50K91q9
4359BK40N27r62J081k021J196k74n77n3J105M73o77q13J335m93J52LL46j407O58
4379a59O6L88o18J83n2N52r23J41k47L13K14p99P05M67j207J001l11m3J467n26
4399F12j019k57J066j375R36nj2m47n13J185k7m73M67K98K79r27R89k014O03N00
4419a34J328o37q99Q32J47N3q84j70J88J274j020L2O01N9j608J72L87J39K0j16
$$ plain form
4439 -236 864 506 991 730 -196 -1389 104 33 945 637 56 154 -213 37 401 -492 530 1011 -475
4458 -475 -246 -262 -385 -583 -727 142 144 -309 84 -289 -722 95 743 -530 558 -352 746 130 291 -488
4478 -488 160 -96 -56 -261 -122 669 -1309 165 334 165 670 408 210 -743 -376 -130 4 512 170 -1308
4498 -1308 -802 658 -948 133 -712 265 532 542 -310 239 83 542 129 431 1756 -498 -99 982
4516 982 -369 -93 -56 -212 627 -122 499 -868 -50 -215 441 -1654 -89 -744 -513 721 -774 2144
4534 2144 -400 182 1073 553 142 -970 221 265 57 -606 -840 -604 468 -1032 -626 646 -27 -183
4552 -183 -405 356 122 297 -294 882 0 638 2069 698 1265 -746 -237 303 115 -270 -175 78 -742
4571 -742 -699 239 439 -371 886 -557 -673 676 70 -89 -265 -1491 -210 841 1158 -114 -234 428
$$ packed form
4439b36J100l58M85k61r26j193J493p1R12l08n81R8l67K50L64q93J022M81j486
4458d75K29j6j23j98j44Q69Km53L93l73m33Q17O48j273J088r10J098o16J61p79
4478d88O48k56M0k05J39P91j978J474J69j69N05k62j98r53L67K46J34N08l42j478
4498a308N06J460j606J081q45R77K67J0q52N49j56M59m13L02J325k254L99J081
4516I82j351K76L7j56Q39p49O21j367Q18j65O56k095J565o55K31J234j495K918
4534B144k544N82Q91n20m11j112J191M4k08o63k34K36J072j500M06J272o73j56
4552a83k22P61k34J75n91J176q82O38J431j371N67k011N09N40j88l85R5K53q20
4571g42M3R38K00q10J257j443j16J349o06j59j76j226J281J051L17j272j20O62
$$ plain form
4589 428 146 76 145 880 -375 17 -174 -205 -388 106 621 -519 -706 -305 -360 711 -988 521 -209 -993
4609 -993 -547 -432 623 381 -33 -8 -368 816 -630 -530 -467 -456 431 -789 -395 -1243 673 -194 -241 874
4629 874 -72 14 62 538 -104 -167 110 -771 -425 -321 103 308 -523 223 -806 219 -318 -978 -272 -169
4649 -169 -218 -575 -55 -511 473 -632 -71 -320 -314 1151 289 278 -770 568 -915 41 344 -86 -565 47
4669 47 287 1246 -335 1152 599 -407 -481 -348 -459 36 622 -1005 3 -736 -1062 -115 229 -560 -1674
4688 -1674 128 372 -1936 564 -198 1890 518 -95 250 -516 -564 166 288 -724 294 344 -708 241
4706 241 -28 263 507 973 -653 1082 -127 -177 -1115 419 158 175 824 590 -169 -346 -324 83 479 331
4726 331 -372 929 -415 318 313 441 242 985 275 -1092 -678 -443 39 829 3 852 -273 260 -182
$$ packed form
4589D28k82p0O9P35j255L92j91l1j83M94N15j140j87M01n5J071j699J509p30p84
4609i93M46J15J055k42m14K5l60J184j446J00O3J1Q87j220L94q48J916q67m7J115
4629H74r46Q6M8M76o42o3K77q81L46J04M24K05q31P46j029J025n37o60P06J03
4649a69m9l57N20m56R84j105N61k49OJ465q62j1j048J338j483R56L03m30m79O12
4669D7K40R59j581J487n53j006p4J33j11M95N86j627J008p39l26R47L44p89j114
4688a674J802K44k308K500p62K088j372o13L45p66m8P30J22j012J018N0j052R49
4706B41k69K91K44M66j626J735j209n0r38J534k61J7O49k34p59j77K2M07L96j48
4726C31p03J301j344P33nJ28j99P43p10j367M14K35M82P90q26Q49j125N33m42
$$ plain form
4745 -182 328 1152 905 -498 379 -402 318 318 326 782 -493 -83 -472 200 -681 -546 -1721 -581 -7 -382
4765 -382 -1220 155 495 277 317 -491 -240 -724 1237 246 897 267 200 -228 -573 -182 163 -364 -1183 -511
4785 -511 217 754 -51 324 -256 866 -1624 -417 -42 622 -18 -286 257 245 -981 1901 189 150 596
4804 596 23 189 -85 -783 -930 918 628 -259 1082 84 760 358 78 124 -236 91 885 -380 108
4823 108 -957 689 385 -471 -2618 -432 210 359 541 -781 -799 -232 -212 509 353 636 -271 311 249
4842 249 -533 -145 313 -326 -195 384 962 -246 -740 640 -258 -725 -826 842 -1927 -252 155 -174
4860 -174 -183 339 243 1191 -62 992 210 1141 -145 -1426 -242 749 -87 165 -92 314 -208 -132 20 -419
4880 -419 -289 -653 -228 -646 -43 119 198 112 -766 -270 1325 404 789 40 -558 -240 -328 552 740 -609
$$ packed form
4745a82N10Q24k47j403Q77p81P20%QM56j275M10l89O72q81J35j175J140N74l75
4765c82q38J375L40k18M0q08K51m84J961r91O51o30o7m28l45L91L45n27q19O72
4785e11P28N37q05L75n80J122k490J207L75O64o40k68N43j2j226K882j712l9M46
4804E96n73J66k74o98j47J848k90q87J341r98O76m02k80M6l60L27P94j265M88
4823A08j065J646l04q56k147K186O42J49J82j322j8N67K0P21j56K83r07N82o2
4842B49p82L88M58o39J31N79N78j208m94J380q98m67j01J668k769J675M07l29
4860a74rN22r6R48j253J054p82R31j286j281J184R91q36K52k57M06n22P6J52m39
4880d19J30l64M25m18O03J62P9q6q78M96J595r21L85p49n98L18q8Q80J88j349
$$ plain form
4900 -609 -118 -398 461 404 829 -551 -445 -386 433 1021 1248 12 42 -1200 -382 -49 -210 230 708 461
4920 461 186 1217 715 126 468 693 68 425 -491 -171 -15 166 -7 83 -629 955 223 -1977 8
4939 8 -186 -174 319 265 -195 85 -321 -524 469 -1006 630 -623 292 571 241 -371 -619 68 142 777 -593
4960 -593 231 -729 -1281 481 1217 -113 -653 416 221 -634 -432 -1081 -215 168 -872 232 512 296
4978 296 -994 133 -1197 313 580 1093 275 248 -118 -2693 520 -322 924 15 381 -702 631
4995 631 842 -1 -132 279 -178 9 839 614 -614 -1025 -215 -1182 677 624 427 -86 -397 -1457 -87
5014 -87 813 247 1299 298 -729 -143 -55 182 -918 -212 -317 -406 1786 339 368 -1380 -70 -197 1316
5033 1316 1615 -754 -1512 255 478 604 264 7 -51 -1492 -617 583 907 404 -179 -1288 395 159
$$ packed form
4900f09M91k80Q59n7M25j380J06N9Q19N88K27j236L0j242Q18L33j61M40M78k47
4920D61k75J031n02n89L42K25o25L57r16L20J56J81j73R0p12J584p32k200J985
4939Hj94J2M93n4m60K80m06k03R93j475J636j253R15K79l30o12k48O87P4O35j370
4960e93Q24r60n52J762P36j330n40J069j95q55K02o49Q66L83j040J104K80k16
4978B96j290J127j330J510K67N13q18k7l66k575L213q42J246r09L66j083J333
4995F31K11q43j31M11m57J87Q30k25j228m11Q10r67J859n3j97n13l11j060J370
5014h7R00n66J052j001j027N86Q8K37j100P06j05q9K192j447K9j748J310j27J513
5033A316K99k369p58J767K23J26l40k57n8j441Q75J200L24n03n83j109J683k36
$$ plain form
5051 159 -420 74 -34 -458 -723 -899 820 495 -17 -838 204 -347 766 -455 620 -856 361 629
5069 629 -533 597 -326 -738 -998 490 402 183 -116 -444 -204 592 306 114 546 -494 -542 -79 -494
5088 -494 686 -467 -634 -464 -1113 -164 -718 350 -1047 -1334 1056 -354 -14 -162 -410 -850 643 1254
5106 1254 567 306 -552 151 -291 901 545 93 237 -745 -1282 145 197 73 31 -709 28 317 -31 722
5126 722 171 -548 -928 -289 29 489 329 -238 -1626 432 1134 -180 1024 -844 -1476 -697 323 -45
5144 -45 1383 169 -256 -493 -448 86 799 -314 -1271 -1807 219 -452 -464 79 442 -706 519 54 1357
5163 1357 -15 -208 -405 -213 568 1081 264 -172 -562 -1266 163 339 1730 -156 -295 -949 189 380
5181 380 23 1225 -1287 -651 -86 572 340 500 -389 51 -230 222 742 894 231 -850 -10 -196 487
$$ packed form
5051A59n79M94j08m24k65j76J719l25n12q21J042n51J113j221J075j476J217K68
5069F29j162J130r23m12k60J488q8k19k99l28K40P96k86j92M32j040m8M63m15
5088d94J180j153j67J70o49R49n54J068j397k87K390j410L40j48k48m40J493O11
5106A254o87k61q58P03m42J192l56m52J44r82n37J427N2j24m2p40P37K89l48P53
5126G22n51p19l80O39L18M60j60n67j388K058P02j314J204j868o32P79J020l68
5144d5J428j214m25k37M5N34P13j113r57n36K026o71j2N43L63j148J225m65J303
5163A357j372j93j97J92P81N13q17m36l90p04J429J76J391j886j39o54J138J91
5181C80l57J202k512O36N65O58k32J60q89M40k81M52N20J52o63j081Q40j86O83
$$ plain form
5200 487 451 -531 -341 -156 560 607 802 -314 160 359 979 182 119 286 -598 -1354 60 782 594 502 -441
5221 -441 -322 294 -690 715 1061 -237 476 -312 1055 1119 195 -442 -62 314 -134 -509 1119 -812 -676
5240 -676 -264 -430 792 306 399 -961 -388 645 1153 72 873 -1574 -726 -670 -60 0 -331 -609 -801
5259 -801 -545 537 1401 830 -93 -1778 -265 -163 141 -73 -819 -727 -958 1073 2054 118 -136 -723 -543
5278 -543 154 438 364 -533 -684 -488 362 1441 438 -89 -499 1035 37 848 1141 -2 -1161 201
5296 201 262 1044 280 -280 -1508 -431 374 661 547 -783 -636 -504 -1441 1210 731 -260 -1609 -959 12
5315 12 1003 813 763 -494 -238 177 50 508 -2 -1051 -1486 -874 256 484 1336 -925 -1328 -316 1040
5334 1040 683 574 64 -354 -634 228 236 113 1321 -120 -225 -830 289 1115 583 238 29 307 418
$$ packed form
5200D87l6r82J90J85P16M7J95j116M74J99O20p97o3J67q84p56J414P22j88r2r43
5221d41J19O16r84J405L46j298P13p88J367O4r24o37L80L76m48l75J628j931J36
5240f76M12j66J222m86R3j360N73J033N08j081Q01k447Q48N6O10O0l31k78j92
5259h01K56J082Q64n71r23j685J513J02L04k14p46R2k31K031R81j936k54n87J80
5278e43O97K84p4q97j51J96Q50J079j003n27m10J534r98Q11K93j143j159J362
5296B01O1P82p64n60j228J077Q05K87j14j330J47J32r37K651m79r91j349O50R71
5315A2R91j90n0j257K56M15j27M58n10j049m35O12J130K28Q52k261m03J012J356
5334A040l57j09n10m18k80Q62Qj23J208j441j05o05J119Q26n32l45k09K78J11
$$ plain form
5353 418 840 1083 416 -1135 -654 942 664 15 371 -2351 933 471 1113 317 477 -2048 39 1374
5371 1374 1062 1758 -423 -1512 -964 -1100 578 837 952 602 -1137 -161 187 845 -951 333 -1781
5388 -1781 283 764 2236 59 -272 -709 900 1389 1072 -352 314 -1554 -601 604 620 1576 902 -192
5406 -192 -1361 333 993 1763 808 -1227 -1114 178 443 1186 155 495 -1970 -546 544 70 -366
5423 -366 -1020 -852 -100 -76 1796 594 -1036 -943 227 1056 -578 -611 -184 -41 -665 -483 1947 485 379
5442 379 -1083 -1676 886 -251 525 877 -47 -69 -218 635 1286 -250 -22 -1289 -1072 -327 1021 338
5460 338 406 -761 1039 550 1366 538 -1029 -649 -42 -311 1549 -563 -583 -613 -937 -653 602 441 -300
5479 -300 -542 -236 58 86 1235 908 -703 -846 271 528 239 1352 -457 -1037 26 828 207 733
$$ packed form
5353D18M22K43o67j551M81J596k78o49L56k722L284m62O42p96J60k525K087J335
5371A374l12O96k181j089N48j36J678K59J15l50j739R76L48O58j796J284k114
5388a781K064M81J472k177l31m37J609M89l17j424O66j868R53J205J6R56o74j094
5406a92j169J694O60P70r55k035J13J292K65P43j031L40k465J424J090m74m36
5423c66o54J68P52K4J872j202j630R3J170Q29j634l3M27J43o24J82K430j462j06
5442C79j462n93K562j137P76L52r24k2j49Q53O51j536K28j267K17P45J348o83
5460C38O8j167J800m89Q16q28j567L80O07k69J860k112k0l0l24K84J255j61p41
5479c00k42L06K94K8J149l27j611j43J117K57k89J113j809n80J063Q02o21N26
$$ plain form
5497 733 -538 -383 -1235 119 647 1475 167 -826 448 -115 1374 75 -423 -1297 7 1764 1344
5514 1344 -10 -30 -428 749 1491 595 525 -488 -1593 -884 -394 110 -461 100 -390 -963 -1502 879 1156
5533 1156 -978 603 -1941 39 1048 1705 -88 -286 -555 -1173 936 1649 851 565 -611 -845 242
5550 242 1171 1103 -754 -499 -815 512 1158 -148 760 -1098 -912 847 560 -20 -464 387 -246 -270 425
5569 425 380 1456 -9 -1032 -941 -973 553 266 -294 -1345 441 -140 1129 496 183 -946 -1803 380
5587 380 -504 39 -303 -40 -755 -298 1562 920 -149 -962 -1109 525 577 693 -1114 35 -991 -775
5605 -775 -73 -73 79 -1272 195 -2276 -139 607 523 -143 -825 -313 270 -851 1483 1507 -563 -396 294
5624 294 284 703 -96 -449 592 623 -557 571 100 -859 115 -385 561 1650 1029 -235 -2086 -460
$$ packed form
5497G33j271J55q52J354N28Q28j308r93J274n63J489j299m98q74J304J757m20
5514A344j354k0l98J177P42q96p0j013j105P09M90N04n71N61m90n73n39K381K77
5533A156k134J581k544J980J009O57j793j98k69o18K109P13p98k86j176k34J087
5550B42R29o8j857K55l16J327O46j306R08j858J86J759k87n80m44Q51o33k4O95
5569D25m5J076j465j023R1l2J526k87n60j051J786n81J269o33l13j129q57K183
5587C80q84N43l42K63p15M57J860o42j069q13j47J634N2J16j807J149j026K16
5605g75P02%J52j351J467k471K137P46q4o66o82N12N83j121K334K4k070J67O90
5624B94j0M19p99l53J041L1j180J128m71r59R74n00R46J089o21j264j851J626
$$ plain form
5642 -460 98 -102 281 -450 563 -1144 -293 -389 895 -142 -924 -155 -290 -163 462 128 -1468 -216
5660 -216 1480 1066 784 98 -266 417 500 1773 940 515 -1170 -756 34 350 883 615 -430 -167 343
5679 343 368 1695 783 -129 -614 -101 476 894 -371 -1120 -1041 -561 292 1380 1028 130 -853 -622 786
5698 786 308 408 -50 -269 -876 -589 1374 40 -1114 -502 121 207 217 -651 -524 -1391 -563 -1311 616
5717 616 1232 725 1371 149 540 -493 429 472 -102 -587 83 161 -172 26 -382 -1268 -1641 -363 799
5736 799 657 1231 -1049 -628 355 98 522 -249 -1112 256 -104 75 514 -104 161 -455 -342 -145 324
5755 324 369 972 354 -257 500 462 683 -296 593 183 -972 432 -86 -569 -182 -1031 -425 372 328 334 -386
5776 -386 -1477 761 1057 523 247 -220 -853 -519 221 310 660 479 -1288 -90 949 1013 -322 -693 -11
$$ packed form
5642d60N58k00L83p31J013j707Q51r6J284j037p82P69j35J27O25l34j596J252
5660b16J696m14k82o86l64O83Q3J273q33m25j685M14P90L16N33k68j045K63N10
5679C43K5J327r12r12m85N13N77M18j265p49P9M80Q53J088l52q98r83K31J408
5698G86m78J00m58k19o07K87J963j334j154O12O23Q6J0q68J27q67Q28p48J927
5717F16O16n07O46j222L91j033R22M3n74m85O70P8l33J98m08q86l73J278J162
5736G99j42N74k280M21R83k57M24p71q63J368l60J79M39o18K65o16J13J97M69
5755C24M5O03o18o11P57l8K21r79Q89m10j155J404n18m83L87q49O06P97m4Op20
5776c86j091K238K96n34k76m67o33L34P40Q9L50j81j767J198J039O4j335l71O82
$$ plain form
5795 -11 596 294 759 781 663 -1091 26 -228 477 794 420 247 -1789 -1005 -108 148 483 -820 -1284
5814 -1284 -242 -239 -435 534 -28 35 -430 -191 114 -211 -372 -1230 -1139 275 2135 609 362 -780 57
5833 57 -259 104 603 -641 -1574 -782 1150 -92 365 548 -693 -293 -335 -109 -341 -910 192 280 -221
5852 -221 694 430 -285 -464 88 86 -257 1306 220 -235 127 367 -300 -235 842 -18 -844 543 597 102
5872 102 418 -385 -598 516 1391 -659 912 -188 -689 -389 -568 181 248 -70 -1455 -350 -166 970
5890 970 457 249 -145 -1055 -843 -363 461 -287 208 843 233 1108 1138 545 602 -793 -591 460 1303 501
5910 501 -1249 -439 -820 -220 104 -192 -638 -595 -1212 567 756 164 808 -209 -704 -371 327 -68 81
5929 81 -492 -542 847 631 1039 -196 -626 605 -1470 514 455 1448 -725 -547 -223 739 1418 846 -260
$$ packed form
5795a1O07l02M65K2j18j754J117k54P05L17l74j73k036P84Q97K56L35j303m64
5814a284J042Lj96R69n62O3m65K39L05l25j61q58R1J414J860j526k47j142Q37
5833E7l16L63M99j244r33P92J932j242M57J83j241M00m2K26k32n69J102Q8n01
5852b21R15k64p15j79N52kl43J563j086m55L62K40o67O5J077q60q26J387N4m95
5872A02L16q03k13J114Q75k050J571j100n01L00j79P49O7l18j385J105J84J136
5890I70n13k08l94r10K12M80Q24p48M95O35o10Q75L0n93N7j395K02J051Q43q02
5910E01j750Q10l81O00L24k96m46M3o17J779J89n92O44j017m95L33O98l95J49
5929H1n73n0J389k16M08j235m30J231k075J984n9R93k173J78L24R62O79n72j106
$$ plain form
5948 -260 34 -1380 1093 530 -468 -574 -164 -634 153 -1389 78 307 -77 50 -46 879 408 -480 788
5967 788 -517 -740 1264 -97 449 -390 -281 361 373 537 500 -225 -174 200 -184 350 749 460 990 -838
5987 -838 -132 658 299 590 -208 -1281 426 264 170 80 -562 -82 -275 295 1064 -435 -954 -1011 -284 1061
6007 1061 -79 -28 350 206 -321 452 -191 461 -277 -421 765 41 773 718 912 204 -90 1102 405
6026 405 445 -300 -1081 530 -57 120 -19 1184 387 58 144 1111 208 419 -622 728 -183 431 441 -536
6046 -536 354 -604 -180 -337 -1567 151 -551 -1600 -16 -759 467 383 -247 320 654 1468 33 113 1071
6065 1071 -704 59 162 -443 -168 -791 0 -184 804 -334 985 35 -1030 457 -559 -631 -142 -119
6083 -119 7 -122 358 126 1038 1546 399 -382 -877 1510 -601 648 559 -511 -339 -146 1 -413 543
$$ packed form
5948b60K94j414K473n63r98j06M10m70P87j542J467K29l84J27r6R25m71q88J268
5967G88j305k23K004j361N46q39J09O42J2J64l7p25N1L74l84N34L99k89N30j828
5987h38P06P90l59K91p98j073J707j62r4r0o42M80j93N70P69j499n19n7P27J345
6007A061j140N1L78j44n27P73o43O52p38j44J186p24P32n5J94p08k94J192o97
6026D05M0p45p81J611n87J77j39J203p97l29Q6R67r03K11j041J350r11O14J0r77
6046e36Q90r58M24j57j230J718p02j049J584p43J226q4o30N67L34Q14j435Q0R58
6065A071j775P63J03o05K75o23P91j84R88j138J319r50j065J487j016p2M89K3
6083a19J26j29M80k32R12N08j147p81m95K387k111J249q9j070J72J93J47m14R56
$$ plain form
6102 543 -604 -214 -373 180 376 411 23 -636 -230 -167 800 -495 428 -401 -80 -372 -809 396 -546 -403
6122 -403 727 -52 106 -201 1175 603 -587 -852 928 781 -139 -1129 58 145 -367 282 74 569 340
6141 340 677 -102 -124 -1639 135 778 391 22 -457 533 -1039 -222 -1001 996 -419 -365 75 -1136 1038
6160 1038 751 -64 783 444 166 -574 562 299 -290 -338 349 630 957 940 -74 -282 -108 158 738 -1358
6180 -1358 -445 750 -347 -558 -240 -570 -1042 -179 -911 -814 101 667 751 -124 178 -310 -367 176 422 507
6200 507 -256 -730 346 -816 629 257 321 -145 -219 -680 80 -169 219 -525 -379 43 942 -610 -314
6219 -314 597 -280 1131 -303 290 -251 117 804 -873 183 -50 -109 310 400 98 -221 890 162 -276
6238 -276 201 -905 572 -420 -126 454 654 130 -670 178 640 -243 -890 368 658 -514 -421 319 -94
$$ packed form
6102E43j147L90j59N53J96L5l88o59M06O3R67j295R23q29L21k92m37J205r42J43
6122d03J130p79J58l07J376n72j190k65J780j47r20r90J187Q7n12O49k08M95k29
6141C40L37p79k2j515J774O43l87l69m79R90j572Q17p79J997j415N4M40j211K174
6160A038k87q15Q47l39k78p40J136k63n89m8O87K81L27j7j014k08J74K66N80k096
6180a358R13J195j097k11L18l30m72Q63p32R7R15N66Q4q75L02m88n7N43K46Q5
6200E07p63m74J076j162J445l72O4m66p4m61P60k49L88p44J46M22Q99j552K96
6219c14R11q77J411j434N93n41L68O87j677J056k33n9M19R0l02l19J111p28m38
6238b76M77j106J477r92K94N80K00n24q00Q48M62q83o47J258K90j172R3P40m13
$$ plain form
6257 -94 -635 1164 310 907 -1000 229 474 354 -906 583 150 1030 -411 -496 593 -820 660 375
6275 375 58 449 -487 -980 118 -396 239 355 -1246 123 -275 584 188 -340 -165 56 1302 1431 -758
6294 -758 310 -142 100 -229 134 370 -826 -326 -497 381 398 -71 -546 1007 -258 -68 -968 86 128
6313 128 351 -428 508 367 532 1106 -466 307 34 313 -116 695 693 -480 -375 21 -41 -1120 551 992
6333 992 -575 229 -233 -460 1031 651 -306 -1159 655 532 1096 337 -341 557 -131 -11 354 1264 572
6352 572 -1810 -110 235 -628 -165 181 -353 -328 -67 280 -162 -507 1023 -823 459 1337 -203 999
6370 999 -758 158 790 82 163 -45 -100 83 -319 473 655 -613 835 492 -416 -363 -367 870 -232 1115
6390 1115 602 -210 -345 699 147 253 570 -59 -632 -330 275 1263 -80 -354 537 -748 -577 -148 85
$$ packed form
6257i4n41J799q54N97j907J229K45j20j260J489m33Q80j441q5J089j413J480k85
6275C75l17L91r36m93J098n14O35J16j601J369l98Q59l96n28J75K21J246J29k189
6294g58J068m52K42l29L63K36j196N00j71Q78J7m69m75J553j265J90r00J054M2
6313A28K23p79R36j41J65N74j572P73k73K79m29Q11kj173J05L96o2j079J671M41
6333I92j567Q04m62k27J491l80r57q53J814j23N64p59o78Q98o88J20L65R10o92
6352E72k382J700L45q63M63L46n34K5K61L47m42l45J530j846J282Q78j540J202
6370I99j757R16O32p08Q1k08n5J83m02P92J82j268J448l43r08N3mJ237j102J347
6390A115n13q12j35J044n52J06L17o29n73L02O05R88j343k74Q91j285J71M29K33
$$ plain form
6409 85 939 1356 436 -455 -136 221 413 -157 -285 -580 201 -141 793 -104 -105 -130 526 839 460 -709 18
6430 18 404 368 -465 -395 -284 -115 295 -1124 143 -548 24 -377 393 -823 49 -736 140 331 -501 484
6450 484 -558 -641 -1137 668 102 134 -468 285 -114 -1036 -672 -492 119 -504 266 200 57 -278 891 -151
6470 -151 -543 -1287 533 -82 -31 681 528 327 -453 -200 -204 497 519 578 3 -699 234 -65 -196 107 220
6491 220 18 -251 -402 -1242 -230 294 347 331 -432 -257 -146 -420 -1267 -798 -286 130 402 332 386 197 -306
6512 -306 -1325 -445 129 703 942 183 -917 -27 1469 -134 -657 208 107 558 -42 -118 -45 317 -586
6531 -586 711 -46 -217 -314 645 995 425 115 133 596 -1146 -608 -820 735 -869 713 -557 1055
6549 1055 -645 -91 389 1037 -359 -582 -297 -531 -778 26 -512 -58 297 316 640 -334 -490 -1136 -362
$$ packed form
6409H5Q54M17r20q91L19L57J92n70j28k95P81l42R34q97jk5O56L13l79j169P27
6430A8L86l6q33P0J11J69M10j419J267o91N72m01P70j216Q72p85Q76J91q32R85
6450D84j042q3m96J805n66L2o02P53l99r22L64J80O11o23P70o6j43l35J169j042
6470a51l92p44J820o15N1P12j53k01p80K53mP01K2N9n75p02R33k99j31L03J13
6491B20k02k69j51q40J012N24N3j6p63J75J11k74q47M69N12M16K72p0N4j89n03
6512c06j019Q80N74N74K39p59j100Q90J496j603n23Q65j01M51o00p6P3L62r03
6531e86J297p57j71r7R59L50n70l10J8M63j742N38k12J555j604J582j270J612
6549A055j700N54M80O48j396k23K85k34k47Q04n38M54L55J9L24r74j56o46P74
$$ plain form
6568 -362 471 459 573 -121 638 357 -232 1350 195 256 -381 880 350 -1790 363 1025 181 -120 -322
6587 -322 -735 -827 85 929 -103 325 -251 -400 -86 621 -1784 -92 -509 67 619 -120 47 408 177
6606 177 420 413 -209 -70 330 208 363 -614 -242 614 343 -189 -755 839 564 996 377 -818 -1348 -244
6626 -244 498 -331 -745 -651 698 -108 -1375 -299 285 -534 -245 1081 -453 80 662 52 -28 -1008 -823
6645 -823 831 561 -687 -1137 -1223 -107 772 -215 307 547 -620 -455 196 -199 -350 974 81 -592 382
6664 382 -238 143 -125 793 -102 31 -369 -119 -334 -593 -489 381 56 -510 -494 199 -389 634 381 -147
6684 -147 271 -21 -586 -253 -113 -116 335 -288 857 -172 -155 802 3 -544 806 46 -503 209 -31 122
6704 122 -271 700 324 647 46 -40 116 344 -232 111 642 828 269 -857 88 78 -268 -152 475 912
$$ packed form
6568c62Q33j2J14o94P59k81n89J582j155O1o37J261n30k140K153O62q44l01k02
6587c22m13r2R12Q44j032M28n76j49L14P07k405J692m17N76N52p39J67L61k31
6606A77K43po22J39M00j22J55r77L72Q56k71n32n66J594k75M32o19j195n30J104
6626b44P42q29m14R4J349q06j267J076N84q19K89J326j534N33N82o10q0r80J85
6645h23J654k70j248m50q6J116Q79r87N22K40j167J65O51l95j51J324q93o73R74
6664C82o20L81k68R18q95J33m00K50k15k59J04Q70l25n66J6O93n88J023k53n28
6684a47M18k92n65L33J40lM51o23J145j029J7R57p99n47J350p60n49P12k40J53
6704A22l93R71l76L23o01q6J56K28n76L43N31J86n59j126R45j0l46J16O27M37
$$ plain form
6724 912 -190 -467 131 180 -631 -8 -280 1332 -341 -757 -99 428 -219 -735 1747 107 1005 281 -404
6743 -404 -397 22 603 533 428 610 -471 -1528 275 -562 -9 287 145 -188 588 -194 113 247 -395 45
6763 45 -1172 1670 380 -35 463 46 -28 587 -1428 -272 307 -186 1116 137 -313 -271 644 -313 -72
6782 -72 -621 -1124 416 -686 -234 868 540 609 225 -122 868 131 -740 436 384 91 1047 153 -73 904
6802 904 1013 239 -321 -542 358 -43 -451 307 199 225 -979 432 -301 -579 -1251 -237 660 405 -428
6821 -428 -47 -660 -499 685 -459 -161 274 -823 -28 114 -1135 -694 -857 -115 -110 593 -1054 -374 -319
6840 -319 -487 1238 88 71 -394 450 -44 676 -240 609 749 -518 -686 374 341 373 314 -672 148 -27
6860 -27 -314 -471 751 968 -94 -190 -252 646 370 1222 -453 -1146 -629 -93 466 -463 -426 300 -66 -85 -397
$$ packed form
6724I12j102k77N98M9q11O23k72J612j673m16O58N27o47n16K482j640Q98p24o85
6743d04PM19N81p0j05J82j081j057J803q37N53K96j42l33P76p82L07J34o42M40
6763D5j217K842j290m15M98m17p4O15k015J156N79m93J302r79m50M2R15r57K41
6782g2n49n03J540j102M52J102l28O9l84l47R90p37q71J176n2k93R56q94k26R77
6802I04J09p74n60k21R00m01m08P58j08K6j204J411p33k78o72J014Q97k55q33
6821d28L81o13J61J184j144K98M35j097P95J42j249M41j63P42NP03j647O80N5
6840c19j68J725j150j7m65Q44m94P20r16Q49J40j267j68J060l3L2n9r86Q20j75
6860b7k87j57J222K17j062r6o2Q98k76Q52j675o93N17N36N59r29L7P26l66j9l12
$$ plain form
6881 -397 789 451 102 108 115 -1067 475 -1100 163 -294 -540 116 5 885 589 254 60 590 -884
6900 -884 688 926 171 -758 222 241 -40 79 -957 103 250 -295 356 1140 77 64 368 796 -55
6919 -55 291 -316 -557 855 -178 701 -408 702 215 1058 -812 -176 16 -679 -180 74 -417 128 962
6938 962 -1280 183 409 106 -117 761 106 -159 456 228 255 -489 170 517 -1101 480 8 -1374 324
6957 324 626 673 314 -316 -452 154 -1632 -327 1532 491 536 173 256 357 -400 937 406 774 -626
6976 -626 716 784 -609 326 -449 755 249 -385 393 294 -625 165 285 -84 -199 -857 435 -489 36
6995 36 735 94 -442 386 585 -758 -66 -1041 779 -726 -197 -132 -1133 -1191 -199 1123 28 -5 525
7014 525 -1050 -998 532 -776 -1318 -166 441 1535 458 746 143 188 746 443 -12 -694 1211 -708
$$ packed form
6881c97J186l38l49OPj182J542j575J263m57k46O56j11Q80k96l35j94N30j474
6900h84J572K38p55r29R80J9k81J19j036J060J47n45O51P84j063j3L04M28q51
6919e5L46o07k41J412j033Q79j109J110m87Q43j870O36J92o95M99K54m91N45Q34
6938I62k242J463K26l03k23Q78o55k65O15k28K7p44O59L47j618J581m72j382J698
6957C24L02M7l59o30j36O06j786J305J859j041M5l63Q3J01p57J337n31L68j400
6976f26J342O8j393R35p75J204n06o34P78r9r19P90J20l69j15o58J292r24N25
6995C6O99o41n36Q28J99j343O92r75J820j505N29O5j001n8R92J322j095l3N30
7014E25j575N2J530j308n42J152O07J094j077K88o03M5N58l03m55o82J905j919
$$ plain form
7032 -708 -197 385 -369 513 -1898 735 -500 818 309 -465 623 -568 -147 -67 -429 -982 471 -140
7050 -140 301 -781 111 -993 -1027 777 -1136 -237 -843 167 773 -532 123 -700 -615 614 617 -413 -265
7069 -265 697 -251 -893 -589 129 679 -233 -140 560 -461 -763 586 -720 246 -118 -74 956 -1231 -590
7088 -590 -109 780 84 182 626 788 253 401 -321 -1325 1560 450 -809 -186 -774 -863 -530 897 -338
7107 -338 -167 502 -499 517 139 -501 -674 -879 772 -503 -130 -796 646 -1336 1191 81 175 156
7125 156 -278 -700 -294 597 283 -229 -364 781 -400 1040 1169 610 173 151 365 371 403 842 184 636
7145 636 -409 148 165 330 -984 179 -330 16 434 -444 -387 -20 -576 -76 -208 -25 -147 -1090 1050
7164 1050 -288 584 581 759 -1303 441 -265 458 51 -619 380 46 -278 210 -196 -127 -359 907 -1750
$$ packed form
7032g08N11N82p54Q82k411K633j235J318n09p74J088j191M21Q0l62n53J453o11
7050a40M41j082Q92j104l4J804j913Q99o06J010O06j305O55q23Q5J229Lj030J48
7069b65R62r48o42L04P18N50r12R3P00j021l02J349j306R66l64M4J030k187O41
7088e90M81Q89o96R8M44J62n35J48p22j004K885j110j259O23n88q9L33J427j235
7107c38J71O69j001J016l78o40j73k05J651j275L73o66J442j982K527j110R4j9
7125A56m34m22M06Q91l14n12j35J145j181J440J29n59m37k2K14OL2M39o58M52
7145F36j045N57J7J65j314J163n09L46M18q78N7L67n56N00j32J83j22r43K140
7164A050j338Q72lJ78k062J744p06P23m07o70R99l34l24M88m06O9k32J266k657
$$ plain form
7183 -1750 -1067 -319 423 149 -90 -112 435 785 -858 -990 -142 -1403 -220 -122 -123 722 277 290 -271 -108
7203 -108 394 806 -270 -111 -267 -238 1281 -386 752 351 -1035 -125 -806 1089 -788 858 -189
7220 -189 546 -84 -594 303 1178 1170 374 131 10 217 -146 228 -199 -375 -774 738 -964 -201 966 -312
7240 -312 338 -532 68 1424 -41 1307 -32 -338 -102 544 379 -1070 -150 -443 76 912 231 -296
7258 -296 -994 -1257 -422 304 -107 487 -836 977 -1329 1015 691 -487 -1014 -990 60 -567 20 830
7276 830 -549 -339 320 -538 -964 -361 1154 -335 -298 636 108 403 -804 187 205 -584 -499 24 -804 -1173
7296 -1173 461 560 1607 394 -889 -708 4 146 -402 -1111 150 26 -252 -579 -389 352 -276 350
7314 350 -333 -160 -729 -802 774 626 91 527 199 746 64 -332 267 385 931 260 529 -129 -246 82
$$ packed form
7183a750O83P48P42k74k39k2N47L50j643j32Q48j261J183R8jQ45m45J3n61J63
7203a08N02M12j076J59j56K9J519j667J138m01j386R10o81J895j877J646j047
7220a89P35o30n10Q97Q75qp96k43j21K07l63L74m27j76l99J512j702P63J167j278
7240c12O50q70O00J356j465J348j339l06K36O46j65j449R20k93N19Q36o81n27
7258b96o98k63Q35P26m11N94j323J813k306K344l24j178n27K4J050o27N87Q10
7276H30j379K10O59q58m26O03J515j489L7R34n28K95j207R91J8p89Q5N23q28l69
7296a173J634R9J047j213j283J81P12J42n48p09J261j24k78l27J90P41o28O26
7314C50o83J73n69p3J576j48n35M36l28N47o82l96N99J18N46o71K69o58j17L28
$$ plain form
7334 82 -382 -639 -361 22 -195 -284 -242 395 -705 -487 -851 -178 455 -276 -82 -6 -427 -79 380 -662 51
7355 51 -394 286 -1252 697 -976 306 213 -259 -185 -54 -276 -46 300 14 756 1253 103 -24 572
7374 572 -862 789 558 -5 99 117 152 -163 -380 -173 904 -280 -758 661 109 -614 -244 577 623
7393 623 229 138 478 1156 264 -23 700 862 -231 1259 -284 1065 385 -553 -872 113 -200 -798 988
7412 988 46 690 549 506 823 750 463 690 -84 117 -349 -545 -138 -215 -439 -549 748 557 -199 523 684
7433 684 -412 130 420 902 -379 786 -42 -103 -109 -259 332 155 389 683 -69 1285 1077 -606 129
7452 129 102 900 304 -50 157 487 294 458 -140 1546 -584 -33 -309 -481 -641 -145 -749 -1329 795
7471 795 -74 68 -788 -349 166 -659 786 52 368 822 668 95 -23 1163 293 -586 -447 -193 383
$$ packed form
7334H2m64k57K78L83k17q9M2O37j100K18l64O73O33p31J94P6m21L48M59j042P13
7355E1m45O80j538J949j673J282r3m72P4J31k22K30L46k86P42M97j150j27N96
7374E72j434J651k31n63J04J8L5l15k17K07J077j184m78J419n52p23L70Q21M6
7393F23l94r1L40O78q92k87P23J62j093J490j543J349o80r38l19R85l13n98J786
7412I88r42O44j41m3L17p3k87K27p74K01m66j96M07p7k24j10J297j91p56P22J61
7433F84j096N42K90M82j281J165q28o1oj50N91j77K34K94p52J354k08j683P35
7452A29k7P98n96l54K07L30j93J64n98J686k130N51k76j72j60M96o04n80K124
7471G95q69J42q56M39N15q25J445p34L16M54j54n73j18J186q70q79J39K54N76
$$ plain form
7490 383 -191 -249 -876 501 -127 -309 -359 629 419 -476 65 949 -692 -318 -535 -1558 48 -919 -325
7509 -325 570 198 668 158 -225 646 374 -598 217 1554 -15 51 -508 -236 1370 -284 -355 -680 80
7528 80 97 202 283 1138 716 -315 882 567 -584 -617 -681 -687 -385 411 767 -811 -180 107 -658 3 -989
7549 -989 112 645 287 -609 421 -406 -1 449 193 113 18 1477 234 553 181 346 153 600 612 76
7569 76 -219 -607 -380 -117 531 -592 747 -526 -45 -300 141 -24 -358 410 115 503 -283 1311 521
7588 521 -622 -935 -47 -338 393 459 -132 -331 -25 -1013 -430 278 -732 58 -341 448 -1682 -258 326
7607 326 -1428 340 301 82 -250 -532 636 -1169 -177 -182 -1095 -530 312 -657 138 49 -395 -213 -506 24
7627 24 -649 857 -670 -4 -243 -709 -306 -196 279 -831 -232 250 -496 360 5 738 47 303 761
$$ packed form
7490C83n74n8o27J377o28j82n0R88k10q95N41Q84j641L74k17j023J606r67N94
7509c25Q95l72M70n10l83Q71k72r72Q15J337j569O6n59K72J606j654p1l25P60
7528H0J7J05Q1Q55m22j031J197l15j151l3o4oL02P96L56j578O31K87p65O61r92
7549i89J101N33l58q96J030q27M05M50k56q0r5J459j243L19l72J65j93M47J2n36
7569G6k95l88K27K63O48j123J339j273M81k55M41j65l34P68k95L88p86J594p90
7588E21j143l13Q88k91P31O6n91j99L06r88N83P08j010P90l99P89k130J424N84
7607C26j754J768l9k19l32k82J168j805R92nr13N65Q42r69P95q9m44J82k93N30
7627B4o73J506j527O66k39m66M03J10M75j110N99M82p46Q56l55P33o91K56M58
$$ plain form
7646 761 259 1439 -60 -622 -215 -439 263 -800 490 1650 -209 -141 867 543 -78 -49 729 -17
7664 -17 177 -677 -197 643 461 -655 -61 603 1241 1044 738 -771 -572 -613 -308 53 -24 -244 -80 -569
7684 -569 -443 92 1023 1056 -757 1311 -429 736 -160 -44 -12 -62 319 1851 -865 -768 57 776 -569
7703 -569 -826 -101 -191 449 -1127 289 288 -691 -693 372 542 -473 -356 -402 1388 -264 -9 -343 345 1080
7723 1080 259 -287 -980 457 -358 405 326 10 -104 -96 751 350 358 -126 -149 637 -119 1078 -597 -173 625
7744 625 -651 -444 -33 537 667 -184 495 -504 35 -521 -422 685 -1525 1042 1182 126 -552 -80 1027
7763 1027 33 593 -820 187 -407 -238 340 -342 39 807 19 -768 413 -3 -875 55 -777 -890 671
7782 671 -759 165 -449 -13 -337 -251 -291 1374 -236 847 454 -518 330 1087 1179 -723 272 243 -817
$$ packed form
7646G61n02J180j499n62M07k24P02j063J290J160j859O8J008l24o21K9P78p46
7664a7J94q54M80Q40j82j116N94O64O38j97l06j509J99m1L05L61p7k20J64m89
7684e69J26N35R31L3j813K068j740J165q96J16L2n0L81J532k716R7Q25P19j345
7703e69k57P25r0O40j576J416jr79kJ065J70j015J17m6J790j652K55l34O88P35
7723A080q21n46o93J437q15P63p9l16j14QQ47m01Qm84k3P86p56J197j675M24P98
7744F25j276K07M11N70J30q51O79r99N39n56R9J107k210K567J40j056o78M72J107
7763A027r94N60j413J007n94J69N78o82L81P68p88p87J181m16q72R30q32j13J561
7782F71j430R24o14M36l24Q6m0J665j610J083l93r72Q48P57R2j902R95k9j060
$$ plain form
7801 -817 0 112 193 619 -1482 -479 591 29 227 -352 245 754 81 690 54 -590 -98 -206 -440
7820 -440 328 320 880 880 313 -815 192 -202 213 -206 -722 151 260 336 -4 -326 -389 326 -64 844 -145
7841 -145 -543 -430 -65 206 335 -926 -777 -777 -149 631 -737 659 -998 168 -1303 -194 -29 -161
7859 -161 -100 -635 527 -422 308 1002 -129 -360 -670 154 -374 -153 -1059 -108 -343 -867 -213 120 927 861
7879 861 1158 6 -238 865 -880 -1094 580 -71 -4 208 -514 5 1557 -1197 -925 -733 -399 245
7897 245 -404 -450 597 744 978 773 -274 69 829 -140 -169 58 -242 67 -330 -119 838 369 -564 88
7917 88 -512 -94 44 346 -141 -994 -266 439 1232 121 451 100 431 536 1000 -518 -525 447 -145 1225
7937 1225 -26 334 491 -129 192 653 -108 152 184 987 715 0 -1528 -594 -337 501 -94 -311 -112
$$ packed form
7801h17Q17J12Q1M26k101J003J070n62J98n79N97N09o73O09o36o44M92j08k34
7820d40P68qN60%n67j128J007l94M15m19n16Q73J09P6l40l22o3P15l90R08r89
7841a45l98J13L65K71J29j261J49%O28P80j368J396j657J166j471J109J65j32
7859a61O1n35J162r49P30O94j131k31l10Q24n28K21r06R51k35n24O54L33Q07o6
7879H61K97j152k44J103j745k14J674o51O7K12p22N19J552k754K72J92L34O44
7897B45o49m6J047J47K34k05j047L43P60r69k9K27l00L09l97K11R57m69r33O52
7917H8o00M18J38L02m87q53P28P05P93j111L30l51L31J05M64j518pR72n92J370
7937A225j251L60J57o20L21M61p61K60L2Q03k72p15j528R34K57Q38n95k17J99
$$ plain form
7956 -112 -114 730 20 187 200 -737 -656 -44 -243 128 -597 -447 403 670 -813 276 918 950 398 318 760
7977 760 -21 -472 -977 753 45 431 -317 169 -91 -250 -1030 -571 1 470 -871 -708 549 86 -509
7996 -509 -186 -262 -447 -404 -936 -316 1042 1340 -629 499 38 -348 57 522 -69 217 -307 120 -784 -229
8016 -229 -86 -1049 679 -793 757 -240 -1035 100 -456 33 -41 -473 -109 -12 448 -628 276 93 125
8035 125 296 372 459 175 186 237 340 -366 -207 244 -555 -186 134 531 -73 -373 742 -242 612 -175 723
8056 723 -267 -854 -1306 -1308 -472 484 -189 235 423 -211 470 96 71 788 -158 -13 -330 -1033 -475 297 463
8077 463 193 36 121 247 -297 -245 -597 735 -67 -687 514 -515 846 337 149 460 -503 554 180
8096 180 225 -149 -357 975 1159 1007 33 808 -83 -818 402 -63 -83 138 758 -249 237 88 -133 799
$$ packed form
7956a12kQ44p10J67J3r37Q1O12j99L71p25J50Q50K67j483J089O42L2n52q0M42
7977G60p81m51n05J730p08L86p48M86k60j59p80M59N72M69j341J63J257m63n95
7996e09L23p6j85M3n32O20J358K98j969J128m61l86M05M65n91K86n24M27r04N55
8016b29J43r63J728j472J550r97p95J135n56M89p4m32L64R7M60j076R04j83L2
8035A25J71P6Q7k84J1N1J03p06J59M51p99L69L20L97o04l00J115r84Q54p87Q98
8056G23r90n87m52kQ36R56o73M24J88o34O81l74k5P17r46J45l17p03N58P72J66
8077D63k70j57Q5J26n44N2l52J332q02o20J201j029J361n09j88L11r63J057l74
8096A80M5l74k08J332J84j52r74P75q91p35J220m65k0K21O20j007M86j49k21R32
$$ plain form
8116 799 -96 -304 761 226 -837 295 -632 91 -1043 511 812 37 -440 -286 -471 520 794 -184
8134 -184 -944 -800 541 479 579 -1765 754 -69 -1044 -516 -137 -857 -485 755 -485 -946 644 -174
8152 -174 -105 389 -265 180 935 103 323 -695 84 239 115 488 -341 -51 -201 391 675 -288 833 -506
8172 -506 695 1446 -116 78 -1 -492 -116 -123 226 -555 211 641 -806 1029 -228 -633 92 -753 -542
$$ packed form
8116G99q95k08J065n35j063J132r27P23j134J554L01p75m77J54j85R91K74r78
8134a84p60J44J341o2J00k344K519q23r75N28L79p20L72J240j240m61J590q18
8152a74O9M94o54M45P55q32K20j018P79J55j24L73q29K90j50N92K84r63J121j339
8172e06J201P51j562J94p9m91L76pL49p81P66M30j447J835j257m05P25q45K11
8191e42
$$ Imaginary data points
##PAGE= N=2
##DATA TABLE= (X++(I..I)), XYDATA
$$ plain form
0 0 0 0 0 0 0 0 -108 0 -73 108 -108 108 -158 216 -217 309 -325 424 -441 546 -649 760 -870 980 -1156
25 -1156 1302 -1474 1704 -1902 2148 -2442 2714 -3048 3419 -3783 4238 -4712 5216 -5804 6423
40 6423 -7102 7875 -8715 9651 -10701 11873 -13208 14721 -16485 18519 -20951 23904
52 23904 -27527 32189 -38363 46941 -59857 81349 -123807 240947 -1251595 -4640949 -3560411
63 -3560411 -349039 3019212 3785683 2111892 -613419 -2143973 -1904652 -461742 664519
72 664519 916381 551629 445265 629321 555970 -379521 -1640697 -2047526 -748335 1517335
82 1517335 3006975 2261961 -351901 -2906293 -3312138 -1174202 1901654 3511812 2496941
91 2496941 -206314 -2384737 -2485421 -763390 1129226 1744310 954581 -181847 -624941
$$ packed form
0@%%%%%%j08J08p3J81k16K16k66L74m33N26o34P49q65R87j195J409j630J850k136
25a156K458k776L178l606M050m590N156n762O467p202Q021q950R928j1020J2227
40F423j3525J4977j6590J8366k0352K2574k5081K7929l1206L5004l9470M4855
52B3904n1431N9716p0552Q5304j06798J41206k05156L64754j492542l389354J080538
63c560411L211372L368251P66471j673791k725311j530554K39321J442910J126261
72F64519K51862l64752j06364J84056p3351r35491j261176m06829J299191K265670
82A517335J489640p45014k613862k554392m05845K137936L075856J610158j014871
91B496941k703255k178423j00684J722031J892616O15084p89729j136428m43094
$$ plain form
100 -624941 -279113 88811 -155287 -771890 -877050 33272 1375838 1876299 799884 -1197492
110 -1197492 -2477423 -1845387 331301 2323765 2503937 725929 -1545035 -2484362 -1441386
119 -1441386 574763 1858197 1496261 59716 -1070492 -1027280 -167068 468178 267931
128 267931 -369818 -539938 138514 1058526 1183736 127733 -1321262 -1839793 -789458
137 -789458 1082299 2207737 1565690 -371280 -2005920 -2002127 -431764 1329074 1851358
146 1851358 859532 -633892 -1330841 -798655 263214 794258 406019 -319391 -509776
155 -509776 71976 771100 727061 -196004 -1181184 -1211406 -92343 1273531 1646008 601654
165 601654 -1028533 -1864460 -1183671 429142 1612279 1414000 106086 -1126639 -1266514
$$ packed form
100f24941L45828L67924k44098o16603j05160R10322J342566N00461j076415j997376
110a197492j279931O32036K176688J992464J80172j778008k270964r39327J042976
119a441386K016149J283434l61936j436545j130208M3212Q60212O35246k00247
128B67931o37749j70120O78452R20012J25210j056003j448995n18531J050335
137g89458J871757J125438o42047j936970j634640L793J570363J760838N22284
146A851358r91826j493424o96949N32186J061869N31044l88239p25410j90385
155e09776N81752O99124m4039r23065r85180l0222J119063J365874L72477j044354
165F01654j630187q35927O80789J612813J183137j98279j307914j232725j39875
$$ plain form
174 -1266514 -344330 687928 898892 233512 -526477 -586992 59328 671017 524670 -307249
184 -307249 -999382 -771687 290420 1256094 1180401 26520 -1249470 -1525971 -526398 907746
194 907746 1563537 920609 -407637 -1257666 -967655 81692 890960 789412 21691 -580800
204 -580800 -442927 199624 586817 237871 -527442 -891588 -362155 669590 1253249 749842
214 749842 -502018 -1433944 -1191677 72382 1305602 1465968 437406 -880445 -1399038
223 -1399038 -761025 388696 1048132 757107 -75504 -629271 -478661 63667 347468 79726
233 79726 -384998 -442077 95150 741808 788331 37285 -926298 -1210294 -453971 779230
243 779230 1451397 948712 -346328 -1364274 -1270332 -178073 978226 1263159 534873
$$ packed form
174a266514R22184J032258K10964o65380p59989o0515O46320O11689j46347q31919
184c07249o92133K27695J062107R65674p5693j153881j275990k76501R99573J434144
194I07746O55791o42928j328246q50029K90011J049347Q09268j01548p67721o02491
204e80800J37873O42551L87193l48946p65313l64146N29433J031745N83659n03407
214G49842j251860r31926K42267J264059J233220J60366j028562j317851n18593
223a399038O38013J149721O59436k91025q32611n53767J50610N42328K83801k67742
233G9726m64724n7079N37227O46658M6523p51046r63583k83996P56323J233201
243G79230O72167n02685j295040j017946R3942J092259J156299K84933p28286
$$ plain form
252 534873 -500063 -968401 -591017 155779 557825 350414 -110035 -272369 13872 364359
262 364359 292512 -231561 -707842 -570844 193644 959386 989290 147853 -907085 -1272038
272 -1272038 -595076 585701 1285164 933571 -144998 -1026508 -1009084 -195995 651223 829576
282 829576 299375 -356719 -535374 -166360 283273 317350 -72588 -427424 -299098 249331
292 249331 676285 491740 -229088 -861582 -788945 -7970 835433 997197 318375 -624970
302 -624970 -1029300 -567924 326485 873871 645698 -85763 -640279 -555621 1967 452283
312 452283 378812 -83543 -422466 -269572 217229 523682 293588 -292581 -671332 -438014
322 -438014 245381 771913 640206 -68362 -738687 -778243 -153288 583746 794737 324496
$$ packed form
252E34873j034936m68338L77384P46796M02046k07411m60449j62334K86241L50487
262C64359p1847n24073m76281J36998P64488P65742K9904q41437j054938l64953
272a272038O76962J180777O99463l51593j078569q81510J7424Q13089Q47218J78353
282H29576n30201o56094j78655L69014M49633L4077l89938l54836J28326N48429
292B49331M26954j84545p20828o32494P2637P80975Q43403J61764o78822r43345
302f24970m04330M61376Q94409N47386k28173p31461n54516Q4658N57588M50316
312D52283p3471m62355l38923J52894M86801L06453k30094n86169l78751K33318
322d38014O83395N26532j31707p08568o70325l9556O24955P37034K10991m70241
$$ plain form
332 324496 -375961 -684019 -366793 227165 532078 297638 -197846 -440699 -199098 263459
342 263459 452903 151661 -356436 -559228 -213106 387819 687296 372981 -298679 -733162
352 -733162 -528616 135719 673822 613048 28600 -543764 -602573 -132497 402047 513722
362 513722 138237 -330467 -427048 -83513 339650 403214 32915 -406528 -468382 -57337
372 -57337 448891 569782 161576 -417285 -643383 -300222 306439 639049 408117 -159234
382 -159234 -549690 -429823 50364 429553 370454 -28718 -356722 -296688 71179 362002
392 362002 266655 -127989 -432328 -320622 133574 510468 435905 -53371 -531546 -562510
402 -562510 -101113 450118 612844 252939 -298856 -561442 -335502 141246 437945 316224
$$ packed form
332C24496p00457l08058L17226N93958L04913k34440m95484k42853K41601M62557
342B63459J89444l01242n08097k02792L46122O00925K99477l14315o71660m34483
352g33162K04546O64335N38103o0774n84448n72364n8809M70076N34544J11675
362E13722l75485m68704r6581L43535M23163O3564l70299m39443o1854M11045
372e7337N06228J20891m08206n78861k26098L43161O06661L32610k30932n67351
382a59234l90456J19867M80187L79189n9099l99172l28004O0034L67867K90823
392C62002r5347l94644l04339J11706M54196L76894p4563m89276m78175l0964
402e62510M61397N51231J62726l59905n51795k62586K25940M76748K96699j21721
$$ plain form
412 316224 -54250 -304090 -212941 80175 248475 110005 -181812 -300483 -82499 286641
422 286641 435475 171760 -304810 -562264 -338137 206037 603511 502505 -20085 -521347
432 -521347 -583802 -168645 351104 540987 277263 -167186 -397781 -254029 70801 247882
442 247882 140714 -92192 -175584 -17516 200706 214301 -35531 -323276 -347017 -30890
452 -30890 368272 487462 184906 -304722 -562961 -357465 143231 515464 452260 27202
462 27202 -384604 -443623 -138092 231776 348990 152197 -130505 -227612 -79189 124142
472 124142 156246 -13381 -196173 -176525 55196 285066 264309 -21383 -328892 -367887 -77466
483 -77466 301798 435228 199125 -199839 -421050 -278108 85489 347773 291142 -4843
$$ packed form
412C16224l70474k49840R1149K93116J68300j38470k91817j18671K17984L69140
422B86641J48834k63715m76570k57454K24127N44174L97474j01006n22590n01262
432e21347o2455M15157N19749J89883k63724m44449k30595J43752L24830J77081
442B47882j07168k32906q3392J58068K18222J3595k49832k87745k3741L16127
452c0890L99162J19190l02556m89628k58239K05496N00696L72233o3204m25058
462B7202m11806n9019L05531L69868J17214j96793k82702r7107J48423K03331
472A24142L2104j69627j82792J9648K31721K29870k0757k85692l07509l8995K90421
483g7466L79264J33430k36103l98964k21211J42942L63597K62284n6631k95985
$$ plain form
493 -4843 -255115 -246747 -15524 199079 192421 -11961 -193180 -160495 55301 230671 178797
504 178797 -67019 -276698 -236284 32021 288510 294032 35617 -255139 -322941 -105909 192616
515 192616 307750 144970 -133188 -269244 -149664 94256 227392 126185 -94887 -214332
525 -214332 -110768 112706 232624 125726 -112966 -256733 -162293 88409 266518 206372
535 206372 -40225 -251077 -235379 -14308 207012 232190 50285 -157872 -201515 -52247
545 -52247 136092 176764 38236 -136572 -170975 -23042 158316 193246 38436 -168380 -229817
556 -229817 -78824 152519 256540 134298 -104533 -248903 -174709 43591 208735 177888
566 177888 -1548 -157347 -151860 -7774 123966 114148 -15151 -124695 -95863 46708 155034
$$ packed form
493d843k50272Q368K31223K14603o658k04382j81219L2685K15796J75370n1874
504A78797k45816k09679M0414K68305K56489N522k58415k90756o7802K17032K98525
515A92616J15134j62780k78158j36056J19580K43920J33136j01207k21072j19445
525b14332J03564K23474J19918j06898k38692j43767R4440K50702J78109o0146
535B06372k46597k10852J5698K21071K21320K5178j81905k08157m3643J49268
545e2247J88339M0672j38528j74808l4403J47933J81358L4930j54810k06816o1437
556b29817J50993K31343J04021j22242k38831j44370P4194K18300J65144l0847
566A77888j79436j55799N487J44086J31740r818j29299j09544K8832J42571J08326
$$ plain form
577 155034 111248 -60639 -200332 -166373 26719 211273 219812 34389 -184113 -248867 -104703
588 -104703 120938 232357 146346 -49544 -178039 -142274 4638 116549 98995 -5752
598 -5752 -78776 -44433 48252 93557 24828 -96085 -138947 -43856 118754 198354 106551 -90173
610 -90173 -226870 -178489 21953 205895 221884 60899 -138307 -211252 -112061 60692 157133
621 157133 112057 -11374 -92191 -72319 4028 47778 14263 -43857 -49605 21402 102876 100224
633 100224 -8392 -135721 -161955 -45923 120434 197104 112508 -69756 -198092 -167301 -6451
644 -6451 147012 171609 59874 -82246 -136421 -72072 34280 83046 45737 -24582 -45852
655 -45852 376 50384 41618 -28657 -89496 -72030 25120 119557 120063 11172 -115571 -152296
$$ packed form
577A55034m3786j71887j39693L3959J93092J84554Q539j85423k18502o4754J44164
588a04703K25641J11419q6011j95890j28495L5765J46912J11911j7554j04747
598e752p3024L4343R2685M5305o8729j20913m2862R5091J62610P9600r1803j96724
610i0173j36697M8381K00442J83942J5989j60985j99206p2945R9191J72753R6441
621A57133m5076j23431q0817J9872P6347M3750l3515n8120n748P1007Q1474k652
633A00224j08616j27329k6234J16032J66357P6670q4596j82264j28336L0791J60850
644f451J53463K4597j11735j42120n4175O4349J06352M8766l7309p0319k1270
655d5852M6228N0008q766p0275o0839J7466R7150R4437N06j08891j26743l6725
$$ plain form
667 -152296 -61491 78071 154352 100639 -29398 -124165 -107563 -3598 88002 92055 18788
678 18788 -53476 -59145 -1935 51236 40508 -19441 -67103 -47965 28124 87337 67724 -18006
690 -18006 -96981 -94439 -8489 85650 106976 36964 -59413 -98904 -51876 31810 76126 46473
702 46473 -20385 -58915 -31854 25499 52454 19902 -40822 -67698 -28129 46217 84429 45393
714 45393 -39458 -96882 -73716 12596 87560 89763 20086 -58069 -79310 -35411 28447 55826
726 55826 29537 -13924 -30420 -7940 21145 19124 -16755 -47642 -32312 24665 74624 68838
738 68838 -1834 -79912 -98448 -38593 54490 106520 74203 -12488 -84959 -87598 -26193 44388
750 44388 70374 43555 -2829 -31750 -27106 -11637 -7073 -12207 -8777 16088 45531 47693 4815
$$ packed form
667a52296R0805J39562P6281n3713j30037r4767J6602J03965R1600M053p3267
678A8788p2264n669N7210N3171j0728n9949m7662J9138P6089N9213j9613q5730
690a8006p8975K542Q5950R4139K1326p0012r6377l9491M7028Q3686M4316k9653
702D6473o6858l8530K7061N7353K6955l2552o0724k6876L9569P4346L8212l9036
714D5393q4851n7424K3166Q6312P4964K203o9677p8155k1241M3899O3858K7379
726E5826k6289m3461j6496K2480K9085k021l5879l0887J5330N6977M9959n786
738F8838p0672p8078j8536N9855R3083N2030l2317q6691p2471k639O1405P0581
750D4388K5986k6819m6384k8921M644J5469M564n134L430K4865K9443K162m2878
$$ plain form
763 4815 -54819 -85056 -50095 30873 94951 90920 19364 -70246 -106832 -66333 19078 82178
775 82178 82190 27549 -35447 -62783 -45030 -8895 19807 30161 27691 22802 13554 -8224 -37427
788 -37427 -55297 -37105 15707 67508 78452 30709 -44969 -91914 -73555 -1636 72895 92381
800 92381 48156 -24385 -72436 -67444 -19774 30153 51788 39065 12437 -9809 -23275 -29086
812 -29086 -28414 -16931 10935 40638 50468 27609 -22670 -65893 -66052 -20262 44228 77901 56057
825 56057 -4712 -59414 -69981 -33664 20095 51874 46619 16187 -17217 -32663 -29428 -16402
837 -16402 1151 14351 26470 30722 17926 -8391 -39171 -48678 -24240 20396 53535 51780 12631
850 12631 -34756 -57026 -39547 3451 41682 49957 25851 -10217 -32483 -31774 -14750 3184 16115
$$ packed form
763D815n9634l0237L4961Q0968O4078m031p1556q9610l6586M0499Q5411O3100
775H2178J2n4641o2996k7336J7753L6135K8702J0354k470m889r248k1778k9203
788c7427j7870J8192N2812N1801J0944m7743p5678m6945J8359P1919P4531J9486
800I2381m4225p2541m8051M992M7670M9927K1635j2723k6628k2246j3466n811
812b9086O72J1483K7866K9703R830k2859n0279m3223j59M5790O4490L3673k1844
825E6057o0769n4702j0567L6317N3759L1779n255l0432l3404j5446L235J3026
837a6402J7553J3200J2119M252j2796k6317l0780r507K4438M4636L3139j755l9149
850A2631m7387k2270J7479M2998L8231Q275k4106l6068k2266P09J7024J7934J2931
$$ plain form
863 16115 19259 17381 10590 -4714 -20088 -29941 -20209 4479 31439 40502 21637 -12901 -38420
876 -38420 -39555 -14495 18987 37390 28962 5364 -18404 -26744 -19242 -3241 8735 14324 15702
889 15702 11073 3494 -9273 -21718 -23528 -12069 12764 29985 31367 12819 -17223 -36399 -31118
902 -31118 -5829 21783 34456 25279 2278 -20496 -30117 -23086 -6042 12503 26025 27734 15290
915 15290 -6088 -26246 -33531 -21351 5334 32668 40770 23670 -11663 -41692 -45928 -21383 17879
928 17879 46028 45367 18030 -20345 -44874 -42257 -15503 19105 42386 40275 16109 -18736 -41752
941 -41752 -42353 -18940 17624 45462 46252 19828 -19846 -48990 -49701 -18944 24773 51231 46623
954 46623 12740 -28868 -52664 -43536 -9177 31079 51664 41189 6823 -31584 -48711 -39178
$$ packed form
863A6115L144j878o791j5304j5374r853R732K4688K6960R063j8865l4538k5519
876c8420j135K5060L3482J8403q428k3598k3768q340P502J6001J1976N589J378
889A5702m629p579j2767j2445j810J1459K4833J7221J382j8548l0042j9176N281
902c1118K5289K7612J2673r177k3001k2774r621P031J7044J8545J3522J709j2444
915A5290k1378k0158p285J2180K6685K7334Q102j7100l5333l0029m236K4545L9262
928A7879K8149o61k7337l8375k4529K617K6754L4608K3281k111k4166l4845k3016
941d1752o01K3413L6564K7838P90k6424l9674k9144p11L0757M3717K6458m608
954D6623l3883m1608k3796R128L4359M0256K0585j0475l4366l8407j7127R533
$$ plain form
966 -39178 -7082 27412 46013 37169 6027 -27931 -46185 -35844 -3970 30492 46845 34182
978 34182 1674 -31956 -46608 -32308 -157 30750 41528 26980 -1983 -29196 -37910 -24915
990 -24915 2805 27241 35934 23629 -1861 -25716 -34489 -24154 -46 24084 33579 22391 -558
1003 -558 -22848 -31111 -19922 450 21785 29458 19724 -2271 -20740 -28223 -19448 731 18652
1016 18652 26428 18638 1275 -17190 -25335 -18549 -2031 15881 23484 17791 137 -14322 -24039
1029 -24039 -19352 -1162 14547 23737 18054 2867 -14875 -22490 -18259 -3007 13397 20981 15831
1042 15831 1808 -13297 -21932 -15732 -1397 14723 21159 15559 931 -14365 -19973 -13953 -1980
1055 -1980 13259 18483 12722 -793 -12946 -18454 -13147 958 13414 17849 11367 -424 -12163
$$ packed form
966c9178L2096L4494J8601q844l1142l3958j8254J0341L1874L4462J6353j2663
978C4182l2508l3630j4652J4300L2151L0907J0778j4548k8963k7213q714J2995
990b4915K7720K4436Q693j2305k5490k3855q773J0335K4108K4130R495j1188k2949
1003e58k2290q263J1189K0372K1335P673r734k1995j8469p483Q775K0179J7921
1016A8652P776p790j7363j8465q145O786J6518J7912P603n693j7654j4459r717
1029b4039M687J8190J5709R190n683j5187j7742p615M231J5252J6404P584n150
1042A5831j4023j5105q635O200J4335J6120O436n600j4628j5296n608O020J1973
1055a980J5239N224n761j3515j2153n508N307J4105J2456M435o482j1791j1739
$$ plain form
1068 -12163 -15505 -11187 497 10880 14878 10359 -1737 -9589 -12293 -6341 1635 8852 11545 7058
1082 7058 -814 -8172 -10025 -6830 -2180 3119 7867 6904 2936 -2589 -5336 -6122 -2333 2796 6795
1097 6795 5881 3206 -249 -4000 -7029 -7327 -3013 2881 8544 8981 4370 -2400 -9936 -12023 -6712 3585
1113 3585 12072 14472 7488 -5207 -15803 -15382 -5755 7996 16590 16004 6857 -7576 -17710 -17574
1127 -17574 -6028 8179 17617 17532 6508 -9138 -19840 -18786 -6132 12569 24022 22135 5957
1140 5957 -16161 -27449 -20739 -1974 17215 26205 19206 -950 -19480 -25832 -16540 3147 19787
1153 19787 24583 15220 -4549 -20680 -23964 -15045 3279 18599 23679 14491 -4224 -20448 -23741
1166 -23741 -13146 8181 23227 23588 10786 -10672 -24504 -22954 -7274 12222 21377 17880 2145
$$ packed form
1068a2163l342M318J1684J0383L998m519j2096p852k704N952P976P217K693m487
1082G058p872p358j853L195M650N299M748r63l968n525k747p86L789N129L999
1097F795r14k675l455l751l029k98M314N894N663M37m611o770p536k087N311J0297
1113C585Q487K400o984j2695j0596M21R627J3751Q594n86r147j4433j0134J36
1127a7574J1546J4207R438q5j1024j5646j0702J054J2654J8701J1453j887j6178
1140E957k2118j1288O710J8765J9189Q990o999k0156j8530o352R292J9687J6640
1153A9787M796r363j9769j6131l284Q919J8324J5320N080r188j8715j6224l293
1166b3741J0595K1327J5046L61j2802k1458j3832J550J5680J9496R155l497j5735
$$ plain form
1179 2145 -14062 -19251 -13323 -536 10792 16091 11703 1173 -8511 -14679 -12589 -3636 6794 13520
1193 13520 13523 3406 -8032 -14891 -11399 11 11694 15607 9904 -2645 -11303 -12166 -5467 3033
1207 3033 7912 7451 2012 -1629 -2466 -3457 -2745 -1398 378 2927 5745 3744 328 -6861 -9154 -4922
1223 -4922 1323 8956 8153 1223 -5132 -7678 -4308 920 5250 4047 861 -1647 -2858 -2117 -1178 -101
1239 -101 205 -35 2770 4399 2536 -2315 -6896 -6249 -833 6095 7872 2666 -2525 -8034 -6684 1307
1255 1307 7102 7001 2329 -3844 -7008 -2252 2830 5372 2548 -1349 -4289 -2986 1656 3140 1509
1270 1509 -1694 -2621 625 1987 634 345 -2328 -1717 1766 4323 2968 -1797 -5644 -5714 1968 9541
1286 9541 10918 3317 -8627 -13021 -7915 3920 11575 11605 3271 -9594 -13850 -9313 2021 10318
$$ packed form
1179B145j6207n189N928J2787J1328N299m388j0530r684o168K090Q953J0430O726
1193A3520Lj0117j1438o859L492J1410J1683L913n703j2549q658q63O699Q500
1207C033M879m61n439l641q37r91P12J347J776K549K818k001l416p189k293M232
1223d922O245P633q03o930o355k546L370N228M330j203l186k508j211P41R39J077
1239a01L06k40K805J629j863m851m581O47N416O928J777n206n191n509J350P991
1255A307N795j01m672o173l164M756N082K542k824l897k940J303M642J484j631
1270A509l203r27L246J362j353k89k673O11L483K557j355m765l847p0P682P573
1286I541J377p601j1944m394N106J1835P655L0q334j2865m256M537J1334Q297
$$ plain form
1300 10318 10746 5201 -2257 -6781 -6198 -3419 -681 2965 6292 6689 4009 -2512 -11172 -11945 -3709 8814
1316 8814 16539 13203 -285 -14758 -18445 -10330 5715 16544 16942 2622 -12124 -15782 -8967 2849
1330 2849 11166 10641 3769 -2879 -5676 -6645 -3804 -781 451 4600 6682 5117 -1574 -8745 -9936
1345 -9936 -5067 5332 13154 12010 857 -10166 -14014 -5824 7132 12671 7589 -1257 -9487 -9132
1359 -9132 -753 5483 6705 769 -5007 -3710 -139 3325 3625 -943 -4887 -5378 85 4907 4850 746
1375 746 -3015 -3868 -621 3358 4326 -2133 -3893 -3008 2061 5645 4008 -2235 -9611 -7894 57 10270
1391 10270 12673 5290 -7073 -12751 -7911 2620 10277 10936 1604 -6711 -9748 -5029 2226 5270
1405 5270 4998 819 -565 240 668 -1380 -5543 -6518 -472 7342 11471 5700 -5820 -13138 -11270 -271
$$ packed form
1300A0318M28n545p458m524N83K779K738L646L327L97k680o521q660p73Q236J2523
1316H814P725l336j3488j4473l687Q115J6045J0829L98j4320j4746l658O815J1816
1330B849Q317n25o872o648k797r69K841L023J232M149K082j565o691p171j191
1345i936M869J0399P822j144j1153j1023l848Q190J2956N539n082q846q230L55
1359i132Q379O236J222n936n776J297L571L464L00m568l944m91N463M822n7m104
1375G46l761q53L247L979R68o459j760Q85N069L584j637o243p376J717P951J0213
1391A0270K403p383j2363n678M840J0531P657O59r332q315l037M719P255L044
1405E270k72m179j384Q05M28k048m163r75O046P814M129n771j1520p318J868J0999
$$ plain form
1421 -271 11392 14530 7246 -5234 -12561 -9789 -352 7894 9068 2584 -2565 -4367 -1485 114 -478
1436 -478 -710 -1935 2861 6553 5972 753 -9635 -12665 -4488 5777 14023 12456 1109 -10512 -13956
1451 -13956 -6297 5153 11329 9571 3272 -5535 -6724 -4003 -1444 -292 1416 3743 5571 6737
1465 6737 1137 -7233 -11405 -7457 2873 13046 14736 5213 -9735 -17249 -11934 2255 15921 15859
1479 15859 6932 -4786 -12546 -10534 -1951 6370 7699 6933 1858 -2434 -5993 -6058 -6006 -2388 4117 10545
1495 10545 10333 1982 -7861 -15103 -11307 1608 13313 16131 6478 -8680 -16657 -12302 238 11220
1509 11220 13454 6653 -4132 -9901 -8187 -1471 3271 4206 3544 1226 1284 -1069 -3486 -6422 -5101
1524 -5101 -55 7748 10546 4265 -5640 -11259 -8957 178 9365 11949 4714 -4698 -10677 -7782 2416
$$ packed form
1421b71J1663L138p284j2480p327K772R437Q246J174o484n149j802K882J599n92
1436d78k32j225M796L692n81n219j0388l030Q177J0265Q246j567j1347j1621l444
1451a3956P659J1450O176j758o299q807j189K721K559J152J708K327J828J166
1465F737n600q370m172L948J0330J0173J690r523j4948p514N315J4189J3666o2
1479A5859q927j1718p760K012Q583Q321J329p66n075m292l559o5N2L618O505O428
1495A0545k12q351r843p242L796J2915J1705K818r653j5158p977M355J2540J0982
1509A1220K234o801j0785n769J714O716M742R35o62k318N8k353k417k936J321
1524e101N046P803K798o281r905n619K302R135R187K584p235r412n979K895J0198
$$ plain form
1539 2416 6967 6804 895 -3876 -3909 92 2484 1409 -461 -2343 -1797 3612 3859 1824 -1847 -4868
1555 -4868 -2320 3695 6006 4979 -1574 -6342 -5136 -249 5211 4923 819 -4815 -4075 -1083 4565
1570 4565 4830 817 -4185 -6027 -747 3857 4068 1028 -4301 -5593 -1795 3698 6361 3320 -2317
1585 -2317 -6932 -3785 -392 4613 4198 -71 -2994 -4411 294 2266 1830 -988 -2106 -1168 1399 4437
1601 4437 1904 -1886 -5163 -5219 -157 5342 5761 -6 -5605 -6838 -2994 4677 7168 2668 -1990 -4227
1617 -4227 -2944 -827 3896 2565 -1351 -3506 -1179 721 3210 1297 -1242 -4346 -1370 3971 5625
1632 5625 1745 -2292 -5872 -4880 841 3667 4813 1353 -3857 -5358 -1829 1659 3807 4441 -1162
1647 -1162 -2031 -698 520 965 -954 -1379 -1224 2477 3234 3384 -1250 -4234 -6265 -907 4579 6598
$$ packed form
1539B416M551j63n909m771l3M001K392j075j870j882N46N409K47k035l671l021
1555d868K548O015K311j027o553m768J206M887N460k88m104n634P40K992N648
1570D565K65m013n002j842N280M604K11l040n329j292L798N493K663l041n637
1585b317m615L147L393N005m15m269k923j417M705J972m36k818j118R38K567L038
1601D437k533l790l277n6N062N499M19n767n599j233L844P671K491m500m658k237
1617d227J283K117M723j331l916k155K327J900K489j913k539l104K976N341J654
1632E625l880m037l580R92N721K826J146l460n210j501L529L488K148O34n603
1647a162q69J333J218M45j919m25J55L701P57J50m634k984k031N358N486K019
$$ plain form
1663 6598 3312 -1705 -6307 -5576 -2132 3743 5996 3674 -1083 -5055 -3101 -2205 1377 1882 2196 1026
1679 1026 2287 107 -3003 -3807 -3783 -647 4651 7521 3693 -2315 -8086 -8070 -2355 5669 10112 5810
1695 5810 -1389 -7307 -8349 -3446 4024 7342 6438 1861 -1790 -5302 -4527 -2386 310 3356 4899
1710 4899 3653 1519 -4007 -6871 -6326 609 6699 9464 5744 -1985 -8266 -9676 -2908 2963 8211
1725 8211 7978 759 -5048 -7231 -5627 -949 5492 5336 4779 539 -1724 -4601 -5762 -3282 1503 4955
1741 4955 5228 3550 -2223 -6296 -6211 -2089 3642 7383 6431 1640 -4937 -7069 -4136 -1278 4307 4394
1757 4394 2524 -980 -3356 -5309 -3486 -1178 840 3924 4049 2581 -505 -4476 -5623 -2840 1759
1772 1759 5875 6087 2389 -2264 -5547 -5237 -159 4261 6263 4317 261 -4062 -4211 -3769 -1375 2476
$$ packed form
1663F598l286n017m602P31L444N875K253k322m757l972J954Q96L582N05L14j170
1679A026J261k180l110q04K4L136N298K870l828o008n771J6N715Q024M443m302
1695E810p199n918j042M903P470L318r04m577l651l512P75K141K696L046J543
1710D899j246k134n526k864N45O935O090K765l720p729o281j410O768N871N248
1725H211k33p219n807k183J604M678O441j56n57m240k263k877j161K480M785L452
1741D955K73j678n773m073Q5M122N731L741r52m791o577k132K933K858N585Q7
1757D394j870l504k376j953J823K308K018L084J25j468l086l971j147K783M599
1772A759M116K12l698m653l283L10N078M420K002j946m056m323j49M42K394L851
$$ plain form
1788 2476 3431 3840 1234 -1044 -3586 -4258 -1497 3199 4633 5589 2128 -2061 -4660 -4332 -1227 3825
1804 3825 5102 4481 1420 -3008 -4774 -4073 -426 3038 3739 3142 1811 -1152 -2631 -3142 -2623 2175
1820 2175 2827 2933 1634 -814 -3641 -3635 -883 1942 3778 3610 781 -2104 -3718 -3238 -2378 1058 2978
1837 2978 2883 1073 -153 -1757 -3331 -2199 -906 2488 2528 3357 395 -1041 -4219 -3351 -395 1845
1853 1845 4573 3936 1146 -2550 -3768 -3684 -238 2873 3377 4661 1306 -2262 -5094 -3803 -1049 2655
1869 2655 5556 4810 1197 -2566 -5285 -5423 -2535 1999 6030 5302 1265 -2273 -7138 -5034 -969 4151
1885 4151 5656 3564 1659 -3417 -5525 -5575 -1179 2705 6732 4995 1472 -2976 -6256 -5153 -1268
1900 -1268 3460 5766 5592 68 -3340 -5432 -5347 -343 3888 4981 3998 695 -4737 -5255 -3860 -580
$$ packed form
1788B476R55M09k606k278k542o72K761M696J434R56l461m189k599L28L105N052
1804C825J277o21l061m428j766P01L647L464P01n97j331k963j479n11N19M798
1820B175O52J06j299k448k827OK752K825J836j68k829k885j614M80Q60L436J920
1837B978r5j810j226j604j574J132J293L394M0Q29k962j436l178Q68K956K240
1853A845K728o37k790l696j218Q4L446L111N04J284l355l568k832J291K754L704
1869B655K901p46l613l763k719j38K888M534M031p28m037l538m865K104M065N120
1885D151J505k092j905n076k108n0M396L884M027j737l523m448l280J103L885
1900a268M728K306j74n524l408k092Q5N004M231J093r83l303n432n18J395L280
$$ plain form
1916 -580 2854 4471 3990 -602 -3465 -5555 -3699 -388 4020 5923 4074 843 -2721 -4926 -3860
1931 -3860 111 3457 4150 2941 1221 -3920 -5228 -3425 597 2915 3924 4111 377 -2851 -4186
1946 -4186 -4079 -1393 2184 4091 3797 2059 -2612 -4207 -3390 -679 2695 4660 5104 1128 -3444 -5021
1962 -5021 -2389 -642 1698 4050 4034 1770 -2235 -4465 -3405 -460 4173 4231 3357 689 -2285 -3602
1978 -3602 -2641 -736 3046 3785 3405 -585 -2044 -3232 -4213 658 3589 4390 2539 -410 -3953 -4269
1994 -4269 -2286 1337 4145 3853 2087 -1421 -3135 -2284 -1001 853 1907 1367 1096 -1903 -1905 -2813 -1968
2011 -1968 1261 2452 2226 1295 68 -1377 -3007 -1771 914 2143 1567 533 -956 -2506 -1417 91
2027 91 266 189 -156 -772 -488 -53 -823 -542 -723 -874 453 1418 753 -575 -1137 -2063 -1412 1346 2739
$$ packed form
1916e80L434J617m81m592k863k090J856L311M408J903j849l231l564k205J066
1931c860L971L346O93j209j720n141j308J803M022K318J009J87l734l228j335
1946d186J07K686L577J907k94j738m671j595Q17K711L374J965M44l976m572j577
1962e021K632J747K340K352j6k264m005k230J060K945M633N8q74k668k974j317
1978c602R61J905L782P39l80l990j459j188r81M871K931Q01j851k949l543l16
1994d269J983L623K808k92j766l508j714Q51J283J854J054n40k71k999kr08Q45
2011a968L229J191k26r31j227j445j630J236K685J229n76j034j489j550J089J508
2027I1J75p7l45o16K84M35p70K81j81j51J327R65o65j328n62r26O51K758J393
$$ plain form
2046 2739 2665 162 -1486 -2133 -1169 -531 1481 1955 -112 947 1205 -105 -856 -1515 -717 1345 3722
2063 3722 2551 -457 -1470 -3787 -3327 982 2367 4019 2047 -2233 -3777 -1396 222 3040 3820
2078 3820 868 -583 -2185 -2598 -536 -974 1076 701 242 1646 -231 -1044 -3344 -1994 500 2938
2094 2938 3851 1584 -2705 -4930 -3715 2034 5518 3645 1153 -2244 -4703 -1805 1621 3247 3013
2109 3013 534 -2361 -2020 210 207 -713 77 -849 1353 2531 1075 -181 -4085 -3022 1688 4108 4425
2126 4425 2338 -3525 -5445 -4078 733 4129 4112 589 -2733 -3058 -1440 224 1242 388 -1384 -460
2142 -460 116 2216 -130 -1992 -3865 -2789 1899 5307 5301 237 -5029 -5754 -1603 3374 6448 3456
2158 3456 -1390 -4800 -4705 -362 2772 3841 -158 -615 -44 -18 1151 300 -3281 -2956 -429 3377 5110
$$ packed form
2046B739p4k503j648o47R64O38K012M74k067J059K58j310p51o59P98K062K377
2063C722j171l008j013k317M60M309J385J652j972m280j544K381J618K818P80
2078C820k952j451j602m13K062m38K050l75m59J404j877q13k300J350K494K438
2094B938R13k267m289k225J215N749L484j873k492l397k459K898L426J626k34
2109C013k479k895L41K230lr20P90r26K202J178j456j256l904J063M710K420L17
2126D425k087n863j920J367M811L396j7l523l322l25J618J664J018q54j772R24
2142d60N76K100k346j862j873J076M688L408on064n266p25M151M977L074k992
2158C456m846l410R5M343L134J069l999m57N71K6J169q51l581L25K527L806J733
$$ plain form
2175 5110 3273 -3941 -7620 -5051 2335 7426 7615 -176 -6191 -6861 -3147 1622 6697 3683 -1620
2190 -1620 -2975 -3733 -22 2818 1813 -198 -1323 425 4244 3346 -1469 -5072 -4640 -843 5741 7391
2206 7391 3370 -4172 -8205 -6479 2288 7595 7606 1551 -6067 -6696 -2433 3264 5819 700 -2308 -3567
2222 -3567 -1695 3032 3327 -115 -4152 -4822 224 4865 5228 1484 -5455 -6518 -951 4862 8109 4201
2238 4201 -2684 -7496 -4728 2269 7226 5099 -1293 -5326 -3239 60 4782 4048 -2126 -4325 -4794
2253 -4794 1998 7343 5639 -254 -7937 -7755 -206 6026 8126 2070 -6784 -8862 -3833 4029 7378
2268 7378 4637 -1996 -5936 -3876 2686 5722 3629 -4063 -5963 -2258 4530 6820 4188 -5980 -9507
2283 -9507 -5614 4549 11927 7208 -1899 -10956 -8405 -815 8927 9682 2680 -5961 -8645 -3680 4408
$$ packed form
2175E110j837p214l679K569P386N091J89p791o015o70L714M769N075l014n303
2190a620j355p58L711K840j005k011j125J748L819q98m815l603M32L797O584J650
2206G391m021p542m033J726Q767N307J1o055p618o29M263N697K555n119l008j259
2222c567J872M727K95l442m037o70N046M641L63l744o939j063N567N813L247l908
2238D201o885m812K768O997M957k127o392m033K087L299M722p34o174k199m69
2253d794O792N345j704n893p683J82P549O232K100o056q854k078N029P862L349
2268G378k741o633l940K060O562L036k093p692j900L705O788K290k632j0168l527
2283i507L893J0163P378m719r107r057K551P590R742P55p002q641k684M965Q088
$$ plain form
2298 4408 7755 2476 -2469 -6391 -2834 5151 6260 956 -7071 -8221 -1848 7513 9842 3101 -5832
2313 -5832 -10845 -5421 5077 11892 7912 -2708 -10565 -9040 -190 7704 7862 -634 -6690 -7282 300
2328 300 7043 5769 605 -7998 -8613 -891 8189 9047 427 -9857 -11305 -1590 8977 10822 3346
2343 3346 -7016 -11226 -6779 5204 11242 6329 -3602 -10741 -6666 3891 9669 5179 -5078 -9206
2357 -9206 -7034 4011 10507 7683 -3549 -11359 -9610 1440 12761 10890 -309 -11179 -12319
2370 -12319 -2240 8680 13478 4815 -6585 -11182 -4855 6378 10581 3867 -5992 -9523 -4832 6075
2384 6075 10773 4090 -7484 -11420 -5446 5802 14070 7069 -6123 -14627 -9906 4182 14176 11687
2398 11687 -1211 -13609 -11855 -1054 11708 13185 2377 -9211 -12837 -2975 8614 11235 2536
$$ packed form
2298D408L347n279m945l922L557P985J109n304q027j150O373R361K329o741q933
2313e832n013N424J0498O815l980j0620p857J525Q850P894J58q496o056n92P582
2328C00O743j274n164q603o15P722R080Q58q620j0284j448R715J0567J845p476
2343C346j0362m210M447J1983O038m913r931p139M075J0557N778m490j0257m128
2357i206K172J1045O496k824j1232p810J749J1050J1321j871j1199j0870j140
2370a2319J0079J0920M798q663j1400m597O327J1233M203o714r859l531M691J0907
2384F075M698o683j1574l936N974J1248Q268p001j3192q504M721J4088R994k489
2398A1687j2898j2398J754J0801J2762J477j0808j1588l626R862J1589K621q699
$$ plain form
2411 2536 -7925 -11305 -2166 9041 12315 3073 -8451 -12341 -4322 9334 15006 6428 -8769 -16833
2425 -16833 -7739 5671 14998 10278 -5162 -13914 -10888 2109 13105 11465 -459 -11947 -11303
2438 -11303 550 11812 11887 -353 -12267 -12861 -219 12852 13451 3401 -10144 -13565 -4776 10474
2452 10474 14405 6052 -9554 -15225 -7463 6767 14994 8710 -6031 -13878 -8782 5828 14120 10338
2466 10338 -5337 -13780 -10699 3711 14994 11397 -2562 -15186 -12292 350 14767 14491 1170
2479 1170 -13473 -15417 -2713 12278 15785 4843 -10067 -14872 -6380 9955 16012 6471 -8929
2492 -8929 -14795 -6464 8158 15909 7033 -8450 -18190 -9667 6987 16901 10628 -5621 -17618 -12063
2506 -12063 4216 16857 14381 -2936 -15914 -14684 -168 13540 15829 1662 -13827 -15071 -3099
$$ packed form
2411B536j0461l380R139J1207L274r242j1524l890Q019J3656N672q578j5197q064
2425a6833R094J3410R327m720j5440q752L026J2997J0996j640j1924j1488O44
2438a1303J1853J1262P5j2240j1914n94J2642J3071N99j0050j3545l421Q789J5250
2452A0474L931q353j5606n671P762J4230Q227o284j4741p847N096J4610Q292l782
2466A0338j5675q443L081J4410J1283l597j3959j2624K894J2642J4417k76j3321
2479A170j4643j944J2704J4991L507j0942j4910m805Q492J6335O057r541j5400
2492h929n866Q331J4622P751q876j5483r740Q523J6654R914o273j6249j1997N555
2506a2063J6279J2641k476j7317j2978J230J4516J3708K289j4167j5489j244J1972
$$ plain form
2519 -3099 12082 14515 3925 -11711 -16794 -4181 11535 16621 7950 -9701 -17768 -8810 8980
2532 8980 19032 10335 -7189 -17530 -12244 5400 17280 11973 -3733 -16022 -12020 3044 16255
2545 16255 13464 -871 -15567 -13742 1470 15739 15428 592 -14420 -17439 -2646 14234 16688
2558 16688 2632 -12320 -17755 -5996 10716 19397 8049 -9755 -18198 -8278 9896 18383 10581
2571 10581 -8600 -16473 -11151 6877 17682 11190 -5020 -18018 -13085 4210 18220 15058 -2934
2584 -2934 -17218 -16864 -143 17963 18789 2987 -14324 -18314 -4458 12783 19078 6759 -11168
2597 -11168 -16854 -7103 9727 16989 7255 -9994 -18104 -8002 9930 18381 9836 -9323 -18940
2610 -18940 -11764 7362 20818 13550 -5242 -18902 -15084 1216 18201 15940 -683 -17185 -17354
$$ packed form
2519c099J5181K433j0590j5636n083J2613J5716N086q671j7651q067Q958J7790
2532H980J0052q697j7524j0341N286J7644J1880n307j5706j2289M002J5064J3211
2545A6255k791j4335j4696J825J5212J4269l11j4836j5012l019J4793J6880K454
2558A6688j4056j4952n435J1759J6712Q681j1348j7804q443R920J8174Q487p802
2571A0581j9181p873N322J8028J0805o492j6210j2998M933J7295J4010l162j7992
2584b934j4284L54J6721J8106Q26j5802j7311l990J3856J7241O295j2319j7927
2597a1168n686R751J6830P262r734j7249q110J0102J7932Q451q545j9159r617
2610a8940P176J9126J3456p268j8792j3660L818J6300J6985k261j6623j6502j69
$$ plain form
2623 -17354 -1596 15841 17496 2885 -12852 -17488 -2954 13667 18196 4603 -13183 -19141 -6502
2636 -6502 13185 19312 8711 -10345 -18569 -8764 8466 19549 11790 -8664 -20089 -13098 5452
2649 5452 18951 13626 -3286 -17894 -14886 2720 18287 15718 -845 -16336 -16355 -715 15862
2662 15862 17653 3095 -14854 -17597 -3353 15000 20808 5476 -14262 -18919 -8391 10820 19451
2675 19451 8827 -10037 -19076 -11237 8455 18199 11552 -7633 -19120 -13307 5518 19228 13644
2688 13644 -5140 -18219 -15567 2640 17055 16712 -940 -17494 -16777 -1300 17198 18431 2740
2701 2740 -15132 -19361 -5735 14001 19573 7352 -11519 -20117 -8409 9388 19682 9199 -10166
2714 -10166 -18865 -10835 8857 19610 11078 -7698 -19021 -13926 4871 18675 15119 -3676 -19105
$$ packed form
2623a7354J5758J7437J655j4611j5737m636J4534J6621M529j3593j7786n958J2639
2636f502J9687O127j0601j9056q224R805J7230J1083p759k0454j1425O991J8550
2649E452J3499n325j6912j4608L008J7606J5567k569j6563j5491j9J5640J6577
2662A5862J791j4558j7949k743J4244J8353N808j5332j9738m657J0528J9211Q631
2675A9451j0624j8864r039P839J9692R744o647j9185j1487N813J8825J3710n584
2688A3644j8784j3079K652J8207J4415l43j7652j6554P17J5477J8498J233j5691
2701B740j7872m229J3626J9736N572j2221j8871q598J1708J7797J0294j0483j9365
2714a0166q699Q030J9692J0753q532j8776j1323N095J8797J3804l556j8795j5429
$$ plain form
2727 -19105 -16538 2035 18450 17098 -641 -16947 -18925 -1085 16502 18475 3891 -14693 -18841
2740 -18841 -5192 12841 18388 6660 -12306 -19065 -8065 11581 19912 10108 -9565 -18823 -11886
2753 -11886 8029 18882 11822 -6642 -18663 -14477 4206 18009 14970 -2745 -17548 -15730 1111
2766 1111 17160 16223 160 -17036 -18296 -1719 15603 18406 3550 -14639 -19392 -6145 12308
2779 12308 19401 7446 -11804 -18350 -9663 9520 19019 10543 -8672 -18620 -11266 7730 18571
2792 18571 11091 -6414 -18234 -13299 4703 18505 14886 -3529 -17760 -16965 687 18100 16708
2805 16708 1095 -17268 -19123 -3268 15682 17687 4063 -12621 -18245 -6330 11549 18552 7055
2818 7055 -10654 -17866 -9646 8537 18721 9794 -8166 -18610 -12753 7629 18613 12913 -5082
$$ packed form
2727a9105K567J8573J6415j352j7739j6306j978J7840J7587J973j4584j8584m148
2740a8841J3649J8033N547j1728j8966o759J1000J9646Q331r804j9673r258O937
2753a1886J9915J0853p060j8464j2021M186J8683J3803l039j7715j4803J818J6841
2766A111J6049r37j6063j7196j260J6577J7322K803j4856j8189m753J3247J8453
2779A2308P093j1955j9250o546Q687J9183R499q476j9215r948P354J8996J0841
2792A8571p480j7505j1820M935J8002J3802l619j8415j4231P95J7652J7413j392
2805A6708j5613j8363j855J5855J8950K005j3624j6684n624J1915J7879P003j1497
2818G055j7709p212Q220J8183J0184q927j7960j0444N857K0382J0984n700j7995
$$ plain form
2831 -5082 -18569 -14418 2639 18504 14239 -2283 -16898 -15510 63 15131 17222 1960 -14975
2844 -14975 -17088 -3782 13640 18494 4090 -13261 -17483 -4782 11306 18377 7405 -12203 -18833
2857 -18833 -8552 8184 18421 10571 -6929 -19010 -11209 5911 17830 12176 -4256 -17620
2869 -17620 -13657 1669 16226 13666 -1672 -16453 -14541 463 15699 15147 1893 -14363 -16912
2882 -16912 -3578 14836 16866 4628 -12391 -17619 -6567 11287 18038 8674 -9937 -17636 -9203
2895 -9203 8082 17789 10719 -5899 -17337 -11678 4636 17077 12167 -3988 -16303 -12410 2711
2908 2711 14808 13913 -1754 -14498 -15109 389 15034 15425 1664 -14760 -16343 -3308 11575
2921 11575 17192 5383 -11710 -16611 -7086 10188 16067 8059 -7723 -17052 -9994 8244 15919
$$ packed form
2831e082j3487M151J7057J5865m265j6522j4615J388J5573J5068K091j5262j6935
2844a4975k113J3306J7422M854j4404j7351m222J2701J6088P071j0972j9608o630
2857a8833J0281J6736J0237p850j7500j2081P801J7120J1919n654j6432j3364
2869a7620L963J5326J4557k560j5338j4781J912J5004J5236n52j3254j6256k549
2882a6912J3334J8414K030j2238j7019n228J1052J7854O751r364j8611p699Q433
2895i203J7285R707p070j6618j1438N659J6314J2441m910j6155j2315L893J5121
2908B711J2097q95j5667j2744o11J5498J4645L91j3761j6424j583J3035J4883
2921A1575N617j1809j7093m901R525J7274N879q008j5782r329P058J8238P675
$$ plain form
2934 15919 9852 -6060 -15305 -11064 5706 16297 11765 -3707 -16024 -12242 4032 15343 12799
2947 12799 -808 -14118 -13596 -311 14689 15416 1820 -13267 -15609 -3334 11166 15565 5555
2960 5555 -10471 -15310 -6291 8751 15506 7779 -7922 -16336 -9212 5983 15487 8399 -6143 -15765
2974 -15765 -10512 4718 15447 11149 -1614 -13666 -12323 1332 13496 12945 253 -14082 -13579
2987 -13579 -1007 11965 14703 2149 -11715 -15090 -2944 10955 14863 5771 -9138 -15977 -6026
3000 -6026 7915 15517 7694 -7684 -14519 -7493 5196 14781 9583 -4382 -13792 -11025 2766 14340
3014 14340 10586 -2028 -13647 -11123 1210 12044 11553 -238 -11533 -12552 -882 11652 12837
3027 12837 2954 -9929 -14444 -3765 9321 14397 7124 -8446 -13296 -6590 7395 15057 8230
$$ packed form
2934A5919o067j5912r245M241J6770J0591m532j5472j2317L782J6274J1311k544
2947A2799j3607j3310N22J3285J5000P27j3596j5087k342J2275J4500M399j0010
2960E555j6026m839R019J5042O755p727j5701q414P124J5195R504p088j4542r622
2974a5765N253J5230J0729m298j2763j2052J343J3655J2164n51j2692j4335N03
2987a3579J2572J2972K738j2554j3864l375J2146J3899L908r092j4909o839R951
3000f026J3941P602p823j5378o835P026J2689R585n198j3965r410K767J3791J1574
3014A4340l754j2614j1619K524J2333J0834m91j1791j1295j019J1670J2534J185
3027A2837r883j2883m515J0679J3086N076p273j5570m850O706J3985P662o827
$$ plain form
3040 8230 -5434 -13554 -7901 4516 12817 8685 -4394 -13016 -9448 2664 12543 9970 -2045 -11575
3054 -11575 -11139 430 11583 11800 954 -10777 -12317 -2206 9358 12137 2563 -9459 -12229
3067 -12229 -5096 7816 12460 5083 -8184 -12268 -5990 6818 11934 6396 -6458 -12783 -6831 4715
3081 4715 11601 9761 -4230 -11401 -9020 1583 11343 9825 -1596 -10211 -9476 -149 9842 10351 904
3096 904 -8810 -9984 -977 8839 10585 2389 -9021 -12758 -4033 7993 11968 3779 -7059 -11673
3110 -11673 -6638 5750 11940 5949 -4077 -11109 -7979 1173 10040 7796 -2177 -11042 -8503 1180
3124 1180 9126 8792 -1169 -10004 -7863 870 8877 9410 917 -8993 -10360 -611 7593 10813 2751
3139 2751 -7830 -10659 -4550 7338 9522 5027 -4809 -10046 -5394 3778 10311 5722 -4263 -9743
$$ packed form
3040H230j3664q120N653J2417Q301m132j3079q622L568J2112R879k573j2015r530
3054a1575M36J1569J1153K17j0846j1731j540J0111J1564K779r574j2022k770
3067a2229P133J2912M644p377j3267m084O278J2808N116n538j2854o325N952J1546
3081D715O886j840j3991p171K381J0603R760j518j1421q615P35R327R991N09r447
3096I04r714j174R007R816J746q196j1410l737Q725J2026L975q189j0838m614
3110a1673N035J2388O190n991j0026p032L130R152Q867k244r973q865K539R683
3124A180P946l34r961q835K141Q733Q007N33q493r910j367R749Q204L220q062
3139B751j0581k829O109J1888K184m495r836n237M652R172O533m589r985n480
$$ plain form
3153 -9743 -6230 2782 9619 6695 -3024 -9103 -6712 1372 8941 8470 -874 -8355 -8227 -272 8036
3168 8036 9451 1718 -6910 -9236 -1617 6939 9183 2086 -7875 -8418 -4115 4960 10154 4338 -5348
3183 -5348 -8995 -5809 4698 9501 5729 -2577 -9945 -6751 2269 8475 7375 -1538 -7940 -7926 208
3198 208 7018 5507 -110 -8261 -7461 -1276 5997 6808 974 -6063 -8026 -1168 4908 7621 1762 -5657
3214 -5657 -8178 -3142 5248 8466 4466 -3374 -8428 -5561 2864 7985 6321 -1133 -7281 -5168 2688
3229 2688 6860 5763 -837 -5776 -6225 812 7189 5284 -1540 -6300 -6852 203 6307 6989 1666 -5944
3245 -5944 -6730 -1996 4652 7438 2309 -4153 -5228 -3245 3231 6626 3811 -3391 -6877 -3222 3197
3260 3197 6932 4135 -1982 -7446 -4633 481 7487 5576 -981 -6135 -5305 -271 5732 6706 1610
$$ packed form
3153i743L513R012O837k924r719o079K391Q084P569m71r344p481J28P955Q308
3168H036J415p733q628k326P619Q556K244p097r961n43M303R075N194n816r686
3183e348l647L186J0507M803l772q306p368L194R020O206j100q913o402J4Q134
3198B08O810j511n617q151Q00O185P273Q11n834p037j963O858O076K713n859p419
3214e657k521N036Q390L218m000p840n054K867Q425N121j664p454o148K113P856
3229B688M172j097o600m939m49P037O377j905o824m760n52P055O104O82n323p610
3245e944p86M734O648K786n129o462j075J983O476L395k815p202l486L655O419
3260C197L735k797o117n464K813N114P006j911o557n154Q30N034O003R74n096
$$ plain form
3275 1610 -5721 -4804 -1783 3841 5634 1296 -3193 -4589 -1067 4298 5333 1111 -4066 -5529 -2220
3290 -2220 3620 6266 2856 -2181 -6268 -3752 1894 5940 4544 -421 -4854 -3077 733 4966 5383
3305 5383 799 -4079 -3535 -1308 4076 4542 575 -4097 -5205 137 4650 4647 483 -4689 -4522 -835
3321 -835 2807 5348 2017 -2725 -5703 -2351 2367 5268 2171 -1482 -4643 -4155 1604 4140 3214 -851
3337 -851 -3511 -3521 176 4269 2782 354 -3995 -3558 295 3994 3527 -122 -2919 -4544 -1208 4471
3353 4471 3035 1972 -3390 -3423 -2505 2269 3124 1724 -2447 -4949 -2535 3010 3912 2025 -2479 -3519
3369 -3519 -1533 1056 4480 3510 -864 -3231 -2469 -89 3475 4056 -899 -3266 -3190 -143 2618 3111
3385 3111 -97 -2239 -3641 -1479 2293 2228 1339 -1572 -3696 -1701 1726 3219 1198 -1912 -2691 -2674
$$ packed form
3275A610p331R17L021N624J793m338m489j396L522N365J035m222n177j463L309
3290b220N840K646l410n037m087K516N646M046j396m965m433J777L810M233M17
3305E383m584m878N44K227N384M66l967m672j108N342M513lm164n172J67L687
3321h35L642K541l331m742k978L352M718K901l097l653l161M88N759K536r26m065
3337h51k660j0L697M093j487k428m349M37L853L699m67l649k797j625L336N679
3353D471j436j063n362l3R18M774Q55j400m171k502K414N545R02j887m504j040
3369c519J986K589L424r70m374k367P62K380L564N81m955k367P6L047K761M93
3385C111l208k142j402K162L772o5q89k911k124J995L427J493k021l110p79J7
$$ plain form
3401 -2674 1301 3242 1745 -1192 -3466 -2299 467 2567 1089 -289 -2735 -1940 -590 2313 2614
3416 2614 -790 -2373 -1972 -543 2886 4154 297 -3113 -2005 -285 1435 2135 1021 -1670 -1869 -1454
3432 -1454 1422 2417 744 -938 -2498 -1259 600 2701 2402 335 -2228 -1167 1233 1899 2396 1456
3448 1456 -1281 -2959 246 1944 3332 -680 -1542 -2794 -421 1869 739 1612 -2627 -1955 260 1506
3464 1506 1951 -520 -2251 -1850 -1259 959 1136 -17 -1192 -1083 -2017 835 2774 2301 1254 -2418 -2042
3481 -2042 -173 1558 873 -750 -1364 -1297 -609 925 2776 -140 -1789 -1702 -409 1393 1599 117 -241
3498 -241 -1389 -891 1497 1806 1084 171 -1912 -807 1341 686 53 -1801 -1992 -1302 409 1095 476 -372
3516 -372 -1377 -851 1898 1598 2531 -436 -1867 -1570 -609 1220 954 -400 -1200 -1556 -495 -10 1137
$$ packed form
3401b674L975J941j497k937k274J167K766K100j478j378k446P95J350K903L01
3416B614l404j583M01J429L429J268l857l410J108J720J720P00j114k691j99M15
3432a454K876R95j673j682j560J239J859K101k99k067k563J061K400O66M97r40
3448A456k737j678L205J698J388m012q62j252K373K290j130Q73m239O72K215J246
3464A506M45k471j731M01N91K218J77j153j175J09r34K852J939m73j047l672L76
3481b042J869J731o85j623o14O7O88J534J851k916j649Q7J293J802K06j482l58
3498b41j148M98K388L09p22r13k083J105K148o55o33j854j91O90J711O86o19q48
3516c72j005N26K749l00R33k967j431K97R61J829k66j354q00l56J061M85J147
$$ plain form
3533 1137 615 -382 -895 -788 2014 -100 -375 -2095 -784 514 1447 1572 236 -1490 -2025 -1101 222
3550 222 826 775 -518 -919 -1691 -47 1251 1973 -105 -802 -1069 -302 896 532 -1137 -585 -1337 -91
3568 -91 1099 914 321 -93 -816 -726 489 787 182 -182 -1042 444 1043 1238 157 -340 282 316 629 1483
3588 1483 77 116 -632 253 -129 1265 774 -150 -1824 -1899 -44 547 661 -553 -1251 -908 -445 -286 -258
3607 -258 1029 -146 316 -611 1246 1048 704 67 -999 -776 814 279 -587 409 77 536 1199 1015
3625 1015 520 -693 -1256 -269 -284 878 478 682 -1611 737 -629 626 121 1056 30 -941 -493 -871
3643 -871 -640 342 -172 -120 -615 28 32 678 -436 -492 -439 525 1435 530 -190 -267 -1203 427 -556 -543 -192 -72
3665 -72 773 -197 175 283 -124 174 -801 -44 119 1367 -648 -622 -567 733 628 93 -92 -900 -325 -114
$$ packed form
3533A137n22r97n13J07K802k114k75j720J311J298R33J25j336j726n35R24J323
3550B22O04n1j293m01p72J644J298P22k078o97k67P67J198l64j669N52p52J246
3568i1J190j85n93m14p23R0J215K98o05l64q60J486N99J95j081m97O22L4L13Q54
3588A483j406L9p48Q85l82J394m91r24j674p5J855N91J14j214o98L43M63J59K8
3607b58J287j175M62r27J857j98l44o37j066K23J590n35q66R96l32M59O63j84
3625A015m95j213n63R87j5J162m00K04k293K348j366J255n05R35j026r71M48l78
3643h71K31R82n14N2m95O43MO46j114n6N3R64R10r05p20p7r36J630r83J3L51J20
3665g2Q45r70L72J08m07K98r75P57J63J248k015K6N5J300j05n35j85q08N75K11
$$ plain form
3685 -114 487 184 989 -415 810 29 -772 714 484 -276 -402 -52 -351 202 -456 -1382 -974 -513 479
3704 479 998 228 949 79 -801 780 104 -405 1256 -231 -1174 -115 -153 -152 1225 -220 443 27 763
3723 763 -707 -483 -4 -478 -705 365 -19 184 -292 -585 -474 1211 905 5 -358 -245 47 -1631 493
3742 493 -294 -173 802 1276 -212 -519 207 249 -520 -665 332 857 150 -282 -1097 -766 140 -33 1019 -748
3762 -748 -72 -308 18 197 372 1006 745 -340 -1191 304 -3 -791 379 1418 -341 291 -693 -123
3780 -123 -1016 -260 18 1108 -630 -103 -68 -41 220 -244 -39 754 -154 -500 -189 377 -360 -158 544 -560
3800 -560 28 -832 -1139 -622 -580 -607 21 1174 48 1082 -678 -844 -306 -571 699 708 542 59 -527 -612
3820 -612 256 223 1070 -385 -144 661 -153 1446 -970 -705 31 -22 -337 504 -625 -1421 -567 279 1669
$$ packed form
3685a14O01l03Q05j404J225p81q01J486k30p60j26L50k99N53o58r26M08M61R92
3704D79N19p70P21q70q80J581o76n09J661j487r43J059l8JJ377j445O63m16P36
3723G63j470K24M79m74k27J070l84K03m76k93J11J685l06r00l63J13K92j678K124
3742D93p87J21R75M74j488l07P26M2p69j45R97N25p07m32q15L31R06j73J052j767
3762g48O76k36L26J79J75O34k61j085q51J495l07p88J170J039j759O32r84N70
3780a23q93P56K78J090j738N27L5K7K61m64K05P93r08l46L11N66p37K02P02j104
3800e60N88q60l07N17M2k7O28J153j126J034j760j66N38k65J270Rj66m83n86q5
3820f12Q68l3Q47j455K41Q05q14J599k416K65P36n3l15Q41j129p96Q54Q46J390
$$ plain form
3839 1669 278 280 430 -304 683 -641 -275 410 -169 559 -51 -387 -282 -511 -283 -283 458 384 -367 -882 -428
3860 -428 479 625 -213 -471 -847 446 668 -92 -251 207 940 -506 220 -603 8 -218 -1320 -17 527
3879 527 465 -527 -1400 460 -209 270 99 279 -368 934 -221 215 2029 -809 671 -1047 -886 -1176
3897 -1176 -650 450 -1086 -519 1081 1017 282 381 398 -1027 -183 -901 206 379 -86 -95 -813 -436 -1495
3916 -1495 -942 -178 234 402 -96 635 -71 -734 -381 -476 1217 -721 83 523 113 -30 -27 1628 413
3935 413 288 -323 43 -161 -1172 875 1522 755 218 717 894 -984 -852 -267 549 545 104 -305 -591 -1379
3955 -1379 25 -69 1381 304 -274 604 -575 1099 183 -301 -328 79 315 885 -963 -517 993 952
3973 952 -180 764 -1187 -74 -96 -212 150 357 440 8 927 413 448 161 -260 1014 -339 -653 -432
$$ packed form
3839A669j391KJ50p34R87j324L66O85n79P28o10l36J05k29K28%P41p4p51n15M54
3860d28R07J46q38k58l76J293K22p60j59M58P33j446P26q23O11k26j102J303N44
3879E27o2r92q73J860o69M79j71J80o47J302j155M36J814k838J480j718J61k90
3897a176N26J100j536N67J600o4p35R9J7j425Q44p18J107J73m65rp18L77j059
3916a495N53P64M12J68m98P31p06o63L53r5J693j938Q04M40m10j43LJ655j215
3935D13j25o11L66k04j011K047O47p67n37M99J77j878J32N85Q16mm41m09k86p88
3955a379J404r4J450j077n78Q78j179J674r16m84k7M07K36N70j848M46J510m1
3973I52j132R44j951J113k2j16L62K07Q3m32R19n14L5k87m21J274j353l14K21
$$ plain form
3992 -432 -385 -11 282 -107 -10 846 -997 1180 -483 628 -320 -579 -446 450 -70 -85 361 42 -683 652
4012 652 -508 354 -840 690 -765 -159 -856 -35 231 49 238 467 -734 -942 -88 646 512 -601
4030 -601 120 -451 27 318 -668 -143 -347 357 517 138 235 -495 -470 130 411 110 182 232 -420 -215 202
4051 202 -174 -135 -196 -322 696 541 -188 126 -1061 278 15 272 70 69 -1666 18 -89 291 945 -454
4071 -454 -524 -1491 39 314 75 438 -265 -206 -437 -146 -401 566 127 150 111 919 867 -905 -566 739 -638
4092 -638 78 -734 814 -40 -404 797 1249 -727 -1087 517 701 673 1172 60 -152 -92 -409 435 381
4111 381 851 468 498 -176 444 29 -134 1316 889 170 -215 -481 -389 1219 -256 247 160 305 51 -345
4131 -345 -27 -555 -1007 387 725 -85 -262 -1177 387 -283 1097 1143 70 -240 668 -358 -666 -589 -95
$$ packed form
3992d32M7L74K93l89R7Q56j843K177j663J111r48k59J33Q96n20j5M46l19p25J335
4012F52j160Q62j194J530j455O06o97Q21K66j82J89K29j201k08Q54P34j34j113
4030f01P21n71M78K91r86N25k04P04J60l79R7p30K5O00K81l01P2N0o52K05M17
4051B02l76L9o1j26J018j55p29L14j187J339k63K57k02jj735J684j07L80O54j399
4071d54p0r67J530K75k39L63p03N9k31K91k55R67m39K3l9Q08n2j772L39J305j377
4092f38P16q12J548q54l64J201M52j976l60J604J84k8M99j112k12O0l17Q44n4
4111C81M70l83L0o74O20m15j63J450m27p19l85k66R2J608j475N03q7J45k54l96
4131c45L18n28m52J394L38q10j77r15J564o70J380M6j073l10R08j026l08P7M94
$$ plain form
4150 -95 1300 603 14 -140 -836 -104 -87 1155 71 -633 -145 57 -398 723 -663 172 546 -384 -808
$$ packed form
4150i5J395o97n89j54o96P32J7J242j084p04M88K02m55J121j386Q35L74r30m24
$$ [...]
8191D47
##END NTUPLES=NMR FID
##END=
