##TITLE=1H_IAMT-160
 PyD5
 108 sc, 
 11.05.2022
##JCAMPDX= 6.0         $$ Bruker NMR JCAMP-DX V2.0
##DATA TYPE= NMR FID
##DATA CLASS= NTUPLES
##ORIGIN= UXNMR, Bruker Analytische Messtechnik GmbH
##OWNER= root
$$ XWIN-NMR		Version 3.5
$$ Wed May 11 16:11:05 2022 Russian Standard Time (UT+4h)  she@DPX200
##.OBSERVE FREQUENCY= 200.1313499996
##.OBSERVE NUCLEUS= ^1H
##.DELAY= (6, 6)
##.ACQUISITION MODE= SIMULTANEOUS
##.ACQUISITION SCHEME= undefined
##.AVERAGES= 108
##.DIGITISER RES= 18
##SPECTROMETER/DATA SYSTEM= spect
##.PULSE SEQUENCE= zg30
##.SOLVENT NAME= Pyr
##.SHIFT REFERENCE= (INTERNAL, Pyr, 0, 15.7039)
##AUDIT TRAIL= $$ (NUMBER, WHEN, WHO, WHERE, WHAT)
$$ ##TITLE= Audit trail, XWIN-NMR		Version 3.5
$$ ##JCAMPDX= 5.01
$$ ##ORIGIN= Bruker BioSpin GmbH
$$ ##OWNER= she
$$ F:/spectra/data/she/nmr/H-F/1/audita.txt
$$ ##AUDIT TRAIL=  $$ (NUMBER, WHEN, WHO, WHERE, WHAT)
(   1,<2022-05-11 16:09:34.60 +0400>,<she>,<DPX200>,
      <created by zg, POWCHK disabled, PULCHK disabled
       configuration hash MD5:
       00 E9 B6 7A A2 85 ED C7 34 08 36 98 17 FE 4E 26
       data hash MD5: 16K
       42 6F CA AA 32 F4 C2 1F FA E3 05 80 A4 65 CB 51>)
$$ ##END=
$$ 
$$ hash MD5
$$ F4 5B D3 A8 A7 02 8F 46 83 1F 2B 57 B9 71 C4 7F
##$RELAX= 
##$RELAX= 
##$RELAX= 
##$RELAX= 
##$RELAX= 
##$RELAX= 
$$ Bruker specific parameters
$$ --------------------------
##$DU= <F:/spectra>
##$EXPNO= 1
##$NAME= <H-F>
##$PROCNO= 1
##$TYPE= <nmr>
##$USER= <she>
##$AMP= (0..31)
100 100 100 100 100 100 100 100 100 100 100 100 100 100 100 100 100 100 
100 100 100 100 100 100 100 100 100 100 100 100 100 100 
##$AQSEQ= 0
##$AQ_mod= 1
##$AUNM= <au_zg>
##$AUTOPOS= <>
##$BF1= 200.13
##$BF2= 200.13
##$BF3= 200.13
##$BF4= 200.13
##$BF5= 200.13
##$BF6= 200.13
##$BF7= 200.13
##$BF8= 200.13
##$BYTORDA= 1
##$CFDGTYP= 0
##$CFRGTYP= 5
##$CHEMSTR= <none>
##$CNST= (0..31)
1 1 145 1 1 1 1 1 1 1 1 1 1 1 1 1 1 1 1 1 1 1 1 1 1 1 1 1 1 1 1 1 
##$CPDPRG= <>
##$CPDPRG1= <>
##$CPDPRG2= <>
##$CPDPRG3= <>
##$CPDPRG4= <mlev>
##$CPDPRG5= <mlev>
##$CPDPRG6= <mlev>
##$CPDPRG7= <mlev>
##$CPDPRG8= <mlev>
##$CPDPRGB= <>
##$CPDPRGT= <>
##$D= (0..31)
0 1.2 0 0 0 0 0 0 0 0.06 0 0.03 0 0 0 0 0.0002 0 0 0 0 0 0 0 0 0 0 0 0 
0 0 0 
##$DATE= 1652270973
##$DBL= (0..7)
120 120 120 120 120 120 120 120 
##$DBP= (0..7)
150 150 150 150 150 150 150 150 
##$DBP07= 0
##$DBPNAM0= <>
##$DBPNAM1= <>
##$DBPNAM2= <>
##$DBPNAM3= <>
##$DBPNAM4= <>
##$DBPNAM5= <>
##$DBPNAM6= <>
##$DBPNAM7= <>
##$DBPOAL= (0..7)
0.5 0.5 0.5 0.5 0.5 0.5 0.5 0.5 
##$DBPOFFS= (0..7)
0 0 0 0 0 0 0 0 
##$DE= 6
##$DECBNUC= <off>
##$DECIM= 24
##$DECNUC= <off>
##$DECSTAT= 4
##$DIGMOD= 1
##$DIGTYP= 9
##$DL= (0..7)
0 120 120 120 120 120 120 120 
##$DP= (0..7)
150 150 150 150 150 150 150 150 
##$DP07= 0
##$DPNAME0= <>
##$DPNAME1= <>
##$DPNAME2= <>
##$DPNAME3= <>
##$DPNAME4= <>
##$DPNAME5= <>
##$DPNAME6= <>
##$DPNAME7= <>
##$DPOAL= (0..7)
0.5 0.5 0.5 0.5 0.5 0.5 0.5 0.5 
##$DPOFFS= (0..7)
0 0 0 0 0 0 0 0 
##$DQDMODE= 0
##$DR= 18
##$DS= 0
##$DSLIST= <SSSSSSSSSSSSSSS>
$$ [...]
##$SUBNAM2= <"">
##$SUBNAM3= <"">
##$SUBNAM4= <"">
##$SUBNAM5= <"">
##$SUBNAM6= <"">
##$SUBNAM7= <"">
##$SUBNAM8= <"">
##$SUBNAM9= <"">
##$SW= 26.0245750270697
##$SWIBOX= (0..15)
0 0 2 0 0 0 0 0 0 0 0 0 0 0 0 0 
##$SW_h= 5208.33333333333
##$TD= 16384
##$TD0= 1
##$TE= 0
##$TE2= 300
##$TE3= 300
##$TEG= 300
##$TL= (0..7)
0 120 120 120 120 120 120 120 
##$TP= (0..7)
150 150 150 150 150 150 150 150 
##$TP07= 0
##$TPNAME0= <>
##$TPNAME1= <>
##$TPNAME2= <>
##$TPNAME3= <>
##$TPNAME4= <>
##$TPNAME5= <>
##$TPNAME6= <>
##$TPNAME7= <>
##$TPOAL= (0..7)
0.5 0.5 0.5 0.5 0.5 0.5 0.5 0.5 
##$TPOFFS= (0..7)
0 0 0 0 0 0 0 0 
##$TUNHIN= 0
##$TUNHOUT= 0
##$TUNXOUT= 0
##$USERA1= <user>
##$USERA2= <user>
##$USERA3= <user>
##$USERA4= <user>
##$USERA5= <user>
##$V9= 5
##$VALIST= <valist>
##$VCLIST= <CCCCCCCCCCCCCCC>
##$VD= 0
##$VDLIST= <DDDDDDDDDDDDDDD>
##$VPLIST= <PPPPPPPPPPPPPPP>
##$VTLIST= <TTTTTTTTTTTTTTT>
##$WBST= 1024
##$WBSW= 4
##$XGAIN= (0..3)
0 0 0 0 
##$XL= 0
##$YL= 0
##$YMAX_a= 756130
##$YMIN_a= -344459
##$ZGOPTNS= <>
##$ZL1= 120
##$ZL2= 120
##$ZL3= 120
##$ZL4= 120
##$ABSF1= 10
##$ABSF2= 0
##$ABSG= 5
##$ABSL= 3
##$ALPHA= 0
##$AQORDER= 0
##$ASSFAC= 0
##$ASSFACI= 0
##$ASSFACX= 0
##$ASSWID= 0
##$AUNMP= <proc_1d>
##$AZFE= 0.1
##$AZFW= 0.1
##$BCFW= 1
##$BC_mod= 2
##$BYTORDP= 1
##$COROFFS= 0
##$CY= 11.3945322036743
##$DATMOD= 1
##$DC= 2
##$DFILT= <>
##$DTYPP= 0
##$F1P= 2.36226072786647
##$F2P= -0.459571619588291
##$FCOR= 0.5
##$FTSIZE= 0
##$FT_mod= 4
##$GAMMA= 1
##$GB= 0.15
##$INTBC= 1
##$INTSCL= 1
##$ISEN= 128
##$LB= 0.24
##$LEV0= 0
##$LPBIN= 0
##$MAXI= 10000
##$MC2= 0
##$MEAN= 0
##$ME_mod= 0
##$MI= 1.114404
##$NCOEF= 0
##$NC_proc= 0
##$NLEV= 6
##$NOISF1= 3.799351
##$NOISF2= 2.8
##$NSP= 1
##$NTH_PI= 0
##$NZP= 0
##$OFFSET= 15.70392
##$PC= 1
##$PHC0= -17850.88
##$PHC1= 8.400748
##$PH_mod= 1
##$PKNL= yes
##$PPARMOD= 0
##$PSCAL= 0
##$PSIGN= 0
##$REVERSE= no
##$SF= 200.130013532006
##$SI= 16384
##$SIGF1= 3
##$SIGF2= 2
##$SINO= 400
##$SIOLD= 16384
##$SREGLST= <1H.CDCl3>
##$SSB= 0
##$STSI= 0
##$STSR= 0
##$SW_p= 3612.71676300578
##$SYMM= 0
##$S_DEV= 0
##$TDeff= 0
##$TDoff= 0
##$TI= <>
##$TILT= no
##$TM1= 0
##$TM2= 0
##$TOPLEV= 0
##$USERP1= <user>
##$USERP2= <user>
##$USERP3= <user>
##$USERP4= <user>
##$USERP5= <user>
##$WDW= 1
##$XDIM= 8192
##$YMAX_p= 0
##$YMIN_p= 0
$$ End of Bruker specific parameters
$$ ---------------------------------
##NTUPLES= NMR FID
##VAR_NAME=  TIME,          FID/REAL,        FID/IMAG
##SYMBOL=    X,             R,               I
##VAR_TYPE=  INDEPENDENT,   DEPENDENT,       DEPENDENT
##VAR_FORM=  AFFN,          ASDF,            ASDF
##VAR_DIM=   8192,          8192,            8192
##UNITS=     SECONDS,       ARBITRARY UNITS, ARBITRARY UNITS
##FACTOR=    0.000192,      1,               1
##FIRST=     0,             0,               0
##LAST=      1.572672,      0,               0
##MIN=       0,             -344459,         0
##MAX=       1.572672,      756130,          0
$$ Real data points
##PAGE= N=1
##DATA TABLE= (X++(R..R)), XYDATA
$$ [...]
2537g59J81J73J140m32Oj29r19N40j04j99Q15m57m10Q96k65J45Qn9J85m62o49
2558g55Q36j189M84Q95O2p97J176n34j56R46m45m89k01J74j215J57J513J78o15
2577B5P23m53j42l05P3N58r38K5K42j01P09n17j7N47k03j39l80k90j97P69J78
2598A67K55o32J66J28m18M37L80k28L04l0p13J99J58l79n15N22k71j32J00P54
2618B52O3j76N47N6J13q06p7l34j93l48P57L68k93J196l29m41k09Q84j454l02
2638g26l7O46j87Q7N61j55o3J026j598O55p96M70R18j139j83P30l95k20M33j17
2658i0N32j9p71J38J97p0QJ48K4q18P70k38k37N88M34j072M30Q30o95J94k36M
2680E1m44Q9K86l17K97P84l4k56M71o11k97m68k19p85M53P12L14K41Q4J52M76
$$ y = [-759, -578, -405, 735, 303, 309, 180, -739, -199, -303, -502, 313, -144, -554, 342, 77, 222, 230, 171, 356, -106, -755, 81, -1108, -624, 271, 333, -464, 712, 178, 22, 968, 523, 34, -167, 7, -1208, -1051, 462, 640, 25, 748, 295, 153, -152, -79, 479, -459, -434, -192, -293, 416, -101, -118, 429, 226, 87, -293, -583, -780, -11, 167, 422, -210, -44, 84, -334, 103, 483, 255, 559, 529, -184, 15, 173, -206, -721, -199, -470, -602, -502, 252, 315, 139, 686, 742, 855, 49, -28, -362, -555, -903, -146, 222, -71, 1125, 796, 355, 146, 1030, -424, -726, -763, -117, -304, -217, 344, 189, 126, 1152, -446, 209, -587, -117, 801, -338, -521, 209, -186, -406, 27, -90, 442, 423, -348, -210, -13, -83, -75, 73, 97, -721, 49, -189, -426, 162, 596, -476, -46, 784, 89, 283, 47, 51, -393, -304, -18, -335, -38, 746, 712, 456, 927, 316, 19, -449, -668, -1453, -1000, -288, 26, 267, 351, 503, 979]
2701I79m80p11P2o75N45r67P48K39L36N79P55n89n36J21j369L33R6K69o5J05N91
2722C76l55O89k50Q25k48q0p41q61M47j70O8L70O52p61k08K01K87N27j84L14q55
2743D3r36M14l5N99Q9M77m02o0k53J89L77J33J45n69k04j715J047J48L47J11Q61
2764H06J0r06K83j04J116j414j25o8q50N59l2P30J054k16k48j67q62M27k12L83
2784A64n83n9R0K70M2L98O73r91K93J09p91k87L01L50N50p26J69R70k96o05Q8
2805A29K32n54L78j44J82j93m05M03k73P44j054Q16j17k34L00j93o7O00o13j97
2825b60k15l44N01N67n22N58N16n98L81O2q32n30l75J24m33K00J115J75M95m1
2845E44N04o15K50j491J33O54l16o38Q22N03J0O02k3k74n0m30m65k70l85M94j24
$$ y = [979, 499, -212, -140, -815, -270, -1237, -489, -250, 86, 665, 1420, 831, 295, 416, -953, -620, -524, -255, -320, -215, 376, 21, 710, 460, 1285, 1037, 957, 216, -645, -198, -368, -300, 70, 722, -39, -247, -46, 241, 768, 584, 898, 43, -893, -479, -514, 85, 174, 651, 249, 189, -64, 125, 502, 635, 780, 211, 7, -1708, -661, -513, -166, -55, 806, 816, -90, 193, 89, 1205, -209, -334, -402, -1252, -693, -725, 5, 1059, 843, 595, 428, -434, -7, -219, 164, -419, -478, -388, -118, -76, 322, 995, 4, 297, 406, -385, -672, -371, -21, 529, -197, -28, 942, 646, 41, 129, 361, -193, 185, 41, 223, 30, -375, 28, -245, 499, -555, 261, 144, -90, 210, 17, -50, 550, -63, -260, -475, -819, -318, 249, -273, 285, 801, 203, 584, 646, -186, -716, -1091, -967, -1400, -1200, -85, 90, 585, 544, 1048, 433, 683, -808, -675, -21, -337, -975, -153, 350, 360, 962, 939, 665, 615, 185, -280, -550, -935, -441, -565]
2866e65J09L05O16M08q02J55q82P40Op71L03k05L74k20Q04j26n78M01N1j63k17
2887b57n4J30J62K22o1l04M5k83P7K78K73L00l2n48M5n77O65L18m89p05N43k29
2909d81N56m78M28M56k4q1r88N80k99N14p65K76Q15k17n75K15J068p22j72m95
2929c89K84m16L05O95o84P36m31K35q5n03J88J56R8l39n98N55m21J95J37P61L36
2950H15o37q39J003l80R8o25O36J97o17k6m52l48J051J83j10O3N27m77k36K31
2970E7k98k18k13J183p64J75j16K88k57N38k58J44n47q2N78p55j54J92J94p2M9
2991c36P11m00M02Q4L51r94M8m55L73n15R64L7k08L59l24J054j285K35o72Q28
3011B57o20n9O44j5L94n16m6M59n39k86J069o89k48j18r6n4PN80M44m25K02L22
$$ y = [-565, -456, -151, 465, 873, 71, 226, -656, 84, 90, -681, -378, -583, -209, -429, 375, 249, -329, 72, 123, -40, -257, -311, -181, -19, 203, 142, -162, -117, -400, -323, -45, 228, 528, 496, -52, -7, -584, 81, 399, -90, -795, -252, -481, 75, -403, 25, 481, 457, 376, -612, -32, -331, 183, -582, -306, 509, 292, -283, -68, 1000, 278, 106, -389, -105, -521, -216, 479, -205, 531, 100, 335, 250, -253, -65, 91, 189, -150, -748, -193, -614, -419, -282, 479, 815, 178, -661, 342, -38, 60, -565, 71, 268, -349, -375, -827, -1175, -124, 59, -51, 12, 539, 62, -174, 57, -241, -459, -672, 511, -253, -78, -194, 94, -163, 375, 117, 261, -286, -368, 210, -545, -699, -507, -313, -385, -336, 375, -25, 377, 461, 812, -182, -134, -589, -216, -731, 233, 270, 62, 421, 97, 1151, -134, 101, -571, 257, -363, -422, 222, 207, 601, 85, 39, 498, -41, -327, 742, 53, -195, -313, -409, -463, -456, 124, 568, 143, 345, 667]
3033F67p45l21K87J09N86q02R2n6J14n03O85k31l06P20J83j88k61K54q02n5J163
3054E90k2j175k18J237n67o24Q80L37j11n07j3j05j80L70K03n80P24l38K1k81
3074c59N61N53j181P80M57j041k57N14N24Q5o45R93m27j043J23K27L1K82n07k34
3094e64O58J63k32J57K39p65L85J50l02M04j00m5j95j5M94m30J03K40l11J66n5
3115A45J63q32N61j94ll77N32l23n15P83J80l04K25n77Q22n13j37L72r68R28P76
3136G44q71l00K48Q60j113m2O60j17L22l97p01L36N61N22o58J65j04n93L33M4
3156a01K7n26L73P3L75J43m69J79o83J101j93o7n29j74k06P99m51J82L54k6j01
3177H0m70J96j27Q08l13p70N04L11j85K07l50M89n47l63P28M7j46r29P72L4n03
$$ y = [667, -78, -399, -112, -3, 583, -219, -127, -183, -69, -572, 113, -118, -424, 296, 479, 291, 30, 284, -518, -573, 590, 568, -607, -825, 412, -155, -779, 101, 438, 327, -180, -193, -298, -478, -108, 95, -485, 239, -99, -78, -359, 202, 755, -426, 354, 811, -230, -487, 27, 551, 636, -9, 984, 557, -486, -363, -136, -105, 177, -330, -564, 94, 257, 25, 182, 421, -344, 41, 191, -111, 293, 193, 148, -47, -62, 432, 2, 105, 345, 34, 200, 145, 308, -524, 37, -157, -160, -537, -5, -328, -843, -60, 120, -184, 41, -536, 286, -227, -364, 8, -960, -32, 744, -127, -427, -179, 681, -432, -474, 186, 69, 391, -6, -707, -371, 190, 712, 54, 219, 115, -478, -145, -101, -74, -600, -227, -154, 221, 364, -105, 74, -609, 492, 299, 232, -297, -471, -677, 122, -329, -147, 207, 181, 80, -390, -194, -321, 487, 174, -596, -92, 219, 34, 241, -109, 380, -167, -530, 198, 245, 99, -830, -58, -24, -527]
3198e27J62N73n31Q34l51N0o7o6O69o16l70J42L96l15j23l07j50J183l15n56m23
3219g08O12K4j63K74P81q55R04p97L66j283Q72j43M23J27k67O5m76Q0N37r62O49
3240F0o53Q41jj99K73l59j03N81q53O46q97M29L14m8K24j96k85m68Q96l46J10
3261c4p34P1P42K42j11j97Q93o47o49O90m34l64N43L59K85j41j34l8J92j173O77
3282C8N43n82k31N92p36O2P6J08L69j77j93K63K04J93l75k58O13p9q01K16j18
3303b73QM57j78j88K78J6J87j45M30m05m8o0j12J44o40j25R88o06N09K17n13j93
3325b52o1L32l63kQ94o42l43K23O90L64o99j94n73K13K89l21J117j113K91N26
3345C76m19M28o47N74k78k82m79K22Q37P9j87j94M21l41R5j26j55L23j17J56o54
$$ y = [-527, -365, 208, -323, 511, 160, 210, 143, 77, 746, 130, -240, -98, 298, -17, -140, -447, -597, 586, 271, -285, -708, -96, -72, -235, 39, 820, -35, 869, 72, 438, -845, 27, -116, 307, 434, 167, 232, -244, -164, 373, -589, 60, -593, 248, 247, 48, 321, -38, -141, 440, -413, 233, -664, -235, 79, 31, 255, 59, -226, -694, 202, -144, -34, -768, -697, 45, 287, 176, -21, 872, 225, -424, 266, -168, -532, 11, 370, 655, 514, 380, 342, 534, -639, 38, 581, -1, -232, 360, -376, -314, -238, -130, 239, 62, -131, 132, 336, 529, 154, -104, 509, 430, -371, -155, -273, -265, 192, 14, -174, 104, 120, 307, 162, 592, 187, 139, 79, -33, 111, -529, -654, 334, -272, 237, 454, -59, -252, -313, 19, -344, -346, 548, -94, -437, -214, 476, 840, 141, -53, -626, -413, -124, -445, 672, -441, -150, 376, -43, 385, -262, 312, 34, -248, -727, -505, 332, 411, 224, 30, 451, 110, 205, 79, -76, 247, 130, 286, -368]
3366c68j27k66R06N20p99K84M93n42j13k43K76K35K64l72o79K98M10K41p72k43
3386e97Q27M04k21m3L85m51%n4r18N69k04M96k31J59m3N69k86J16o22M42p48J68
3408b83j16P4M03o95M88J219r4j025q93N78M09q69P71K87l41P6P59o46J70Q0r48
3429e96M66R3n80M08OKQ3K53n64M51M99q38L17J059k118J076L72L8p34N31n14
3450b90M14l4N7L26m47m61N16p23P92k35l03J020j290N87K0K88o23J71M06k35
3470d4L09j08j47p40k62R48Q19j01l65J16n22l58M74o89N31m82M1LM83M4P84j42
3492E92p64P10k73o85l39R77n12M7J176j143Q86n26K37k96o96O01k60N60j107
3511h15M14k83N77P30m81p10J395j065j08K25%n51R78P0l60j07J24rJ0k64j24
$$ y = [-368, -495, -761, 145, 665, -134, 150, 643, 101, -12, -255, 21, 256, 520, 148, -531, -233, 177, 418, -354, -597, 230, 634, 413, 370, 755, 304, 304, 250, -668, -99, -303, 193, -38, 121, 78, 647, 361, 477, -145, 297, -451, -283, -399, -325, 78, -617, -129, 1090, 996, -29, -922, -344, 65, -804, -33, 254, -87, -11, 748, 102, 272, 352, -596, -130, -37, -617, -209, -203, -201, -118, 135, -429, 22, 521, -317, 0, 1059, -1059, 17, 389, 427, -307, 224, -290, 124, 90, 147, 473, 26, -435, 81, -642, 150, -85, -388, 632, -658, -71, -51, 237, -386, -215, 191, -44, 265, 157, 10, -730, -992, -44, 775, 674, 309, 425, -97, -455, 19, -670, -139, -621, -580, -577, -94, -50, 734, 592, -172, 538, 265, -420, -759, 218, -294, -247, 929, -214, 672, 146, 383, 87, -609, -8, -268, 292, -815, -401, -684, -107, 623, 142, -568, 827, -238, -346, -121, -121, -672, 306, 376, 16, -91, 33, 24, 34, -230, -354]
3532c54K68J93N17m98k54N82K57k48p81K28M9N71K49j58J26p04O65n20l90j14
3552c16Qj64k03O36j62K40M89j7l35j04o73M96q1L11K01L19k92o81O82Qn14L60
3574B08n54j59L24n46M16L41n41N75K00k32J08m03Q85q20O64j95n20J99m8K86
3594A88K20K76j74O8p11k81J041r35M80j112J127M42o70N3l62K78O78l71j91j37
3614i3L29j417K90M30k64P37k06M3Q2L87j75k20N65k96m65J83m12J10R06m22L16
3635D08j80N13l15k25q4l13j53l43J16Q26nN23n19P62m69r28Q55m51J57n08N97
3656B64p11L39J50M02l49K67N5O7r59M11K62n2L65j78L06K81j465k94Q70L89r41
3677e21O78L47n55m27J200o30l23n5m78P02L59k80L82n86K59K40k02m67m82Q52
$$ y = [-354, -86, 107, 624, 126, -128, 454, 711, 463, -318, -90, -41, 530, 779, 621, 747, 43, 708, 188, -202, -316, -308, -472, -675, -39, -201, 39, 528, 511, 176, 72, -601, -105, -186, 125, 326, 645, 353, -328, 354, 362, -152, 208, -346, -505, -181, -727, -311, 30, -511, 64, 264, 32, 140, -263, 622, -198, 466, 271, -249, -50, -98, 188, 408, 684, 510, 578, -133, -414, 627, -308, 172, -940, 187, 629, -41, 12, -350, -72, 606, 235, 44, -93, 236, -1181, -891, -461, -725, 12, -194, -151, -69, 318, 143, -77, 488, 192, -273, -90, -502, -392, 514, 92, 408, 228, 741, 426, 201, 117, -196, -349, -692, -576, 250, 245, 768, 249, 1011, 542, -386, 469, 18, 175, -333, 264, -447, -108, 42, 444, 95, 362, 417, 484, -475, -64, 198, 146, 511, 333, 639, 920, -545, -839, 31, 420, -521, 157, 504, -51, -478, 722, 92, -231, -286, -764, -62, 297, 17, 399, -187, 72, 312, 110, -357, -839, 13]
3697A3l47P89o94M60K11r49J248m05l22M61j86R8j137P02L29l5k39O75n25J41
3717B88k40L76P3j715J072J13K40l12R09p6p57M68j11Q3k88q7O8O0j59j96J221
3738A030j07j426N06j63m06J05O0L52K41k27j10q89Q90o59O27K34L29J46q34J428
3758A127j388J48k44l53J033j127R94K13N0k72L30n0K1m14j15m0N9k4M69o73O38
3779C82n65r9J44k39J000j152J006p22K83m84J567q96L85q53K67m90K35Mp80M49
3799e58P08J23p24J185j02o19J60L91l48m33J87n91P51K22l17N39j141M28J0K34
3819A05p40J92k53M38L37K96m42K8j44n34N41P0l5L58O64m68n51L77p12l8P65
3840B54o99K80K25r2M16p71P17n0p9l6p66R39q45M02j01Q98o85J063n33q2M5l54
$$ y = [13, -334, 455, -239, 221, 432, -517, 731, 326, 4, 465, 279, 377, -760, -58, 271, 236, -3, 672, 147, 288, 48, 424, 497, -1218, -146, -33, 207, -105, 804, 728, -29, 439, 328, 411, 123, 36, 104, 164, 5, -191, 1030, 923, -503, 3, -160, -566, -461, -401, -49, 192, -35, -145, -1034, -144, -803, -176, 58, 387, 533, -301, 1127, -261, -113, -357, -710, 323, -804, 190, 403, 453, 181, 511, 461, 482, 68, -47, -87, -28, -52, 417, -256, 382, -183, -282, -138, -377, 623, -529, 477, -245, 38, -446, 1121, 225, 610, -243, 24, -466, -231, -227, -1007, -558, 150, 273, -451, 734, 632, 13, 173, 564, 216, -217, -30, -621, 130, 352, 35, 574, -567, -139, -129, 105, -635, -443, -696, -258, 79, 375, -67, -39, -183, -717, -176, -106, -141, 217, 881, 413, -138, 239, -473, -511, 254, -445, -165, 60, -32, 384, -387, 330, 280, 201, 165, -601, 338, -507, -105, -206, 692, 7, 1070, 537, 455, 500, 146]
3862A46j391J038L16j34L11j99K22N3o0Ql37k64O40n12j33J42k87N21Q45q89%
3883C6L23m57J23M21p24M65m36k30k93M45O04k25M82o08L74r49M84l06O65n88
3903c94M41L75p53J56P70l45l15N33n74M32n03J17L45k20k62J92L08J71k51L16
3923E39k41k38K86l71l94L43m92k9O86q34L91O54M08o20L69k55k47L91p50O73
3943B69p69M63L57K99p73K73k86L65k84N05j562O50O91M4l90O29R9m54R29n63
3963D92k25r88J446j283K43J19o03Q72mk45K98J61M89m74M06m18m47K51N10m85
3983A15j465L01P61j65O55q58N0M97j58P36n43m67j73K33K97j93N5K39l27J177
4003G67l14j027J097n75N0j00o04J54O15Q6L61m51J03K71n69q2m95rO36k19O31
$$ y = [146, -1245, -207, 109, -25, 286, 87, 309, 362, 302, 310, -27, -291, 349, -163, -296, -154, -441, 80, 925, 36, 36, 359, -98, 25, 446, -278, 187, -249, -479, -772, -327, 277, 52, 534, -74, 300, -649, -165, -471, 194, -394, 47, 422, -331, -175, 595, 250, -65, 468, -106, 326, -177, -60, 285, 65, -197, -5, 303, 474, 223, 539, 298, 60, 346, -25, -419, -76, -568, -597, 89, -745, -354, 300, 708, 88, 457, 202, -45, 346, -404, 269, -500, -37, 320, 619, -154, 119, -167, 198, -86, 419, -1143, -493, 198, 242, -148, 481, 580, 126, 1055, 492, 267, -721, 725, -558, -315, -196, -799, 73, 69, -176, 122, 283, 772, 298, 704, 286, -161, 90, 600, 115, -1350, -1049, -288, -453, 202, -656, -606, -109, -267, 469, -74, -541, -714, -481, -184, -377, -322, -83, -410, 767, 453, -574, 523, -52, -2, -102, -706, -552, 63, 149, 510, 59, 162, 433, -136, -218, -713, -722, -86, -305, 326]
4024C26p2K95j35m58O10k34o47N97l76J30r2K17N1n90R51p02R50l80r60K26N67
4045B74o56Q1n1Q13j30j091M54M03M11r87L44k29J249j224P26o48m1j024J065
4064b61k60J39J506q95K25K60n92J24q36P24l56l62J45Q2N36L85J89j47m65m30
4084b89M20m68l11l81P36p9J36O61j96K77p8n81N87J21q70j30M57l2n94J166n01
4105E1M3M3P1k25k21l28J47k73Q42o27M96k3r20O10M5K74M27l59M61o4m34k59
4127b23K42n43NM68N77r71J308p39L33l17m39J007m50l76q38K94K53j04Q50j30
4147B07K87J50k62q19j41L46N1K65j71j10N48L04M2q64L98n00RP89r45J156p82
4168d2Q47j009L76j73r13J483m90n91M47J3K25q47L24j53k3M46O53p93l69K56
$$ y = [326, 254, 549, 414, -44, 566, 332, -315, 282, -94, 36, -56, 161, 212, -378, 573, -129, 821, 441, -519, -293, 274, -382, -301, -352, 461, 331, -760, -306, 97, 508, -479, -135, -364, 885, -339, 387, -261, -302, -1326, -261, -521, -382, 1124, 229, 454, 714, 122, 246, -590, 134, -222, -584, -439, -357, 179, 564, 753, 606, 141, -289, 131, -337, -648, -1029, -293, -372, -236, 425, 229, 506, 428, -153, 434, 555, -315, -445, 12, -20, -614, 552, 51, 94, 137, 208, -17, -238, -566, -419, -692, 150, -477, 19, -4, -924, -314, -269, 5, 432, 73, 534, 470, 36, -223, 19, -524, -519, -51, 526, -445, 863, 124, 457, 140, -299, 708, 258, -118, -956, -662, -409, -513, 337, 207, 494, 644, 382, -437, -578, -232, -181, 84, -87, -197, 351, 655, 697, -167, 231, -269, -260, 529, -416, 740, -42, 805, -204, 172, -1, -914, 569, 79, -512, -65, -52, 173, -674, -350, -503, -526, -80, 573, -220, -589, -333]
4188c33P56m40K3Q7K7j39p4l61j26J58O3L59l37K87J21O04o58n2J22r73L48O59
4210A21o06L44K74Q92j07n52j41o93R28j002J8Q56r91J298K55l39n35K60q7o17
4230d24K25j85P36n02L91k51O8M00P8j055O17M49o71L6K22n80J359o99j87L15
4250C42j39l73K56L8l66L08K20l00m10m4J254p70m5o38P56q4K5n01Q63m4O72m29
4272E91o46n33K18R87o19N04l29K9M07K42r12J14o59O93m73k87Q43K14k85n97
4292d98J680j284L48l48j88J070j636Q31l2L99L09o34n92k62N45k10R3N07j14
4311a6p04P85n69J503q71j60L69k17r96J062j53j66k94Q20n5J25p66N79n29N69
4331C16n81L72P3j45M17r95P57O80l92j504R59M57P23q62k24J54P9R9o67J09N5
$$ y = [-333, 423, -17, 6, 93, 120, -19, -93, -454, -580, -422, -359, 0, -337, -50, 71, 675, 17, -35, 87, -886, -538, 121, -485, -141, 133, 1025, 918, 366, 225, -468, 460, -542, -524, 332, -659, 639, 894, 555, 20, 280, 193, -424, -199, -384, 352, -150, 241, -10, 58, 458, 536, -519, 98, 547, -124, -88, 134, -446, 913, 214, 27, 342, 203, -170, 86, 124, -242, 66, 286, -14, -424, -468, 786, 16, -29, -667, 89, 5, 30, -471, 392, 348, 1020, 591, -55, -588, -370, 617, -2, 502, 173, 202, 609, 851, -61, 53, -606, 87, -386, -673, 170, 384, 99, -498, 1182, -102, 246, -102, -290, 780, -856, -25, -57, 342, 651, 17, -575, -837, -292, -502, -409, 98, -16, -720, 65, -504, 999, 128, -32, 337, 120, -876, 186, 33, -133, -427, 393, 338, 463, -303, 276, -253, 316, -265, 107, 180, 35, 452, -543, 214, 894, 502, -1002, -43, 414, 1137, 275, 51, 205, 284, 383, -284, -175, -120]
4352a20o31N98k21l01l02K82J118o59M4O9r10J781o64n20l71Q02K01k16L18M86
4372G84q33q50Q84q50JM87J288m97o96J368j355N26l87J07j98K06k27P47k67k52
4392a4n22P83j16Rk60O53m16n84N58J71j029J077M88n62l39m14K8K49L41M12l24
4413A89K4M70P1j064k9M33q25r6J180l70J100j043M68j49n08n00K10N18n1P31
4433G59j105j5L44L38k13O73j375P70m28Q7K01j94o62Q45j0j82l03Q31j07k77
4453b3j79K77j97k0m07O94M95p50P01o33J29k35j15Q0R97n51Q52j145l79N3N20
4474A64L9j20j0K60k88Q51j147L53L87k90K84k77j280J120l44P46K18j104J155
4493G17l05p64K23l47j12R76o06J652j844Q55Q8l87j30l05M73j35M2K49o3k24
$$ y = [-120, -751, -153, -374, -675, -977, -695, 423, -236, -192, -123, -1033, 748, 84, -436, -807, -5, 196, -20, 298, 784, -49, -899, -15, -865, -864, -377, 911, 414, -282, 1086, -269, 257, -130, -23, -221, -15, -242, 505, 238, -14, -536, 247, 131, 140, -120, 533, 117, -467, 91, 262, -767, 310, 798, 236, -103, -517, -489, -240, 101, 513, 189, 213, 683, 754, -310, -339, 94, -731, -827, 353, -17, 1083, 40, 508, 359, -149, -649, -439, 79, 28, 759, -346, -361, -17, 321, 108, 781, -594, 176, -252, -165, 36, -158, -820, 25, 15, -167, -470, 361, 254, -23, -202, 75, -122, -142, -549, 145, 640, -110, 591, -42, 87, -148, -263, -183, 814, 263, 1115, -30, -409, -356, 164, 203, 83, 73, 333, 45, 896, -251, 102, 489, 199, 483, 206, -1074, 46, -298, 448, 666, -438, 717, 412, -352, -129, -476, -588, 388, -218, 1434, -410, 445, 533, 146, 16, -289, 184, 49, 91, 340, 277, 53]
4513E3N51r80R38m24j49J34K93o45p0k13J363p62O66o35n44M46O1p65J441j370
4533f11N84K28K15J29j407J140j92J15o08Q90p64o67J058m29j43P36L02j147q44
4552a415J056o95M96P80j86J70r05m3N95Jk18O01J68r63j35P74K11k84Q36m53
4572C91j43l45N3j65m12R58j52p90N17J211m89j150R49j79j562J169q7j80Q61
4591D55K92q51Q13m16j065Q71M0p14N65L01K66j002L6M03J20m55K77k09J059j408
4611f22J854n62m78L57n16J38k67K64n34K43N55o01n87K034j256L71n11J061j509
4630e66J208r03L8P2k82L75J81J4L05l75o26L52o21J161n45NK95R2o50M06J74
4651A10L44j07N45j801Q89m00k6O07M10k53q29M13j33J97J04j17O35J3k87k86
$$ y = [53, 604, -376, 562, 138, -11, 123, 416, -229, -299, -512, 851, 89, 755, 120, -424, 22, 83, -682, 759, -611, -27, 201, 416, 545, -862, 278, 86, 201, -407, 483, -281, -948, 110, -319, -462, 274, 576, -571, -1415, -359, -1054, -558, 222, 36, 206, -699, -742, -147, -146, -364, 237, 405, -558, -693, 81, 292, 8, 844, 391, 248, -97, -44, -209, -621, 337, 185, -605, -88, 1123, 634, -516, 433, 254, -1308, -139, -226, -406, 455, 747, -104, 709, 293, -772, 99, 139, -575, -10, 291, 557, -445, -409, -6, 114, -341, -64, -273, 786, -622, 1232, 670, 192, 549, 33, 171, -96, 168, -366, -123, 432, -169, -756, 1278, 22, 393, -118, 943, -566, 642, -261, -223, -151, -433, -58, 123, 137, 442, 67, -559, -207, -828, 333, -212, -207, 88, 180, -470, -64, 110, 454, 347, 892, -909, -20, -420, -446, 161, 571, 318, -511, -98, -231, -34, 70, -47, 588, 601, 314, 28]
4671B8J62j89j12L82o32n54M69L08O05q22P02K86n73k30J52o79P87l2N30J17n26
4692A79m84J123p33M16o64o20O75P7k52k78N05P3j66M05J77j11o94j3M2K90n39
4713e92Q98m02R2l63M47l41J381j091m65L31j76j40P52J2o24N37l3n8p31O69l8
4734F5M41q32q6Q41l10j36M38n16j02K28k21M31p69P14o19N94n59L68j31o7j65
4755c93R1P79m62j71R92l17o17J31k59l44N77j36o23Q91P54j185M03J12l98N38
4775C63o43p7O89l18m13N48K07M0l26m71L71r44M39K00J26J70k63K70K0k1k27
4796b60O64j50p37L71J85K06q40Q5O07J4p39N53Q4j12K02l14j3j49N88M05r95
4817c45J0J40N72n11m40J061Qp77K88K19j01N64p43n7M7k72L8j85R33Pk75l01
$$ y = [28, 190, 1, -111, 271, -361, -915, -446, -138, 467, -355, 347, 633, 60, -170, -18, -697, 90, 58, 588, 705, 179, -305, 818, 85, 501, -163, -783, -108, -31, -283, -561, -56, 17, -149, 256, 433, 322, -372, -385, -343, -53, -592, 306, -96, -4, -367, 80, -261, 1120, 29, -436, -105, -281, -421, 331, 343, -281, 256, 223, 165, -566, 103, 65, 506, -326, -412, 429, 119, -17, 421, -95, -197, 31, -190, 241, -528, 186, -433, 161, -398, -30, -161, -228, -393, -302, 477, 15, -156, 836, 519, -98, 33, -226, -570, 7, -129, -752, 139, 893, -292, 111, 223, -175, 363, -280, -357, 332, 14, -399, 149, 356, 396, 70, -401, -30, -974, -535, -335, -209, -39, -302, -32, -12, -33, -260, 404, 254, -483, -112, 73, 279, -561, -476, 131, 145, -594, -41, 43, -69, 133, -181, -194, -343, 245, 650, -345, -335, -195, 377, -134, -574, 487, 495, -282, 6, 225, 124, 688, -55, -112, -65, -337, -299, -484, 449, 456, 181, -120]
4839a20R1J56k59L78j281J270l15j00L32K59K6j31p38LL46j58M94o7J32k61l06
4860b49L84J12L23n45N5l13M00p55J98Q03J88k52N20o66M2n91R93l70n92N41r3
4881A33m11oN18k89l88O77l8R5r9k33k7L09l88K79Kk03j26j59P4K11M0M83m85
4904c1O45k83l81M85m25q74K4K59M66K70R0j18M45q26J88l28j45N86l60P52r36
4925d97O14n76Q47o5l77J291j531K13n09O61n47J42J74l25O96j59j080R79l07
4944c56l81K75M59M77m03m34M55k19J33K67K85j404N74k79P48l39K17m66J74r5
4964c12L06L43l66n0k50O15k8j17j392J815n12O37p12l44O56j12j19l9M46j86
4984B79K75o41N65n19k5J73k86P12p3j080J661o63o6j42j52l53K78P18r33m52
$$ y = [-120, -29, 127, -132, 246, -1035, 235, -80, -180, 152, 411, 437, 306, -432, -429, -83, -241, 253, 186, 318, 57, -249, 135, 247, 570, 25, 80, -233, 167, -588, -390, 413, 601, 349, 869, 203, 245, -346, 647, 277, -315, 226, 133, -278, -284, 234, -55, -443, 234, 196, 291, 192, -41, -68, 241, -147, 132, 134, -69, -195, -354, -280, -69, -29, 454, -31, 614, 331, -50, 435, 10, -864, -840, -581, -115, 155, 245, 127, 572, -254, -66, -394, -539, 47, -313, 439, -497, 117, -459, 388, 323, -54, 1237, -294, -81, -590, 71, -476, -334, -160, -485, 211, 52, -1028, -49, -356, -737, -462, -3, 474, 71, -363, 92, -127, 6, 273, 558, -846, -272, -551, 197, -142, 75, -391, -217, -312, -6, 337, -29, -79, -329, 286, 258, 141, -1251, 564, 52, 689, -23, -367, 289, 177, 58, 19, 465, 279, 554, -87, 478, -41, -66, 107, -179, 533, 460, -620, 1041, 378, 312, 170, 18, -335, -57, 661, -272, -724]
5004g24J86R03L76p14p46L92o4l14N32K25k23J8P75n83L77k92p68N09J24K30m56
5025b37K01j0P5j35M49p5R09r25M4p23k76K43kJ51O3K75j56k76j70N10P71p12
5047fp25N56K98l06M25k03q22L56O13K89o26P1n49O18L40o25O67n79M43P1n05
5068a99P63k23j66J12M15p69l05J34L35l40J57O2J02O9O83n63m2k81m09L24j17
5089b58J99p60R57n19L17l85n8L53j46k4O48K86j33o22J26O06k94j98n55L83o5
5110a42O57k17m14K99J07q10J7M29J17j85N92L78n10J63j98j52n99J17N21j32
5130C8k29N01J80m46l02l6P63n33K66r17Q16L03r82J220j060J32L72l9K07o79
5150d25L17p0J49J11J93o46R18m91q68J060o28MM29o57N02j02M45o21J50r1N70
$$ y = [-724, -538, 365, 741, 27, -719, -327, -391, -705, -173, 52, -171, -153, 622, 39, 416, 124, -644, -135, -11, 219, -237, -36, -46, 29, -106, 343, 268, 1177, 252, 296, -427, -703, -460, -462, -311, -248, 27, -129, -405, -575, -65, 706, -6, -731, -175, 123, -183, 242, 39, -783, -427, 186, 475, -151, -80, -629, -11, 329, -296, 371, -208, 235, 306, -199, 564, 341, 175, 287, 702, -67, -372, -238, 97, -243, -86, -24, 78, 147, 830, 267, 225, -56, -465, -141, -258, -59, -819, 138, -381, -64, -449, -507, -154, -300, -324, 324, 610, 477, -145, -19, 587, 293, 95, -460, -77, -142, 515, 298, -116, 183, 290, -520, -503, -74, 43, -142, 450, 828, 318, 481, 283, 131, -468, -351, 170, 38, -191, 310, 490, 44, -258, -294, 469, -64, 202, -715, 101, 404, -578, 642, -418, -286, 86, 47, 254, -425, -108, -178, -29, 82, 275, -371, 547, 56, -812, 248, -380, -376, 53, -604, -102, -204, 241, -380, -230, -321, 249]
5171B49J50k94m02M60j152R82p00N91K74K55k74K05l05m84L7R48q04N5N52k94
5191D9N5k93nO68p52Q54m37OK20k53j49J65J65j135J415r07P94m59N96p62M26
5212B61j25o7k68j24Q24o67q7k11L27N81k82j13p2q11J355j077P15j9l27J37N2
5233BK05n73L60J09n1j86M55J35l7j207R55K65m15m98K86K25M66o17m00K79j54
5254c96L68J15K5m17L18P03r19J60m10L66K7L70m24M88Jr76R74j88q68K95N2P39
5276D03m57m20K56O60o63P18r80j2J75J04n98J96O93pl63l8P84k71m7m28J51j68
5298c12K78M77p99P40K38o69j81k76J041j95j03m91L1P26l39n60K43K49K81n52
5318a73j88L42K28q4j2N84k35m77k84R08r60R59k25p99P09l03r7n5L50j61j06
$$ y = [249, 399, 105, -297, 163, -989, -7, -707, -116, 158, 413, 139, 344, 39, -445, -408, 540, -264, -209, 343, 49, 104, -189, -194, 474, -278, 576, 139, 145, 365, 112, -37, 128, 293, -842, 573, -334, 460, 1, 597, -165, 261, 136, 69, -199, -323, 501, -166, -253, -464, -137, 444, 162, 49, -23, -834, 521, -556, 159, 140, -187, -50, 2, 207, -366, -6, 103, 52, -134, 321, 456, 419, -788, 167, 432, 17, -481, -195, 30, 496, -121, -521, -242, -396, -28, 87, 112, -305, 13, 716, -203, -43, -453, -87, -60, 310, -114, 374, 375, -601, 373, 185, -683, -388, -336, 403, -54, -474, -218, 442, -221, 497, -483, -495, -320, -216, -814, -618, 75, 68, -295, -333, 451, 180, 133, -295, -144, -312, -34, 443, -356, 384, 622, -47, -228, -504, 537, 342, 239, -252, -221, 505, 166, -394, -151, 98, 379, -173, -361, -19, 209, 125, 113, 697, 462, -15, -299, 609, -351, 608, 383, -416, 293, -10, -107, -162, 188, 27, -79]
5339g9K50k74J28j19J081l73j126R49k60M41p03j91N91j109P24j14O85j104R22
5358C19m28n26N91r7K89O03j95j89k14l35o11Q33J14j63L44o56N39l93P34l04
5378B55M24q70N53o04L34K96j035P41j22j49L97q41Q26n90O21n43l7J70k21O09
5398B14k45L47o2j015O04M61j016Q63k99k16L70L38J02r2j595J575j02N0n06N79
5418C55N2l16O26j041j53R97r40P09L61j110P36k38j46L37p68N36k85q0R35m68
5438I9J91m40Q35o56l75ql74L99P40j02O04k30j42p78P7N21j20m18M29q59Q03
5459A96q2J59r33P64J83m07L99p49N81j016j09J525j41l19m26K12O94r79L48N58
5479D58o32o14P37o24M71L10q18N72m2L07M11j263J195p5n16k4L16J90k67K00
$$ y = [-79, 171, -103, 25, -94, 987, 614, -512, 437, 177, 618, -85, -276, 315, -794, -70, -184, 501, -603, 319, -109, -635, -44, -141, 148, 751, 556, 367, 153, -182, -793, 40, 154, -9, 335, -321, 218, -175, 559, 255, 679, -191, 362, -242, 92, 388, -647, 94, -28, -177, 220, -621, 205, -385, 236, -307, -344, -174, -395, 214, -31, 316, 254, -761, -157, 304, -712, 151, -148, -364, 6, 344, 446, 354, -1241, 334, 232, 282, -224, 355, 407, 91, 717, -324, -477, 520, -420, 289, 650, -460, 276, 38, -108, 229, -539, -3, -288, -368, 567, 99, 290, -150, 685, 29, -346, -354, -728, -329, 411, 309, 913, 683, 541, -237, -160, 361, 241, -177, 252, -607, 196, 114, 273, -660, 104, 287, -120, 279, -470, 111, -905, -1014, 511, 370, 51, -375, -163, 531, -448, -100, 458, -174, -788, -51, -675, -204, 106, -712, -140, -182, 125, 536, -727, 468, 393, -123, -147, 169, 359, 92, 292]
5499B92L21m47l80N8J80m91J37K09Q25o26k67J81L7m58M90P4l0j3k78M23m49p6
5521b88J006p49N15R6j225J083l85K59l20j87J2L51l21%J28Q17q68l05Q00J06
5541E25o83o33J204r8m03O67m48k54O4Q94k81o12l22M56j01m37J060r44L5l42
5561f53O24j42Q68q08J22Pj88k09K56m69N12K60o2O5J58n40j63R20j370L39k09
5582f82N67j1L11O8m03M94q74k54r6K86K42K99M16K67q73L0J84O8p76Q03m87M00
5604b1o1J14L74N79j592J137j012L64K76o53N67k20j06O08j28J28j057J047r63
5623f19J079q91R61j28m18P7N31j274J156j76l62P33r54P51p24M62N20M2o12L34
5643D88j075P93M28p34O50K56j124P5K55M34k84K32m34M72l43P72q57j06J61j67
$$ y = [292, 613, 166, -214, -156, 24, -467, -330, -121, 704, 78, -189, -8, 29, -429, 61, 135, 105, 92, -186, 237, -212, -288, 718, -31, 484, 580, -645, 438, 53, 312, -8, -195, -183, 168, -153, -153, -25, 792, -76, -381, 419, 525, -158, -791, 413, 315, -88, 579, 131, -123, -59, 835, 554, -58, -380, 76, -25, -462, 598, -346, -311, -653, -29, -171, 697, -111, 11, 18, -170, -379, -123, -592, -80, 180, 118, 183, 341, -199, -362, 558, -812, -473, -682, -115, -126, 185, 253, -150, 344, -530, -784, -880, -594, -352, -53, 363, 630, -243, -213, -29, 39, -737, 66, -421, -21, -82, 32, 406, 985, -607, 530, -482, -118, 158, -495, 72, -148, -254, 354, 226, 354, -703, 344, -619, 460, -431, 530, 402, -16, 61, 592, -682, 474, 298, -64, 669, -285, 466, -258, 204, 724, 766, 154, 488, -587, 206, 634, -100, 550, 806, -318, -243, 12, 446, 162, 394, -40, 432, 89, 861, 4, -102, 59, -108]
5663a08L78o04K78J46q5N93Q0p92j46R08j98o50j97O26p54Q49j27r21Q32Q6M01
5684E95l87l05j006J032J4K75k81l14k32O71j26Q06n25L39l83J36o92J46J114
5703H77j296K88m71J50L27Qk1j88N36o39J049j52q58M30L14o19Q16p44J01k28
5723c20R87o12l71Q9k29n3l7Q19n57M21m07K86m25j27n58Q53P85o62J79J74N9
5744B94m54o42R96L62j88M37j505J461j073n61O13J96M95l29l12k74M05k81M22
5763F2n89L5O3J54L97K59n95N7N01Pj587P80L24K52m16J36M55K89q46K21K93J63
5785D15n60j96M62N84q06M18L70p48M56J1o48J25j96N81j24l88J28K10l12L83
5805A65M95n46P7l18j45P90L3k77k12K90n43L59n04L49L32l08j67P18p0j393J73
$$ y = [-108, 270, -334, -56, 90, 5, 598, 678, -114, -260, 648, 450, -200, -397, 229, -525, 324, 197, -724, 108, 194, 595, 208, -97, -1103, -71, -57, 218, -63, -377, -609, 62, -64, 742, 217, 556, 173, 309, -383, -237, 877, -419, -131, -602, -452, -125, -117, -138, -326, 210, -429, 620, 468, -390, 40, 354, -265, 551, -193, -92, -320, 667, 55, -316, -227, -456, -509, -546, 273, -284, 137, -270, 16, -409, -536, -1094, -241, 544, -118, 61, 235, 294, -160, -802, 194, 556, 368, 805, -700, 761, -312, -873, -260, -64, 431, 102, -210, -484, -79, -360, 62, -527, -492, -429, -275, 122, 381, -214, -157, 344, 351, -1236, -456, -132, 120, -296, -160, 295, 584, -262, -41, 252, 415, -145, -341, 121, 705, -101, 317, 687, -61, 395, 406, -242, -117, -313, 268, 144, -244, -116, 94, -218, 165, 660, 114, 191, -127, -272, 518, 551, 274, 62, 352, -191, 168, -336, 13, 345, 37, -130, 588, 518, -875, -702]
5826g02Q22k07L75p74m6P21kn01Q6R55j192Q53o23K17N71J66m63m23J84l13P11
5847D15O34p91m85k9J6P5m20P99m82K80M66J37k14l10K31p09N51p95J61J241p01
5868G0m18J096n58r28R21j7O3J07p0O01q24M89m80k34K6K98m30K54j19N7J27J91
5890B22n14Q24n52N22j026L60J31K22m60O15n07N37m30o65J004mk32K11m28l45
5910e15N45Q3p55R32n03K39J16K37k01m20M26L93n86K35LK76L73j196l16J27J099
5931E92J41m17k74K73J62l66k58Q3MN78j408J014k33L15k08q2M4K9L69m01K28
5952A85L44p84M65J18o30L2L38k35N06k69K31m24J82M5m21K16Q4J9K8M03j73o29
5974c69J17M56j96o0K27l19L52J08n38L54k59Q01p73P50l76l54L72j03J3o05L00
$$ y = [-702, 120, -87, 288, -486, -532, 189, 187, -314, -228, 727, -465, 388, -235, -18, 553, 719, 256, -167, 17, -296, 415, 1049, 258, -227, -256, -240, -165, -585, 214, -268, 12, 478, 615, 401, 91, 322, -387, 164, -631, -470, 771, 70, -348, 748, 190, -738, 183, 166, 229, 336, 266, 867, 43, 532, 52, -182, -156, 142, -288, -34, -153, -96, 31, 222, -292, 532, -20, 502, -524, -164, -33, 189, -271, 344, -163, 374, -56, -721, 283, 279, 47, 258, -170, -515, 30, 113, -642, 290, -213, 26, 142, 379, 178, -242, 184, 577, -9, 226, 229, 505, 878, -318, -634, -507, 592, 733, 316, 42, 315, 477, 111, -147, -64, -60, 518, -890, 124, -109, 206, -2, -84, -40, -11, 358, -43, 185, 529, -255, 210, 328, -302, -270, 68, -167, 339, 70, 301, -123, 59, 104, -317, -101, -17, 2, 30, 433, 260, -369, -252, 204, 8, -52, 175, -144, 208, 316, -222, 132, -127, 674, -99, 651, 275, -79, 293, 190, 203, -402, -102]
5995a02M35j08o3K85m10L70q80m90R92M74j35K81n62q03Q68L44n45R7n66P48j074
6016h44J112j82k09j85j01L51K37Kk04qj45k75J88o63L21J028k72j52R1j99K94
6037A85k79m37j9M48l13N10n18L81M01n37o44O77Q67l7r92J51j29K54o9J49J89
6058B38p04P02J9o40O67l66L72q42L35K77n94K81m53R19k84P55o15Q8j39N5l96
6079c25N52j016J251r81J329q97Q4O35m88O9j58o84N42K98o8L7k93L86j8j002
6099g47R17O2k58N00k77J67J83q36K14N35K94l85n13L55l5K56o73K83m69L78J01
6120E2O36j171Q31j330R51J17n45K52N14k19l39M47J73l89o65L78J58l14l7P75
6140B75l80L55M76o50o80R95q87j03N35Ol78R36j06p8l92M76K29j028L55Q12m20
$$ y = [-102, 333, 225, 162, 447, 37, 407, -473, -963, 29, 503, 368, 649, 87, -716, 152, 496, -49, 48, -518, 230, -844, 268, 86, -123, -308, -409, -58, 179, 181, -23, -31, -176, -451, -263, -926, -605, 423, 151, -1, 90, -109, 185, -94, -531, -550, -102, -415, 95, -423, -42, 359, -178, -822, -145, 722, 685, -307, -156, -285, -31, -100, 49, 238, -466, 236, 255, -385, 282, -84, 288, -554, -219, 58, -536, -255, -708, 211, -73, 682, 67, 155, 16, 71, -325, 227, -789, 462, -519, 810, -87, -3, 632, 144, 213, 55, -629, -87, 211, 143, 180, -113, 273, 255, -747, 170, 232, -26, 474, 197, 364, 547, -289, -75, 460, 754, 369, -144, 211, 176, 432, -241, 42, -427, -49, 52, 688, -483, 348, -982, -31, 86, -459, -207, 307, 88, -251, 196, 369, -20, -685, -307, -149, -463, -500, 275, -105, 250, 726, 76, -604, 391, -496, -599, -64, -58, -436, 500, 394, 316, -76, 400, 629, -399, -44, 768, 348]
6161C48m20M1k39O62n97J2P15m78M16r8l88N60j047N78L5m19M60k31O7M00m58
6182h1k15j66J52M53l55n12J262n04K46p66P54m50p7M05n39L90j82L92o9K14m21
6203f9R8k84L68l89M4J73M17l48J56N95n56N09k50r21Q40q10k78P44l71K00P1
6224f1L70j271J393p79M36J27k69J77j059J808l62n57o2J22N51k39j27J1n09O29
6244C29p59L96k01k43J210l73k95M50q99J016j248N88r89O49N2P57R9j161N36
6263h6J62q29J388j34o94j73k17M61M25l24q24M50P32o69L17L28m10M80k27L26
6283D82q56j92K88L31k30M53k14n38N03K2l35J14O86l29k40j94q83P53N72k04
6303a1K97n11j28J270j158p79O44Q15j04J6n16N31p49M8P07m11L06m42M62p47
$$ y = [348, -72, -31, -270, 392, -205, -193, 522, 44, 460, 362, -26, 534, -513, 65, 100, -319, 141, -90, -23, 377, -81, -296, -462, -310, 143, -212, -724, 538, 34, 280, -486, 268, -182, -259, 146, -393, -3, -185, 207, 138, 352, -69, 29, -255, 113, -276, -232, -59, 358, 10, 166, 761, 205, 714, 464, -457, 383, -427, -705, 39, -332, -132, -61, 309, -962, 431, -348, 88, 215, -54, 123, -936, 872, 510, -47, -109, 13, 564, 325, 198, 209, -300, 329, -430, -34, -235, -478, 732, 359, 64, 514, -385, 631, -617, -29, -1018, -369, -317, 440, 539, -622, -86, 76, -753, 635, 501, -193, -366, -583, -122, 303, -21, -845, -395, 337, -332, -15, 313, -97, 383, 156, 482, -374, -566, -278, 53, -177, 276, 62, -476, 27, 49, -286, -172, 514, 185, -55, -249, -1132, -379, 193, -11, 286, -225, -353, 917, -241, -1020, -376, 439, 335, 351, -165, 366, -383, -335, 372, -39, 267, -175, 287, -460]
6323d60N68m27j65R00l14k00M9M9L18o11J1M97n44M91p45J401o13K9M5m8M11m20
6345B22j3q18P04l77K70K12m80M31m3J91K65p41j54M87L11j41J21p61r2R64n5
6366E03p6o27m09Q87n1m51N96n10m01k79O56J32J53l51p61J806n78O50n39j294
6386i44J026J1J51K03j53p97O34M1k36L22p43M16M4L04k29l36L70n48K8O2M46
6407G2k21J5M11P6Q9J05m76k37o8K85M14l60r03N74K32O04l29o82M86N22n9L49
6429H99j276J45N82n27M88m59O35j309p0J645k15q18R9P07J97j462O87lL67l58
6449d6j61N32o67M28k86Q10r94O80p59J318m21M9j300O78J67N77n69P5J54l72
6469a07N89p63j04P63Q09j338p0k89M50K53J73q10J251j381J126J42r10M05r7
$$ y = [-460, 108, -319, -484, 416, 102, -98, -49, 0, 318, -293, -282, 215, -329, 162, -583, 818, 205, 234, 279, 231, 642, 222, 209, -609, 95, -282, -12, 200, -280, 151, 108, 299, 564, -177, -331, 156, 467, 326, 447, -314, -406, 558, 503, 427, -200, -609, 278, 227, -224, 372, -138, -539, -818, -162, -30, 123, -228, -989, 817, 239, 889, 350, -944, 82, 93, 244, 447, 294, -503, 131, 172, -64, 258, -485, -69, -25, 279, 50, -286, 84, -464, -436, -374, 72, -149, -134, 277, 353, 442, 547, 71, -166, -234, 51, 465, 105, -798, -224, 8, 612, 283, -399, 87, 609, 550, 899, -377, -232, 350, -177, 311, -148, 487, -822, -892, 753, 538, -280, -181, 526, 723, -739, -52, -55, 312, -46, -207, 325, -342, 86, -200, 610, -384, 296, -463, 855, 434, 483, -817, -139, 28, 605, 36, 111, 265, -107, 482, -281, -385, 378, 1187, -151, -221, -510, -60, 193, 366, -444, 807, -574, 552, 694, -216, 189, 92]
6488I2j21O5l71r6P94p20O97K48j030M51N85J34o44j76K70k45k79l00M97j97L40
6509fL0k06Q1N03o74L40j54J69r30J520j249P53m67K8Q14n02M11j017K84p25J176
6530A79l26K52L32q2J37k19j68K7j82k07m48J229p10P3L65k22n1j34J84o06K98
6551b79K17p06J80M33LJ84K84o70L72K31r4l31M59K44j168M15O57L17K47k118
6571a123J210N18r08Q66o78j6j40M96K75p21l52Q45K05m06j82N44n92J34M97p53
6591b81L38k04J3L74L55j070Q40r10N94m49O92j53n57J37K23p01O92r2R0m59J080
6612E52n00n18M75P6J84j7L45o77L75n46J10l01N18n46P6L40l21L03M97k72K70
6633D23p73L75k58l1m22K60r8K62Q61m88M77o05j44L69J2k8j30L47l80J99o72
$$ y = [92, -29, 36, -335, -431, 363, -357, 340, 588, -442, 9, 594, 728, 84, -92, 178, -67, -346, -646, -149, -346, -6, 24, -182, -101, 402, -272, 68, -86, 83, -847, 673, -576, 177, -290, -262, 552, 50, 461, -556, -272, -997, 179, -147, 105, 437, 355, 492, 273, 105, 132, -50, -257, -705, 524, -186, -113, 252, 30, -21, -155, 29, -577, -279, -62, -768, -588, -155, -152, 32, 316, -354, 18, 249, 155, -176, 283, 527, -641, -226, 431, 748, 995, -1123, 87, 605, -303, 563, -115, -131, -271, 225, 500, -221, -573, 272, 477, 71, -111, 433, -159, -25, 472, -281, 57, -147, -134, 240, 595, -475, 365, -545, 49, -400, 292, 139, -418, -281, -58, -759, -67, -159, -69, -528, 552, 52, -466, 9, 85, 269, 252, 597, -80, 295, -251, -141, -442, 76, -470, -394, -54, -375, -72, 425, 153, 423, -350, 25, -233, -264, -686, -426, -524, -262, 599, 111, 588, -17, -161, 208, 220, 192, 62, 409, 29, 228, -444]
6654d44Q54O5l28q85J415n7o22r40J090J14l1r87O10K27M41o40O5K12j77P43m37
6675B88q03P27j55m56L87K75m99J037j100N29p37O80N96j623J115j68J82O5k47
6694I3n58K38O9L78q05M58n28J451m51Q1L0j054J93J060m66k06k59j41R77o90
6714a30P00j10n79Q62r66O52M23k54p02P4P2j62J137r51o94M25L50n59M30L53
6734C71n81J44N14j34j08J7K25l31l36L4j04O64L05q20N5N4Q40j162K68l21l7
6755d43N72k59M98l56J033p04p92K60K19n68n39R32P1O6jk73O85p13K16L01P7
6776B82k41l7N18J02n95Qm72N14n30M37O18p81L62M17m19O2l64O58j059m84R71
6797c3M36l57r03R80L99q14J23J85k90K43J24L19l10l85R0k29J028O6m90j46J1
$$ y = [-444, 410, 475, 147, -738, 677, 620, -2, -942, 148, 262, 231, -756, -146, 81, 522, -118, -53, 159, -18, 725, 288, -515, 212, 57, -399, -12, 263, -236, 801, -299, 230, -507, 173, 769, -854, 261, 93, 275, 340, 93, -465, -227, -158, 220, -585, -127, -655, 796, 345, 426, 456, -598, -405, 655, 189, -17, -276, -417, 560, -130, 570, 460, -119, 743, -223, 429, 852, 598, -104, -30, 42, -120, 1017, 66, -628, -203, 147, -412, 18, 371, -210, -66, 448, 314, 206, 223, 448, 117, -219, -185, -289, 375, 680, -140, -85, -31, 809, -353, -85, -406, -443, 129, -130, 368, 12, 1045, 341, -451, -191, 28, -540, -1079, -147, -76, -10, -11, -284, 401, -312, -96, 205, 282, 41, 4, 522, 624, 29, 37, -435, 79, -451, -14, 604, -177, 185, 602, 183, 245, -119, 539, -520, -1004, -33, 403, 46, -857, 123, 522, -292, -169, 16, -274, -31, 93, 412, 102, -283, -193, -422, 606, 672, 182, 36, 47]
6818D7k87M65l69M84J23p70P14K89m06K8K50k02j122M07L62m2M39o37J45N02j026
6839f06Q36o63P74p7mm72j98J370j255M79o27j27Q76m92j16q7J29P58n74M82m69
6860f3L07r06J013l50k88j21j24K08m79J27O96l44R31o76M66n81q3O90n58K70
6880A35l4M27l71n94J29K03l76O2K38M63p7L78j222J507q95n67R91l61J98l7o20
6901d23M9P85q34N95L2j04K06K39k27K26J08j020N94n70M76J05n9j67Q99q50l94
6922c34O91N9l2m52Rm8Q6n20j4L13j07K61q9K02k45j64j87O5J201j082R3M28j59
6945b5K91p74P99o65J34J068l42m23o73R14q3j85k62m58J037m92K39m8r78J033
6965A07j99j37P17m15l61M62p25J312k24o63K89j16k9j10K76q63M50M9O90k48
$$ y = [47, -240, 225, -144, 340, 463, -307, 407, 696, 290, 318, 568, 366, -756, -349, 13, -29, 410, -227, -82, 420, -606, 230, -433, 341, 264, 260, -212, -410, 960, -295, 184, -443, -570, 306, -186, -302, -389, -260, 498, -76, 406, -63, 244, -662, 351, 1, -287, -408, -532, -324, -803, -676, 20, -324, 607, -69, 397, -184, -267, 423, -135, 135, 101, 528, 157, -437, -308, -105, -481, -419, -181, 282, 205, 583, -639, 868, -27, -594, 397, 36, 234, 197, -423, -374, 411, -423, 172, 204, 100, 306, 545, 318, 544, 652, -368, 226, -344, 132, 237, 178, 11, 910, 60, -334, 357, 416, 384, -68, -59, -107, -21, -541, -555, -242, -349, -88, -177, 25, -220, -384, -571, -506, 695, -387, -294, 134, -25, 266, -508, 291, -374, -240, 828, 486, 63, -610, 304, 221, 36, -226, -684, 353, -139, 100, 52, -926, 107, -92, -229, 488, 73, -288, 174, -551, 761, 537, -126, 163, 47, 18, -92, 184, -679, -229, -180, 510, 262]
6985B62L89n88O49r12J38m6Q68m10P6l44L32n62P22l1l2k8m09N78o92k88L92L75
7007D39k66o6k74M11M5J00l49j32P20k40l71O4J44j91M22M53p84L69k98j94l82
7028c80J156j563P24m26M40o24L76K20k95O47l81J97N20l85l0O87j128R3l92K39
7048c05N51l76N14n01j07K47l83O11k23j42j26N62k46o28J152q44O36k60o02J08
7068c62N15M3J23J07J4m60k68L66R7o7L40k9j386P16M60J36o19N14OJ38m98l55
7090d69O24l50O9M98j86K09o9p18L75l03J83j63J70P35n14o46M35J29k9j54J7
7111a57k93Q52q00J211o64k52r1K48p66L22M40m9m66M54K91r5l80K25r07J400
7131E23k45n04K97l76J39j71k38R66n60Q24n0q35N26m53l9K55k3J25r4n43R51
$$ y = [262, 651, 63, 712, -200, -62, -108, 760, 350, 426, 82, 414, -148, 574, 543, 511, 483, 74, 652, -40, -328, 64, 439, 173, 107, -167, 244, 289, 389, 40, -92, 628, 388, 17, 81, 225, 34, 456, 909, 125, 494, 196, 2, -380, 776, -787, -63, -489, -49, -673, -297, -77, -372, 275, -106, 91, 611, 226, 196, 883, -245, -152, -544, -305, 246, -130, 384, -117, -224, 23, -360, 251, 28, -114, -240, 322, 76, -552, 600, -244, 392, 132, -470, -362, 153, 196, 319, 426, 440, -20, -288, 78, 175, 108, 448, 419, -967, -251, 209, 345, -274, 240, 246, 384, -114, -469, 155, -195, -126, 372, 186, 395, 326, -392, -17, -320, -137, -300, -130, 605, 91, -555, -120, 9, -20, -174, -157, -450, 402, -398, 813, 149, -103, -194, 54, -712, -390, 50, 1, -465, -11, 280, 185, -195, 30, -877, 523, 278, -226, 71, -305, -166, -337, -575, 391, -169, 655, 605, -230, 296, -157, -196, 59, 36, 161, 67, -476, 475]
7152D75Q5p0k59J18p34O8M44K75n64P38m72K42Q1l42L38j20m17l91O34m59K97
7173c3K79n28K8N53k05L44k61p5K29m00j32K0K26l1k4j92J09j75N97j27k97l68
7195d63Q73n79P47j395P50j66J75J52OJ22L9j046K12Q24L9j047O43L92j66Q78
7215I90r75j90J115l25r8N97j031o11P61k3m54m2R9O56p13O49o81R5L28m47P30
7236D30k91N83l72o58R67n30J79m47K81r51J243K37m82KL17n72j07K44n8k52n69
7257h06M78L70L33k37L45p47N36p0J12Q2m72lj24J40k56M2k81J220o33l57j49
7278d77N28J50r3j1L6l27P21k53L43j079R03r87N09r1J87K47m40m10M75L42o56
7299c83K97L29l36K17Qr3k82N95j24q0p53N02o6q68J337n46P26k86k37M1n33Q60
$$ y = [475, 560, 490, 231, 349, -385, -317, 127, 402, -162, 576, 104, 346, 427, 85, 423, 303, -114, -505, 129, -330, -33, 246, -282, -254, 299, 94, 438, 177, 102, 331, -69, -201, -181, 45, 14, -10, -202, -93, -268, 329, 202, -95, -463, 410, -169, 578, -817, -67, -233, -58, 94, 100, 222, 261, -785, -573, 251, 290, -757, -114, 278, 112, 990, 15, -175, 940, 615, 517, 1114, 83, -528, 233, 210, -244, -286, -187, 469, -244, 405, -276, -181, 147, -300, 430, 139, 722, 350, -308, 659, 129, 308, -139, 142, -809, 434, 671, 189, 191, 508, -64, -171, 73, 15, -237, -806, -328, 42, 375, 138, 483, -264, 272, 202, 314, 396, -76, -79, -203, -63, -319, -277, -558, 662, 29, -328, -477, 51, 201, 108, 97, 133, -194, 527, 274, 617, -462, 441, -546, -37, -128, 59, 306, -134, -544, -69, 273, -383, -86, 243, -93, 124, 132, 39, -243, 352, 228, 148, -605, -103, -169, -1037, 300, -246, 480, 194, -43, -2, -535, 325]
7321C25j96J04m18K72l10l31M23J71l38j3J08L51jj82L20j01k38p5j70N06m0K41
7343D08r41J0M42K67J65l54j99N5o7M10j2K53o06J58n17L52N0K30l67O21n48N67
7365C77L26n09k97J91J15o64k49M54O87m90n30L17o95K28R19J06o87J56J68l98
7385d75K33n36L55K39R9j68j0Q12p03N3N49p83J52O87O89j587K25O94J09j183
7405e49N57J66p44P36k54o8J28P78l90j11n16L87N2J027j113J1J05l28O7k89n3
7426d01J52j11O3M7N75o18L61mo08N47l25o6M89o88Q50l78J27o92P63m64K54K20
7448I3J45j81K63q2k43r6ll34Q68n36K52P36j135L35o20M59J63L89o91j46N96
7469B32J83J77l93O21o52q1K25k74Q7j22j23l94J131L2r53N70m91L99j99JP2l64
$$ y = [325, 129, 233, -185, 87, -223, -554, -131, 40, -298, -311, -203, 148, 147, -35, 285, 184, -54, -129, -299, 207, 167, 408, -533, -523, -81, 186, 351, -3, -202, -147, -214, 196, 184, 437, -169, -11, -528, -176, -126, 104, -263, 358, -190, 377, 703, 194, -103, 88, 203, -461, -710, -256, 431, -59, -589, -272, -967, -739, 180, 286, -401, -245, -77, -475, -242, -778, -423, -184, -85, -253, -263, 549, -154, -101, 448, -335, -183, 504, 1193, -394, -169, 525, 634, -549, 8, 174, -570, 166, -88, -156, -28, 750, 360, 249, -267, 120, 172, 1199, 86, 97, 202, -126, -59, -348, -401, -249, -360, -297, -250, 325, -293, 68, 64, -544, 3, -322, -388, 101, -587, 263, -115, 12, -680, 83, -381, -127, 93, 238, 57, 320, 238, -5, -101, -104, -438, 430, -106, 146, 882, -253, 82, -538, -79, 84, 473, -218, -364, 232, 415, 592, 199, 820, 168, 87, 312, 38, 125, 3, -120, -514, 617, 649, -304, 266, -225, 174, -25, -24, 48, -316]
7491c16O80o95P24l77r9q94J153p50J056J37m71m60N6Q43k02j28M10j148L74j39
7511b46K27RP93j027k50M22L86m42q12J410o28J73M18m39j16N42j178J017k07
7530E2n25k00Q86J97q6n92M97r13P74l14J76m02k10O09J52J27q8o70N75M97m50
7551I2M28r37M3K17Q64q67k98R39k62J74m86M27P5j273N12Q8N2k84N41o0j3J062
7573A034m35n61Q2r02o4J120j12K05j098K48L25m67K97P86k44n28P09R9J08l45
7593B57p46%M26J64j50j59J002p47K3J67l63N66l79L70k09j67l79M52k57j21O18
7614C68q43j72N34K15J64k9j79J88l65J35m5J29r08J404j204Q79m34P99p02K2
7634d4K15M44q97N49m56J043o65q76N89K54m1k62M3k09L19p4J73p40J385o13K15
$$ y = [-316, 364, -331, 393, 16, -83, -977, 176, -574, 482, 619, 148, -312, -256, 587, 385, 257, 667, -481, -107, -246, -19, -10, 783, -244, -494, -72, 314, -128, -940, 470, -158, 15, 433, -6, -122, 420, -758, 259, 52, -473, -673, 213, 410, 324, -268, 229, -684, 90, -224, -48, -450, -660, -51, 101, 228, 140, -530, 45, 542, 92, 520, -417, -374, -157, 707, -160, -458, 481, 219, 393, -93, 334, 409, -864, -352, -264, -212, -496, 45, -15, -28, 1034, 599, 38, 120, -782, -846, 274, 162, 367, -731, -483, -158, -625, -328, 458, 214, -314, 395, 494, 602, 257, -489, -489, -63, 101, -49, -208, 794, 47, 70, 237, -126, 440, 61, 431, 222, 55, -324, 128, -129, -250, 368, -475, -647, -113, 102, 266, 237, 58, 246, -119, 16, -29, 100, -808, 596, -608, 271, -163, 636, -66, -44, 171, 615, -282, 267, -189, 854, 189, -687, -98, 156, 115, -147, -104, -313, 6, -68, 105, -635, 750, 137, 352]
7655C52m65O11p70N79j04j95m52O07n62m7N13P05r50P29j089J02P58m53N16M19
7675H04j413K79j19O43L20p37M89l07Jm26J104j017L83K45K23q34L22j74M15L53
7695E54l77p32J325p37L1l07N67j32l97O45p49M43J71n44N15pj00o7L98J7m59
7716E8p54R76l94J174j202n27K64J37N22L89k94j143K41P69N90j215j3P45l23
7735@K63P7q36K44Q55n12o10N40P5J25k8j81p79J066p65j66P82l86M07n5J72j456
7757a168J211M03k97K90j81q09J049j12O06j327n9L30K64om94Qq2N29L0n03p3
7778c91P08m42J71R8m98P47j136Q99k8n10r5J95K56O24m25j67k71O13k48J00m81
7799b81j2N39j7o35J04m11O15K23j05%N1K6Q70j130L64j73N8k88q9M20l29P10
$$ y = [352, -113, 498, -272, 307, 203, 8, -444, 163, -399, -446, 67, 772, -178, 551, -538, -436, 322, -131, 385, 804, -609, -330, -449, 194, 514, -223, 266, -41, -40, -466, 638, -379, 4, 249, 472, -362, -40, -214, 201, 554, 177, -555, 770, 33, 64, -243, 324, 192, -205, 440, -309, 134, 305, -239, 276, 269, 169, 102, 500, 517, 58, -696, 280, -114, 1060, -142, -669, -405, -268, 254, 643, 349, -794, -553, 216, 806, -409, -422, 323, 0, 263, 340, -496, -252, 603, 91, -519, 21, 96, 221, 193, 12, -767, 299, -466, -632, 150, -236, 171, 116, 288, -1168, 43, 446, 149, 439, 258, -551, 498, 386, 992, -335, -394, -64, 200, 194, -300, -292, -374, 155, 185, -318, -391, 317, -125, 46, 144, -354, 393, -743, 156, 128, -382, -477, -282, -26, 598, 173, 6, -265, 348, 100, 200, -281, -293, 246, 229, -406, -302, -713, -98, 125, 20, 20, 71, 97, 967, -163, 201, 28, 86, -202, -291, 129, -200, 510]
7821E10j028Q31j25k33m8K80m15P64m85k24J1R56j249R76l90l95Q2k52P19j329
7841a044J304m97L03m7K76j86j65J8o51O13M20k49O07p73M79l34P8K68O37j585
7861e28l4O93J64M5n72M20m70P12k41l82M33k07k79M14r3J25j0o54R39m20N6L83
7883D94j211J168o47l58K58K65n0J04J66K96L31l18r53J85Q52k90j037O19L74
7902B48J49J51n03q76Q94L94rn32J23l50K0j29J93L91p08M22l24Q77p01N38Q5
7923C53l49J27L50n65M07k42j68K19n14j49L81K14k05R22j138K66P64q45Q88n47
7943A69m32K62P04j115O50k85K17n44P08r4k79j34K74l37l32P81n14M12k78o56
7963h23J033l43K53l04n5Jj35M89O01r90l0L14R7J94j244J026J009j531M76n43
$$ y = [510, -518, 313, 188, -45, -93, 187, -228, 536, 51, -173, -162, 794, -455, 521, 131, -264, -182, -434, 285, -1044, 260, -237, 66, 19, 295, 109, -56, -38, -689, -76, 344, 95, 702, -71, 408, 74, 152, 420, 1057, -528, -562, 131, 295, 340, -232, 188, -282, 430, 189, -193, 240, 33, -246, 168, 75, 200, 190, -464, 475, 55, 111, 494, -717, 451, -196, -554, -296, -31, -81, 23, 189, 485, 816, 498, -455, -270, 582, 292, -745, -126, 248, 397, 548, 45, -831, 63, 457, 448, -84, 39, -311, -291, -420, -227, 164, -544, -122, -446, 431, -270, 268, 353, 4, 131, 481, -84, 323, 81, -87, 132, -382, -531, -150, 64, -141, 781, -357, -91, 673, -172, 716, 169, -263, -1, 703, -412, 238, -47, 170, -374, 334, 240, -39, -173, 101, -236, -568, 213, -301, 111, -167, -823, 210, -133, 120, -184, -239, -238, -373, 116, 717, -273, -303, 11, 108, 302, -942, 84, 1093, -438, 38, -505]
7983e05L16k13P33q17J33M31RM1L89j2J41l43Kl93P37p39P36p25l91O53m74L69
8005G8l48M63l69k51k7n3L30j81o04O26N10P5o85K52o8N16q88M17M66pp6K43n89
8028a70J27J02j197Q89K57m16N63p13Q43k94N6J5r1n26M41l65M59j36P2j82O58
8049C92l6j052Q2n5K23J064m09N1N2l11k69j03k50N71m44J30L84l96P85km82J72
8071I7m91P74r23M03j64L30j82J12J88n09O08j02k65o25K70J13R21l41oJ46n4
8092C00l18J13L87q94J91j82N64l92K07l89O1j08n2J152q86j87L29L0R98j344
8112d20Q11J76j184P76m76J031n09J21j197J009j40j59k58M68J4M86j315J059
8130B93r51P10q9J22l53O88m42J11j77o0J280j064n88J044k85o15O30m76n32J028
$$ y = [-505, -189, -402, 331, -486, -353, 78, 87, 128, 517, 505, 646, 303, 305, -88, 649, -90, 646, -79, -470, 183, -291, 78, -270, 193, -176, -427, -454, -507, -177, -358, -962, -336, 174, 249, -436, -184, -252, 264, -624, -207, 259, 252, 176, 419, -170, -43, 59, -1138, -249, 8, -408, 155, -558, 285, -9, 47, 62, -29, -555, -114, -479, -20, -156, -84, -266, 392, 356, -696, -614, -669, -446, 618, 209, 260, 312, 1, -268, -371, -621, -50, -494, -364, 20, -376, 409, 407, -75, 97, -394, 380, -543, -140, -304, 26, -156, -44, 144, -365, 243, 141, -124, -749, -479, -366, 555, 214, 208, 354, 300, -18, 95, 482, -412, -221, -403, 161, -231, -24, -413, -352, -460, -512, 640, -246, -433, -104, -74, 924, -420, 391, 567, -617, 159, -317, 714, 205, 326, -871, 138, -2, -161, -419, 49, 63, 549, -766, 293, -658, 52, -37, 85, -268, 420, -22, 89, -88, -148, 1132, 68, -520, 524, 239, -376, 254, -222, -754, 274]
8150B74k72q33Q46K85m9K40o86L35k45n16L90J30N63p14L72n36Q51k94j7l3n01
8171d10K89J06p3O0j81K47O74j278N07k7k5l19K12P2M59J71n91Op39J099
$$ y = [274, 2, -831, 15, 300, 251, 491, -195, 140, -105, -621, -231, -101, 462, -252, 120, -416, 435, 141, 124, 91, -410, -121, -15, -88, -28, -209, 38, 712, -566, -59, -86, -111, -430, -218, -146, 313, 484, -107, -101, -840, 259]
8191B59
$$ Imaginary data points
##PAGE= N=2
##DATA TABLE= (X++(I..I)), XYDATA
0@%%%%%%%%%%%%%%%%%L2j33K09k16K16k16K17k48L30m07M34m67N48o33O99p85
33d20Q82r86J100j220J360j510J674j863K064k279K530k793L098l445L821m261
49b248M771n367O076o935Q004r373J1211j3819J7835k4926M1158j32068q9254
62a94935J79809M1878j379r9812q8558p8431j3690L917K4712J413J635l957K5383
75b02015M6345O5501L7934j1663p7157j04553q5879j2972N1909Q2182N1175k153
87a61346m2228l0199J1542M9871M2711J379m8550o7190m6066j014L2633M1730
99b16727K3537k537j8179j6042K024K8437M7200M4115J3068l8260q0826q4066
111b98256m3687K3165P5256Q6935N4298N312k4297k5687n824Q418K261k1924m6043
$$ y = [0, 0, 0, 0, 0, 0, 0, 0, 0, 0, 0, 0, 0, 0, 0, 0, 0, 0, 32, -101, 108, -108, 108, -108, 109, -139, 191, -216, 218, -249, 299, -334, 365, -420, 462, -524, 576, -644, 716, -794, 880, -983, 1081, -1198, 1332, -1461, 1637, -1808, 2013, -2248, 2523, -2844, 3232, -3703, 4301, -5072, 6139, -7680, 10155, -14771, 26387, -105681, -194935, -15126, 26752, 25373, -74439, -162997, -241428, -255118, -251201, -226489, -225076, -223441, -227398, -202015, -155670, -90169, -52235, -63898, -141055, -245608, -331487, -344459, -292550, -210368, -159193, -161346, -203574, -233773, -222231, -172360, -129649, -128270, -176820, -244010, -290076, -291090, -258457, -216727, -193190, -195727, -213906, -229948, -227924, -199487, -152287, -108172, -95104, -133364, -214190, -298256, -341943, -318778, -243522, -156587, -102289, -96977, -121274, -146961, -152785, -144367, -142106, -164030, -210073]
124b10073m8843k4024J8850O2532Q7187P8346L7017j9928o7451p9398n3602r424
136b28811K4263K8544J1911K97J0482M2568O4347N4033N487n3892q7771p3289
148b01831k4284L0734O1141N7823L0241p10j7745j7125j237J6036K4327J2293
160c0337j3811l8407m5078k0894J8145N2688N5495K7396j3945l6503k7372M203
172f8420L4182L5329J1740k5425m8049m3350j4853K2621M5846N1072L6692Q160
184D5545j4297k4575j8981n664N80r052k4043l1710j6366K4119O3258P8131N4053
197A20998J161n0118p2133n8109j9631J3565K7914K2753J0775N975J2073K3395
209C8618L0820K2441l113l3471n6261n6884k9901J4223N0940O4603M4613P164
$$ y = [-210073, -258916, -282940, -264090, -201558, -114371, -36025, 992, -18936, -86387, -165785, -219387, -228811, -204548, -176004, -164093, -163796, -153314, -110746, -46399, 7634, 13121, -40771, -128542, -201831, -226115, -195381, -134240, -76417, -46176, -46886, -64631, -81756, -82993, -66957, -42630, -30337, -44148, -82555, -127633, -148527, -130382, -77694, -22199, 5197, -8748, -45251, -72623, -68420, -34238, 1091, 12831, -12594, -60643, -103993, -118846, -96225, -50379, 693, 37385, 45545, 31248, 6673, -12308, -17972, -17392, -26444, -50487, -82197, -98563, -74444, -11186, 66945, 120998, 122159, 72041, -92, -58201, -77832, -64267, -36353, -13600, -2825, 3150, 15223, 38618, 69438, 91879, 88766, 55295, -966, -57850, -87751, -73528, -22588, 42015, 86628, 93792]
221I3792k6285l5988k0450L656J7951R966j1884k7577k5410m226K2586L8606L3706
234F8443J1287j3564k8248k3606m921J4929K1689J1932j3689l2086l3981j1120
246c2935K2275M5072M2929J9893j1430l1462k9270j2536M771Q769l532j7715k1633
259a6804p574K0455M3471N0284L3326m124m1443n8597n2952k2683J2251L5263
271i127L6247K2783L271l059J367J0635J0889m811k7947m4855m1619j6169K1395
284d1000M7265N1421L1016L03k5594l3264k3215m576Q986P271l303j6171j4988
297a5849j849K0640L4272K8202O891j8596l5174l0916q567J5152K5197J5430m744
310C0089k3553k4649p609J5066L2637K9643J3321j2046k8368k9536j5804J837
$$ y = [93792, 67507, 31519, 11069, 14725, 32676, 42642, 30758, 3181, -22229, -26455, -3869, 34737, 68443, 79730, 66166, 37918, 14312, 9391, 24320, 46009, 57941, 44252, 12166, -21815, -32935, -10660, 34412, 77341, 97234, 85804, 54342, 25072, 12536, 17307, 26076, 22544, 4829, -16804, -24378, -3923, 39548, 89832, 123158, 119034, 77591, 18994, -33958, -56641, -44390, -9127, 27120, 49903, 53174, 50115, 51482, 62117, 73006, 68195, 40248, -4607, -46226, -62395, -41000, 6265, 57686, 88702, 89005, 63411, 30147, 6932, 2356, 11342, 18613, 15310, -861, -15849, -17698, 2942, 37214, 65416, 72307, 53711, 18537, -12379, -20946, -5794, 19403, 34833, 30089, 6536, -18113, -25722, -10656, 21981, 51624, 64945, 52899, 24531, -5005, -20809, -18972]
322a8972J2785R659j246j0598o916Q552K7052L3338K0481o540l6093n0388l9343
335e8229j1720J7618L6767L5755J8630R04q592o171N28J790p346k1211l0775k7748
349e9800n882K1583M3062M5414K5604m562k9753l7397k6215o335Q844J3228L873
362h336n417o790K194J6485K4529J9784R21j9655l3229k7349r247J2089K4747
375i274K0429N903j3644j8238q960O995K1903K1099P609j1838k6474k4513j0478
388c9481O623J6957J4920L328p427o423K053J6653K1081J2076r356k9449l8386
401c6831k6616l365K2946L5157L3477J3942m268j5276j4026o520m02l393j3034
414a8209j9736j4181R5K2215L8085L5328J6283r267l0604l7563k5521n858J1292
$$ y = [-18972, -6187, 3472, 2226, -8372, -15288, -6736, 20316, 53654, 74135, 67595, 31502, -18886, -58229, -69949, -52331, -15564, 20191, 38821, 39725, 31133, 24962, 25490, 27280, 19934, -1277, -32052, -59800, -65682, -44099, -1037, 44377, 69981, 65419, 35666, -1731, -27946, -34281, -25437, -12209, -8336, -13753, -20543, -18349, -1864, 22665, 42449, 43370, 23715, -9514, -36863, -46110, -34021, -9274, 11155, 17058, 3414, -14824, -23784, -16789, 5114, 26213, 33822, 21984, -4490, -29003, -39481, -32858, -15901, -981, 2347, -5080, -11503, -9450, 7203, 28284, 40360, 31004, 1555, -36831, -63447, -66812, -43866, -8709, 24768, 38710, 34442, 19166, 5140, -1380, -1782, -5175, -18209, -37945, -52126, -52031, -29816, 8269, 43597, 59880, 50613, 20009, -17554, -43075, -48933, -37641]
427c7641J7924J2337L886k713K002J0598J6084J0307l959k0623k9574k3657n716
440e0745J5863K6806K2480R214q950j6276j1748J491J2869J4255M109j2105k0108
453a2845j7899o099J1093K0646J6287M093o680j1999k524P712J2864Q127o315
466A6461k0705k8888j6590K035K1724L3239K6500R162q213j9955j7527r165j217
479a3139Q73m916p953p107L940J8257L0437K5874Q656j3495l0568l4418k1933
492d5492k104J3868K3099J6857O304m90j264J900Q524L979o303j8896k3553j8521
506d2092J48J6894K8045K2382R354j0067j6975j4684m440Q156J0581M209o486
519E025j5493j2210j619J1812J8760J5105K624r118j3559q103K138R245Q595k842
$$ y = [-37641, -19717, -7380, -3494, -6207, -4205, 6393, 22477, 32784, 28825, 8202, -21372, -45029, -50745, -34882, -8076, 14404, 23618, 14668, -1608, -13356, -11865, 1004, 15259, 19368, 7263, -12845, -30744, -36843, -25750, -5104, 11183, 15276, 8596, -3403, -5927, 1785, 14649, 22776, 16461, -4244, -33132, -49722, -47687, -25963, 7276, 33776, 42938, 34725, 14770, -2757, -11922, -13139, -12266, -17182, -25135, -32242, -28302, -10045, 20392, 46266, 54922, 41427, 10859, -23559, -45492, -47596, -33728, -10629, 6228, 12532, 12042, 10778, 12678, 21202, 25181, 18878, -18, -23571, -42092, -41944, -25050, 2995, 25377, 34731, 24664, 7689, -6995, -11435, -3279, 7302, 11511, 5025, -10468, -22678, -24297, -12485, 6275, 21380, 24004, 14886, 1327, -6776, -4638, 4607, 13202, 10360]
533A0360j3950j8448j1238L347K0200K6518J9741M787j2634j9954j8514r692J629
546a7848M610K823k099k862M868J4653J9639J8118L095j5179k8406l0112j6153
559d4853J067J7127K4806J9280O980l252n153k695K62N15o821j4701j7518j1450
573c6406L242J8376K4983K1137O708r598j9085j7861p091N207Q104O661l245r219
587h087o861R18J1228J4962J1619j37j0244j4916r773k59P478Q744K040p177j1885
602a2350p636L624J4420K0029J3625J82j2665j9238j7504o635L870P992O870K576
616b840q65L294Q811J3078J0768r15j4626k4570k3319j2137N100J9942K4029J8657
630B4407M666m151j0550p074k748j660n521j0568j1669o803O230J8069K3549J7191
$$ y = [10360, -3590, -22038, -33276, -29929, -9729, 16789, 36530, 41317, 28683, 8729, -9785, -19477, -17848, -13238, -10415, -12514, -15376, -10508, 4145, 23784, 41902, 44997, 29818, 1412, -28700, -44853, -43786, -26659, -1853, 17427, 24407, 21155, 16002, 13307, 13569, 14084, 7263, -7438, -24956, -36406, -33164, -14788, 10195, 31332, 38040, 28442, 9357, -8504, -15595, -10388, -2284, 4377, 1132, -8087, -14948, -14030, -2802, 12160, 23779, 23642, 13398, -1518, -11291, -11550, -4072, 4672, 6712, -465, -12350, -19986, -16362, -1942, 18087, 31712, 31894, 19229, -9, -17513, -24148, -20278, -12286, -5416, -2840, -3705, -411, 8400, 21478, 32246, 31331, 16705, -7865, -31184, -43321, -38221, -18279, 5750, 24407, 29073, 24922, 14372, 7298, 4550, 2890, -2631, -13199, -24868, -31671, -25441, -7372, 16177, 33368]
644C3368L425j0499k0466j7944q731K321J0000P826J077m044l621P38Q869J2263
658A4582P721l438j0371j4927j0241k85Q646R854N132l705q128o579J525J0783
672E69J4836R063m85j3018j9169j3066l546O137J1333Q875L842q94o11M480P233
687A5579O688k133j3101j9406j8627o958P132K0490K3309J3905L334p761j2702
700I749r696m560j330k415n434o679j810N375J5823J9419J3683J120j2658k0149
714D38j7899p078L152J0672J0299L464j809k299J82N280Q244M631l807j0414j4575
729a1519q855J883Q424J1425P573l75p137o231r72O196J0314O598j639j1355j6104
744a1774r592j768R538J2056R972L248l263k980j347M333L377p53r582j5375j2625
$$ y = [33368, 36793, 26294, 5828, -12116, -20847, -18526, -8526, -700, 377, -3667, -7288, -6550, 2319, 14582, 22303, 18865, 8494, -6433, -16674, -16959, -8313, 1541, 6673, 2968, -5160, -11739, -10214, 569, 15405, 24468, 23983, 10965, -8204, -21270, -24816, -18679, -7346, 1529, 5371, 4477, 3866, 8346, 15579, 22267, 20134, 7033, -12373, -31000, -37958, -30826, -10336, 12973, 26878, 30212, 22451, 9749, 53, -4507, -5837, -8252, -13686, -20365, -22175, -16800, -977, 18442, 32125, 33245, 20587, 438, -17461, -24539, -21387, -10715, -416, 3048, 1239, -1060, -878, 4402, 12646, 17277, 13470, 3056, -11519, -20374, -18491, -10067, 1358, 8931, 8556, 1419, -4812, -5784, 412, 10726, 17324, 15685, 4330, -11774, -21366, -23134, -13596, -1540, 8432, 11680, 8417, 5437, 4090, 8423, 11800, 11047, 1465, -13910, -26535]
759b6535l408Q896J7760K0494J2474q86j0584j4210j1341m145M20J064r79k484
773a3464L03O054J2259J4918Q454j103j2993j9115j5868o954N544J2239J1201
786A475P140l73m041j735L331M324J892l751j0676j1771o650K068R784J3618P934
801A2569N17o364p236l382K858O773M563j796q681j1812p296J699J0090J1453
815C955Q685K550m555p072l320O91J958L48n709r242p242k206R549J5551J5138
830A9079P809l052j1859j4625r910l307L591L616K950L36L78M364R134Q640N838
845B2982l838j2072j5377j3402m192P197J3070J1740O721j315l771m466J66K079
859E522O70l187p741r376l563L428R961J1864P944q64o310r169n265J578N096
$$ y = [-26535, -29943, -21047, -3287, 17207, 29681, 28795, 18211, 4001, -7340, -11485, -11065, -10001, -10980, -13464, -13161, -7107, 5152, 20070, 28524, 27421, 14428, -4687, -20555, -27509, -21965, -9726, 1475, 8615, 8242, 4201, 2466, 5797, 10121, 12013, 8262, -2414, -14185, -20835, -18767, -8983, 4635, 12569, 13086, 6722, -514, -3896, -1038, 5735, 10298, 8502, -179, -11991, -19287, -17588, -7498, 3955, 12640, 15190, 10635, 3563, 243, 934, 2892, 3240, -2469, -11711, -18953, -21159, -11610, 3941, 19079, 26888, 23836, 11977, -2648, -12558, -15865, -12274, -8658, -5708, -5372, -4994, -630, 8504, 17144, 22982, 19144, 7072, -8305, -21707, -25899, -18702, -5632, 6108, 12829, 11514, 7743, 3277, 3443, 5522, 6192, 3005, -4736, -14112, -17675, -14247, -4286, 7578, 15522, 14658, 8348, -821, -6086, -4508, 588]
874E88M371l00o290p740m741K451R028J0929O241l5o529q254m480k09L743J193
890c4j502n891n778Q2P505J2580J0611L792l919j2149j3172q461L37M744O194
905e061N033L62j37K230M397N668L783m643r355j3380j0625o52P768J3500J1617
920A0505M880k031n327o901j831J020J352j531m968o645k976M572R094J0044P028
935A6285j124p300j0551n518j121N158N498K090k665n905l957K592O953Q420N091
950A3946j669p684q968m872J136M259M282Q66l091l393j975M767P836Q190K576
965A6206n239j0052j1099n971J493O545Q593M798R44k556k013J798L011K806k522
980F742p975r763o172j11Q522J1558J0281K941l584p593p394j830m0K697P36j922
$$ y = [588, 4959, 4659, -1631, -9371, -14112, -11661, -2633, 8296, 14537, 14502, 7973, -281, -4761, -4970, -1227, -34, -1536, -7427, -13205, -13123, -5618, 6962, 17573, 21365, 17446, 5297, -7875, -16336, -15999, -11255, -5061, -28, 334, 197, 2427, 6824, 12492, 16275, 11632, 2277, -11103, -21728, -22380, -14612, -1112, 10505, 15385, 13354, 8027, 1126, -705, 315, 1667, 136, -4832, -11477, -14453, -9881, -787, 9257, 16285, 15161, 7861, -2690, -8208, -9329, -4171, 1327, 3417, 752, -5153, -9110, -6518, 435, 8855, 13946, 12277, 4593, -4375, -9247, -8111, -3852, 430, 1296, -1795, -5188, -7163, -2396, 5440, 13630, 16206, 10967, 915, -10184, -16155, -14662, -8117, 476, 5274, 6218, 3662, 1649, 3447, 6458, 9264, 6742, -1233, -10996, -17168, -17279, -8757, 2801, 13082, 16023, 12439, 4846, -2548, -4378, -4418, -1721, -985, -2907]
996b907m032j908L203P528Q621M029j754p776r118p183l27N544O550K750j83m577
1012a540k378J14N893M961L883k985o555p853m139J203N705N846K665j623l639
1027d42k716J096N189O088J522m265q534p900l065J674Q099O806N595n90m694
1042C863l351n58J807J868r73m202p150m255J622N873J0862O941K462m237q051
1057B521p602l799K560L573K560k05k410j644J695N473O333L622k806q217p953
1072f299n403M42N765O490M989r80l055l893J45K554M605J913k888n641n952k376
1088i584J875N681O147L814j831m609n354R22L519L513K398k965n812o392j803
1103a0481L220P348O429K889r77n286n220j410J672K525R53j925m787l409J501
$$ y = [-2907, -6939, -8847, -5644, 1884, 10505, 14534, 12780, 5004, -4114, -11297, -11624, -6080, 470, 3220, 3037, -1540, -3918, -3804, 2089, 7050, 10933, 7948, 1393, -6460, -10599, -9396, -3691, 2155, 4820, 3197, -442, -3158, -2062, 3127, 9215, 10737, 6472, -2062, -9962, -13027, -11353, -3254, 3552, 9147, 8557, 3863, 512, -46, 1761, 3629, 2656, -1546, -8696, -12951, -11329, -5456, 5406, 12347, 14809, 10572, 2521, -5081, -8880, -6320, -2747, -187, -392, -2802, -4446, -2751, 2722, 9055, 12677, 9871, 1654, -6299, -11702, -11260, -5495, 995, 5984, 5004, 1949, -1944, -1799, 755, 5360, 7273, 4385, -1256, -7208, -9584, -7709, -2028, 4119, 7933, 6102, 1493, -3861, -2939, 580, 4093, 6491, 3526, -2286, -8678, -10481, -7261, 87, 6516, 9405, 8428, 3142, -2078, -3488, -1816, 709, 1662, -263, -5050, -8459, -6958]
1118f958M726P916N098J703m668q886o342k425K506N314L211R63k279j792J010
1133i03K907M704J249r64o518p590m190J113N764P284M832m87l838m056j204N35
1149a362L021K051r24l613n442k351K918O615M693K389j258m353o729r09K287
1164b967M321L113j245l720n235j129K257N830N368J982k379m818n479k071K096
1179d076L171K454qk708l244j15L796N644M049n56l896p031n534j039K883N110
1195a100M852J197k161l301p10K020K302K147j720m605n206l017J953N208O089
1210C948M118K53m984m361l347N85L270J903K98k442l197j513K184M391M490K460
1226H056k191n176m631k264J648M821K887N53k875l437k187J902M011M489J142
$$ y = [-6958, -2232, 5684, 10782, 12485, 7817, -1069, -7411, -9836, -7330, -2016, 1195, 2158, -121, -1913, -903, 2004, 6708, 7957, 6993, 475, -7115, -11305, -10192, -4428, 2856, 7688, 7201, 3363, -693, -1897, -1362, 1659, 3710, 2786, -827, -6269, -8620, -5702, 913, 5606, 7995, 6737, 2384, -4345, -5254, -2967, 1354, 4467, 3222, -498, -5733, -6862, -4605, 1225, 6593, 8575, 6196, 1378, -4101, -6172, -4076, -905, 1549, 1541, -1167, -4411, -4526, -730, 4914, 8963, 8407, 4511, -2520, -8054, -9093, -6210, -1100, 3752, 4949, 2788, -513, -1223, 797, 3099, 5246, 3526, -1079, -6285, -9302, -7349, -2141, 3948, 8066, 8319, 3335, -1026, -4373, -3788, -518, 1385, 1683, -759, -3956, -5469, -3285, 1106, 5596, 8056, 5865, 689, -3942, -6206, -4558, 263, 3150, 3703, 828, -2609, -4796, -2894, 1117, 5606, 6748]
1241F748j836n203l723k732K676K928L591P52k787k403l95R75M082L614k36l549
1257B502n784m169j10K953M535M122J626k408k892j596K11J515K383m48l297m214
1273e071k389J568M739N484K909o49l040m835k872p72L892K338R04j614l431r25
1289c764Q77L163M361J958k247m094l771l023J990L759L705M15o25m224j032J89
1305b363L085L328J032j730m099l670j723K223L769K700J050j052l125k348J698
1320a225K383K612O31k449l683l721o46K614M320L827O25j991l414k236O79J071
1336f03J821O22k016k943j798P07L521M360K929j521k189n136k680J139K282L276
1352A771J48n94j786k064K94K039L596R10p70l446l825j020Q88L204K554J660
$$ y = [6748, 4912, -291, -4014, -6746, -4070, -1142, 2449, 3201, 414, -1989, -2384, -1409, 2673, 6287, 6051, 2502, -3282, -7451, -7561, -4608, -73, 4049, 5675, 3267, 375, -1221, -1010, 505, 2888, 2440, -857, -5071, -7460, -5892, -1153, 4331, 7240, 6591, 3551, -1284, -4156, -4928, -1036, 1302, 2206, 592, -2839, -3764, -2887, 276, 4637, 6595, 4348, 254, -3517, -6540, -4550, -791, 2914, 3329, 2704, -1520, -2552, -2363, 722, 4050, 5082, 3352, -747, -4417, -6140, -3917, -148, 2552, 3602, 2550, -575, -2923, -1225, 1158, 3770, 4401, 1952, -1731, -5452, -6098, -3484, 836, 4663, 5288, 3297, -117, -2353, -1674, -603, 1218, 1840, -176, -3119, -4917, -4210, -689, 3671, 6600, 5079, 2890, -2246, -4926, -3787, -1505, 1771, 1919, 1325, -461, -2525, -2231, -192, 3404, 4314, 3544, 98, -3727, -4747, -3859, -655, 1899, 3559]
1368C559j479k830j980L15J791L642Q82j693l164k533k007K644K743L548N28j828
1384B138k133k389p3J990K612J137j395l736k915O2K030L497L347K68j608l495
1400f63k356K69J615K463R28j107k541k221K08K242L389L004n69l547l260k947
1416e093R46K517K808K199j635k463j443l65K520K147K359j684k894l157j673
1431d911J027M082K756J332j612k644k298o69J912L390N87q04k583k868j524K292
1447b535K682K628J356k340j652k341k81J480K332J043j273j249l164q62J772
1462b404L747J963P42j766k736l025O8K444K253Q74n04j928k931L18J446L122
1478A683K496q86k109l815r67M02J456L044J646l26j870j788j064J696J367K479
$$ y = [3559, 2080, -750, -2730, -2415, -624, 3018, 3900, 2207, -957, -3490, -5497, -2853, -110, 3438, 3966, 2138, 5, -2384, -2457, -467, 2145, 3282, 1887, -1849, -4764, -4702, -2672, 825, 4172, 4440, 2832, -663, -3019, -2750, -1135, 1328, 2256, 1149, -1392, -3613, -3405, -1163, 2226, 5230, 4661, 1114, -2146, -5093, -4147, -1630, 1178, 3377, 1742, -721, -2164, -2529, -9, 2138, 4497, 2813, -81, -3238, -4911, -3884, 198, 2954, 4286, 2674, 30, -2268, -2937, -1025, 2365, 2952, 2148, -435, -3303, -4827, -2535, 147, 2775, 4131, 1791, 139, -2202, -2483, -1003, 1329, 2372, 1099, -150, -3314, -4176, -2404, 1343, 3306, 4048, 2282, -454, -3479, -3411, -967, 1286, 2160, 1656, -272, -3203, -2885, -1439, 1683, 4179, 3293, 1184, -2631, -3598, -3196, -1740, 1304, 2950, 2624, 754, -1034, -2098, -402, 965, 3444]
1494C444j477j392k859r18O79K584K329P56K7l541j916J18K63K554K151o92j363
1511G47k987j076Q50K109L116J176j478k524k406m09J560K226J119O2k718j200
1527a833j204J454K498K388R9j691k484j688j168J971K595J730j243r22j408j527
1543b433J384J831J843O19k497j872q84q31J705L066P40q23j332k369k90J198
1559i45J149J847m36k98k612m87J59J400K257J91m85j478j724q88J146J755J409
1576A960J65j230k860r49O78K470J535M08Q2l057j492n62J454J430K419p35r92
1593G24j956j255O55J541K340M76j172j371k316K13J029K140J726o98k017j494
1609a435j081R01K457J931q54r65j503j274J14J198J855M86m07j158j479n60O02
$$ y = [3444, 1967, 575, -2284, -3202, -2523, 61, 2390, 3146, 3173, -368, -2284, -2166, -1903, 651, 2802, 2110, 747, -2240, -3316, -2466, -357, 2759, 3935, 2457, -67, -2473, -2882, -1322, 904, 2023, 2085, -633, -1833, -3037, -1583, 915, 3303, 3402, 1711, -773, -2461, -3629, -1658, 937, 2667, 1424, 502, -906, -2433, -1049, 782, 2625, 3244, 747, -1125, -2009, -2840, -1135, 1931, 2671, 1848, 516, -1853, -2143, -945, 204, 2051, 1615, 1317, -1295, -1782, -1623, -223, 2034, 2225, 1740, 262, -1462, -2350, -1204, 551, 1960, 2125, 895, -1965, -2914, -2236, 234, 1769, 2177, 2259, -798, -2290, -2852, -1398, 32, 2451, 1716, 724, -1232, -2487, -1832, -291, 2049, 2525, 1353, -18, -2334, -2121, -1092, 1048, 2774, 2076, 59, -1435, -2516, -1615, 842, 2773, 1919, 954, -549, -1823, -1709, -511, 1344, 1830, 1423, 265, -1214, -1774, -1172]
1626a172K009O41N15q25k085j483K93K011J253J835j442r41j699p50O36J653J282
1643A731K00j830j516j326J255R60K471k05p27j712j651l06J688J361J619o84
1659A328j120j261j478K24L060P81M72l51k803q05L22P45K094R10j213j29k451
1676a675k0P54J549J020L74q12j625j032l09J038J783P94o20j602n77j128J064
1693a024J772K48J062j063j253j446K76P94J075J348p79q00j507m9n7K102J95
1710H94J076j628j391o94k80J833P43K092j293j108j720N9P84J138K041j288k66
1727I92k943L97M07R64J855K62q82q69j412r33J678J453N12L39k032p53p58J92
1745a531K112K22J479j649j693o21l73O07J524J032K37j215l09p33m41R23J541
$$ y = [-1172, 837, 1478, 1993, 1168, -917, -2400, -2107, -96, 1157, 2992, 1550, 609, -1090, -1840, -1204, 449, 1731, 1931, 101, -1415, -2741, -1486, -526, 1945, 1740, 1013, -699, -2350, -2656, -968, 393, 2012, 1328, 208, -1053, -2531, -2307, 753, 1534, 2006, 1655, -1148, -1953, -1631, -886, 1208, 2118, 905, 776, -1675, -1695, -941, 608, 1628, 2002, 1190, -435, -1467, -1776, -738, 1045, 1839, 1219, -383, -960, -2088, -1024, 748, 996, 2058, 995, -258, -1704, -1428, -634, 441, 1789, 1010, 210, -1297, -1346, -1403, 699, 894, 1970, 342, -1049, -1743, -2023, -190, 553, 2645, 1352, 244, -1476, -1417, -633, 505, 2546, 1258, 992, -1951, -1554, -1147, -183, 1672, 1934, 1052, 183, -1229, -2162, -484, 969, 1481, 1820, -212, -965, -1723, -1531, 581, 803, 2282, 633, -1060, -1681, -2054, -1447, 77, 1109, 1346, 131, -178, -911, -1352, -429, 1112]
1762A112R43j560p71r59j193J325J985K61r7r50q40q54L50J963O95M88j290q79
1780b71j083%N37J423R58r73l21j821J53N80K135K33j74j157j304j055J11J311
1798g18K332M02m02q79j504J07j05J382J255j258L7j560m78J32J234J235J196
1815B408r04j252n72j454O62K035K14L74n05k240o37J108P94J396M32l36k071
1832e48p41p01P26J293Q36n02j88r19m21k7J761R54j5p54j882r62Q31M6J285J141
1852A213M72j384j028m44R59M38P56l62q22j181p40O20J173R96J095m39n41j096
1870c15n82L61Q73K99N70j673j80k42QQ54J897k84p15n01j384p63R59J490J29
1889H01P11q95r67l33j84N96J156N95q60r52j552R38O98O99P59o80n03j16n61
$$ y = [1112, 2055, 495, -276, -1235, -2428, -1103, 882, 1143, 1046, 96, -744, -1598, -1248, 715, 1410, 1898, 608, -271, -1354, -1354, -817, 606, 1564, 591, 270, -1551, -1398, -818, 1317, 1550, 1376, 219, -1085, -2140, -2029, -718, 1614, 2016, 1614, 735, -769, -662, -767, 615, 1870, 612, 649, -911, -1389, -1257, -23, 1212, 2408, 1504, 252, -320, -1774, -1112, 923, 1137, 1511, 1006, -1234, -1871, -763, 31, 1427, 1859, 1523, -548, -1289, -1990, -1264, 29, 865, 363, 175, -744, -1165, -1192, 569, 1523, 1508, 754, -1128, -2090, -1259, -1213, 72, 1213, 1685, 301, -727, -1171, -212, 226, 982, 620, -202, -1383, -2123, -1503, -330, 666, 1761, 1322, 781, -315, -897, -536, 337, 636, 1206, -467, -647, -889, -881, -27, 1870, 1586, 871, 370, -1014, -1777, -818, 672, 801, 1512, 617, -350, -683, -867, -271, 885, 1480, 620, -332, -1884, -946, -248, 451, 1210, 530, 27, -89, -650]
1908f50N90q9R57L14m15j036p17r88J149J411J52J288j391l12j357J322o21Q77
1926D84n21M16j446j98m17P10J791P35oj277K81j432k92K54R56O73j145q5p49
1945a268O80J423J05L61k37j382r24j96J30Q72Q25R94n55o70l47q27J005P93L20
1964A102j052n09p35l56J034J084N68L31k53j665l1J38M57N59M80j081j050k21
1982a200K43M24M52J478p1l08j501l93R15m91J377j078K20j064k04J026k54J158
2000G29J149p81r1j232j417J53J201r9O74k44l30L81N46N17k2k62m23m38p83p96
2020a568K4K026R86J16j293L25j284n51M10O90L54K85n03j145l7J040J03J277
2038A255k00L21j601k58M73J02L10N48m40p70n66j92J080K63J737j187n27j49
$$ y = [-650, -60, -149, 808, 1122, 707, -329, -1046, -2034, -885, 526, 678, 1966, 575, 263, -1094, 228, -393, 484, -37, 379, -1067, -1265, -1682, -972, 819, 1554, 1548, 271, 552, -880, -1172, -918, 38, 711, -434, -519, -1268, -588, 835, 940, 1301, 1064, -318, -1242, -1438, -1308, -436, 389, 1383, 828, 158, -189, -1016, -11, 782, 1102, 50, -459, -1194, -1550, -516, 568, 1136, 1467, 1214, -451, -482, -344, 113, 672, 1152, 71, -979, -1200, -957, -533, -81, 1397, 1326, 1018, -483, -876, 39, -452, 925, -153, 67, -997, -1201, -175, -429, 729, 1878, 1097, 1006, -226, -1643, -1490, -289, -388, 286, 42, -288, 93, 639, 1156, 1134, 872, 449, 11, -772, -1568, -1544, 482, 1468, 1584, 291, 616, -668, -1219, -809, -119, 235, 520, 17, -1128, -1165, -125, -22, 1255, 1055, 1376, -225, -483, -10, 92, 402, 950, 510, -260, -826, -1018, 62, 325, 2062, 875, 348, 199]
2056A99q87l92J239N80k57n17o67K78r43J456Q15N82k37n23j266m20k96O67L1
2075e58J371l21k11j0n13J471n4o43m01q4n96m23M32O79M74q8j53L7k10o76R80
2096E03o87K68p2n19M6rJ94N18M06k72O12j168n13j29L81Q58N26l58l64L4o24
2117c69l51N07J042n61J9K9m48K16j13R2l1N25j095q72M48J209O99P34k27j011
2137D42n07j234l20J010J135M3l85O49l98L53j047L24n43J89q3j497R64R25M59
2156D79o5R30o60p73j60q41L85R41n36O05j32Pk36K33M36N40r26K07m39n49J14
2177d40k07O4P50K67j06j077J60J179j69o07K07O3j12J75N7J46j64O80p97K45
2197C14j415P10l27P80R57q60n54k64p09N20O66N26j85KL12n84n67JJ071q14P2
$$ y = [199, -688, -1080, 159, 739, 482, -35, -702, -424, -1367, 89, 904, 1486, 1249, 726, -540, -960, -1256, -589, -558, 813, 492, 281, 271, -242, 1229, 1175, 532, 131, 47, -549, -972, -540, 139, 613, 525, 372, 409, 199, -477, 503, -184, 84, 12, -507, -461, -470, -276, 242, 648, 376, 988, -180, -693, -822, -441, 417, 943, 585, 221, 255, -369, -720, -213, 829, 268, 287, 316, -132, 84, -29, 63, 32, 557, -538, -1410, -962, 247, 946, 1680, 1453, 442, -65, -1299, -1619, -609, 526, 569, 184, 833, 435, 788, -259, 65, -478, -289, -372, -1869, -905, 20, 479, 414, 1344, 684, -89, -249, -1090, -705, 236, -300, 305, 173, 180, -56, 177, 613, 1153, 227, 434, -5, -554, -440, -647, -583, 167, 434, 328, -749, -589, 590, 421, -186, 21, 84, -28, 147, 204, 350, 186, 866, 69, 314, -1101, -391, -718, 62, 1019, 159, -395, -659, -1368, -848, -182, 344, 159, 161, 473, -111, -678, -677, 394, -420, -348]
2218c48K09o61P11l68P8J362n17m97L64r95m99N31Q65o73R90j339O27m22R45l1
2238C32J75j16r08k08p22R15N08L85K80N87K16j103r68K11K21J95K84k51L45k58
2258A20J91l2l86J65N64m56j05p80J55Q50m5k67J66n14p9L93O50r10Q49J12j044
2279d03K60q90J040n28P67k57k1k19L30L6k72O43L7l15m42j13n04K79R03K75K65
2300H71p50L90q46Qk31J524j372J02J81J5m95O00O90J71j70k56o92p38J56P27
2320a15L38J40K1J89N3o68M43j30l49p8K37r2n29m9J204m92N2l42P87r54Q80n76
2342c0K92k79j48j08K60o09K81Q38M21l86m67P9m2k2k00j04j11L68K85p82L59
2363a05j16L4J03Q35j395Q78p9o48O9K78J92k72j72M35p5j32P41L08q31O86o02
$$ y = [-348, -139, -800, -89, -457, -379, 983, 466, -31, 333, -662, -1161, -630, 235, -438, 552, -787, -160, -582, 363, 332, 507, 391, -517, -725, -1447, -532, -24, 361, 641, 1228, 1444, 341, -627, -416, -195, 0, 284, 33, 378, 120, 311, 279, -107, 58, 622, 166, 61, -719, -564, 286, 241, -26, 140, -374, -453, -60, 590, -320, 529, 641, -403, -143, -1033, 7, -521, 246, -11, -32, -251, 79, 115, -157, 486, 523, 208, -234, -347, -851, -572, 331, 606, 871, 121, 511, -335, -327, -558, 966, -406, -304, -123, -108, -603, -3, 687, 858, 688, 432, -260, -998, -842, -115, 223, 363, 384, 573, 626, -42, 401, 271, -78, -156, 81, -11, -540, -589, 615, 123, 175, -167, 620, -334, 546, -30, 262, -17, -165, -273, -13, -622, -341, 497, 918, 532, 65, 144, 102, 80, -120, -224, -335, 33, 318, -464, -105, -221, -187, -84, 751, -644, 234, 155, -493, -424, -146, 46, -226, -398, 37, -38, -170, 571, 879, 48, 734, 132]
2384A32p65M47j34P83o77P39J48l98M03q24K16R08m83n86j005Q67K35K63k77J5
2404Gl04M05l26O27n27J83o74K3N91k22K9n57J076m87j37J028p10j48L2j33j53
2425c77M28J06q08N55N92o51L07n64L78j16R68q40k18L33k49J22K05JK2j41o70
2446f17Q34o97L42K43p62N34N79j4m64j12L31k31J40j000R21p12J71L87M95R9
2466D67k44l6j101J184k64K00m49R4J52M95n80Mn85J384l71k78L29j34o66N53
2486A54j14k53J83J77L91n07p5R22j028j29J69k63J80l18L43J93K34oj65K14k22
2507H0n61P13k08o64P20k36L83n38KK32m06L45n3n74Q69m19RK24l37O69l14L53
2529B89n52J022r53J22K06n78K18M19r3k77O87m22J16l1k69k51L86N12j29K65
$$ y = [132, -633, -186, -320, 463, -214, 525, 673, 275, 678, -146, 70, 978, 495, -91, -1096, -229, 6, 269, -8, 7, -297, 108, -218, 409, -118, 65, -609, -586, 5, -217, -188, -745, 331, -156, -293, 735, 25, -123, -91, -224, -377, 51, 157, -651, -96, 496, -155, 152, -412, -34, -150, 818, -22, -240, 93, -156, -34, 171, 172, 194, 53, -617, 217, -480, -138, 105, -657, -123, 456, 442, -22, -134, 197, -34, 106, -894, 27, -685, -514, -127, 368, 467, 223, 187, -914, 270, 6, 206, -243, -149, 3, 498, -82, -78, -663, 721, 350, 72, 401, 267, -399, 154, 40, -213, -30, 147, 538, 31, -44, 878, -150, -279, -110, -373, -193, -511, -168, 25, 259, 253, 88, 302, 80, -481, 232, 24, -640, 80, -156, 227, -311, -309, -77, -483, -138, -191, -765, 104, -315, -306, -82, -419, 250, -64, 289, -263, 759, -194, -72, 134, -444, -226, 193, 100, -177, 510, 88, 204, 173, -96, -347, 39, 551, 422, 687]
2549F87j591J020p34J232j016N28K06k62r7n51J348r85J94N7r37J170m2m50M15
2568A92l98j40J2M11o0m2l20K69j40j00n29O86j2o8R07p22O5O63m90n86o26Q03
2590b25l28M28J20j55L18j53k6o94P52l17p7j0M27l63m88N0L41L58L71k59J66
2611B36R3J16J43l49l28k35Nj91l2J81R36k81J183j082K32j115P04q21r1P3L70
2632b53L5K72l03Q56j86n96J69R92j309K72n11l83O14J5j23M62L14R9N21r53k60
2653b56O91m36J92J41o25j77N06L36%P1n94J15M68N6l91M27j038j95l82Q75r5
2674c11O68L35p01P62r30J39j08P03n92m29m82J84L18O42j31L2K39J65m21l58
2694b76p4L27m13j99R7O4J081J60m73K12l91L38l31q75k18M04j50j20J067M85
$$ y = [687, -904, 116, -618, 614, -402, 126, 332, 70, -27, -578, 770, -215, -21, 36, -901, 269, 227, -223, 192, -206, -346, -334, 77, 17, -25, -345, -76, -216, -316, -845, -159, -171, -239, 668, -54, 11, 674, 184, -402, -1028, -225, -553, -125, -5, -160, 158, 5, -21, -715, 37, -280, -357, -367, 60, -303, -791, -741, -400, -42, 329, 70, 236, 329, 445, 588, 239, -89, -324, -319, -510, -542, -361, 575, 294, 1477, 395, 627, -488, 216, -605, -696, -623, -253, -218, 54, -249, 607, 421, -175, -6, 986, -323, -51, -562, -945, -331, -316, -439, 23, 337, 436, 957, 4, -256, 435, -1, 191, 332, -293, -470, 36, 372, 372, 443, -151, -36, 432, 488, 97, 524, -514, -709, -1091, -216, -311, 357, 692, -9, 753, -177, -38, -146, 557, -35, -464, -946, -762, -444, 198, 67, 99, 338, 503, 82, -276, -350, -23, -436, -635, -538, -474, 607, 767, 294, 506, 115, 453, 122, -753, -971, -567, -717, -837, 230, 715]
2714G15n4J49j077Q5j89M32j529L09Q00o66J123K13J7L28m18Q17j172j29k82j91
2734g19R46o15l11N78J02K47L79p77o40Q22N54l11q7K74l85j55k78J83l86N53
2754b6l77J395l39K19M3m15j456m4J33M84R07m53O1k51M21O14n17j9o78n3R5o03
2776h59l6N34J224j071J405m56Kj022k39k24k00O24L00o99M47q5L27Q86n88k91
2796b1m2j55J5k03K77L03r0k75M59l17p26O99q3k76R6o62J023M97k53q30M17j4
2818a61j29K72k67j18N89L44j59l28k21n39J96j229J314l22J251K57p29L22J21
2837D64p13J10M85n95l81J03k22M06k76K123o59l64O43q40n85N88j184k03R14
2856a86l76J282o39L29k16M65o41Mn17M83K21q47L36M5J73O41j92k1l33J68K44
$$ y = [715, 661, 810, -267, -182, -371, 61, -1468, -1159, -359, -1025, 98, 311, 328, 656, 238, 1055, -117, -246, -528, -719, 227, -388, -699, -121, -19, 228, 607, -170, -810, 12, 566, 255, 168, 442, 57, -98, -376, -193, -579, -26, -403, 992, 653, 872, 915, 500, -956, -1000, -867, -383, 524, 71, 132, -119, 302, 916, 399, 380, -298, -351, -256, -859, -895, -361, 863, -208, 1197, 741, 743, -279, -518, -742, -942, -318, -18, -717, -270, -355, -28, 858, 270, -21, -63, -218, -203, -406, -129, 174, 84, -191, 268, -49, -775, -76, -159, -435, -339, -1001, 22, 519, 266, -564, -147, -161, -290, -18, -285, -403, 186, 530, 371, 43, -178, -717, -521, -1750, -436, -758, 493, 750, 21, 343, 464, -249, -139, 346, -249, -630, -527, -749, -343, -619, 1504, 845, 481, 1124, 284, -301, 287, -897, -1100, -186, -562, 720, 81, 410, 194, 659, 18, 22, -495, -12, 209, -638, -302, -257, -84, 557, 365, 344, 11, 179, 423]
2877D23l57j075L63j34l88R67Q7N04p49J16L60m08K02N91m44m00P9k82m43J431
2897D43o18N53l08L58O68p95l80j31L80q09R44n54l25n18Q60L32L23P44p15k41
2917B11n57N87M5m88j35m84J258o28k59Q74j48Q6l85rm78k33K48R57p02M9K30
2938C9M14k46k29P7m95M48Q6j32n96K43Q47k78l14K71K86m37l74J012j060O06
2958A68p5j97j15l74j63J15P54L40o85J18K93L45r32R96k15k7J04j079l43J25
2978h47mN88J99O49l98j70k83L14l46m80Q71m34K12K88q0M50L2J51q47K36K2n48
3000d25K90l71n50R66J27L50o84N15m02L50l86P2R5P46j157N00m43O79K70p4m54
3021A4o3m78L74j94P71n57N39r45Q40l67j58o7K52N66n02N04q40r5l02K49L88
$$ y = [423, 66, -1009, -646, -780, -1168, -201, -114, 390, -359, -243, 117, -291, -89, 502, 58, -342, -263, -545, -988, 443, -175, 378, 70, 428, 1096, 301, -79, -210, 170, -639, 305, -249, -574, -1092, -232, 100, 423, 1167, 452, 211, -346, 241, 286, -202, -337, -821, 437, -191, -450, 424, 276, 362, -23, -32, -510, -743, -495, 462, -240, -191, 39, 453, 207, -22, 55, -440, 8, 94, -38, -634, -391, 456, 178, -136, 135, 421, -16, -390, 622, -438, 168, 93, -104, -219, -593, -756, -641, 113, 453, -232, -114, 179, 524, -408, 588, 373, 346, 450, -629, -972, -847, -851, -263, -64, 585, 187, 17, -266, 48, -298, -778, 93, -341, -129, 159, 79, 529, 561, 712, -135, 101, 123, -425, -135, -506, -1056, -90, 37, 387, -297, 218, -184, 166, -220, -148, -53, 693, -464, 36, -407, 272, 542, 468, 14, -49, -527, -153, -347, 424, -133, 406, -539, 301, -66, -224, -291, -39, 527, 25, 529, -311, -406, -708, -459, -71]
3042g1m95L77P34o52R3L33K27k63m80J004q82M89J87k43p15L58K9n30nJ082o8
3063E09L24m46n34M55o04j33Q44j025N47l74j73N17o6L13L3J95r05N70q12M94
3083b71J37j14P28o27j49P94n34q9P4J26N50o56J073j103k29k20n7J024p7p56
3103c76L57J29k11P25m11q90J247n63m3j84k75k24N23K71O0k52J36J091r29K81
3123D62l33m93j23M56K31j73P97l61q46P50J7j52j59k38j7O97n46J77j74l17L76
3144C1J46K60n47J96j3k43m87J09L45N51n45M64q96M06j94K82N65l47n34J83R54
3165F86r93J49j25O22p72j35P88n31k77N02R57q00rk45K16j8k47j15J162r16K95
3186A94o83M49m64Q82J61m35L63j173J200l58J83j2R1J08p72R85q12K25p78J336
$$ y = [-71, -566, -189, 545, -107, -14, 319, 546, 283, -197, 807, -75, 414, 601, 358, -357, 1, 30, -500, -505, 577, 509, 833, 387, -147, 308, -296, -429, 415, -610, -63, -437, -610, -93, -159, 154, 187, 382, -523, 47, -765, -271, -134, -248, 480, -147, -296, 498, -36, -125, -51, 75, 625, -31, 1042, -61, -290, -510, -567, 457, 380, -376, -19, 110, -101, 624, 213, -677, 570, 7, -36, -220, -495, -719, -196, 75, 135, -117, 19, 1110, 181, 462, 129, -364, -487, -31, 200, 27, 824, 463, -383, 367, 384, 232, 73, -165, -182, 515, -31, 146, -28, -345, 31, 177, 437, -110, 86, 73, -170, -657, -548, -203, 348, -197, 267, -629, -223, -417, -135, 430, 83, -451, -268, 686, -307, -158, -283, 339, -433, -568, 220, -311, -588, -86, 871, 71, 62, -183, 33, 15, -232, -347, 815, -101, 194, -489, -40, -504, 378, 539, 104, 467, -706, 494, 136, 319, 307, 398, 506, -266, 719, -93, 132, -646, 690]
3206F90m45l69J030r53K10K02m88j45m20P03j76LJ58J5l32R8K54L54K91n76P19
3227H23p28K22m25l5O75p39o62J467n42M37p94k27O58p0j68l1k55N9m45Q09L0
3248E9m75P21M63q96K29M90o98L32J37Q5r4L55q83K52Nj96J22P12j075J55l4n1
3270b85P57o13K82n06O5k38j88N99M15k52O30o44k3j77J08Q67j017M51R1k07l49
3291b34l9M31l72J70M29l92J82l65J47M71q93N33K77K06r31M19N9k56J66QK35
3312B51o26R38J55n89P4j30l0P46j055m99Q51J40m24J8k3K11l64L14R6m22M08
3333D0R56j609N54J74K41O1o16n3O6P8R0q34M59L64K43l42M54l11l3j23N54r04
3355d91K6J207p96m74Q22k86P6J58l29l34N46q8L43o40j82O14j57l07N65K71p27
$$ y = [690, 245, -124, 906, -47, 163, 365, -123, -268, -688, 15, -161, -158, 0, 15, -317, -219, 35, 389, 680, 104, 823, 95, 317, -108, -143, 532, -207, -869, 598, 56, 493, -301, -528, 130, 60, -108, -139, -394, -335, -780, 29, 59, -416, 305, 768, -128, 101, 591, -107, 225, 362, 447, 353, 708, -175, 77, 82, -114, 8, 720, -355, -200, -234, -285, 472, -141, 141, -365, -300, -538, -726, -127, 288, 36, 666, 22, -1, -178, -70, 797, -220, 231, 322, 115, -234, -273, 158, -214, -44, 385, -7, 175, -190, -43, 428, -465, 68, 345, 551, -380, 39, 98, -158, 8, 16, 251, -375, 563, 718, 129, 203, 73, 43, 789, -266, -765, 86, 226, -198, -180, -203, 8, -356, -42, 54, -368, 40, 996, -613, -59, 115, 356, 417, -199, -252, -186, -108, -18, -852, -393, -29, 214, -128, 326, 15, -18, -141, 413, -491, -465, 742, -54, -528, 294, 8, 84, 242, -87, -421, 125, 37, 380, -260, -442, 172, 15, -292, 273, 544, -183]
3376a83L07l56j65K5K03k4J64P22j260J245j197Q7J096p10J01M26j22mJ98r46
3396c93R69j94o7k7l83M20l90L17o29L07J73j83j05n29M28M77J28L86m77R6L95
3417G19L34n8q10R6j238P47p57P28M24o7O23o65l1r6M81l98J06O76j059L49q00
3438f96P93r7M6n30J63M81k46R9n15K19q3O3N41J38q68Q75j30m25R2L72O15q24
3460H3L2J02l17K61m99L86J08k72K50L74l80m7J48j06l99L34q42N6O37M19j34
3481A94k73O13o18j68J48k86k82M68R7l84L60N05k02O3N86o73n61q9P08j72n53
3502e19m31J119J89l18K32qJ14p46L71l86k52K91P24o00k0K06m67L26o01J081
3522C05l49N30p0l13J96l67l31j6K90j42K03K15L0Q84j83o97j79L05p54J71l45
$$ y = [-183, 124, -232, -397, -372, -169, -193, -29, 693, -567, 678, -519, -432, 664, -46, 55, 481, 359, 355, 553, -393, 576, 382, 315, 288, -95, 325, -65, 252, -377, -70, 103, -80, -185, -714, -286, 191, 319, 705, 228, 324, 719, 1053, 995, 185, 281, -957, -210, -967, -239, 185, 118, 741, 76, 45, -51, 430, 32, 138, 814, -245, 104, -696, 97, 0, 46, -484, -321, 160, -86, 13, -502, -283, -366, -303, 238, 376, -492, 383, 253, -172, -80, 292, 907, 83, 115, 217, -100, 161, -338, 48, 156, -116, 134, 508, 128, 81, 229, 123, -276, 58, -784, -728, -91, 328, 194, -79, 534, -84, -252, -104, -390, -672, -204, -107, -491, -131, 374, 172, 235, 821, 148, -413, -502, 206, 34, -519, -950, 169, 358, 40, 272, 264, 378, -368, 3, -383, -635, -344, 380, -220, -240, -34, -501, -175, -776, 305, -44, 486, 416, 103, 299, -68, -399, -415, -125, -267, -64, 151, 181, 1065, 882, 185, 6, 311, -443, -272, -617]
3543f17q3N49O2r8J11K94N34n47K96m86k32l12N4m6L99K10P95n26P07q66q21P41
3565A18q3m31J00M36m38J28J5K67m29J243o17P7k33n58J72O83o09R92l34m82P57
3586G74m53l08j11N70o92M59M90j280M09J81N3j58J55n20M52k51R67n77j7j49
3606fj74L21k59m62K24o88J389k9J23l05l26R86r31j03K84n74j02K1Q1L23K29
3627B2j42O48j299KJ21r2O89m79j55K69P08M84j22j74n76M52Q7l58J51q0Jp83
3649f26R31j62O68n81m50N95J18p31m12Q15r2kO4L82o12P03j96J41p32k00J43
3670b36O9L46J69k46l46q4M5J91K75j73J26KL29o20O80o24M2j04J46K90m11K05
3692G1O29p07J005o04j08p7j03q63M51j2K27J152r59J13k76j99n50O49m43M13
$$ y = [-617, -700, -151, -89, -187, -76, 218, 752, 205, 501, 15, -217, -529, -475, -521, -122, 88, 883, 357, 1064, 198, -623, 118, 35, -396, -296, 140, -298, -170, -155, 112, -317, 926, 309, 386, 153, -405, -233, 450, -159, 833, 499, 17, 774, 321, 13, -98, 472, -220, 239, 729, -551, -142, 39, 92, -66, 89, -431, 21, -230, 737, 160, 143, -6, -180, 141, -118, -580, -356, -1044, 345, 316, 439, 134, -192, 794, -137, -240, 44, -530, -632, -611, -530, -207, 22, -120, 528, -771, -769, -648, -740, -51, -530, -685, -416, 292, 776, 654, 480, -96, 356, 443, 85, 236, 156, 157, -626, 305, 143, 811, 230, -220, 375, 493, -238, -650, 165, 73, 71, 135, 517, -95, 608, 412, 553, -179, -379, -236, -167, 179, 348, 102, -244, -328, -283, -92, 183, 10, 136, 138, 467, -153, 527, -97, -55, -159, -13, 277, -134, 71, 700, -7, 998, 394, 286, 209, 106, -757, -306, -318, -91, 1061, 102, 215, -61, -260, -810, -161, -604, -191]
3712a91M5M68l09p7k46P95L94j036L14J4J27k57l09O33n68O71m02l33K66r5K44
3733A48ok02k69k15K73J29n22L41L84o84O7N94N35k70o56L77j27J99r9M88o91
3754b06m17O63K20n31R01m61J00J88n50l46K28n52L63Q96q57M22Q56m47m26j89
3774a45K15L09J73j280K89K62m02R76p70O15L24M57j106r50K43P64k79j08K92
3793a21M06JJ95l58M83j24r5j16o77P57n25K22j41N69m00k4L81m64N4j137Q19
3814b95r0N90L62m58N7L7o72J185k01K34j307P68M56n86q68Q56j90n1O99q95K49
3835a20l82M8M92M06j40l90q11K99J05N34o40P10K36p65O27K66o09R0M52n67m00
3856e59M14O50N49j265K78J248p54Ro01n91j08N30P2q26R88J04M36R8n8l55j070
$$ y = [-191, -146, 322, 13, -64, -310, 485, 879, -157, 157, 171, 298, 41, -268, 365, -203, 468, 66, -267, -1, -96, 148, 142, -60, -329, -544, -271, -142, -664, -323, 61, -623, -556, 38, 573, 303, -353, 24, -103, 96, -3, 485, -206, -623, 40, 260, -271, 630, 169, 269, 457, -93, -439, -211, -763, -400, 496, -361, 61, 917, 470, 44, -145, 70, 379, 552, -728, -439, -177, -579, 397, -373, 242, 566, 1023, -83, -1033, -790, -26, -305, -413, -121, 285, 286, 481, 123, 606, 482, 387, 271, -406, 351, -174, 48, -93, 476, 76, 52, 433, -31, 23, -1114, -295, -385, 205, 567, 109, 166, 203, -469, 716, 515, 749, -558, 210, 666, 80, -788, 68, -122, -173, 526, -369, -120, -502, -454, 38, 444, 304, -86, -897, -598, -493, 41, -599, 111, 347, -418, 209, 475, -134, -44, 408, -159, -559, -145, 505, 1054, -211, 67, 1315, 561, 570, -31, -622, -730, -200, -128, -954, 34, 138, 574, 672, 614, 259, -811]
3877h11M71m51J146p71N66o03J160m19q85J144k06j98J13n12k86P92n12J1M37
3896A86l14P4j71Q4M09o63O38J12l68M80n33j085J182j53L3j04P8K91P04m12o09
3917a41R05m48o96K18k62L36o88J284n26K74j03P34j141m73m10P55L6l71M90M97
3937B70N51p54K75j52L18l32K1o56L5Q77k16J64J94k08n85P21q90M71m3P29p79
3958A1L07m47J44j89OK78L0l66p9O44j102O25P95n60M4J56k50J8j61l83N45N78
3980F44p4l85n6m50l03Q9J042j48l62n30L62J16K87N42j446J400m64p26Pj51L87
4001b19m61R64n23L69M93m8l17K71l35q83j82Q12m26O03L12M39N8m82l53Q93j167
4022a82L27n25K45J74k89K10P99o07n27Q89q57O35n68M1mL72K69j058O43j15K76
$$ y = [-811, -340, -791, 355, -416, 150, -453, 707, 288, -597, 547, 341, 143, 256, -256, -542, 250, -262, -251, 186, -128, -54, -225, -141, 268, -395, 243, 355, -13, 467, -66, -1151, 31, -122, -89, -193, -115, 176, 880, 468, -141, 764, 316, -380, -162, -424, -88, -776, 508, -18, 256, 153, 887, -254, -727, -1137, -382, -346, -717, -227, 270, 821, 67, 342, 190, 508, 176, 197, -459, -424, 453, 237, 401, 595, 387, -198, 523, -367, 104, 61, 790, 11, 318, -129, 15, -174, -168, 110, 140, -226, -305, 339, -763, -138, 657, 97, 141, 297, 47, 65, -96, -479, 66, 644, 570, 185, 129, -321, -624, -535, 507, 359, -3, -533, -171, -55, 232, 774, -672, 728, 264, -462, -455, -606, -219, -680, 284, -239, 130, 623, 575, 258, 529, 194, -689, -871, -59, -485, 118, 430, 869, 927, 445, 92, 985, -182, 145, -380, -135, 39, -250, -40, 759, 152, -375, 514, -343, 292, -276, -235, -239, 133, 402, -656, -13, -128, 148]
4043A48j85J1k75L04R93j005J52j03l86l88O77m14r3L62m48P04J40P21l26j454
4063h65L11j11P0J95R9K70L80l94M74l4m54M60k06n08m4M15k24L42n32N20j73
4084iO92l7j155L74k7K21n31N65L60o95J006n96n4m5O2K4k87j22L14j03K11K3
4106A91k17K18j19J50p96Q77q73M50K08J07L14r05N56m85oR47j163J37O31N0m98
4127b26L13O57l25p08m00O84n56N35K32p10Q04O35K28j074M33l64O20j403J51
4146d74N8L74K80R4M62n35N39j206N17j40o1o58k40O02Q89k24L82k69J7j27n86
4167c06j43K27k57R6q9N54L22o67j57J164o56K93o74Q39j070O4M33K40k03o58
4187f48K86N22Q1k39p0K46l30M69m88q7L00k36j241J057O7N61p3J58O70j943M16
$$ y = [148, -37, -26, -301, 3, 996, -9, 143, 40, -346, -734, -57, -471, -564, -202, -650, 54, 194, 915, 589, -865, -554, -665, -595, -400, -301, -31, 349, -45, 429, 395, -59, 401, 195, -313, -357, 58, -166, 176, -356, 164, -9, 683, 646, -509, -135, -162, 59, -472, 93, 453, -242, 764, 168, 114, 69, 131, 155, -132, -254, 60, -43, 168, 191, -26, 192, 73, 223, -573, 304, -569, -119, 89, 196, 510, -395, 161, -324, -330, 617, -546, -409, 222, 272, -226, 87, 744, 419, -289, -689, -5, -561, -26, 206, -504, 300, 935, 1163, 89, 522, 158, 778, -625, -474, -416, -42, 238, 332, 794, 259, 798, -408, 109, -31, -92, -750, -990, -388, 501, 277, 659, 390, 407, 280, -306, -449, -222, -479, -383, -472, 82, 404, -263, -420, 744, 88, 381, -293, 546, -524, -460, -27, 213, 10, -648, -362, 160, 241, 2, -68, 178, -152, 317, -171, -258, 42, -194, -1435, -378, -311, 250, 177, 335, 1005, -938, -522]
4208e22j05q9J72R98o90N12l39J0J8N59l44k15K12q93O00m51M13o58K52J144n33
4229E1M73j30Q5p73J03q5l82K34j18l7M90q5M63n00J29L67m45K67k45k57M77k40
4251a58N55l49j77L04o80J51Q27m01O60m54o33P66N01p59m00n93O57J92n58O83
4271A34Q43q72L65n08M04j501J108l41J84p47P26J15L44k50J27l08L01k28j72
4290b76K41k53K87k53J571j015j66M41r89K54J31N82r61R45o73L88O0k89j85N
4310a55J63J24l6M02p71m32Q02l38O2M33J23j166P07j96M46k56l94M39J64J81
4330C02m61M3J2q63N19O06o06L36O53M3n96m97N58n35n69Q11j17M62p56J862j167
4351D0J0j22Q86r58n5j29q85J484r09Q62Nl43K26m0k9n98J042l34j19Q6L02j15
$$ y = [-522, -627, -716, -544, 454, -236, 276, -63, -53, -35, 524, 180, -35, 177, -716, -116, -567, -154, -812, -560, 584, 51, 524, 394, 479, -294, -191, -276, -658, -424, -542, -579, -89, -174, 289, -211, -82, 285, -160, 107, -138, -395, 82, -158, 397, 48, -129, 175, -505, -354, 473, 72, 732, 278, -355, 411, 912, 153, -247, -840, -183, 9, -549, 134, 977, 105, 470, -38, 366, -1135, -27, -368, -184, -931, -205, -90, 254, 4, 131, -177, 124, -104, -276, -35, -288, -1, -254, 1317, 302, 136, 577, -412, -158, -27, 555, -406, 539, -134, 254, 314, 25, -160, -155, 8, 132, 96, 498, -273, -705, 97, -241, -179, 254, 377, -789, -82, -278, 168, -88, -482, -43, 121, 302, -159, -116, -104, -967, -448, 158, -448, -112, 541, 584, -12, -509, 49, -486, -1055, -244, -361, 101, -655, 1207, 40, 50, -72, 814, -144, -199, -328, -1213, 271, -638, 224, 229, -114, 112, 72, 43, -555, 487, 153, 34, 120, 422, 307]
4373C07n04O38k64p9o02O72M01p89L38m38K10k08M62j90M02l01m16K29N54J14
4393E36n97K73J74n89l44L29o31K15J051r2K89o93L62j47p67J108k47o52l40R26
4413A64L77R8k14l55K42K01j89q66p6J63N52q78L94K20L78ol51L24Q34m72n86
4434d6l92K34n61K12R57J86p53J090j186M28j0k61R54j522J604q85l24J07P7N90
4454D99n58M85m75L94q63N43L15o63m04J227l51K78o70n26K70M24K86K78k84J01
4474C06L01o47j51K68m35o04M30J113k31k37J95Q64j739J55j33O72p76J20J180
4493F51n18J95m78L77o5M57p29N06j250O82M5L47o21N38j001J042l31N70j16n84
4513b83L85n59O26J65K12q49J25P56l20l69l65P73J13o83M83j015J187n42M31
$$ y = [307, -197, 441, 177, 98, -504, 168, 569, -220, 118, -320, -110, -318, 144, -46, 356, 55, -361, -132, 422, 536, -61, 212, 386, -203, -547, -218, -849, -634, 417, 325, 614, -79, 283, 136, -631, 477, 230, -422, -762, 164, 541, 639, 425, 70, 312, 513, 324, -542, -618, -455, 97, -781, -387, -167, 211, 205, -146, 178, 1012, 540, -46, -438, -204, -765, -553, 404, 590, -163, 927, -259, 169, 159, -102, 852, -670, 934, 49, -275, -168, -91, 499, -59, 426, -49, 345, -518, 25, 340, -323, -727, 500, 149, 427, -243, -769, -499, -75, 211, 489, 205, 306, 607, -40, -191, 77, -358, -962, -532, 581, 350, 113, 308, 1172, -567, -412, -545, 127, -649, -529, 651, 133, 328, -150, 227, 162, 619, -110, 396, -854, -172, -127, 220, -401, 137, -864, 178, -153, 417, 301, -283, 102, -457, 169, 334, 546, -303, -178, 578, 258, -111, -476, 297, 410, -273, 210, -805, 382, -160, 271]
4532B71O0p77Q98oJ81o20R25r47J3k95M52m90p8K39K04P79m94K29r7m65M28o12
4554b02M0j193J118n87J411r5q73J022q08k37K75R2k80p41J012l45k15P48L30
4573D72j4n41j31Q33n13n24k07m2O06N03P8m78L79m0K06j95j164O32J59j82J74
4594A1N03J37o60l71Q22k62qj52J48j86j68N21n88O59p64K28k27M95K66q44j85
4615f25O07P9J026j401L15N72n6r59K76r58J207K0R90q50M25j252Q70o43l2L90
4635AL89j97n19L52J2L72K05k52j057K91O77Q2l22N1l32L05M95m78o00M14L43
4656B32l80O79n07l52J66N77p54P69m77K68j98p51J299l06R4p60J136l42l40k12
4676a59m65Q41m8l5q24R87l88N76q18Q39l84J46k92J0mN1m41J17M20p6J21K0J03
$$ y = [271, 331, -446, 452, 446, 627, 7, 932, -15, -2, -297, 155, -335, -413, -174, 30, 809, 315, 544, 447, -18, 410, -202, -162, -1355, -237, -824, 587, 492, -381, 641, -167, -404, -129, -37, -317, -1058, -46, -391, -606, 142, 472, 458, -83, -214, 619, 106, -418, -625, -667, -61, 442, 520, 42, 421, 381, 587, 392, -772, -140, 19, -163, 11, 514, 651, -9, -380, 442, 180, 172, 20, 168, -18, -186, 335, -253, 406, -358, -130, -357, 138, 404, -440, -625, -18, 61, 1087, -314, 1, 573, 517, -442, -166, -1124, 83, 103, 1093, 243, 668, -584, 286, -357, -389, 1, 390, 193, -326, 26, 38, 410, 615, 363, -694, -403, 274, 356, 34, 85, -247, 58, 553, 75, -525, -111, 232, -148, 531, 24, -328, -162, 415, -339, 430, -47, 221, 23, -728, 571, 265, 359, -401, 735, 393, 53, -159, -624, 217, 169, 134, -690, 297, -91, 485, -333, 506, 122, 268, -24, -14, -18, 33, -408, -291, 129, 53, 174, 194, 297]
4699B97%j12n16K85M6j64J73K8K3N46J67j056J25m87N96p08P67k64P0O35P8l93
4721A36N9m75n29P83l92m89P64J156l53r03L80N82m48l56N44l01rK03M28r58M54
4742B76n27M41L83m45l34J5k74M57n3Q49o14K36p53Q26j533P10O71n67K81k60
4762b15n38R20m1n04R33p13j73L77O81j311J359m98n51J039p96j88m92J80N68
4781C7l49O90p31M60m0j20q7M47q16J6N76p79K05J471n11m83N8O0P69j970R06
4802a91j72K14N23n40P67o61O89o45R45q35r8J3j26j28M08p57M92P04n98R0k3
4823G1k6O14j80l88J28k83j53J41J7l03L3K00J55k31M41M60m76m4l53J82o48M74
4845a69k19m28P43p97P92N42j71K11j35o1p28J63K67n36JJ83M3L10O78p99P5M96
$$ y = [297, 297, 185, -331, -46, 0, -164, 9, 37, 60, 606, 773, -283, -158, -645, -49, -757, 10, -254, -184, 451, 529, 136, 195, -280, -809, -26, -418, -907, -143, 1013, 660, -243, 137, 719, 271, -85, 459, 158, 149, 352, 780, -178, 276, -251, 190, 573, 128, -206, -191, -465, -8, -61, 788, 174, 410, -343, 483, -1050, -340, 331, -236, 45, -215, -753, 167, 126, -378, 555, -158, -331, 46, 727, -584, 775, 277, -274, 765, -31, -219, -711, -531, 37, -312, 378, -353, 107, 67, -53, -140, 307, -509, -493, 83, -696, -491, 980, 469, -14, 44, 104, 873, -1097, -191, -363, -149, 374, -166, 601, -60, 629, -16, 929, 94, -4, 9, -117, -245, 163, -594, -102, 602, 4, 94, 71, 45, 659, 479, 91, 219, -64, -217, -76, -59, -362, -329, -129, 26, -205, 236, 696, 220, 176, -177, 5, -643, -169, -388, -816, -73, -870, -78, 464, 293, 504, 369, 308, -420, -257, 10, -526, -525, -342, -299, 11, 689, -110, -35, 461]
4867D61k6r29M26q69O49j48K72J06L54N05m75k02j15K95o40J86j52L61n46P9M90
4888H2K99O1k13n63J39L21p03L02j32M08M91l20p69J062j150J564j069m03J111
4907E18j82j71Q8p15N74m9j65j80p8Q57p57L65m12K4L67j5m31N91o59O69k54K60
4929B45p1m55M46m03J68M21R9j328J043L04n32K50l55K21M87j014P44J94j201
4948g37P27k0l8K6o63O74N92n18o48J220j395J127o59J65J231j705P64N90n84
4967A49J68m35L72l43J01r03R90k89M07M2m14L99l69q34P73N62o9m81K73j79J
4988g9N8KM75j27l59J67P96p55p34L67L7p6K50j3k57J62L65p91N63Q5R4p64P35
5011B01n74L69j05l9j72R68p20L33k48K96L86n29k96p44N53O45l90J65n53J49
$$ y = [461, 435, -494, -68, -937, -288, -436, -164, -58, 296, 801, 326, 124, 9, 304, -336, -150, -302, 59, -487, -408, 82, 381, 442, 229, -334, -195, 126, -577, -275, -407, 1, 492, 172, -597, 465, -685, 879, -190, -593, 518, 336, 165, 253, -462, 112, 63, -102, -282, -360, 497, -260, 105, -307, -283, 84, 69, -362, 229, -430, 239, -15, 245, 174, -281, 165, -238, -70, 351, 450, -878, 165, 469, -63, 187, -168, 53, 540, -474, 270, 464, -737, -10, -30, -68, -42, -705, -31, 561, 43, -605, 615, -780, 347, -312, -147, 1084, -621, 143, 733, 149, 317, -118, 254, -89, 12, -891, 99, -190, 217, 259, -155, 244, -125, -959, -186, 376, 307, -174, 99, -80, -79, -21, -19, 456, 329, -30, 137, 933, 178, -556, -189, -152, -228, 22, 9, -248, -86, 279, -512, 51, 136, 230, -534, 201, -373, -4, -109, -148, -320, 648, -72, 261, 13, 309, 695, 166, -130, -874, -321, 324, -66, 99, -454, -305]
5031c05L46l99M58r8P3j07r7j20L71o0j087J265p5j24Q7l60O55k54M71m25m43
5052b28L06m14R84o61O05k76o54L98r4P92k14r30L84L68o93K75o3J36O4N47k77
5073C55K27k85j10R4l37m48M59m1K55k46K2k83O47M40r90O82o98N2m07R76k44
5094A20N41o06o37R65J5l50O36n33j127Q75K46l74R93l83l84K64j37k72k37L34
5114e1k51J63K89P4k59M53p65L31k72K93n27l8J54Q54l12N2J88J68n65n15J348
5135H12m34p31J60J34n8J72l7K21q02M16j53N53n52P62o74N61k79N67J5n48q36
5156g31J093k12q5L26k10j38K54j102O53M07j24k44L31p16L45P33o35R4P8J97
5176C14r88N05K13l50l08J104p00m20K93l1Q4N18J11j66M8L73l84k50m64N59o47
$$ y = [-305, 41, -358, 100, 2, 75, -32, -129, -249, 122, 62, -1025, 240, 165, 41, 128, -232, 423, 169, 640, 215, -228, 78, -336, 648, -13, 592, 316, -338, 60, -34, 758, 544, -386, -2, 366, -327, -52, -115, 21, 85, 632, 355, 582, 297, 187, 281, -56, -504, -45, -86, 169, -77, -55, -338, 309, 749, -241, 441, -257, -205, -612, 364, 120, 661, 55, -582, 383, 398, 48, 684, 151, -976, -101, 145, -229, 764, 381, -3, 261, 124, -148, -385, -51, -302, -139, 150, 224, -35, 418, -347, -16, -288, 5, -522, -560, -406, 448, 136, 188, 376, 544, -21, -536, 812, 378, -353, -193, -59, -117, 55, 18, 239, -563, -147, -300, 253, -299, 463, -211, 350, 71, 638, 653, 105, -731, 362, 150, 65, 391, 181, 43, 297, -805, -152, 255, 131, -113, 218, -498, -153, 580, -55, 39, 117, 314, -674, -169, 44, -306, -614, 490, -210, -630, -337, -368, -284, 234, 345, 179, 227, 600, 216, -34, -498, 61, -586]
5197e86kL52O06j38Rn31J60N2J04l40M77K61o01J71m94n2K77J422q05p72k40J189
5219E19l03l04L31J31p71Q86m19m70k78R43m80R7m6N00j399N13K61N69q7l11J22
5240Dp5J44K46K8n15J12k2K80n2J68l77n38M77L84l8m39L5j8J00j78l17R31j52
5263A88j54K30j15l22L97p02Q82q76L16k1n19R46K51n83M4l4P08K10p87k14K86
5284A31l87J89j15M87M98l48n01O11k28j103N48K62L41q09R75n78L09j13R4L16
5304E79m7r40n3O56q44J134L04j286J348o97j040L91P36j3j0k03o48M54M2M62
$$ y = [-586, -588, -236, 370, 232, 241, -290, -130, -78, 26, -314, 163, 424, -177, -6, -500, -552, -275, 1147, 342, -430, -670, 519, 216, -88, 243, 374, -397, 489, 70, -400, -678, 265, -215, -118, -164, 336, -1063, -550, -289, 280, 193, -118, 4, -71, 73, 319, 347, -168, -56, -78, 202, 150, 318, -59, -597, -120, 264, 226, -213, -178, -196, -96, -274, -591, 340, 188, 34, 264, 149, -173, 224, -478, 404, -472, -156, -177, -696, 250, 501, -82, -38, -72, 636, 846, 59, -155, 131, -256, -67, -182, 305, 803, 455, -46, 565, 337, -766, -218, 44, 385, -424, 551, -27, 282, 169, 263, 579, 532, -408, -461, 195, -649, 485, 789, -497, 851, 154, -886, -495, 241, 228, 218, 15, -633, -179, -137, 325]
$$ [...]
8191A2
##END NTUPLES=NMR FID
##END=
