##TITLE=1H_IAMT-159
 DMSO-d6
 8 sc, 
 11.05.2022
##JCAMPDX= 6.0         $$ Bruker NMR JCAMP-DX V2.0
##DATA TYPE= NMR FID
##DATA CLASS= NTUPLES
##ORIGIN= UXNMR, Bruker Analytische Messtechnik GmbH
##OWNER= root
$$ XWIN-NMR		Version 3.5
$$ Wed May 11 15:43:12 2022 Russian Standard Time (UT+4h)  she@DPX200
##.OBSERVE FREQUENCY= 200.1313499996
##.OBSERVE NUCLEUS= ^1H
##.DELAY= (6, 6)
##.ACQUISITION MODE= SIMULTANEOUS
##.ACQUISITION SCHEME= undefined
##.AVERAGES= 8
##.DIGITISER RES= 18
##SPECTROMETER/DATA SYSTEM= spect
##.PULSE SEQUENCE= zg30
##.SOLVENT NAME= DMSO
##.SHIFT REFERENCE= (INTERNAL, DMSO, 0, 15.7039)
##AUDIT TRAIL= $$ (NUMBER, WHEN, WHO, WHERE, WHAT)
$$ ##TITLE= Audit trail, XWIN-NMR		Version 3.5
$$ ##JCAMPDX= 5.01
$$ ##ORIGIN= Bruker BioSpin GmbH
$$ ##OWNER= she
$$ F:/spectra/data/she/nmr/H-F/1/audita.txt
$$ ##AUDIT TRAIL=  $$ (NUMBER, WHEN, WHO, WHERE, WHAT)
(   1,<2022-05-11 15:41:59.89 +0400>,<she>,<DPX200>,
      <created by zg, POWCHK disabled, PULCHK disabled
       configuration hash MD5:
       00 E9 B6 7A A2 85 ED C7 34 08 36 98 17 FE 4E 26
       data hash MD5: 16K
       C0 72 57 9C 93 76 5F 23 82 55 E0 A1 94 DD 76 CE>)
$$ ##END=
$$ 
$$ hash MD5
$$ 6D 44 5B 9A C6 DC BC 70 DD C2 D0 46 70 58 0F 74
##$RELAX= 
##$RELAX= 
##$RELAX= 
##$RELAX= 
##$RELAX= 
##$RELAX= 
$$ Bruker specific parameters
$$ --------------------------
##$DU= <F:/spectra>
##$EXPNO= 1
##$NAME= <H-F>
##$PROCNO= 1
##$TYPE= <nmr>
##$USER= <she>
##$AMP= (0..31)
100 100 100 100 100 100 100 100 100 100 100 100 100 100 100 100 100 100 
100 100 100 100 100 100 100 100 100 100 100 100 100 100 
##$AQSEQ= 0
##$AQ_mod= 1
##$AUNM= <au_zg>
##$AUTOPOS= <>
##$BF1= 200.13
##$BF2= 200.13
##$BF3= 200.13
##$BF4= 200.13
##$BF5= 200.13
##$BF6= 200.13
##$BF7= 200.13
##$BF8= 200.13
##$BYTORDA= 1
##$CFDGTYP= 0
##$CFRGTYP= 5
##$CHEMSTR= <none>
##$CNST= (0..31)
1 1 145 1 1 1 1 1 1 1 1 1 1 1 1 1 1 1 1 1 1 1 1 1 1 1 1 1 1 1 1 1 
##$CPDPRG= <>
##$CPDPRG1= <>
##$CPDPRG2= <>
##$CPDPRG3= <>
##$CPDPRG4= <mlev>
##$CPDPRG5= <mlev>
##$CPDPRG6= <mlev>
##$CPDPRG7= <mlev>
##$CPDPRG8= <mlev>
##$CPDPRGB= <>
##$CPDPRGT= <>
##$D= (0..31)
0 1.2 0 0 0 0 0 0 0 0.06 0 0.03 0 0 0 0 0.0002 0 0 0 0 0 0 0 0 0 0 0 0 
0 0 0 
##$DATE= 1652269319
##$DBL= (0..7)
120 120 120 120 120 120 120 120 
##$DBP= (0..7)
150 150 150 150 150 150 150 150 
##$DBP07= 0
##$DBPNAM0= <>
##$DBPNAM1= <>
##$DBPNAM2= <>
##$DBPNAM3= <>
##$DBPNAM4= <>
##$DBPNAM5= <>
##$DBPNAM6= <>
##$DBPNAM7= <>
##$DBPOAL= (0..7)
0.5 0.5 0.5 0.5 0.5 0.5 0.5 0.5 
##$DBPOFFS= (0..7)
0 0 0 0 0 0 0 0 
##$DE= 6
##$DECBNUC= <off>
##$DECIM= 24
##$DECNUC= <off>
##$DECSTAT= 4
##$DIGMOD= 1
##$DIGTYP= 9
##$DL= (0..7)
0 120 120 120 120 120 120 120 
##$DP= (0..7)
150 150 150 150 150 150 150 150 
##$DP07= 0
##$DPNAME0= <>
##$DPNAME1= <>
##$DPNAME2= <>
##$DPNAME3= <>
##$DPNAME4= <>
##$DPNAME5= <>
##$DPNAME6= <>
##$DPNAME7= <>
##$DPOAL= (0..7)
0.5 0.5 0.5 0.5 0.5 0.5 0.5 0.5 
##$DPOFFS= (0..7)
0 0 0 0 0 0 0 0 
##$DQDMODE= 0
##$DR= 18
##$DS= 0
##$DSLIST= <SSSSSSSSSSSSSSS>
$$ [...]
##$SUBNAM2= <"">
##$SUBNAM3= <"">
##$SUBNAM4= <"">
##$SUBNAM5= <"">
##$SUBNAM6= <"">
##$SUBNAM7= <"">
##$SUBNAM8= <"">
##$SUBNAM9= <"">
##$SW= 26.0245750270697
##$SWIBOX= (0..15)
0 0 2 0 0 0 0 0 0 0 0 0 0 0 0 0 
##$SW_h= 5208.33333333333
##$TD= 16384
##$TD0= 1
##$TE= 0
##$TE2= 300
##$TE3= 300
##$TEG= 300
##$TL= (0..7)
0 120 120 120 120 120 120 120 
##$TP= (0..7)
150 150 150 150 150 150 150 150 
##$TP07= 0
##$TPNAME0= <>
##$TPNAME1= <>
##$TPNAME2= <>
##$TPNAME3= <>
##$TPNAME4= <>
##$TPNAME5= <>
##$TPNAME6= <>
##$TPNAME7= <>
##$TPOAL= (0..7)
0.5 0.5 0.5 0.5 0.5 0.5 0.5 0.5 
##$TPOFFS= (0..7)
0 0 0 0 0 0 0 0 
##$TUNHIN= 0
##$TUNHOUT= 0
##$TUNXOUT= 0
##$USERA1= <user>
##$USERA2= <user>
##$USERA3= <user>
##$USERA4= <user>
##$USERA5= <user>
##$V9= 5
##$VALIST= <valist>
##$VCLIST= <CCCCCCCCCCCCCCC>
##$VD= 0
##$VDLIST= <DDDDDDDDDDDDDDD>
##$VPLIST= <PPPPPPPPPPPPPPP>
##$VTLIST= <TTTTTTTTTTTTTTT>
##$WBST= 1024
##$WBSW= 4
##$XGAIN= (0..3)
0 0 0 0 
##$XL= 0
##$YL= 0
##$YMAX_a= 35678
##$YMIN_a= -46773
##$ZGOPTNS= <>
##$ZL1= 120
##$ZL2= 120
##$ZL3= 120
##$ZL4= 120
##$ABSF1= 10
##$ABSF2= 0
##$ABSG= 5
##$ABSL= 3
##$ALPHA= 0
##$AQORDER= 0
##$ASSFAC= 0
##$ASSFACI= 0
##$ASSFACX= 0
##$ASSWID= 0
##$AUNMP= <proc_1d>
##$AZFE= 0.1
##$AZFW= 0.1
##$BCFW= 1
##$BC_mod= 2
##$BYTORDP= 1
##$COROFFS= 0
##$CY= 11.3945322036743
##$DATMOD= 1
##$DC= 2
##$DFILT= <>
##$DTYPP= 0
##$F1P= 2.36226072786647
##$F2P= -0.459571619588291
##$FCOR= 0.5
##$FTSIZE= 0
##$FT_mod= 4
##$GAMMA= 1
##$GB= 0.15
##$INTBC= 1
##$INTSCL= 1
##$ISEN= 128
##$LB= 0.24
##$LEV0= 0
##$LPBIN= 0
##$MAXI= 10000
##$MC2= 0
##$MEAN= 0
##$ME_mod= 0
##$MI= 1.114404
##$NCOEF= 0
##$NC_proc= 0
##$NLEV= 6
##$NOISF1= 3.799351
##$NOISF2= 2.8
##$NSP= 1
##$NTH_PI= 0
##$NZP= 0
##$OFFSET= 15.70392
##$PC= 1
##$PHC0= -17861.69
##$PHC1= 15.60075
##$PH_mod= 1
##$PKNL= yes
##$PPARMOD= 0
##$PSCAL= 0
##$PSIGN= 0
##$REVERSE= no
##$SF= 200.130013532006
##$SI= 16384
##$SIGF1= 3
##$SIGF2= 2
##$SINO= 400
##$SIOLD= 16384
##$SREGLST= <1H.CDCl3>
##$SSB= 0
##$STSI= 0
##$STSR= 0
##$SW_p= 3612.71676300578
##$SYMM= 0
##$S_DEV= 0
##$TDeff= 0
##$TDoff= 0
##$TI= <>
##$TILT= no
##$TM1= 0
##$TM2= 0
##$TOPLEV= 0
##$USERP1= <user>
##$USERP2= <user>
##$USERP3= <user>
##$USERP4= <user>
##$USERP5= <user>
##$WDW= 1
##$XDIM= 8192
##$YMAX_p= 0
##$YMIN_p= 0
$$ End of Bruker specific parameters
$$ ---------------------------------
##NTUPLES= NMR FID
##VAR_NAME=  TIME,          FID/REAL,        FID/IMAG
##SYMBOL=    X,             R,               I
##VAR_TYPE=  INDEPENDENT,   DEPENDENT,       DEPENDENT
##VAR_FORM=  AFFN,          ASDF,            ASDF
##VAR_DIM=   8192,          8192,            8192
##UNITS=     SECONDS,       ARBITRARY UNITS, ARBITRARY UNITS
##FACTOR=    0.000192,      1,               1
##FIRST=     0,             0,               0
##LAST=      1.572672,      0,               0
##MIN=       0,             -46773,          0
##MAX=       1.572672,      35678,           0
$$ Real data points
##PAGE= N=1
##DATA TABLE= (X++(R..R)), XYDATA
0@%%%%%%%%%%%%Pj5J6j6J6k1K8l1L7m4N0n7O6p5Q4r7J12j26J40j57J78k01K22
35A16k47K77l08L41l79M21m65N13n68O29o97P74q61R62j076J209j370J564j805
54i70K117k533L121m028N633r341L7650o061m9822j3305N178L1358K3510J1549
68C4056j3178k1248k0351m563Q135J7632J3445P662p350j1667j3258r388N74J4278
82e221J7737J0875l753j5878k0182r153R318J8627J7418L878j4252j6667j2307
95a9560J537J1730J5747P878l842j0798j0884m419K963O050Q690M817q57m940
109D112p212o585o97N685R112O500j23o340r771o051J450Q226R279L436l751q274
125a004p126q83M183P840L549q6m081n005k547Q0K522M123K319P43j581k942l820
$$ plain form
0 0 0 0 0 0 0 0 0 0 0 0 0 0 7 -8 8 -8 8 -13 15 -16 21 -23 27 -30 36 -39 45 -52 60 -66 74 -83 95 -106 116
35 116 -131 146 -162 179 -200 221 -244 269 -299 330 -367 407 -454 508 -568 641 -729 835 -970
54 -970 1147 -1386 1735 -2293 3340 -6001 31649 25588 -24234 -37539 -32361 -1003 22507 34056
68 34056 20878 -370 -20721 -25284 -17149 483 13928 21590 14240 2573 -10685 -20073 -19499 -5221
82 -5221 12516 23391 19638 3760 -16422 -25575 -16257 2370 19788 23666 9414 -7253 -19560
95 -19560 -18023 -6293 9454 17332 13490 2692 -8192 -12611 -9648 -3598 5092 9909 9052 4112
109 4112 -3100 -9685 -10382 -4697 4415 10915 10792 4452 -5319 -11370 -9920 -1694 7585 11021 7270 -1004
125 -1004 -8130 -9013 -4830 3010 6559 6473 2392 -2613 -5160 -5080 -2558 1565 3884 4627 3046 104 -3716
142c716j476J613L970M419P68k853m361m011K92L460M667L048j557l233m135j696
158d801J913K818L245M46j699k340j529r70J011K333J135N02K34k046k119r47
174b814Q00J682K140R64q12k547j609m33R37K616J428J49k275k109r59J495J440
191I3J033N72l43r35j270o44J20J397M21J584p18j587m34r30k40J237J486J551
209B393p88j833r69n46L14J980J074J0r02j344o20Q5J346R01N74j15j772q85k76
228a373L67Q21Q64J73n79L15j520l02M11K01R55J487j023l16j383j016J731M12
246B25Q97J11k43j059p63l57N00J592n50O51j270j09m79M0L74M48P82l02l50j95
266e7k02q39O45O83N37J038j095j620J7k28J122R60j06n34L17j634J093p92R81
$$ plain form
142 -3716 -5192 -3579 391 4810 5578 2725 -1636 -5647 -5355 -1895 2772 5820 4263 1030 -3105 -4801
158 -4801 -2888 -70 3175 3621 1922 -418 -1947 -2917 -1906 427 1562 2064 2298 252 -1867 -2814
174 -2814 -2014 -332 1808 2772 1960 -587 -2196 -2629 -1692 924 2352 2501 226 -1883 -2842 -1347 93
191 93 1126 1698 1355 420 -850 -1494 -1374 23 444 2028 1310 -277 -711 -1641 -1881 -644 842 2393
209 2393 1605 -228 -1197 -1743 -1429 551 1625 1635 733 -611 -1231 -1146 200 1101 1675 1560 -212 -1097 -1373
228 -1373 -1006 -185 679 852 273 588 -932 -1234 -823 -622 333 1820 797 481 -902 -1918 -187 225
246 225 1122 1233 990 -69 -832 -1189 -689 903 353 1004 -266 -375 -854 -814 -440 8 790 488 138 -57
266 -57 -259 -1098 -453 230 767 1805 710 -910 -893 -1121 1 961 855 321 638 -996 97 -695 286
285B86K50L4j75L60j092J70L96K84o99N85r0J21Q4q44K06K07J3R62l89r24j8n1
307c24K87N57J49n04q10K60J91m98R84j70J42o42J078o50m50K58J07k68K08N49
327D54l32P9q46J10j02J087K74n54K23m44o30P58l93M62Lj3m09m8J56l0L98N7
349B60J44m79O9Om2m4j06K74L12n29N8m2j54K84K71m43j4m8K80k90J41K01K84
372C93j29j07k49l77L06q0J36J25j9k43q1L66r07O03O69m51P34n43N6l89q7Q6
394a88L46j2K39l67j2k80j19j52N85K98k37j49k43M02j98O2M42o68M65m77L58
415I5M9r22N90r4K71K69l49K21r10N90K71K27j7M51m46m12k11K01O1M27k44m5
437G3j04J12J46o23M44l44J94m6M43k99O98l61k31l92J44L58k42K18m19m17L86
$$ plain form
285 286 536 570 395 755 -337 -167 229 513 -186 399 309 430 514 -330 -124 83 96 1058 669 -255 -273 -324
307 -324 -37 520 669 165 -645 -385 -194 -692 292 122 264 -378 700 50 -400 -142 -35 -303 -95 454
327 454 122 201 -645 -535 -637 450 724 170 393 -51 -681 77 -316 146 149 136 -273 -321 -165 -195 203 260
349 260 404 -75 -6 0 -42 -86 -192 82 394 -135 -77 -119 -273 11 282 -161 -175 -223 57 -233 -92 109 393
372 393 264 157 -92 -469 -163 -243 -107 18 -1 -244 -325 41 -866 -263 406 -45 689 146 202 -187 -274 -188
394 -188 158 146 385 18 6 -274 -393 -545 40 338 101 -48 -291 111 -87 -25 417 -251 214 -263 95
415 95 144 -778 -188 -282 -11 258 -91 130 -780 -190 81 308 291 742 296 -116 -327 -126 -65 362 118 73
437 73 -31 81 227 -396 48 -296 -102 -148 295 -4 694 333 102 -290 -146 212 -30 188 -231 -648 -262
458b62P22n73r0j09J06k09J41R1L73k98K61J90l97m48K66J05L64J06k51l0On29
480d65L73M87j32m24j0P1K86k52J83J02M2k96k0n96P46j45j58j87M91n09j30P24
502A81k84J40k6O40k78l75R3m8j23k33K43K31l05J68M36n08j84k12J23O92n08
523a37R53q81R3J49r7n93M49k12p30Q91O7r8K33M5J5K36m74K14k12J11J18l39
545a99R7l15O57m76p0n2q2J006r01L54m82O00J60q36N34O2n3L16k30j05j32j16
567b63L32l58Q24j074Q26k50k64K17n02N97n3j31J496r99l13j8n92Q84m6n23j89
588c99M88n85J304m29K75r75P88k72K12l37l76J86J17k45J87r58N18L00n52J272
608E19o86M91p30R84j114M33M46N2j06n77K98P8K7O59o35N37l68r32J215j082
$$ plain form
458 -262 460 -113 -203 -312 -206 -415 -274 -183 190 -108 153 343 -54 -502 -236 -131 233 339 88 58 64 -465
480 -465 -92 395 263 -161 -171 -100 186 -66 117 219 261 -35 -55 -651 95 -50 -208 -395 96 -413 -543 181
502 181 -103 37 11 651 373 -2 91 43 -80 -313 -70 161 -144 24 460 -48 -232 -444 -321 371 -137
523 -137 816 -65 28 177 80 -513 -64 -276 -1006 -115 -48 -146 87 132 147 383 -91 123 -89 22 140 -199
545 -199 -102 -417 240 -236 -306 -358 -440 566 -335 19 -463 137 297 -539 -5 57 4 320 90 -15 -147 -263
567 -263 69 -289 535 -539 287 37 -227 -10 -512 85 32 -99 1397 398 85 67 -525 359 313 -210 -399
588 -399 89 -496 808 379 654 -321 467 195 407 70 -306 -120 -3 -248 -61 -1019 -501 -201 -753 519
608 519 -167 324 -406 578 -536 -103 343 395 289 -288 10 88 115 774 139 676 308 -624 591 -491
628d91O66k43m3l80j36Q23J57N99n3o05Q29j233J877j359j037J311j294J502q36
647E4L66l02j59M79m34j128J673J317k143L88l96J14n92L21K36k27K297k044o13
666g93j76K78J68J88L22n79Q44p03Q29k19L49J36m33M02j399R61l15K10K55o04
686b79N07m50j60J48J51m79M50j23Q87k77j65m15k37R3N01q63J359l94p03R52
706E03n17K52J46p42R93p52O19l77n06n32O27M63l48J60J019M22j173j30N31k13
726D45n66m47j50Q31O77r11l01Oj42m08Q59k95N93j24n77J323n53M03j121L84
746g4o09O27p67L63Q00M3j071J109J31k99o53J361o02o57K34j13K8j17J005p30
766Ij127Q04O71M36J74r99N53j342M06n02M02Q7k74J517m12m85L42n28N25j730
$$ plain form
628 -491 175 -68 -111 -491 -627 196 353 952 899 294 1123 -110 1767 408 -629 682 -612 890 54
647 54 420 118 -41 438 4 -1124 549 1866 -277 111 -285 -171 -763 -442 -206 -433 1864 -180 -793
666 -793 -969 -691 -523 -335 -13 -592 252 -451 378 159 508 644 211 613 -786 175 -140 70 325 -279
686 -279 228 -222 -382 -234 -83 -562 -112 -235 652 375 210 -205 -442 -349 152 -711 648 254 -449 503
706 503 -14 238 384 -358 635 -117 502 125 -381 -913 -286 177 -171 -11 1008 1430 257 127 658 445
726 445 -121 -568 -718 113 790 -121 -422 -416 -558 -966 -107 -402 191 67 -510 813 260 663 -458 -74
746 -74 -683 -56 -823 -460 340 383 -688 421 552 253 -400 961 359 -298 -64 -177 -149 -266 739 9
766 9 -1118 -314 357 793 967 -32 521 -821 -415 -917 -515 -428 -702 815 403 -82 260 -268 257 -1473
786a473J677o1K52p63Q10k31m61K16j13k87J014k69q80Q61k98k92Q66n05j285
805a222Q43R6Q2Q80j403J74O85J03l82L42l71j47M98k72p44P60P48j090J66L10
825E6J06p97O39n05J381j973J143L53o1n92M07N85k00J19J29j850R01M86p04K24
845a53M45l63J66L03M92j628j96L67J407j178M42P32j91n53n78J135M10k045L30
864f56M83k08R51n18J193k121M32Q42Q2p21M45j113Q44J209k004J413j668J342
882B27N89j494J081n72l87O9Q31j26K0j11l85n71J234k72j028J239j416O27J043
901E98j325M72K14P4p04P84l66N8M0J97r70J253o97M47q73J331o67l57N64j090
921a017J74P19M58P80m27j89o29l64O11L25p4p99J29l69Q63Q77j325K1K10K6L45
$$ plain form
786 -1473 204 143 395 -368 442 211 -250 -34 -147 -434 580 311 -569 292 -6 -298 568 63 -1222
805 -1222 -379 -283 -201 679 -724 -550 135 238 -144 198 -173 -320 178 -94 -838 -78 670 -420 -254 56
825 56 162 -635 4 -501 880 -1093 50 403 342 -250 157 742 542 661 790 -1060 -159 327 -377 -153
845 -153 292 -71 95 398 890 -738 -934 -567 840 -338 104 836 645 92 -486 649 1059 -986 -656
864 -656 -173 -381 570 52 1245 -876 -444 398 480 -241 204 -909 -65 1144 -860 553 -1115 227
882 227 816 -678 403 -169 -556 -487 344 218 238 127 -258 -829 405 133 -895 344 -1072 -445 598
901 598 -727 -255 -41 33 -671 113 -253 -195 -155 42 -928 325 -372 75 -798 533 -134 -491 73 -1017
921 -1017 -843 -124 334 1114 687 498 -131 -495 116 441 367 -432 -303 -672 191 1068 -257 -236 -26 0 345
942C45p46Q1J197q18J50l93l89n33J151o56Q34J82p26J5M94l34p1l21P92n05j09
963c60J36K86J82n56k58J318m75k4r16Q40k8J3L0k42k19R14n26Q21j613P95o03
984d85l10N06J023q22k18K6q09Q87J41k3m24N99K41k9R25o73l74Q96j02j349j32
1005e06P21J1K01j598J100R14j529R55j047q3J011j91k85N90o7J06J2n58l66M9
1025e60P95J71j966J439O08o60P69q9j282O15j38N79j68l29M75pr8J324j363R7
1045B12J54m31k02O22J7n76k51N11L3M68r74K67m57Q94l20n04M96L61j002J052
1065C70q51Q67j602J073J85j198J648P6l17j260K22R72L65j091N2N27l94k11K24
1084c43l47j78P71n40Q59l66K14N63j028N63l41K98Q0n2l79k53L12O19m11j18
$$ plain form
942 345 -401 -320 877 59 209 -184 -573 -1106 45 -611 223 405 -321 -306 188 -146 -217 -538 254 -251 -360
963 -360 -224 62 244 -312 -570 748 273 249 -667 173 145 158 188 -54 -273 641 115 936 -677 118 -485
984 -485 -795 -289 734 -88 -306 -280 -1089 -202 -61 -84 -508 91 332 303 1228 555 181 1077 975 -374 -506
1005 -506 215 226 427 -1171 -71 843 -686 269 -778 -861 150 -41 -326 264 197 303 315 -243 -609 -560
1025 -560 235 406 -1560 -121 487 -173 596 507 -775 -160 -298 281 113 -216 259 252 154 1478 115 212
1045 212 366 -65 -267 355 372 -204 -455 56 89 557 -417 -150 -607 287 -33 -537 -41 320 -682 370
1065 370 -481 386 -1216 -143 42 -1156 492 568 251 -1009 -787 185 550 -541 -489 38 -356 -567 -343
1084 -343 -690 -868 -97 -637 222 -144 70 633 -395 168 -173 125 205 153 -226 -479 -167 452 41 -77
1104g7Rm58L15o75R56o17P06m32R60n71K6M2m46K94j132J251l24k07j35K09O05
1125B99m26J68K78m03O25l07j45J87p95K29K39L77k31k81N14L5j74j74r6K45N35
1146F99l96l84Rq0L46J83Q0r53P7M49P14R0k49J82K99j02r17m56n38M5R7J049
1168B44l90Q07m96k126K474p51l50O84K85l78M31m93j77J98L71l26R9K33r76N77
1188f0P92l66j076K78lM32l46L65j4M5o32J98M06K79L46n96M10j049J045j215
1208g61N80l37K57k37o40P73K5RL96k49L00J94k82n5J07N58j599K41J283j050
1228d87k43N91m60J083l40j3q47j63l59J395o66J213p54j66P46j271M72J6j92
1247d45j48k5R22J15m99o36J051l84k00P75N1r29r0O44n60m9N12K03QL60m71o29
$$ plain form
1104 -77 -68 -526 -211 -886 70 -547 159 -273 687 116 142 184 -262 32 -1100 151 -173 -380 -515 -306 299
1125 299 -127 41 319 -84 541 234 89 276 -519 -290 -51 326 95 -186 328 363 189 15 -81 164 699
1146 699 303 -81 -72 -152 194 377 457 -496 -419 30 744 834 585 767 1066 964 47 -409 -947 -902 -805 244
1168 244 -146 661 165 -1961 513 -238 -588 96 381 3 434 -59 -236 -38 333 7 106 339 -637 -60
1188 -60 732 366 -710 -432 -435 -3 -349 16 2 47 -585 -387 19 298 644 48 458 -591 454 -761
1208 -761 -181 -518 -261 -498 -1138 -365 -340 -331 65 -184 116 310 28 -27 80 638 -961 -720 563 -487
1228 -487 -730 -139 -599 484 144 131 -716 -879 -1238 157 -509 704 -50 -216 530 -741 -269 -253 -445
1247 -445 -593 -618 304 419 -80 -716 335 -49 -249 526 577 -352 -442 202 -358 -407 105 308 316 676 205 -424
1269d24O61o84L55J05q62R52j275Q33J69K04j24J05j247P97Q31l90l05L60k16
1288a55N56l03m32J85m59N9N22K61k96MK91o84K30N01m97j1J15O6L5O02R1q70
1310a89R8J525j965K2M15K28k56k42J337J8r82M69j564R65j14m4R62n57L01m0
1330C87o28K38P4M51m66O3o01J11L13j020R70l71N51J159j502N6N64K28J29j082
1350c76J71L84L64p94l05P4K09N07p87L95M01q28K05J39L00n42N84J76p45q19
1370a287L67J118j69M26j213J176R73k542P55j35j76R5r10K112j461J275q05N21
1388A20j496J238%J194k009J052k72P86j00j104R23j501J309q78Q49l99M87L10
1406E09r82L21j090J799p1q96j04M75k5L08l24J162j276P80l36p13Q11n43R75
$$ plain form
1269 -424 237 -447 -92 13 -849 103 -1172 -339 -170 34 -90 15 -1232 -435 396 6 -299 61 -155
1288 -155 401 98 -334 -149 -608 -549 -27 234 -62 -58 233 -451 -221 280 -217 -228 -113 -47 -12 590 681 -189
1310 -189 -91 1434 -531 -509 -94 134 -122 -364 973 991 9 478 -1086 -121 -235 -279 683 126 427 387
1330 387 -241 -3 71 522 56 119 -482 -371 -58 -1078 -108 -479 72 1231 -271 -215 349 577 706 -376
1350 -376 -205 179 543 -251 -556 -482 -273 234 -553 -158 243 -585 -380 -241 59 -483 101 277 -468 -1287
1370 -1287 -920 198 29 455 -758 418 1391 -1151 -396 -531 -707 -612 -1522 590 -871 404 -401 120
1388 120 -1376 -138 -138 1056 -953 99 -173 613 513 -591 332 -1169 140 -738 111 -288 199 509
1406 509 -473 -152 -1242 557 486 -410 -514 -39 -64 244 -80 1082 -194 586 250 -463 348 -195 780
1425G80j861P31J92J25J336j630J146j021j20l37J163o41O4L00m86q6M44k16Q27
1444G10k29q69J098k149J737m78m91N58p9j21l26o9p4J780j221M8M00r74K122
1463A373n92j378J568o1k238L72J799j346m0P2K15L8p70k99O75Q28k98J42J046
1482A106k118J873k009K314j068j409J885r86N16J0j50m06R68j144K08j042J622
1499A70o41p62R29j58L9Q19j439P25J504j760j35J615j290R74j500J812L93j581
1517b86P25J397k950J548j401O90R15r9j059J856j158n70J021j195J134L83j425
1534d74l69J447j232L91M10KK6j661J476l34J09O38K35j844O5K050l51J065q47
1553H02j317O48M32j45j333K73J327j100M92L5r72J140k30k10J14l7q45R13l24
$$ plain form
1425 780 -1081 -350 -158 -33 1303 -327 819 -202 -322 -659 504 -137 -73 227 -259 -345 99 -117 710
1444 710 481 -388 710 -1439 298 -180 -671 -113 -192 -313 -639 -708 -782 998 -223 -175 225 -749 1373
1463 1373 781 -597 971 910 -1328 -956 843 -503 -543 -471 -256 -218 -988 -1287 -612 216 -82 60 1106
1482 1106 -1012 861 -1148 1166 98 -1311 574 -412 104 114 -36 -442 526 -618 -410 -1452 170
1499 170 -471 -1233 -304 -462 -423 396 -1043 -318 1186 -574 -709 906 -384 590 -910 902 1295 -286
1517 -286 439 1836 -1114 434 -967 -277 638 539 -520 1336 178 -392 629 -566 568 951 -474
1534 -474 -843 604 -628 -237 173 175 201 -1460 16 -318 -209 429 664 -1180 -1115 935 584 1649 802
1553 802 -515 133 565 420 -913 -640 687 -413 79 114 -858 282 52 -158 -44 -81 -926 -13 -337
1572c37N03n77J23M75m79P65N31k17j166P11M55p34k53M75m62O92j2l90l95m88
1592g80j0J17O05p47J013o8K28n74m3M56l16K40n08P56p50J626q86l38P41m07
1612C55J53r49M8O8K71l98M22N54o3m49l54P76K78q13j49L24K2j84J01j33J86
1633F6l7J078j247k53J26p39N42M84M50l33J98k59l81j17j98L01P75r67Q46K08
1653E43j492M73P99j088J577j567P87m81K96K37j33R95r77k65J033j007J144p60
1671A14o34p5Q76j003Q02l10J67L07n41J34p54Q04j55k90L1N97m86N14o5L53N5
1692D41n31M01q07J98R26n58Q33p03q26O25K06M0k71L33k12j24k5O36m74o91R40
1713C57l17L02m08L48p7l93L76k63l73J013n1r30k28J049r16N51L56k08P5o23
$$ plain form
1572 -337 166 -411 -288 187 -292 473 1004 787 -379 332 787 53 -200 275 -187 505 493 103 -292 -780
1592 -780 -790 -673 -68 -815 198 130 358 -216 -259 197 -119 121 -387 369 -381 1245 359 21 762 355
1612 355 508 -441 -393 -325 -54 -452 -30 524 461 12 -342 434 712 -101 -250 74 96 -88 13 -120 66
1633 66 29 1107 -140 -393 -267 -1006 -464 20 470 137 335 76 -305 -422 -620 -319 456 -511 335 543
1653 543 -949 -476 323 -765 812 -755 32 -449 -153 84 -49 946 -31 -296 737 -270 874 114
1671 114 -520 -595 281 -722 80 -230 -63 244 -297 -163 -917 -113 -268 -558 -527 70 -416 98 33 386 441
1692 441 -90 311 -496 -298 628 70 903 200 -626 -1 205 245 -26 307 95 -29 -54 582 108 -583 357
1713 357 40 342 -66 282 205 -188 188 -75 -448 565 514 -416 -644 405 -511 40 396 188 263 -360
1733c60K25q4O33O6l14j23n99K47M83k69J28r1l32N19o19Q31k86J13J30k70q1
1754e3n2N0N50L5n94J54o97J080o69k39O83m12L53j24n46N62k42N59n16L73m84
1775b29J14N53k8j66k36r23J243k9l87j81K90N6j00m78L5J23o68J178n65J014
1795F16q87Q65n78K46m17Q90j098K88k71J027N37r45m44m35j47N78J96P81m67
1814C35m85K77m43k5J40K28K23k00n28J041j021K67L61j48n78L16J205j648M42
1833b41R1q5M89J52Kn67n75M25j03o0R01m51k80R19k53N32j105k03k86J46J654
1854A102j186l99N50j006Q67N83j6j113R14j49o44J589l5r15o23k57Q52K77n78
1873a87J61K33n39K07L45K20k57N24n38K81k6m61n06M7L22k17Q8M46L32n28L2
$$ plain form
1733 -360 -135 -219 414 480 166 43 -556 -309 174 -95 33 -58 -390 129 -490 341 55 168 298 28 -53
1754 -53 -105 -55 495 530 -64 90 -607 473 -196 -435 248 -164 189 65 -481 81 -161 398 -118 255 -229
1775 -229 -115 438 410 244 8 -915 328 299 -88 -269 21 77 -23 -501 -466 -343 -1011 167 -398 616
1795 616 -271 594 16 262 -155 735 -363 -75 -346 681 1218 273 -171 -606 -753 -175 21 802 335
1814 335 -150 127 -316 -341 -201 27 250 50 -478 563 -458 -191 170 22 -556 -240 965 -683 -241
1833 -241 -150 -235 254 406 408 -159 -734 -309 -412 -472 429 -22 -302 617 364 896 -209 -412 -698 -552 1102
1854 1102 -84 -483 67 -939 -72 511 495 -618 296 147 -497 1092 1057 142 -481 -738 114 391 -187
1873 -187 -26 207 -332 -125 220 440 183 707 169 450 424 -37 -543 -496 -174 -391 -303 143 475 -53 -21
1894b1O16k84R1j340K20P77L4l11n56Q63n18M20N35p59M44m3o99N63rJ70k60N06
1916D39j78k43R2J04J20l91j18N1Q5L0K92r58R73r63M57r9k86M87n7L04n41P25
1938C25K03j056J55M5J083j82j268N02K10J98j07q6j98N28p5kj7k26J70m86j9
1959c03J46NJ23j091J528p14N69j13k58j35J55n4m89Q05n31Q91j317M23K37M61
1979C38l23O27m9j445P44R0N2j82J13r3p30L4Q06k80P39q58j59J226m53q36K30
2000d09R7L6M13n61J89J11o1k06O79L23o92J64M67m27M7J98r90nQ2M81k49Q64
2022E51k82m49K45j8Kj26k52J27P53r08R41j194K30P89q07P11o43k4L79O39J14
2043G78r20j37n55L23L29l07K63N39k64K1J9j43K62M29j027J212j599L67R7j06
$$ plain form
1894 -21 595 311 402 -938 -718 59 93 -218 -774 89 -429 -9 526 -233 211 168 -531 32 23 193 -67 439
1916 439 261 18 110 214 334 -57 -175 -124 -39 -9 283 -675 298 -665 -208 -307 -593 -106 -163 141 -400 325
1938 325 528 -528 -373 -328 755 573 -695 -193 17 215 108 22 -176 352 277 275 258 32 202 -284 -303
1959 -303 -157 -152 -29 -1120 408 -306 263 150 -108 -243 -88 -142 -631 174 -357 534 -783 -360 -123 338
1979 338 15 642 593 -852 -108 -18 34 -148 -35 -128 -858 -824 -18 -298 441 -417 -576 650 197 -639 -409
2000 -409 -312 -276 137 -424 -235 -124 -185 -391 288 611 -81 83 550 123 170 368 -622 -627 -545 -64 -313 551
2022 551 269 -180 65 47 49 -77 -329 -202 551 -357 584 -610 -380 409 -398 313 -330 -354 25 664 778
2043 778 -142 -279 -834 -511 -182 -489 -226 313 49 70 89 -54 208 637 -390 822 -777 -410 -313 -419
2063d19K29K03N9J56l59k85R14n8q42K10Q34J36l67m25j07l42Q32J51r15J359
2083I64j471J92J31PJ96J35N91r97N68K54k17o14P14l38R6N85l42o71L89R86j317
2104a59J46m40J81L04k44O29k61K60K4N18j219M30m17j63Q0N50O29j186J193r59
2124a04j43k13Q72r64R0J76M12L0O0j112M72N45j85O01o91o6l92J99m68M92L21
2145f8j67M19L35j08O2p82J75M38n32K59o54J022m84k1M03k1m31K36p5K61o19
2166c52N83q26L66J34P8O27l85m35R8j016J019L30J50o48J24M23l19L21K3n14
2186b19R61j469J185K4j27j29k5J30r74K27l21J141l91N97n06M99n83j33n03N80
2206c6l58L92L52N61j272L01l07P90j05j028K47N11j278Q01L3p01O52O23J104
$$ plain form
2063 -419 -190 13 72 228 -131 -416 498 440 -402 -192 642 778 411 -14 -121 -463 369 520 -395 964
2083 964 -507 -315 -184 -177 19 154 745 -252 316 570 353 -261 453 115 211 796 454 -217 172 1158 -159
2104 -159 -13 -453 -272 32 -212 417 156 416 440 958 -261 169 -248 -411 -331 219 848 -338 855 -104
2124 -104 -247 -460 412 -552 -462 -286 126 156 216 -896 -424 121 -64 537 -154 -220 -612 -413 -881 -389 -68
2145 -68 -235 184 519 411 473 -309 -134 304 -228 31 -623 399 -85 -106 297 276 -155 81 6 267 -352
2166 -352 231 -595 -229 -95 -17 610 225 -210 -112 -1128 -109 221 371 -277 -153 270 -49 272 295 -219
2186 -219 742 -727 458 482 355 226 201 331 -643 -416 -737 404 13 610 104 603 20 -113 -616 -36
2206 -36 -394 -2 350 911 -361 -60 -367 423 318 -710 -463 48 -1230 -429 -396 -1097 -445 178 1282
2225A282p40J7r66o9L92M47M68o19L80p67r56J628q99Q84K6J38q08J34K75M99
2245G46j301R07j369O67Q72j40m03l58J19J158j387m7J416K38j184L03j5k57J85
2264A50q05N59R9J21j431J485l67j74Q05L33r03q5j09m76J482q69Q25k20q22R31
2284E29n42J71l86Q60m9j126J108j245J283K5p63j52K35J44j122J508m41J133
2302A170n35p84o01N17m50J472k37M79n81l31l19p95J035l20J85K76r48J929j231
2321f9Q66j254M07j77k6R09p69p3j350J486m26J87k72M32J790m15l71j258O61
2340B78k92j60q47K064p45O3J66j962J026P40k83O17o89O99q88O71j657J587K35
2359F23j107J044j887J194K08p32Q99n83m27K36p0Q67J182k335N18R72j168M36
$$ plain form
2225 1282 542 559 -407 -476 -84 363 831 212 592 -175 -1131 497 -402 482 508 646 -162 -28 247 746
2245 746 -555 352 -1017 -350 522 382 -21 -379 -260 898 -489 -536 880 1118 -66 237 222 -35 150
2264 150 -655 -96 3 124 -1307 178 -189 -363 442 775 -128 -213 -322 -798 684 -185 640 420 -402 529
2284 529 -13 158 -228 632 583 -543 565 -680 603 628 -135 -287 -52 92 -1030 478 37 1170
2302 1170 635 -149 -750 -233 -683 789 552 1031 450 119 -200 -995 40 -280 -95 181 -767 1162 -69
2321 -69 797 -457 -50 -227 -253 656 -113 -186 -1536 -50 -476 -289 -561 -129 1661 1246 875 -383 278
2340 278 -14 -174 -1021 1043 298 361 527 -1435 -409 331 48 665 -24 675 -213 458 -1199 388 623
2359 623 -484 560 -1327 -133 75 -657 242 -341 -768 -532 -602 265 1447 -888 -370 602 -566 -130
2377a30j48K86J663J84j274q22L50O27j329J00O04p90P19k77k72N77j59J013p52
2396A70n08K70P6o16L75N71m94o60K39J229l90K83k0q7p35L02j3L00l18P29j792
2417a089J504q28q9l03J235k031J061R24j521J4J260P81p81P80q91J149j383l57
2435e65J355k54k93M90M17j271q53J874j353J393m87r08j61P54m39M38o43R31
2453D25o00P2J199j32k299J470k80M00K18j139L58j216J585r19k04J712j202l20
2471h72O21K23L88j048J041M12N28n57L61k75l53N57j233Q56n6K47o02L01R00
2490A439k687J077K329q8j098l47J40q66N77J268j688J3p34J202q3l84j18L04
2508B56m73M10P8Q97r31J84j069Q32O77j58j19MJ97j582K06J096j39j157R12R48
$$ plain form
2377 -130 -278 8 1671 1855 581 -241 109 736 -593 -493 111 -679 40 -237 -509 68 -91 922 170
2396 170 -338 -68 8 -608 -233 338 -156 -816 -577 652 262 545 525 438 -297 5 -8 292 -26 703 -1089
2417 -1089 415 -413 -502 -805 430 -1601 -540 384 -1137 -1123 137 918 137 917 26 1175 -208 -565
2435 -565 790 536 243 733 1150 -121 -974 900 -453 940 453 -455 -616 138 -301 137 -506 425
2453 425 -175 -103 1096 964 -1335 135 -145 255 473 -666 -308 -1524 61 -858 -1062 650 -552 -872
2471 -872 -251 -28 360 -688 353 765 1293 736 1097 822 469 1026 -207 649 593 840 238 539 1439
2490 1439 -1248 -171 2158 2070 972 625 765 -101 476 1744 56 69 -665 537 454 70 -48 256
2508 256 -217 193 271 1168 237 421 -648 184 861 703 584 588 785 -797 -591 505 366 -791 121 1069
2528A069L57k568P15J346k139J592j665J909j125Q43m07N85J78p52K12p46K84
2545c12Q22k92q58J324o01o33N60k92k52l20R99J89J37m61J200r28n99J034o14
2564A03J045q19m57L48m2j76l76P83n65k36L28m84q94K083j216R08j04K4M09o79
2584a7N18l51r40M70L08K89m11j42k83M81l33R29k87j414R79J138o63m22n99j59
2604i09p4L60N23M80j19o39Q22j122J34Q25n47O1m42M55m09J101N82l90l06r80
2624e94K92M42M08q28Q09m2N92o71m91L67k64O58n38l78J921k825J198l44K57
2643c1k25L28j132K689j710P81q86M63N64o14L36q38J42l51k09M06J29L16m07
2662b49M30J17k007J976j86m72J45k44J180j636L55k94J784j602P90l7K57p81
$$ plain form
2528 1069 1426 -1142 -427 919 -1220 372 -1293 616 -509 334 -73 512 690 -62 150 -596 -312
2545 -312 510 218 -640 684 83 -550 10 -282 -534 -854 145 334 471 10 1210 282 -317 717 103
2564 103 1148 329 -128 220 178 2 -374 409 -156 -392 -64 -548 -1442 641 -575 333 229 253 662 -17
2584 -17 501 150 -790 -320 -12 277 -134 -276 -559 -78 -411 518 231 -1183 -204 934 271 -151 -750 -909
2604 -909 -983 -623 -100 380 261 -378 444 -678 -544 281 -266 -205 -647 -192 -601 500 1082 692 386 -594
2624 -594 -302 140 548 -280 529 487 1079 408 -83 284 20 678 140 -238 1683 -1142 56 -288 -31
2643 -31 -256 72 -1060 1629 -81 700 -186 277 841 227 563 -275 -133 -484 -693 -287 -158 158 -249
2662 -249 181 298 -1709 267 81 -391 -246 -490 690 -946 -591 -885 899 -703 87 50 307 -474
2680d74K17m9M63n15O80K00k72k23J02L16L14j12r72j92m36Q45L84n69Q04o41
2700a30L47J52j014O01P89p81j12k04J70j26j76P91j103L43l68K244k458R69R16
2719H50j850N30N84K11r93K51J035m92n96O57M38n81K42m96m94J80J021q59q42
2738a204J399M11j108K11J157q12K93n06M15j06l52p02P43J087j940J490o7j492
2756a083R89o17k23Q51P37O03r83q75l27P30j58J170l39J90n17p85L63J327l16
2775G37l07j411O32O11M9o79L64P91m10j456J50J456o20K63l53Q99j091k40M16
2794a99O78j289Q90O30m74KL7l23l5Q69o93J9o96O20N03j36n56N21j04p91M55
2815g2m88Q53L98r67m5N39n27P35n17m1Q0P1m84Q40l59m61N39M7K38p72K75j38
$$ plain form
2680 -474 -257 -306 157 -358 322 522 250 27 129 445 759 647 -325 -517 -953 -108 276 -293 511 -130
2700 -130 217 369 -645 -44 745 -36 -148 -352 -182 -308 -484 307 -796 -453 -821 1423 -1035 -66 850
2719 850 -1000 -470 114 325 -668 -417 618 126 -470 187 625 44 286 -210 -704 -524 497 -362 -1204
2738 -1204 195 606 -502 -291 866 54 347 -159 256 150 -202 -904 -161 926 -1014 476 409 -1083
2756 -1083 -94 -711 -934 -83 654 1257 274 -601 -928 -198 -356 814 475 665 148 -637 -274 1053 737
2775 737 430 -981 -349 262 311 -368 -4 787 377 -1079 -929 527 -93 170 -183 716 -375 -615 -199
2794 -199 479 -810 80 710 236 238 275 -48 -83 786 93 112 -584 36 539 403 -153 368 264 -527 -72
2815 -72 -560 293 691 -276 -321 218 -309 426 -91 -132 -52 19 -465 375 16 -445 94 141 379 -393 -118 -256
2837b56O62m10L89p63P27l10K78o01O7j42o1K28K57j02q5K41m65rL52L40l42p6
2859h1l19R4N71q89J284n48n77L51J06n2k22J28R0r4O9P7K61n56J86K35KJ33k61
2882a2M20o50M03m54L8K94P7j36K73k19J5pj65L64r4j75m00J80L65l57j18L90
2904C2j20L08q16O10n1L67k03k62J99q6o3M46o10K50J84k08n31J406j170k56K54
2925c20J6M93k29K41p5L76l35j16O1k19J20Q3m46M81M6Lk98p4j6O11m40k66K20
2948h3K0M98k14k83Q9K33j16l16L16l57J02K85j234J088o22J013p29J76k09N87
2968B44N6n47M98p8l87k88N71K10K56J4o10OK37o6o51J079n48M4l66J38L9J62
2990A3K12j19J22J73p11N62j36J52j87j15j8L48K89o32K55m19M71j5k37m0J36
$$ plain form
2837 -256 406 -4 385 -378 349 39 317 -284 -217 -359 -420 -192 65 -37 -122 119 -346 -355 -3 337 -5 -81
2859 -81 -400 -306 265 -624 660 112 -465 -114 -8 -60 -282 -154 -64 -158 -89 -12 249 -307 -121 114 116 249 -12
2882 -12 408 -242 161 -293 -255 39 116 -20 253 34 49 42 -123 241 147 -28 -428 -248 117 -240 -358 32
2904 32 -88 220 -596 14 -37 330 127 -135 64 -22 -85 361 -249 1 185 -23 -554 852 -318 -574 -320
2925 -320 -304 189 -40 201 126 502 167 51 112 -107 13 96 -350 131 177 180 -118 -192 -208 403 -37 -303 -83
2948 -83 -63 435 221 -62 27 260 144 -172 144 -213 -111 174 -1060 28 -594 419 -310 -134 -343 244
2968 244 300 -247 251 173 -214 -502 69 279 535 549 -61 -55 182 116 -535 544 -4 40 -326 -188 -149 13
2990 13 225 106 228 401 -310 252 116 268 81 -34 -52 296 585 -47 208 -211 260 245 8 -32 104
3011A04J18j60k3l08L88j33K0n5P2L7kR7k23J85j72K95k19k61K22J20K4j28l52
3034c54M11j47J35K6l2J22l42J25L9N3n3J35m3j2J10l3j7J10jm25n3L40k10J09
3058gJ03n5J42J15k85j46J9J34M7j95L99P0j23m69L34J89n08L16QOJ22k13j39
3081a36J79p2L00l31J51o9j27K67J44o29L13O6m53J04M60l27K28k63N22o2J33
3102C98n41J52j45j68M3R5J62Ok12L91j5p9l40N32m51J47l45K17j9L84L0k09k28
3125a95P5L90l73L54o64O87k20J34n0l08M23k91J55kk11L3p5j45O85q71l02J171
3147D00n94J28J001n16j92j47J1J83N9l33R3K1k10j49K86Kj0no6J20l71k83N92
3170B0J33N0k93R7M4k75J14J43M34l98l2p1K71N4l63L2l09J22J0K44p3j3K67r65
$$ plain form
3011 104 222 62 39 -269 119 -14 6 -49 23 60 58 155 -68 117 -55 240 21 -240 -18 102 126 -2 -354
3034 -354 57 -90 45 71 39 161 -181 -56 -17 36 -17 118 75 63 173 140 123 233 232 -193 -246 94 -116 -7
3058 -7 96 41 183 298 13 -133 -114 20 67 -128 271 341 218 -251 83 272 -236 80 88 94 216 3 -136
3081 -136 43 -29 271 -60 91 22 -105 162 306 -323 -10 56 -397 -293 167 -160 68 -195 327 265 398
3102 398 -143 9 -136 -304 -261 -166 -4 2 -210 181 166 87 -253 279 -172 -25 -370 -153 -172 212 242 33 -195
3125 -195 -120 270 -103 251 -413 274 54 188 138 -170 253 -38 117 115 -96 -63 -138 -283 402 -469 -771 400
3147 400 -194 -66 935 419 227 80 91 274 333 0 93 114 -96 -245 41 43 33 28 -38 82 -289 -572 20
3170 20 153 203 -90 7 51 -224 -110 33 467 69 37 -34 237 291 -72 -40 -349 -227 -217 27 -46 -59 208 -757
3194g57M12M72k04M23p23N24l79J2O22j1q80M87K41l68J20K6L66n4l44J38J22
3215B45J71n08K44o51J3M23M10j72l24K33l29p5O63r8k8J44m35J6l0M68l88R9
3237I1l52N1L21o02R17l87J46J60o17O43n71N10k09L3j9l42M78n60J55J70j69
3258a53P8K65k35L14j39k07j57K03K33L04n21n9K94j72M4r5J94k86L36j05n5K96
3280C77j64l06mJ75j95k06l6n5K57k78L57k78M10k76o8K10Q1QN8m2j23m4L28j75
3304A1j46J27k10k84O1L52J13m3L38l13k08R9m8M13k57L02k79p4K59l35K04j23
3326d1K76j91K1j85J30j83M31P1k94k29m2K97p9M11o72o1J39o6O33n13L19J21
3348B93l10j07J03l1j13O8k17M98n97M57o26M21l02Q78j033O28M2k59Q98n76J01
$$ plain form
3194 -757 -345 127 -77 346 -377 147 -232 -220 402 391 -489 -2 239 -129 -9 17 383 329 -15 123 245
3215 245 416 -92 152 -499 -486 -63 347 175 -149 84 -245 -320 343 245 217 361 -74 -58 -88 380 -8 91
3237 91 -261 -210 111 -491 426 39 185 345 -272 371 -200 310 101 134 115 -227 251 -309 -154 16 -153
3258 -153 -75 190 -45 269 130 -77 -234 -31 202 506 -15 -74 220 48 92 -3 191 -95 241 136 81 377
3280 377 213 -93 -97 78 -117 -323 -359 -414 -157 -435 -78 -356 54 -222 -290 -80 1 9 67 25 -98 -142 186 11
3304 11 -135 -8 -218 -502 -441 -89 24 -19 319 6 -202 -103 -151 262 5 307 28 -46 213 -122 82 -41
3326 -41 235 44 65 -120 10 -173 258 329 35 -194 -236 61 -18 393 -279 -340 -201 -267 366 -147 172 293
3348 293 -17 -124 -21 -52 -165 -97 -314 184 -413 44 -582 -161 -463 415 -618 10 52 -207 691 115 216
3369B16p26R04n66J58K79p5o8N05m19k84Q5l8n37O18q5j17R1K58k93R1K65l54
3391i2K52j52P06q72L73l78K1o68O99K7J01M19l64p0m0J29r12Q59l09k10N31J15
3413A65j18k93J30O6k78M09m02k63M71O2K53j06m11K68J22j72Q9k00L8l60M18
3434a12J1k52M90m5K99l11N3r3m58L21n2N15m92M93k79k56K79l67N01o12J69O9
3456a29KL21j29m03J33j89j66L57R7K75m64K39O38r51M27M97j03j127P43n40J61
3477c11J90j99L77J58k78k32N44k37K19q12J85M87N3p6l70L40l03J91j66K01J8
3498b1l92P27n64k5K52L84m19n1l36P98J53m55p8r2l05O07k54M47o29m1J25M36
3520B67k15p3q7M96k74P48j074L82j63l34o8O18o44j00J098n48l54R7m53J90P41
$$ plain form
3369 216 -510 394 -172 -14 265 190 122 627 208 -76 9 -29 -566 52 -33 -150 -59 199 -94 -3 262 -92
3391 -92 160 8 714 -158 215 -163 -142 -810 -111 -84 17 436 72 2 -38 91 -821 38 -271 -481 50 165
3413 165 47 -246 -116 -50 -328 81 -321 -584 -113 -51 202 96 -315 -47 75 -97 -8 -208 -170 -530 -112
3434 -112 -101 -353 137 92 391 80 133 40 -418 -97 -149 366 -126 367 88 -168 111 -256 245 -367 -198 -129
3456 -129 -127 194 65 -338 -205 -394 -560 -203 -106 169 -295 -56 582 -369 58 555 452 -675 68 -472 -311
3477 -311 -121 -320 57 215 -63 -295 249 12 231 -581 -396 91 144 68 -302 38 -265 -74 -240 -39 -21
3498 -21 -413 314 -250 -275 -23 361 -58 -109 -445 353 506 51 -27 -119 -424 183 -71 376 -253 -294 -169 267
3520 267 52 -21 -108 388 114 862 -212 170 7 -327 -395 223 -421 -521 577 29 -325 -228 -681 -491 250
3541B50M12q34Q32o61K05j14k94q7o9Q28q46O10K67o25M76j80r6k03o40J468p37
3562c8N0m62N80k66j26J60M33n32j18K4K93N0n91N63J77K36k51n80L62J34k43
3583a45O5J24Nk21J88j78J85J3l06N59l1j46K50j87M4K5o54L14J65o2J09m60J10
3606b34L89K4K91o05j49mJ35J92j52M0L2J73q0l84J39n1q4N32k14J79k4j49K80
3629B76o44M17K9J12J74o11R6k49N54q6M5k08P5K74M6k37k34K38J64n3j90o06
3651f18R07j76m5k87p1L27L89l97M57m45n6m05Q88m22j43J40r7o6o11P08K35l33
3673a21p9N6m4L42k15o1l16Q36l89k19mL32l16j89L88K3L9j62N58j57m73q7Q57
3696E99p04j79J18J34K14l05o3K58k08L35j67L92m97o9K15l57K92k4K52K9K71
$$ plain form
3541 250 662 -172 660 -1 204 90 -204 -291 -360 468 -378 232 499 -126 350 170 74 -129 -769 699 -38
3562 -38 12 -450 130 -136 -262 -102 331 -201 -319 -295 -2 48 -543 20 197 433 182 -398 -36 98 -145
3583 -145 -80 44 49 -172 16 -162 23 36 -270 289 258 112 362 175 219 244 -410 -96 69 7 116 -344 -234
3606 -234 155 179 470 -135 -284 -288 -153 39 -113 -73 -41 132 52 -332 -193 -244 -328 204 -10 169 145 -4 276
3629 276 -368 49 78 190 364 -247 -151 -400 154 68 113 -95 -20 254 300 63 -171 67 231 178 -12 -618
3651 -618 289 113 68 -219 -290 37 426 29 486 41 -15 -420 468 46 -97 43 -54 -120 -731 -23 212 -121
3673 -121 -200 -144 -188 154 -61 -122 -438 398 9 -210 -214 118 -198 -387 1 24 63 -99 459 302 -171 -258 599
3696 599 -105 -284 -166 -32 182 -123 -186 72 -136 199 32 424 -73 -142 73 -284 8 -16 236 265 536
3717E36l18p3m48L95L12m12m2k45N85k17j72r1M22l68O0p6K94o5M2m45N94k77
3739ij8j37J23J89k53j62N93l63K1J20Nj37J23K53k59J5k2R0k32K22j48j90M43
3762B67O96r12l74k6L34j99L73Q8j17Q6k10L59n40N75l47N94m14m81N65rl15M3
3784C6K70J6k16j5m73L15L04p79O74J77m14k9N91o95M1M22m40l49O41j93J49n20
3806d87J89O89m92L63l32k82K18M90j39k35R4m1J57o01K51K31n6k27q7K99k75
3827b73J69L60p50L63j23m20Q08J10q11J71P17o8l89m14N17K66j49J8P0m15k8
3848b71O69q22o8L64K48K63l30J66o21r8N27K15l79m04M31L53l55K95O1l36q9
3869a81J57K78j82o6o05L38M4Q55j307M20K01k03K3J79L43l05j50M71j35m22Q30
$$ plain form
3717 536 218 145 -303 92 404 -8 -50 -295 290 73 -99 -190 232 -136 -76 -152 142 77 119 -326 268 -9
3739 -9 -27 -164 -41 148 -105 -267 326 -37 -16 104 109 -28 95 348 89 104 82 172 -60 162 14 -176 267
3762 267 963 51 -323 -349 -15 -214 159 247 130 216 6 365 -175 400 53 647 233 -248 317 308 -7 36
3784 36 306 322 106 91 -382 -67 237 -542 132 309 -105 -134 457 -238 -197 225 -215 -564 77 -116 33 -487
3806 -487 -298 391 -101 262 -70 -352 -134 356 217 -18 76 35 192 -409 -158 73 17 -210 -297 2 -273
3827 -273 -104 256 -494 -131 -254 -674 134 244 -567 -396 321 253 -136 -550 -33 233 84 102 172 -243 -271
3848 -271 398 -424 -492 -128 120 383 53 219 -402 -500 27 242 -137 -541 -110 243 -112 183 244 -92 -181
3869 -181 -24 254 72 6 -599 -261 -217 638 -669 -249 -48 -251 -228 -49 294 -11 -161 310 175 -247 583
3890E83r37L10K87l40m2N13m78k3m49R73m76j08Q81p03k90n9j27J79J80J76k72
3911b22L71m43K51k53L3M57j30Q0n54L60O30q19J25K73L3k95K81K6O5q44O50J45
3933B20j73N8k91J70m19R96j030L84J89k40J36L59P8q66M9L17K7k84K27l49L75
3954f7K19j77l46J34M85k77m53m35J040M44k06j33l24m76M86o03J240q26L57J45
3974B27k13j69N85K01q89L19K67p66J36N91l65k55R1N12l20O04l77mJ7j01N74
3995F65r72K21J50L7j0k00K53p91R45l40J61oJ91j84n3N31k40p03O67j85o33P40
4017B44o3K96j047J075m16m08P23q63O07L72p17M17K00n26l28L24O38m58M33q07
4037c04k02M46J1j34J60J9r6K21j29k8k12K59m27N40l57N52j36l40O74p40R62
$$ plain form
3890 583 -354 -44 243 -97 -139 374 -104 -127 -576 397 -79 -187 694 -9 -299 -358 -485 -306 -126 50 -222
3911 -222 149 -294 -43 -296 -263 194 64 144 -410 -50 580 -239 -114 159 192 -103 178 204 269 -575 75 220
3933 220 47 105 -186 -16 -435 561 -469 -85 104 -136 0 359 437 -429 -380 -63 -36 -320 -93 -442 -67
3954 -67 152 -25 -371 -237 248 -29 -482 -917 123 567 361 228 -96 -572 -86 -689 551 -275 82 227
3974 227 14 -155 430 631 -258 61 328 -438 -302 289 -76 -331 -240 272 -48 556 179 175 192 91 665
3995 665 -307 -86 64 101 91 -109 144 -647 298 -42 119 113 304 120 67 598 358 -345 322 137 -496 244
4017 244 181 477 -570 505 89 -319 404 -459 148 520 -197 220 420 -106 -434 -110 528 70 503 -304
4037 -304 -506 -60 -49 -183 -23 -4 -100 121 -8 -36 -248 11 -416 124 -233 319 183 -157 517 -223 739
4058G39j315P55m41L83M34l97k88L19p95L30q1R74m88l48P01q44M49K16k31j9
4078E3l91N84m75P93j61j33J42k74L08n72l51N29J29k80Kj38L44m63K41L34L68
4099E89r12K32L48n29O14ml24q6J62K39k39j99O0j08J48q4N5p48Q11j12j24J89
4121b2O73o74O5m85OL62L59l08j08n46N68l27J54L04m72M96%J58M11j189J63O52
4143B40J70j72n03O16k82m08K39M06n00J77K81R9o31J60O64j025K54O51n40J70
4163F6j02R0K70m40L35k04M36O3l7l97k92L10l86L80K94o11Q48o52k84K74J5L45
4185C21p86L77k43N10J28p52L73J52j11N28o20p99R40P7J41k36K08q15J365q93
4205a35M47m65M2j68K82k94L98J45k4m37R8O92q08K47M60k90j41J35m39q7M2N71
$$ plain form
4058 739 -576 179 -262 121 555 158 -130 189 -606 -276 -357 617 129 -219 482 -362 87 303 72 53
4078 53 -338 246 -229 564 403 270 412 138 446 -126 -477 52 181 -99 -97 -235 109 -354 -113 221 589
4099 589 -323 -91 257 -272 342 338 14 -72 90 329 90 -109 -49 -157 -9 -93 -38 -786 25 -87 -211 -22
4121 -22 651 -23 42 -443 -437 -75 284 -24 -132 -678 -110 -437 -283 21 -451 45 45 203 614 -575 -412 240
4143 240 410 238 -265 351 69 -339 -100 306 -194 -17 264 363 -268 -108 556 -469 -215 436 -104 66
4163 66 -36 54 324 -116 219 15 451 514 477 80 -212 98 -288 92 386 -225 623 -29 -313 -39 -24 321
4185 321 -465 -88 -331 179 307 -445 -72 80 -31 497 -123 -922 18 95 236 0 208 -607 758 -135
4205 -135 312 -153 -111 -279 3 -291 107 252 228 -209 -111 581 -227 20 480 190 49 184 -255 -342 -300 271
4227B71l57L60j19j2N1l97P30o75j4q9M94l93k7K69k77J90K46R2J44l70J69K02
4249D88l14n01j99M69J13JK78n20L12j61j01K05L18l07m7k20K19m8K04J87q88
4270e12M89J65L27l11l84LN87m6k65J65l92K95o83M04j92M39q7J19O8m05l52J043
4292D75l74n28R9O38j68j85j4j04O5J70r4N14k57l49J75j88M05l94j25k66M14
4313i1m90L62J96l33K02l90O62M8L4l99J08k61R38n95k71L27M84j41Q4m93L01
4334B82K36n56O30q12M13m93J97M39m89j39K06k4k89k52M11J61k57P6P92o35j22
4355b25L38L2p7M4k55J10J06K18j90l57M02l41k39K53K81k77Q23n17j96Q02k12
4376E23l20j40N0l43j11L90j53J38k6N11l52M65j073J13Q66j144Q93m38J58m94
$$ plain form
4227 271 -86 274 155 143 194 -203 527 -148 -162 -251 243 -150 -177 92 -185 5 251 343 487 117 286 488
4249 488 174 -327 -526 -57 56 57 335 -185 127 -34 -135 70 388 81 34 -186 33 -15 189 376 -512
4270 -512 -23 142 469 158 -226 -223 364 318 53 218 -174 121 -562 -158 -350 89 2 121 189 -216 -568 475
4292 475 101 -427 -328 310 142 -43 -57 -161 -96 74 -20 494 237 -112 63 -125 280 -114 -239 -505 -91
4313 -91 -581 -219 -23 -356 -154 -544 118 166 200 -199 -91 -352 586 -9 -280 47 531 390 474 -19 282
4334 282 518 -38 592 -220 193 -300 -103 336 -153 -292 -86 -110 -399 -651 -240 -79 -336 -260 532 -103 -225
4355 -225 113 145 68 112 -143 -33 73 291 101 -256 146 -195 -434 -181 100 -177 646 129 -67 735 523
4376 523 203 63 113 -230 -341 49 -104 34 8 519 167 632 -441 -328 538 -606 287 -151 7 -487
4396d87O84M2m98o8L48J88K4k52p7P1K28P63o71K0o80Q99m93j63K03J19n5L68
4418E13o76J84K49m42L60n40J62j29J95M57K57q28L54l78L12j74J64m3L86r07
4438e24L05O45J26l02r2n2m23O84r57J43O23m32N43J3j03p4n04K24L3J42M61J59
4460F38p86N1j36N12j44K22n80N90n03p2J5k61M50J13p7j24l06N39J54p3k42K89
4482B69J0n49j28J76l1K10M53m43K23P8m22M11j43o91N55j83N6O1Q6q06N26M84
4504B02K57q29n4L16Q22q77j0j45l33J253n47l26N14l01Q2k01J93j9N93n18J12
4525A84o1m63L28Q1j74k2j12J05R6j99J35J90j85j2m43j85O22l8K34m18m5K43
4547a39L44n57K32J60L04l27l84O0N27P5k92k93P2M21n30L63J4j3q0K10l37k95
$$ plain form
4396 -487 197 239 -259 -327 21 209 233 -19 -96 -25 203 966 295 315 -365 534 41 -122 81 200 145 513
4418 513 -163 21 270 -172 188 -352 -190 -319 -124 333 590 -238 116 -262 50 -124 40 -3 383 -524
4438 -524 -219 426 552 250 158 106 -317 367 -590 -447 176 -256 287 300 197 123 -381 -157 -124 18 479 638
4460 638 -148 -97 -233 279 135 357 -223 367 -136 -208 -193 -454 -4 109 32 -92 -398 141 295 222 -20 269
4482 269 279 -270 -398 -222 -253 -43 410 -33 190 268 -154 257 114 -577 -22 -205 -149 -88 -2 -808 -282 202
4504 202 459 -370 -424 -108 714 -163 -173 -318 -651 602 55 -271 243 -58 24 -177 16 -3 590 72 184
4525 184 123 -340 -12 69 -105 -127 -239 -134 -38 -237 -102 88 -97 -109 -552 -737 -115 -153 81 -337 -382 -139
4547 -139 205 -352 -120 40 344 17 -367 -307 220 295 3 -290 -218 203 -327 36 50 37 -43 167 -170 -465
4569d65N01m8n8N8J44q2J13l1Nl55L12orj61q2P2j17K04k1l22R5k63O64J80l72
4594d4N15n82O03k63j59K54o67O29m16K45m83N50j68J96l38L89K4j11k9k18L64
4615B91j54k0N0m7r9j88k79M99L6o4O0j0k63K02k17J46l15P00l68K08N70n82K71
4638D27N1k55j97L53k47j07j04M81k98N2n0j88J84K89J49r59J82M43k50K8L46
4659C30p0l75L69l44J04r8j37Q3j37kN46m64M11j56j51J04J41K58j50M9l25l8
4681e2j53K56l56M88M24m99K10k64k09L24k95J30Kk3M19P6m48k58j60J80J69M87
4703D48n16R2M47q04L81Q4L4R2n75N51m67M3P01j263J007n35N17R2q42J92J12
4724b09J44K96n02M58L5l54Q78l28j41o96N05o04P00k62j66K6N2O29q31j3J28
$$ plain form
4569 -465 36 -12 -70 -12 132 50 163 132 137 -218 94 88 79 -82 -164 -92 -209 -5 -26 -348 -253 -516 148 328 -44
4594 -44 471 -111 492 229 70 324 -343 286 -130 115 -368 182 14 210 -128 261 285 174 145 -73 291
4615 291 137 117 167 120 21 -167 -446 53 89 25 85 75 -188 14 -203 -57 -372 328 -40 168 738 156 427
4638 427 478 223 26 379 132 25 -79 402 104 156 106 -82 102 391 540 -419 -237 206 -44 -16 330
4659 330 260 -115 254 -90 14 -84 -221 -138 -275 -277 269 -195 216 60 -91 13 154 412 262 311 -14 -52
4681 -52 -205 51 -305 183 607 108 318 54 -155 169 -126 4 6 -17 402 478 30 -228 -388 -208 -39 448
4703 448 -68 24 471 -333 48 132 166 258 -317 234 -233 -190 511 -752 255 -280 237 329 -513 -321 -209
4724 -209 -65 231 -271 187 222 -132 746 418 277 -419 86 -518 182 -80 -246 -220 -168 461 -370 -383 -255
4745b55j12L97L95o95K64k30K67l22J44O9m5j87P70j78Om45K62J33n81K2M79K2
4767A80k00m19L57L27l28M18q1j99L81j56R3o3K03k93K32k55o77N93j19J4R9J57
4789B64o72O79l15k74P88m64k06L78m9p7n43J66J84N80l31n2P5k77K30l99L84
4810F9l05L26N40n94K01k11K92j080K98O36n7L24n7m05J32k37L77k30n19L34M78
4831C12l63K99n42n7l05N44J12j33K18k76N11l07M02j04l1l5L9m44o04O97n25
4852e92L56J67n8K14r0j74J14m82K99M96M05j106L62j31N9l9P68k63n06J021j031
4873b11J92k38K66L11l77L31l42Q9l4j83p8Q20n72r9P2L19j59N06r53J69l32P26
4895B23r3J02L34n34L2L7%j7l16M07o49O82n8k84O24n40J88k77J38l31N44Q3m23
$$ plain form
4745 -255 -367 30 425 -270 -6 -236 31 -291 -147 -78 -123 -310 460 282 288 -157 105 238 -343 -321 158 180
4767 180 -20 -439 -82 245 -83 335 254 55 436 280 373 310 513 220 452 197 -480 113 -6 8 107 264
4789 264 -408 271 -44 -318 470 6 -200 178 129 52 -491 -325 -141 439 108 56 131 -146 84 -315 69
4810 69 -236 90 630 36 237 26 318 -762 -464 172 115 439 382 -23 109 -128 249 19 -500 -166 312
4831 312 -51 248 -294 -351 -656 -112 0 -133 85 -191 320 13 415 311 280 245 284 -160 -764 -67 -592
4852 -592 -236 -69 -127 87 -3 -177 -63 -545 -246 250 655 -451 -89 -220 -161 -200 568 305 -201 820 -211
4873 -211 -19 -257 9 320 -57 274 -68 21 -13 -196 -274 546 -26 -125 -53 266 107 613 -340 -171 -503 223
4895 223 130 232 566 32 64 101 101 84 -232 175 -474 208 150 -134 490 -50 138 -139 -1 -332 212 295 -128
4918a28L70l28K94k3Or67K48L48M07m10J8K80j59m49P02k44N37o58k35O4L02k56
4940b81j83O28rP3K27l60J25j23J92j54k25J54K38k94J06l07K40k45L84Km83P00
4962D05k37p84J12l46L67N14K5m49J660j812K94k90O75q59L14J003j146K94L76
4981A16L7o02P83J7k29k85o20Q78J57J02Q06j306q16P73Q45q55J82K6M81K64K1
5002G75p47J24n70R5j53k77m9J021m4j45l19o13M11m27R07K19n12r54J195l71
5022d34L97k11K79K40O4p31J69L14K93j004J86N54l60j196J884K56k03l50J93
5041C40l69m09L33J75Q54j660J408j396K71k21J072k44r7k24N13j483J089R84
5059I36n17J001o92k19j47O33l15j96m29J02R34j982O96m17K94j31L51N00j379
$$ plain form
4918 -128 242 -86 208 185 191 -776 -528 -180 227 -183 -165 115 -44 -493 209 -35 502 -156 -391 -327 -25 -281
4940 -281 -464 164 155 228 455 95 220 97 289 135 -90 64 302 8 114 -193 47 -198 186 188 -295 405
4962 405 168 -616 -504 -850 -483 31 56 -393 1267 -545 -251 -541 134 -725 -411 592 -554 -260 116
4981 116 153 -449 334 351 122 -163 -783 95 252 354 1160 -146 -962 -189 656 -199 -17 9 490 754 775
5002 775 28 152 -418 -323 -476 -753 -802 219 175 30 -289 -902 -491 -918 -11 208 -304 -1258 -63 -434
5022 -434 -37 -248 31 271 335 -396 -227 87 380 -624 -438 116 -244 -1440 444 700 497 147 340
5041 340 -29 -438 -105 70 924 -736 672 -724 -453 -674 398 154 57 -167 346 -1137 -48 936
5059 936 419 1420 728 509 362 995 680 484 55 157 1091 -891 -195 -612 -318 -449 -98 402 -977
5078i77J011R9m77m25K70J439m99n62k26j39J44J518j985M11J432j123o09Q75
5096A77j11n71P27k4J084j709P58j466J396P1p66K53k68l07Q62k31j86O48l82
5115d5n74N43J570j493n5r2k71L90p70J628j534Q64p16P80K64j982J805m41n2
5134a81K98n5K77m77O2k7J88K40k18P08q5p50O18k1N04j486J294o53p64J675j148
5155aK18O3j024J34P67N5J46l31L41O0K07l72L92r96L9P23p15L85l84L13k70k02
5177d52J323n15m64o4K81k94Q23j472R94m55q0R25n86K54j276K28O56o96R96O9
5197A95m79N69j151Q86N93m82p72K17J273j211K45n47N30O12M6k20J79l18oP36
5217H95j340m80J695p87j26K71o65k82J508rj389Q48j96J573j908%M33R52r36
$$ plain form
5078 -977 34 133 -344 -769 -499 940 441 -121 -347 -486 -342 1176 -809 -398 1034 -89 -698 177
5096 177 66 -505 222 198 1282 -427 331 -1135 261 332 -434 -181 -449 -756 106 -125 -311 337 -45
5115 -45 -619 -76 1494 1 -54 -146 -417 -27 -797 831 -703 161 -555 225 489 -1493 312 -129 -181
5134 -181 117 62 339 -138 -76 -103 85 325 107 815 730 -20 598 577 1081 -405 889 236 -528 1147 -1
5155 -1 217 280 -744 -610 157 212 358 27 368 428 635 263 655 -341 -302 421 -294 91 -293 20 -250 -452
5177 -452 871 356 -108 -172 109 -185 638 -834 160 -295 -375 550 -36 218 -1058 -830 -174 -870 126 195
5197 195 -284 285 -866 20 613 131 -641 -424 849 -362 -117 -664 -134 478 524 304 483 165 159 895
5217 895 -445 -925 770 -17 -143 128 -537 -819 689 680 -709 139 -57 1516 -392 -392 41 993 57
5236E7n57N87j769P44J137q08J270j200l74J542j257M05K30J25R42j077R10j417
5254e10q6J159P5q28M79o37J378k73j678Q17J087l09o77n17J820q84k197K449
5272F68j721P55Q1L42p12p9M3O01J214r41j311J036q38K075j761J450o42j96o07
5291e43P47L72p26R51n42j278Q51J03m70K30J073j067P35M1q0o79J099Q32k248
5310e99O12J76O69k418K547m23L93k729K315J32J77j256J960j851J520l284J527
5327e32J560q61M68r93L88p11j81O78Q53K80j308P68J77m08r36O07L54m41O41
5346D03j534J849n57j1K7M72K58q62K99m87l79L30L32N7j254J639o50o59k07J425
5366D91k305J770j096J785l56k63j00R76j824J578k63j233J817l04j431Q81J602
$$ plain form
5236 57 -500 87 -1682 -938 199 -609 661 -539 -913 629 -628 -223 7 132 1074 -3 907 -510
5254 -510 -596 563 638 -190 289 -348 1030 757 -921 -104 983 674 -3 -520 1300 416 -1781 668
5272 668 -1053 -298 -217 125 -587 -666 -623 -22 1192 251 -1060 -24 -862 1213 -548 902 260 64 -543
5291 -543 204 576 -150 801 259 -1019 -168 -65 -535 -305 768 -299 436 477 397 -282 817 1649 -599
5310 -599 13 189 858 -1560 987 564 957 -1772 543 675 852 -404 1556 -295 1225 -2059 -532
5327 -532 1028 167 635 -358 30 -681 -862 -184 669 949 -359 409 586 178 -758 -151 203 -238 403
5346 403 -1131 718 161 150 177 649 907 45 344 -143 -522 -192 140 197 -1057 582 -68 -727 -934 491
5366 491 -1814 -44 -1140 645 289 26 -74 902 -922 656 393 -840 977 673 -758 123 1725
5383A725l426K764q84l38J06M96K70k357K728O51k397Q85n96M22q48J355K03j319
5401e60r68M13N58J520l29j041o42J375k90O82j351Q27j34m95n46K32O61j31m02
5420f21J748p65m36J969r18J19j077N44j103L20J000j3m11o48j076J118q02N09
5438e43O63j65J56N5K36n54J825k062L01K6k80j11J313p24p5q36P00P21n34p86
5458f74P14m2O56J73M39j137l14N88m84L68l15K35q8j96j01j41j89O36j99k93
5478c64M23k93K92K82j23O4R8p15K42J68m44L70M8O89j051Q3Q1m06Q40q58Q5N40
5500E1J92K06l9p33O16j04J14k74r9J70r2O9m68J086m29l10K22l72L51J88k22
5521A23n14N00on86L46L22k54j32K66K31k0k97K07j63P7m18K26n3j02L52j63n
$$ plain form
5383 1725 -1701 1063 179 -159 -53 443 713 -1644 1084 1735 -662 223 -373 49 -799 556 759 -560
5401 -560 -1528 -1115 -557 963 634 -407 -1049 326 36 718 -633 194 60 -435 -981 -749 -88 -219 -621
5420 -621 1127 362 -74 1895 977 1096 19 563 -540 -220 780 767 356 -292 -1368 -250 -1052 -543
5438 -543 120 -45 111 166 402 -152 1673 -389 -88 -62 -342 -453 860 136 61 -775 -75 646 112 -674
5458 -674 40 -2 654 827 1266 129 -185 403 -81 287 -28 207 119 -77 -178 -319 -508 128 -71 -364
5478 -364 59 -234 58 340 217 281 379 -336 -94 74 -370 0 48 737 -314 -231 -150 -556 284 -574 -489 51
5500 51 243 449 410 -323 293 189 303 29 -70 100 8 77 -391 695 266 -44 178 -194 157 345 123
5521 123 -391 109 103 -483 -137 185 -69 -201 65 296 276 -21 186 23 100 -318 -92 -145 -247 105 -58 -63
5543f3L32m06l31K02L37j23p01Q26j54k4j24L24m10O89J22p28j29J49M11m98k81
5564e80O62M27n50j80l39O36k61l96k77M28N93l74P39k24k98N3J33n31J75k31
5584c95K71r2N34O8q95O01Mk29j86M03j63k0l8k63M98M47q54Q50o82m63L87M22
5606B05l63J07j98j02L24K92n07L73M01p04J85j56J25j89k01J53K02k27P71n11
5626b0RK41k6r5J32J20n14m05J012p94q4N15j20R8l03O08K7j01n11L89j39p42
5648g03P56o8k25M98o06L75n80J125n49L49J34m90k9k6L06o66L42j50J11l30O96
5669B70L12q74J63k16L47j71j59K14l53O18q6Kj06nk18R5L17m43j45K82K04l13
5691b65K46L59n49O83p93O08k76L10j05m58q8j70N95N40l02m60j58o9K97q2L78
$$ plain form
5543 -63 269 -137 -468 -266 71 -52 -753 73 -81 -105 -229 95 -315 374 496 -232 -361 -212 199 -299 -580
5564 -580 82 509 -41 -221 -560 76 -185 -581 -858 -430 163 -211 528 304 6 59 192 -339 -164 -395
5584 -395 -124 -216 318 386 -509 92 96 -133 -319 84 -79 -99 -137 -400 98 545 -309 541 -141 -604 -217 205
5606 205 -158 -51 -249 -351 -27 265 -242 131 532 -172 13 -143 -18 -207 -408 -255 -53 -280 491 -20
5626 -20 -11 230 204 109 241 361 -153 -558 454 -340 -424 91 -29 69 -234 374 401 300 -211 178 39 -703
5648 -703 53 -15 -240 258 -348 27 -553 572 23 372 506 16 -13 -39 267 -399 -57 -207 -96 -426 270
5669 270 582 -292 -129 -345 2 -169 -328 -114 -467 151 65 67 -39 -44 -262 -167 150 -293 -438 -156 48 -265
5691 -265 -19 340 -209 474 -319 289 13 323 218 -240 -328 -498 97 637 335 -125 -283 -352 -55 -137 241
5712B41J72k47l85J51L25l49k43M38N9L69j56k01o21M30L04p51M63K3j3J80q7
5733A02n42P50k87L05j32J04o93LL73n2m9r01L54Q55l69K46l43M71l01o3L0P9
5755f0N06r56Q98l71k26N62q18M28j26J86M85j23l00J25K08m16j6m43J71M29m11
5776b68O48n13L15l10K97r4l08L65J22m06Q5k17J69L1k96N37J29k67r2K1J41j50
5798f1K40l37K10L98l4o49k32N38J93k71K86j98j02R4LOk89L4K4l99P32k51K37
5821A72n14L96l32m08R03k70m31M86j94J00l99L91JN11m54K36p48J088m74k12
5841a52M46j32j72K70k58K33n04J065j090n2nm36J015n46j21J69l16l56J737k98
5861D97j028L65P67m86j146K02n6M88L52K8n83K56j040J253j180L41J098m5l4
$$ plain form
5712 241 413 166 -219 -68 257 -92 -335 103 162 531 375 174 -447 -17 287 -464 -1 22 9 189 102
5733 102 -440 310 23 328 196 300 -393 -390 -17 -69 -118 -1019 -665 190 -179 67 -276 195 -106 -169 -139 -60
5755 -60 446 -510 388 17 -209 353 -465 -37 -163 23 508 385 85 210 418 2 -14 -457 -286 143 -268
5776 -268 380 -133 182 -128 169 75 -233 132 254 -152 -67 -284 -115 -84 -380 157 286 19 -73 -52 89 -61
5798 -61 179 -158 52 450 416 -233 -465 73 266 -5 281 83 -19 75 78 84 -205 -171 -147 -546 186 -65 172
5821 172 -342 54 -278 -686 217 -53 -484 2 -192 -92 -491 -100 -99 412 -42 194 -554 534 60 -152
5841 -152 294 162 -10 260 2 235 -269 796 -294 -346 -351 -787 228 -318 -439 -270 -586 -942 795 497
5861 497 -531 -166 601 115 -1031 -829 -885 -397 -45 -17 -600 -344 -1384 -131 -1311 -970 128 83 49
5880D9P1l01N46o27r1N02m30JJ48q7P2m0K60k20j33K41j48N20n46O26J02l64L50
5903E01l27o90P96m21Q25l50M2j055N29J075j690P77rL16k79j05O50l44j004Q26
5923F3j02p4K00J86j30l24l29Q66n07o70R12N47j118N64P2m10J81N50r6o61Q03
5944E23Mq36L10K05m16M35Q0l97J45L81m91P28o34l5j15q0L82J90j228R68Ml56
5966b33L21L3k67L63q63Q90m36L21l10N68m27J29J26j37j00J5K36l98q2M29n57
5987c79K37M05l13N03k94J86n58j07L49l60L28M8p48N62m3O02j574J292n4k24
6007a42k7j20R4M2j88K34M08j50j30j23R8J46o72P30r8m59N77l90j33M49j20J54
6029A80No17Q53K2k03l47nK35J7n63K61r07M63J068k2n80m50L62M76N42j736R81
$$ plain form
5880 49 120 -181 365 -262 -353 149 -281 -280 -132 -219 -147 -187 73 -147 -280 -39 -187 333 -213 413 515 151 501
5903 501 174 -516 280 -141 684 334 376 -679 -150 925 -765 12 3 319 40 -65 585 241 -763 63
5923 63 -39 -113 87 273 143 -181 -510 356 -151 -821 91 638 -480 84 156 -254 -73 477 381 -280 523
5944 523 527 -309 1 206 -210 225 305 -92 53 434 -57 671 37 2 -113 -193 189 379 -849 119 123 -233
5966 -233 88 121 -146 217 -646 244 -192 129 -181 387 -40 89 215 78 -22 -7 229 -169 -251 178 -379
5987 -379 -142 263 -50 453 159 345 -213 -320 29 -331 -3 45 -703 -141 -184 418 -1156 136 82 -142
6007 -142 -169 -289 -195 -153 -341 -107 301 151 21 -102 -4 142 -530 200 102 -357 220 -170 -303 146 26 180
6029 180 185 -432 421 443 240 -107 -112 123 140 -423 -162 -1069 -606 462 440 -140 -590 -228 248 790 -946 35
6051C5k06N52m43O75m86r70J008m88N23k29J08j9j036L49L4O89N05m43l95K43
6071FK58m76j44K3J112j02r28L95P6N66j093J44j39J133j426J589j017R97j633
6090f59k89J622q61K77n6P88q18q13K10P26k22m99J11J86q77J427p33K196j725
6109iQO48r2j573R31m77P22l34r67N99KK29N26q73l10J011p16J83P43K9o06J892
6131A566k285Q80k49N3p4n37j40J011P39k04j041j77M85J9P92j820j52K337o76
6150E27l71M94j012J46p66J545o88r7M64j49R0q90J295j50q89J77J96O23or85
6170d46M24o5J18M38n09p69J078n42N93r65P10m21P72j081n06R61K4J14L3l37
6190c76L07j99K3Q00o06n74M33N19l16p41M36m41P04j80O84j235J218K25J58r60
$$ plain form
6051 35 -171 381 -62 613 127 -843 165 -323 200 -29 79 60 -976 -627 -593 96 601 158 -237 6
6071 6 264 -212 -356 -333 779 677 -251 144 220 786 -307 -163 -302 831 -595 994 -23 974 -659
6090 -659 -948 674 -187 90 34 822 4 -809 -599 127 -95 -594 -483 -297 -1174 253 -480 1716 -9
6109 -9 -1 647 555 -1018 -87 -564 158 -176 -1143 -544 -542 -313 213 -660 -970 41 -675 -492 251 280 -326 1566
6131 1566 -719 161 -88 -35 -109 -646 -786 225 964 760 -281 -458 27 46 838 -982 -1134 1203 527
6150 527 156 650 -362 -216 -982 563 -125 -222 242 93 183 -707 588 438 -451 -274 -78 545 539 -446
6170 -446 -22 -87 31 469 -40 -809 269 -273 320 -645 65 -356 416 -665 -1171 -210 -186 -72 -39 -376
6190 -376 -69 -268 -245 555 -51 -625 -192 327 11 -730 -294 -735 -31 -211 473 -762 456 681 839 -121
6210a21j73l47L51P12j249K135j012K05J18J90j577Q70l20Q83j427J106p02K47
6228a11k51n22J369r96J50Q13M79o94n50p09O45M79q49K66J011n93j70L30L13
6247D10l0j271J442q99L15J38P83j44j311R41o70J567k350J591L56n51n11L69
6265A75k65L87n2k09j69r44J195N33n25j3o02N67L79k54l52j66J290n30j183O77
6285f1l11K29K01L29r06R72o3o47j1K41J52m83J022j464J101M22p97L42r38M37
6305b33O00j105N4O51K16m11j34O27O23p72l4L04p63L88j90L30N2r67J181j987
6325a570J908m48n26J432p13Q0j280R06m6m35j55R02m72K73L63o02l76O65j84
6344b78l81L75K01J17rn17K96j96K33j84l22J259l6m04N97r69o23R29m7J39o3
$$ plain form
6210 -121 -294 -641 -290 422 -827 1308 296 501 619 809 -768 102 -218 665 -762 344 -358 -111
6228 -111 -362 -884 485 -511 -361 452 931 237 -313 -1022 -377 102 -747 -481 530 -63 -233 97 410
6247 410 380 -891 551 -348 -33 105 888 744 -567 374 -296 1271 -1079 512 868 317 -194 175
6265 175 -90 297 245 36 -133 -1077 118 651 126 113 -489 78 457 203 -149 -315 975 445 -738 -61
6285 -61 -372 -143 58 387 -519 453 390 -257 -268 -27 125 -358 664 -800 301 723 -74 268 -670 -233
6305 -233 367 -738 -684 -33 183 -228 -362 265 888 116 82 386 -377 11 -179 151 203 -764 417 -1570
6325 -1570 338 -110 -636 796 83 163 -1117 -211 -257 -692 -847 55 -417 -144 219 -383 -759 -94 -278
6344 -278 -659 -284 -83 34 25 -492 -196 -392 -159 -343 -665 594 558 154 751 -218 -841 88 41 180 117
6365A17k09J72R65j278k82P11l09M96l25o50M91L05j156R41M9n03N93K18p3m46
6385a73k25N52j089J677m08j22m32Q29L68j446J90M92o9J220j519J13m41J99L1
6404b53L90n20R19jj379P82j76J9o01j07J187K14J5j091R70N3m46J100j055O39
6424F59n43K0L38n76M82j211J039k18N6J96k49r89J093l87J059n00o31O45k58
6443B5k35J91L91n47O08J6j132K67J85o18O67j17o90J220k0j92N88q01N7k44k30
6464f11J78J083J95q65MO03j421J020m52J75O45p4k79n31j33L64K70k9p1L78N3
6485E02k37J2o70Q88k45o8N11M7o86o78Q11j44M8k81R92m75j78l63j08j19K71
6506a70M37n38L71r3N75j095l24J089j34J64R5o27j63P48J79O15k120N18o4N70
$$ plain form
6365 117 -92 80 1045 -233 -515 196 -113 383 58 -592 -101 204 -952 -11 38 -465 128 346 273 -173
6385 -173 -398 154 -935 742 334 212 -220 609 977 -469 -279 213 144 1364 -155 -42 -483 -284 -253
6404 -253 137 -383 536 535 -844 -62 -238 -219 -820 -927 260 474 489 -602 368 421 -25 1075 20 659
6424 659 116 136 474 -102 380 -831 208 -10 46 242 -7 -996 97 -290 769 269 -362 283 25
6443 25 -210 -19 372 -175 433 449 -683 -416 -231 -849 -182 -299 -989 231 211 19 607 -194 -137 -381 -611
6464 -611 -433 650 845 -20 -16 587 -834 186 -266 -91 554 480 201 -330 -463 -99 171 142 71 449 502
6485 502 265 277 -393 495 250 182 693 740 54 -624 187 43 91 -190 802 327 149 -214 -322 -441 -170
6506 -170 267 -271 100 7 582 -513 -837 252 118 282 377 -250 -413 335 514 1129 -991 -473 -537 33
6526C3k4J76R2n0n55L33l64J198m58j323J034L72K24o53q9J89M87q54J31j74J07
6547a68L47j59N8l66n5m60J11n40J646j26k17m1n64R68l14O91L15j179p06N48
6567b11n49KJ070N0q34K06N00%r84J910p84k88O53j567N64J0q18L76R09k75N25
6588D65r02L22N48l96L84M26j219N46J23m89M08k09J429j544K48k75O90k46j134
6607h25J093j093N31O41p01L20L06r56P37l82R9Q87j262k24Q59J28k31J91m3J117
6627A192j415K24J77N17l8j211M43k74P72k85o33p8J008m97j00O4M93l94l01N73
6647B37O7m85M22l53j07M14R5q39L10P81p07O10j487J540p0j026K86M10j29m94
6667e25J55O55p58M86J13m19L03O4o74M36O77o21k37M07N66r24l60k73R45k90
$$ plain form
6526 33 9 185 277 227 -328 5 -359 839 381 -942 92 464 688 35 -54 135 622 -232 -101 -275 -168
6547 -168 179 20 78 -288 -343 -803 -692 -1232 414 288 71 30 -534 434 120 811 1126 -53 -759 -211
6567 -211 -760 -758 312 362 -472 -266 234 234 -750 1160 376 88 741 -826 -262 -252 -1070 -694 215 -60 465
6588 465 -437 -115 433 37 421 847 -372 174 297 -192 216 7 1436 -108 140 -135 555 309 -825
6607 -825 268 -825 -294 347 -354 -34 272 -684 53 -329 -230 657 -605 -829 30 158 -73 118 75 1192
6627 1192 -223 1 178 695 657 -554 -111 -385 387 102 -531 -609 399 -98 -198 -134 359 -35 -336 237
6647 237 304 -181 241 -112 -219 195 290 -549 -239 542 -165 445 -1042 498 428 -598 -312 98 -31 -525
6667 -525 -370 285 -473 13 126 -293 10 74 -600 -164 513 -108 -345 62 628 -296 -656 -929 16 -274
6687b74n29M6J530j404K80N53N6J45p13O03j423J197m96j87O14J166m59m81j449
6706a225J521L62m43p11O69k68q8J74M05p31M77j650J224M85k63M01j397k72J500
6725A70K06k20n73j04K30n21L27o09R48P1J571j727Q18k29k10q98O14j1J022n19
6745C56K14q34K96l28J174j907P89N75j800J233P21k76O27j238K21n2M30k52o82
6764g33Q44L08j058Q91K18k67P4l48K003k376m54J178M89j422J685k60j180L77
6782c1m12J441j438j4Q86j468J56L40M52J028p33R4k67J241l92k60q74N57q28
6801e22M8Q71o61O6O99j287M35L42k25R12K50r54O29q07l06Q47N04N63j671L97
6821A30j001J109k50O5P15j124q9j32m03P85n30k1N68L7j027P70K29N70J98k7
$$ plain form
6687 -274 -803 -757 773 -631 -351 202 258 403 -310 293 -1130 67 -429 -616 -2 1164 705 224 -1225
6706 -1225 296 658 215 -496 173 -95 -183 -9 396 -335 142 -1508 -284 201 -62 339 -1058 -1330 170
6725 170 376 156 -417 -521 -291 -812 -485 -1094 -146 -75 1496 -231 587 358 148 -750 -136 -147 875 356
6745 356 570 -264 32 -296 878 -1029 -240 335 -1465 -232 489 213 840 -398 -177 -229 201 -51 -733
6764 -733 111 419 -639 252 470 203 277 -71 1932 -444 -898 280 769 -653 1032 772 -408 -31
6782 -31 -443 998 -440 -454 432 -1036 -880 -540 -88 940 207 301 34 1275 883 623 -251 306 -522
6801 -522 -474 397 -264 -198 501 -786 -351 -9 -234 678 928 -26 603 -204 -510 337 841 1404 -267 130
6821 130 -871 238 -12 53 768 -356 -445 -577 -980 -195 -725 -746 -178 -141 -1168 -398 -169 401 599 572
6841E72j092L15J41m19J018p91J147k63j399J272p84k83Q83n26p12J240l03j7
6859ar50J225q75J061l16j027J291K7J62j475N51J199l59o71n6O02l58R13o67
6878B76n93J302q78K18j169J583j359Q61j34Q7R48j526Q0o10J549N98q61r65L30
6897b63k74M92N70j03r58P78o26M49o47R22j465J286k46p98J594k083J920p82
6915b34L75m37P08j06n10k34P97p76j78k47N76Q07J60j258L22M21M30o05k58P4
6935a73N27n85m63L24M62k17m92J384j492L48L34p13O92j81n07N34J044q68k63
6954c05R88o02O22m40J8j79j091J146J79p48n5M97N6j89O76j266O92q50L73O07
6974A29R19l36r75O68j86o55J58j28O82K51p98M41p22N82l75R1l29J044j221O53
$$ plain form
6841 572 -520 -205 -64 -483 535 -256 891 628 -771 501 -283 -566 317 -209 -921 319 16 -1
6859 -1 -951 274 -601 460 144 -883 408 435 597 -878 -327 872 513 -158 -214 388 30 943 276
6878 276 -317 985 107 325 -844 739 -620 241 107 194 1142 -384 -304 -914 635 1233 372 -593 -263
6897 -263 -537 -45 525 422 -536 242 -384 65 -582 340 -1125 161 -85 -883 711 -1372 548 -234
6915 -234 141 -296 412 306 -204 -438 359 -417 -595 -842 -266 541 701 -557 -235 186 616 11 -247 -173
6935 -173 354 -231 -694 -370 92 -125 -617 767 -725 -377 -43 -756 -64 -245 -752 -218 826 -42 -305
6954 -305 683 81 703 263 281 102 -989 157 336 -412 -467 30 86 -103 573 -693 -1 -851 -478 129
6974 129 1048 712 -263 405 219 -436 -278 -406 276 527 -271 170 -552 30 -345 -254 -583 461 -760 -107
6994a07R48j76n78o91J157l42r02R83r45J217q88Q26j25K99j052R81K6q70O24
7013C85o06J4O10J82p97O5k38O51J9j74l74Q03p82O74o01J531j471Q4R76j7l77
7034E57o35l91j61K41o42J355m41k25nM59r8m3p42K155j521l62P84n46J91L26
7054B56j76q8J58L70l44p26O5J78l79M44L01k42L79j186Q60L27j062N31L86p01
7074f49J40N21P13j115O29j26j96k5M09M70p99m51O04O8k87J96K88J42o48P29
7094F13k88j30j25L11o66J05N8O71l75Lo96K47N71q7k42K33n89J93N93j080K94
7115c86M70N63r71L97l26L14L21k0l97L35k41j42j60N58l49k05R82j026M03k72
7135a52m22Q83q27Q04j2r57O31LJ15o16L22M33n99K39M16J89l40O7M34j59m67
$$ plain form
6994 -107 841 665 87 -604 553 211 -691 292 -653 564 -324 502 377 676 -376 605 631 -239 385
7013 385 -221 -207 403 585 -212 -147 -385 266 285 111 -263 540 -242 432 -169 1362 -109 -25 951 934 557
7034 557 -78 -469 -630 -389 -1031 324 -117 -342 -347 112 14 -29 -771 1384 -137 -499 285 -261 -70 256
7054 256 80 -8 150 520 176 -550 -485 -307 -686 -242 59 -183 196 -990 -130 197 -865 -334 52 -649
7074 -649 -509 12 725 -390 239 113 -83 -108 301 771 -28 -479 125 193 -94 102 390 532 -116 613
7094 613 325 195 70 381 -285 -180 -122 549 174 177 -519 -272 299 212 -30 203 -386 -193 400 -680 -386
7115 -386 84 647 -324 73 -253 61 382 362 -35 300 59 -83 -243 315 -34 -239 743 -283 120 -152
7135 -152 -574 309 -518 286 274 -683 -52 -49 66 -550 -228 205 -394 -155 261 450 110 177 611 452 -15
7156a5K86j46j45J94j94M2N26p81J40L20k97k15J47M93J23l43j46M68o84J82J50
7177A05l18M15K01l58K36n24n9K49M69m56J31J30l50R1J22j71N30p10P0M40j12
7198A31p5j04L12l05q3K77j48p4L8R6k12q1q4J00N07l89m8L16R0l16L33r9n9Q3
7222B06k10Q5M17q36R9O40l79k77J80l85J68J86L83l53kR2K45n28K01K48l16n7
7244a93r3J54K47L4l10N44j85o7k73k8N12r44M69N4J31k3L60q47P25M84n47n3
7266A51n8q8Q9J9r4L1Q6n64M01k24N23l64K03K03p90Q17j39J25n08K78l33J21
7288a15M73q60L79J59L3l58P7R1Q8j01J61j70R8K93k50j86K08K39j71l5M3l63
7310b67M81l33N95m26m81K85j2M9K26n1R9O7k65J49j61j4L3p0l85N36k8J82j57
$$ plain form
7156 -15 271 125 -20 174 -20 22 548 -233 -93 227 -70 -285 -138 355 478 135 -11 457 -227 -45 105
7177 105 -213 202 403 45 281 -243 -302 -53 416 -40 91 221 -129 -38 84 -87 443 -267 -197 243 131
7198 131 56 -48 264 -41 -124 153 5 -69 -31 65 -147 -228 -312 -212 295 -94 -142 174 264 -52 281 182 123 206
7222 206 -4 81 498 -338 -239 401 22 -255 -75 -460 -292 -106 277 -76 -78 14 259 -269 -68 180 -136 -193
7244 -193 -286 -132 115 149 -161 383 198 131 -142 -170 342 -602 -133 -79 52 29 389 -458 267 751 204 151
7266 151 93 5 94 113 19 50 136 -428 -27 -251 272 -92 111 314 -476 341 202 327 -181 97 -236 -115
7288 -115 358 -502 -123 36 69 -289 -212 -121 -33 -134 27 -143 -45 248 -2 -188 20 259 88 53 96 -267
7310 -267 214 -119 476 50 -431 -146 -158 -109 117 66 165 232 -33 116 -45 -59 -26 -96 -481 55 27 209 52
7333E2m3o9q0o7K70R3k50k6J83L5oK32j79j60M4k45L98J49q8j41k9K01r0K62n36
7358i0qK23P8j63J59n31K74M6N3l15K82j5j77M55j39n3n47N44K5k13K0M4J51K9
7382A32j62J78L0j41j25r6J40J18Kk48j83L32qJ39J55k0k99J0j2j9O6n9r1O7J59
7407F5J70K8m53J49jJ28k05K56j24Qk12J20j00N4L00l87J59k79L95k37k82M13
7429c5K61l51o8K79j63l42M42R5o2m4j29K05J22n5q5O3k60J6J98n40O11k37L40
7452B61l73J32k54Q2k7N62k16Qj49k35l15J49L00j07K16m5K32j20j56kk00r5K66
7475h6p1O9M1Q3n7o9K28m8j1l4R8K9j49l8k7k18K13j53K61k1p0m8J39k69Q7K19
7501I8l66rM08O9j87J20k49K11j72J45m4J13pj64qj03J60RJ49k71J1N4l5k16N34
$$ plain form
7333 52 9 -60 -140 -207 63 156 -94 -120 63 98 92 324 145 -15 29 -216 182 331 243 102 73 274 184 446 -90
7358 -90 -98 125 203 40 199 -332 -58 -12 41 -274 8 -7 -184 271 132 79 -468 76 101 -112 -92 -48 103 132
7382 132 -30 148 178 37 -88 -184 -44 74 76 -172 -355 -23 -31 108 263 243 -56 -46 -58 -77 -11 -70 -161 -94 65
7407 65 235 263 -190 -41 -42 86 -119 137 13 21 -191 -71 -171 -117 183 -204 -45 -324 71 -166 -448 -35
7429 -35 226 -125 -193 86 -77 -419 23 118 56 12 -117 88 210 155 70 133 -127 -111 87 -453 158 -79 261
7452 261 -112 20 -234 -152 -179 383 167 175 26 -209 -524 -375 -75 -182 34 -11 221 101 -55 -57 -257 -352 -86
7475 -86 -157 -88 -47 36 -21 -90 138 90 79 45 143 172 23 -15 -42 -260 -47 -200 61 40 -30 -78 61 -208 -121 98
7501 98 -268 -277 131 200 13 133 -116 95 -77 68 24 137 130 -34 -42 -145 15 24 173 -98 -87 -33 -68 -284 250
7526B50j99p0j82J56J92k4n14M51J5O6l12J54L00j75l8j02j76l10P27m14L24N7
7548A76L41q46O09l18k05J98R5K6Mq2jJ25l9j65j12M20k33J03Q4k94K70j10J97
7571B43j44j81j48K43J32k90J48J59O3k18J47l29J33o0K62k92K78j59J04k5J46
7592B12r5j66J15k22K93k7K06m15M0rN7j59L95l49M03n05L56j83O0l9Q3j0k56
7615b15L76l78K87r0J80j29J98k95J17L4J19Kl41M14l46J40M8L3k74j84K10k13
7637c07K04j22K25l23N65L3l60J11j77K62P1k20J39j79j43L91r2K9j13l71N83
7658B06l57L95k32j25O2%K00k33L16l09j81N41j91J54n4l01J76j68L13L9k97K00
7680A54m36M16l46K57k83r3J12L1K23n1K48j06n58N94M7l60L25n12J54L13k72
$$ plain form
7526 250 51 -19 -201 -45 147 123 -391 60 75 141 -171 -17 283 108 70 -32 -208 -518 209 -205 119 176
7548 176 517 -329 280 -38 -243 -45 50 76 80 -2 -3 122 83 -82 -194 226 -7 96 180 -114 156 46 243
7571 243 99 -82 -230 13 145 -145 3 162 225 7 154 -175 -42 -102 160 -132 146 -13 91 66 212
7592 212 117 -49 66 -156 137 110 316 -99 -59 -68 -11 -170 225 -124 279 -226 130 -53 7 -32 51 41 -215
7615 -215 161 -217 70 -20 160 31 229 -66 51 85 204 206 -135 279 -67 73 121 154 -120 -304 -94 -307
7637 -307 -103 -225 0 -323 242 275 -85 26 -151 111 182 -38 101 -78 -221 170 78 107 -6 -377 206
7658 206 -151 244 12 -113 -51 -51 149 -84 232 -77 -258 283 92 246 192 -109 67 -101 212 251 -46 154
7680 154 -282 134 -212 45 -238 -331 -219 -188 35 -16 232 126 -432 162 209 -151 174 -338 -184 129 -143
7701a43M32r4j68q6p5K51j33l14L69J72m03J75L0N0j43k10K56p2J47j73K02l0
7723D0k0j03Q6N2K53l64k86O04j54K55l87Q5k60K17J78l90K18p4K11K5r9o7j99
7746a79J9PJ29K00r2r2j60P3L24l23j6J18j48J69J23m31L88J52m5j66j28k52K16
7769a14k1J06K50k83j54M34o4n3k29k4K47j55P9j46M1j58L97m7P0j5j86j09M03
7792B69k67L7m2j94K34ok53N3R2OJ32j83K22l6J21k73M0j59J71N5K73M3j24J9
7816B30k97K7k17K26m42L26J35j57K70M6j36Q1m0j05J52q1J25L2j57j46n4J28
7838e4L52l53j7N2p5J93j92J32J96m02jP7j16J21M27o21K97K25m1j1l17J05j3
7861c6M28p36r5M72L17n41K3J16k84q0L53J64j2n6p2L15k78p3L0K2l77M48K65
$$ plain form
7701 -143 289 195 27 -59 -134 117 -16 -330 39 211 -192 -17 13 63 -80 -290 -34 -106 41 -132 70 40
7723 40 20 -83 3 55 308 -56 -342 262 108 363 -24 61 -199 18 196 -194 24 -50 161 186 87 20 -179
7746 -179 -160 -153 -24 176 84 -8 -168 -95 229 -94 -110 8 -140 29 152 -279 109 261 216 50 -78 -330 -114
7769 -114 -135 -29 221 -62 -216 218 154 101 -128 -152 95 -60 19 -127 -86 -244 153 106 176 161 -25 -134 269
7792 269 2 39 -3 -197 37 31 -222 -169 -77 -71 61 -122 100 64 185 -88 -48 -207 -36 19 292 335 211 230
7816 230 -67 -40 -257 -31 -473 -147 -12 -169 101 147 11 92 52 -53 99 18 143 175 18 -128 -182 -54
7838 -54 298 -55 -72 -20 -95 98 -94 38 234 -168 -169 -92 -208 -87 340 -281 16 241 200 189 -128 -23 -36
7861 -36 392 -344 -439 33 350 -191 -168 -52 -336 -416 -63 101 89 33 -39 276 -2 -75 -45 -23 -400 48 313
7884C13j52m41K05L14k86Q4r1M21n09K82m37M33k48k33M93L38m37l74L59l80O66
7905C20q87J38O45l0J68k82L30l65j21k51k23O21j01K25m3l72P3N37k91j27P5
7926C9J67M8j18r8j0J22m72J9K84L10l46K41M1O6m04j58L05l39M68k82o7P7K28
7949A21J35m05L63m18L44k63J06Q2J80k26K20q1k25O1L1l95j47R26N2p16J96N5
7971dKj00K47J4n21R3Q3J09J29L7M88o67P8J26k80M97m8j2k4j79k05K84k92N7
7995h8J59j18j92N38m12L39l3j65Q6K04j85j97K02n46L17N64m44o8k76L2J93L95
8017C05j99n1j53J30k38l23N86o5M34n82L07M0k18K80l55K64k30J69o76Q69m75
8038a81J61J40m29K61j49k7R9K09l04k21Q68j33l23J34j53k3j24M37p6p7R0j56
$$ plain form
7884 313 161 -280 -75 239 -47 37 -54 367 -142 140 -297 136 -112 -345 148 486 49 -325 34 -346 320
7905 320 -567 -429 216 186 354 72 402 37 -84 -335 -558 63 -38 187 144 -228 -155 382 91 -36 39
7926 39 206 254 136 38 28 150 -322 -303 -19 291 -55 186 227 293 -111 -269 36 -303 165 -117 -184 -107 121
7949 121 256 -149 214 -204 140 -123 -17 65 245 19 239 158 -67 -6 25 -370 -517 409 461 -255 -59 -4
7971 -4 -2 -102 145 159 -362 -269 -186 -77 52 89 577 -90 -12 114 -166 331 283 271 247 68 -137 147 -145 -88
7995 -88 71 -47 -239 299 -113 226 193 28 114 318 133 -64 138 -408 -91 473 29 -39 -315 -283 -90 305
8017 305 106 55 -98 32 -206 -529 57 -8 426 -156 151 191 -27 253 -102 162 -68 101 -575 294 -181
8038 -181 -20 120 -309 -48 -197 -224 -125 84 -220 -441 427 294 -29 105 -48 -71 -195 242 166 89 179 23
8060B3m8J37qqj4J80k79K96q13J75L49m7k32M2O04k31m2K5l83M02j92o3l63J041
8084E51q94K65r4kr3kM44r8k07K2q0o5N53m04O40m08K2j64J92j59k11P73o40j71
8108b30L59j18J8j66J99K40Q8k26k47Kj25j20M48k50P04p89J40o5L29k98j23R1
8130a39k74M29J36K1m73L35J03J01K19J0l57J51n59M65k65J84l12K33k73J18P03
8151E56n67L38n33K64l1j98K71Q4l11J7Q1K68k26K64m84L72n56N65j04j06M62
8172D26m79m3M39m89N64k40n20O21m64N1N80l75k09L82K40m40j63L54m23
$$ plain form
8060 23 -25 112 104 96 82 262 -17 279 -534 -359 -10 -57 -289 -247 357 126 84 109 -274 128 -64 -127 -490 551
8084 551 -343 -78 -172 -174 -267 -269 175 77 -130 -108 -188 -253 300 -104 536 128 150 -14 178 19 -192 581 -59 -230
8108 -230 129 11 29 -137 62 302 390 164 -83 -81 -206 -326 122 -128 576 -213 -73 -138 191 -107 -230 -139
8130 -139 -413 16 152 173 -300 35 138 239 458 468 111 262 -297 168 -97 87 -225 8 -265 -147 556
8151 556 -11 327 -206 58 27 -171 100 184 -127 -110 -29 239 13 277 -207 165 -391 174 70 -36 426
8172 426 -53 -96 343 -146 418 178 -342 279 -185 -134 446 71 -138 244 484 44 -119 235 -188
8191a88
$$ Imaginary data points
##PAGE= N=2
##DATA TABLE= (X++(I..I)), XYDATA
0@%%%%%%%%%%%%%%%Lj0J5j6J6j6J8k2K7l2L6m1M7n2N9o7P5q5R6j08J20j33J48
38G8j65J82k03K28k52K77l07L41l79M21m69N26n92O70p64Q80j030J233j521J970
58A124k778M715j6733l3101R868K7410L2065J3108p572k7475k2054q449J2215
71a7657J8358J7479N913p395j5645j3639p884K753J3260J6071J0250j552j5538
84D774j9436r798M707J9586K0269N444j0475k0455j5233n7J1880J8290R313l565
98A5244j1624j2347m540K901Q359Q379M590j818n820o381n796p01N073P625O271
113I415P69n502r744n377M99P514R667M018k655q622p851k317L815Q715N786m05
129G725n575m580l217rL152M403J604J053j644l742k256j845J961L522K758K650
$$ plain form
0 0 0 0 0 0 0 0 0 0 0 0 0 0 0 0 0 3 -7 8 -8 8 -8 10 -12 15 -17 19 -22 25 -27 32 -35 40 -45 51 -57 63 -70 78
38 78 -87 95 -108 120 -132 145 -162 179 -200 221 -248 278 -314 356 -408 472 -558 675 -846 1124
58 1124 -1654 3061 -13672 -46773 -36905 -9495 22570 35678 28106 631 -21423 -29872 -17657
71 -17657 701 18180 24093 16698 1053 -12586 -20470 -17717 -4457 11614 21864 20312 4774
84 4774 -14662 -24460 -19753 -167 20102 25546 15071 -5384 -20617 -20674 -8794 9496 18809 15244
98 15244 3620 -8727 -13267 -10366 -2007 6372 10962 9144 3324 -3057 -8853 -9554 -4481 3144 9415
113 9415 10184 4682 -5062 -10439 -9940 -2426 7241 11259 8604 -18 -7869 -10186 -6371 2344 8130 7725
129 7725 2150 -2430 -5647 -5656 -2504 1899 3503 4556 2912 -830 -3086 -4931 -2970 552 3310 5960
145E960k526m640l792o76L811M599K471p01l146m181k096J388L737L648j00j073
161B683l644j820j00J487J524J867J30l53j388k185n84K58J589K389K095k483
177A465j472k802q38J544K751K129M01k322k149j582j20L333N25J332l39j707
193A49j338q10Q38J082J094j52M19m89n88k288P8J634P37J119J70j238j848r10
211b341R66J322K194r5j378j836n12Q48N98Q46K61L65j299j048K55j32J058N42
229F14l55L25jj059j182O55Q73Q56q44K346j501j653k01L63P32J032M29j179p8
248A72j521j26J465J6J141M93q04o95m00o24M62M06M13P98r09o76M33r43M01P80
268B82O39l02O71j531j362R16L56J198N67j066j326Q57m06R22J38m56L76l40j66
$$ plain form
145 5960 3434 -1206 -4998 -5674 -1863 2736 5207 4506 1360 -2821 -4917 -3529 208 3856 3756 2683
161 2683 -961 -2781 -2881 -1394 130 1997 2127 1774 386 -1799 -2383 -2125 -536 1853 3948 1465
177 1465 -7 -2809 -3647 -2103 648 2777 3178 856 -1293 -2875 -2995 338 863 2195 1856 149
193 149 -1189 -1999 -1161 -79 1015 863 1282 793 205 -2083 -2005 -371 366 1485 1655 417 -1431 -2341
211 -2341 -1375 -53 2141 2046 668 -1168 -1680 -832 -234 612 873 1238 -61 -1109 -854 -986 72 614
229 614 259 584 583 -476 -1658 -1003 -130 726 -118 2228 727 -926 -1127 -764 -32 1000 1429 250 172
248 172 -1349 -1475 -10 6 1147 1640 836 141 -259 -883 -421 -15 398 1196 287 -389 44 -899 -498 282
268 282 921 619 1290 -241 -1603 -687 -331 867 1434 368 -958 -101 -507 415 553 97 473 133 -33
287c3j71q06R73N23M6q19P38R6r16n84Q12M1Q48j22M09p97j10p50J93L52K75N46
309G44n75l59j38m24J456oL7l77n05J93m34O35k1j94O07k52k83m42m25K14K74
330b75J50O19j17n65or0l3L51O46p56M83p7p19l3L9Q23j28j15N9o28K80k26K37
353h1J19J91J11j0k30n90n6m6J019J28k97k93K89j34q93J267k89m76M44j50j79
374a56l74K29M70k6L3l10j01Q1q4J92OL21J5k03m65j48J63L20k62N56l01N63n49
397c0j63L0K15M20l12K22j40o01K28N82k13k79l23P09L0k97l97J97J90mK22j43
419A43k99L46m56l77J35N31o6N17q37J97r5J7M60J51J25j48o68K38J07K22k97
440e4J56j28J95n12O1L35l8j3K6K87l28j7l90K01O0P88m14K83n32j78J52K27m32
$$ plain form
287 -33 -204 -1010 -37 486 532 -287 451 547 -369 -953 -141 -100 748 626 1035 238 128 -622 -429 -77 198 744
309 744 169 -190 -328 -752 704 698 735 358 -147 46 -388 247 226 32 639 387 104 -338 -763 -549 -275
330 -275 -125 494 377 -188 -194 -284 -317 34 680 -76 407 330 -389 -422 -383 440 312 197 256 -372 -92 -318 -81
353 -81 38 229 340 330 100 -490 -546 -592 427 555 258 -35 254 120 -773 494 205 -271 173 23 -156
374 -156 -530 -301 169 143 176 -134 -235 -154 -238 -46 -40 281 296 93 -372 -520 -357 -37 -299 257 -44 519 -30
397 -30 -193 -163 52 472 160 382 242 -359 -131 451 238 -41 -364 345 375 78 -319 -122 68 64 286 143
419 143 -156 190 -266 -643 -508 23 -43 474 -363 -166 -261 -244 216 367 492 344 -324 -86 21 243 -54
440 -54 102 -26 169 -343 -282 53 15 2 28 315 -13 -30 -420 -219 -159 629 215 498 -34 -212 -60 167 -265
463b65K32L14j25l10M09M1l51K82N32k34n15j4K28r9J71K74m85N58o65M05l85
484bk26m1K13K48M9L46m74%J20j36P6J41O06m77r21K41M57k56k2k26O55n67M67
507B71rn38J33L77m57j71L35K40k12J87q5k19Q82k22l68M0k29l26K97P8J71r2
529H3o3M04k62oq95L73O21m00J75n16P58k28P2N63l51m44n94M28L38j17j75K19
551a7M00m00j78K73J28J81n65J63M61p91N21m89OJ50o6L91Q2L1l49o21P71R2K04
574C78k33O0j7l42N5Q0K54o95M09L75n67L06mq70J295P0N01j151R2N14q83p4O14
597A67M5j22k39K91J89l42R8l95L93N1m9o41K5N92n14N19L11j26j022J757j420
618d32L71L10r34J524q08l44L94o9Q88j661J44J356l25l4L13m99k8M62p43k38
$$ plain form
463 -265 -33 281 156 -154 255 296 -55 227 759 525 10 -4 224 125 296 570 85 643 -22 383 -2
484 -2 -228 -269 -56 192 241 587 113 113 233 97 173 314 920 443 -478 -237 220 -36 -58 -284 371 -196 271
507 271 262 -276 -143 234 -223 -394 -59 181 -31 156 71 -148 734 512 144 184 -45 -371 -74 4 175 83
529 83 20 424 162 156 -739 -366 255 -145 30 -486 272 44 116 679 328 -116 -710 -282 56 -61 -236 -17
551 -17 383 -17 -195 78 206 387 -178 -15 446 -345 176 -313 -307 -157 -223 168 250 281 -68 -689 82 174 378
574 378 145 205 188 -154 -99 -19 235 -460 -51 324 -243 63 59 -811 484 554 1055 -96 -4 510 -373 -447 167
597 167 212 90 -149 142 331 -11 87 -308 85 136 87 -554 -529 63 -451 68 379 253 -769 988 -432
618 -432 -61 249 -685 839 31 -313 81 12 900 -761 -617 739 414 380 693 194 166 628 -115 -353
638c53M45l09J074K1j115P30q4o43K57J635p04o24m84q52R26m95p8O75k22K11
658A1n26L66M07k88n39M03o96L26O00Q38n47q91L37p31K340j187q58K25L96J80
678A66O98m61M77j052O76m71N18K5j85r57O67O0m00J0N36M33q46N09p04k89R63
699C73j37j026R64j3o42J164p20j60k69Q84k11N02o39l31j178R11J211j49j125
718e91P50O75p64K67j9o50J396j500K56o10K29P28k39J4o50J304r75m39l06J472
738C48K89j46q57P41J42q75M07k47k46L15n3J21L78j206P94p45O57O13p93M30
758F7l2k38n67J083j59P08p05p91N93K96p27L34r88J338o29o3N48P71r39N27m40
779a3K27j16P3j228Q32K18N05M2j697J608j430J258m10J024j573J845j515k23
$$ plain form
638 -353 92 -217 857 878 -237 493 409 -234 23 1658 954 330 -154 -1006 -80 -575 -653 22 -200 11
658 11 -515 -149 258 -30 -569 -166 -862 -536 64 902 355 -536 -199 -930 1410 223 -635 -410 -14 166
678 166 864 403 880 -172 504 33 551 576 391 -566 101 161 -239 -229 307 740 -106 403 -301 -590 373
699 373 236 -790 174 161 -481 683 -37 -197 -466 418 207 709 70 -261 -1439 -528 683 534 -591
718 -591 159 834 70 337 318 -332 1064 -436 -180 -790 -561 167 -72 -58 -708 596 -379 -818 -1124 348
738 348 637 491 -366 375 517 -358 49 -198 -444 -129 -182 -61 317 -889 -95 -840 -183 430 -363 67
758 67 35 -203 -770 313 154 862 157 -634 -41 255 -472 -138 -1126 212 -417 -480 68 839 -100 427 -13
779 -13 214 98 171 -1057 -225 -7 498 540 -1157 451 -979 279 -131 893 -680 1165 -350 -573
797e73J448o68n50J444n87K01j42j076m7m00R19J91N39j184m22Q40O42p1j153
816f49O82Q97r98P63o86J80j20o71O78L9j93J611j462K60P05q80j251J376j118
835h37n85J563l44J21n36M76N21q02O73j7K43l22o83N6P28k45L4N16r48k35m54
856a077J412j310J670J09k094J687o56J57j42p28K266j203q32O45J204j453J448
873A103r65r0J03R5K02l41j76K24O36k42P9r04J104j106R03M05j08l61j322J661
893I00m81P91k140Q81J8p47J39J043L39o04L0p68O52R10j226Q31l17N76j019M61
913B69m70l66J378k35K05p38M05p00Q71J070k454J530p5q70O19r19m48J048m5
932G5K4k87M25n22P27q46k3N84m8p96J606n57l3q52P40j067J031k50J0n29J33
$$ plain form
797 -573 875 207 -343 1101 514 715 573 -503 -550 -950 -31 160 699 -485 -907 -67 575 504 -649
816 -649 33 930 -68 695 9 189 69 -602 76 115 -78 1533 71 331 1036 156 -1095 281 -837
835 -837 -1422 141 -203 -82 -618 -142 379 -423 250 233 476 154 -529 -473 255 10 44 560 -388 -623 -1077
856 -1077 335 -975 695 804 -1290 397 -259 -102 -244 -972 1294 91 -741 -96 1108 -345 1103
873 1103 138 48 151 246 448 107 -69 155 791 549 628 -276 828 -278 625 1030 922 561 -761 900
893 900 419 1210 -930 -49 -31 -778 -639 404 743 139 169 -599 53 963 -263 568 251 827 -192 269
913 269 -201 -567 811 576 781 43 448 -252 619 1689 -765 765 690 -180 439 -480 -928 120 75
932 75 99 -188 237 -285 442 -404 -427 157 109 -687 919 362 329 -523 217 -850 181 -69 -59 -588 -455
953d55K53K41%k81J254j214L81k26o93L46L56N69k58j26l06O5O38%k60r57R93
974C20l59L9j064M24R67j001J4P05M75J14m73l16LN18n80j419J504P3P62j49q5
995D72q39Q7K33l11K8J247q83l77R21n35L11m47k38Q12j14m83o7k29N33k11N04
1016D14R3m33r24J321k77J7O47o94o04J443j251O11m82l85Q26J15j399O08J30
1035b24J85P1O25n54k90k60N40N70p21r4M10M67r01P71l73m05L43k0p29L11j47
1056d25P35j27L58j372K43Q51l54Q39j96m28l34P13p63K83p17N31j67N14J1K88
1076D83q20j94M15J80r2r9p9J003m53j77j3l88J9P9M14N20k25o69N11P2r84O55
1098A58p11N55N32l01L99o19K20j08J78n16K2O7j54N24k62l70L40R0P65q74N95
$$ plain form
953 -455 -202 39 39 -242 1012 -202 179 -47 -740 -394 -38 531 273 147 -159 -94 544 544 284 -673 320
974 320 -39 0 -1064 -640 327 -674 -660 45 520 634 161 -155 -152 366 -214 -1633 -129 -56 706 557 472
995 472 -367 -280 -47 -358 -330 917 34 -343 578 43 354 -93 -331 481 367 -116 -183 -412 121 -90 414
1016 414 507 74 -850 471 194 211 858 164 -440 1003 -248 363 -119 -504 322 437 -962 -354 -224
1035 -224 -39 32 657 103 -187 -447 93 663 -58 -152 258 725 -176 595 222 -183 160 140 -589 -278 -425
1056 -425 310 183 541 -831 -588 263 -91 748 552 124 -210 503 -260 23 -694 -163 -330 184 195 483
1076 483 -337 -531 -116 64 -28 -127 -206 797 344 167 154 -234 -215 -136 278 798 573 -96 415 487 -497 158
1098 158 -553 2 534 233 632 13 233 125 303 -213 -191 -124 -278 246 -16 -386 -46 44 809 -65 530
1119E30r39O28p02O92n97M5k39J3J299q47N21j107N58M22K91K63j298K68r9p9
1139c77J19J094j134J83N28j43j79j231J094M06J68m22J74m22k50R24k05q94R45
1158C78j196Q01J76P5K43l73k2k29J139n33j157K90k20K45ql46J062j077J942
1177A190j124k23k48P15l80q0m40M52L34M34n5p95K93J226r40n2k19P28j106O70
1197C80O24j449J011p51P13m42L68q18N61J05r85M97J97p50K37J058l25l24k63
1216c56Q17K82r35Q7m68M54q31Q59p06R12r9J4K87r54j57J421p32m56Q99o13J63
1237a12N39j38j74m01L99L74j023M75J79m96k09J045n67J71K5j35K74l12J019
1256I33r36l90Q93m74p06O03O57k82k99k61p0K85L52o04L6P3pJ66J62p59J066
$$ plain form
1119 530 -409 219 -483 209 -388 -343 -582 -569 730 -117 404 -703 -145 277 568 831 -467 -199 -298 -377
1139 -377 -258 836 -298 -115 413 270 91 -1140 -46 360 528 106 280 -142 -392 532 327 -567 378
1158 378 -818 -17 159 234 477 104 82 -147 992 459 -698 -408 -628 -383 -391 -737 325 -752 1190
1177 1190 66 -157 -405 310 -70 -150 -590 -138 196 630 575 -220 73 1299 359 307 88 816 -290 380
1197 380 1004 -445 566 -185 528 86 454 -364 197 302 -683 -186 11 -739 -502 556 231 -93 -356
1216 -356 461 743 -192 -105 -573 -119 -950 -91 -797 115 16 30 317 -637 -794 627 -105 -561 338 -275 -112
1237 -112 427 289 115 -286 113 487 -536 -61 118 -378 -587 458 -109 62 87 -48 226 -86 933
1256 933 -3 -393 500 26 -680 -77 580 298 -1 -262 -332 -47 305 -299 -263 -190 -197 -31 131 -628 438
1277D38l54K07o63O92o76R87J67m02p82M73K34k27O51j6l28m21L47n42K05K53
1297B43k08p5N68j586Q6K05J139jl88l58J329r33o27m93K21J124J7o03J12J25
1317a03k89O20M5J27j396P63K91p89J232n30p07J471n19J39n43J480j663l52N20
1336b03N24Q3q80n21L48Q1J274l37p72P34p97O16j303J695j113L37o09L93M78
1355B8j7j77J12M92n65p0Q52N04p14O15m79j013k82j89P51J066k45j502R33j215
1375a115K424j677J65K76j30K89l93Q52m39j103O19M13p54N07k3o93J516p36J29
1394A27Q83j074j066J325J24j816J762l26n92k80N73J240r93R87K54j919O86p17
1412h22J109J78n07m17j48R51j71l80r30R82o7l67O45o37J109p31R95q61j319
$$ plain form
1277 438 84 291 -372 320 -356 631 798 396 -386 87 321 94 745 729 401 -20 327 -215 -10 243
1297 243 35 -40 528 -1058 -972 -767 372 371 -17 -375 954 21 -606 -1099 -878 246 263 -340 -228 -103
1317 -103 -392 228 273 400 -996 -233 58 -731 501 -29 -736 735 216 355 -188 1292 -371 -723 -203
1336 -203 321 404 -476 -997 -649 -568 706 369 -403 331 -466 150 -1153 542 -571 -234 -843 -450 28
1355 28 11 -166 -54 438 -127 -197 655 1159 445 1060 581 -432 -714 -903 -152 914 669 -833 100 -1115
1375 -1115 1309 -368 -203 73 -57 232 -161 691 252 -851 -232 181 -573 -66 -89 -782 734 -2 127
1394 127 1010 -64 -1130 195 319 -1497 265 -61 -653 -933 -360 880 -113 874 1128 -791 -105 -822
1412 -822 287 465 -42 -459 -607 344 173 -207 -1137 -155 -222 -589 56 -581 528 -203 792 -69 -1388
1431a388J602M91p87J380j463K71J41j019l9J105j436K2O62J36R01j104N80O5
1449A20J012j759J125j991J065K286k751M2J13P19O14j457J307o66m55J23R93
1466D40j45k48l79J21O23n56J294j006N49n50M00k60j98j31R85l27Q3r40l72N54
1486f3q82J538m06j7k02j97N28o70j064K105j937K498m21j549K334j825J472j299
1504e7n78M13p8p03P13M63k85k20J4J045k0k56p98J384j455K59N79j606J041r22
1524a067J808j659J264L3o59K051j938q60K88N60R07j232L86J496j232O75m58
1541C63o61j379K509j227J487l75j030o11J432l35m13p09Q27j342K117J35j153
1558c65j162K045n21j309M60k25J369K97k91j06N7l93L50P83j652k8J171o22M5
$$ plain form
1431 -1388 214 705 -82 1298 -165 106 247 -772 -811 294 -1142 -1120 -458 -322 579 -525 55 120
1449 120 1132 -627 498 -1493 -428 1858 -893 -851 -738 -19 595 -862 445 -221 -676 -553 440
1466 440 295 47 -332 -211 412 -144 1150 144 693 143 543 283 85 -46 939 612 695 -245 -617 -63
1486 -63 -945 593 187 170 -32 -229 299 -371 -1435 670 -1267 1231 810 -739 1595 -230 1242 -57
1504 -57 -635 -222 -300 -1003 -290 173 -112 -332 -318 727 707 451 -347 1037 -418 -159 420 -1186 -145 -1067
1524 -1067 741 -918 346 379 -280 1771 -167 -1027 -739 -179 728 -504 -118 1378 146 821 363
1541 363 -298 -1677 832 -395 1092 717 -313 -924 508 173 -240 -949 -122 -1464 653 788 -365
1558 -365 -1527 518 -3 -1312 -852 -1077 292 589 298 192 249 -144 206 989 -663 -691 480 -142 -97
1577i7j22o53J066k27j095J022Q80j14r12n3R8J041K01k19m66P28j518P13j14
1596A59J34P43r43J76r8k1P31k010K46J434k05m82O39k82m05J782k160L78q30
1615a014J038l75Q16o8m0L37r97l83P15l05N2L8n4p9M27Q32j528R7J097o74O55
1636E87j228N86N30j176J094r81Q22M78n03k78J14k65k12N14K27p63K19K58n19
1655d96Q46l60K3O20n21J43L53q73P07n81M26m02K27j54k28N07j82j91L76q0J81
1676C41n69L70K37M6l08l99L18j96j15N15m45M86j037N25J77R8K40l56K28o7L80
1697D69o94K5K71o94O01j75R31p85L97L36n75l61P50J48l57m67J26P42m53j18
1717A17l89N51n89J36m6P56n81M13o43K11K38p6k73J1M70k77n03L23N15J11k59
$$ plain form
1577 -97 -219 -872 194 -33 -1128 -106 774 660 -252 -305 -207 834 1035 816 350 1078 -440 273 159
1596 159 293 1036 93 269 171 150 881 -1129 -883 551 346 -136 503 221 -184 1598 -562 -184 -1014
1615 -1014 24 -351 465 397 357 694 -303 -686 29 -276 -224 -186 -240 -319 108 940 -588 -491 606 -68 587
1636 587 -641 -55 475 -701 393 -588 234 712 209 -69 45 -220 -432 82 309 -454 -235 23 -496
1655 -496 350 -10 13 633 112 255 608 -265 442 -139 287 -115 112 -42 -270 237 55 -136 240 160 341
1676 341 -228 142 379 425 117 -282 36 -160 -275 240 -205 281 -756 -231 -54 44 284 -72 156 89 469
1697 469 -225 -200 71 -623 -22 -197 734 -51 346 682 107 -254 496 644 287 -180 -54 688 235 117
1717 117 -272 279 -310 -174 -220 536 -45 368 -275 -64 174 98 -175 -164 306 29 -474 -151 364 475 216
1738B16k67L51J45O8o75K62k8r2R1J38J93l8m78K10L12p68L17l58K59R05m76o98
1760d11M31kl3K89m98j31N49j3k18L54N2n13m29N33L54p05J26p62J072l82J96
1781a41j4J56R2j4K62p55P34o02Q32o77L7J50l2l44l02J339j047L02L52M28o29
1802A27M94j065J55N55L16r35j02O48j83K84n61O02J84r27L41L38r3j233L35Q47
1822A27L6P8j045J576p59k78J21J51r80J202o63O87n06k76O0K18K4P2P16j101
1842e40N72L44K13Lj170K1j51O62L41N18j268K88J52L42k08l49K92J04M04j166
1862e96M12M91j93n30N36k50O90L81o48J83m93K14J52m23J065o82r27J74J134
1881F90r55O44q31M60K10N5L30q51Q12r94K23j5N69k98J4l3L29k7N43j115L98
$$ plain form
1738 216 -51 300 445 513 -162 100 72 -20 71 209 402 364 -114 96 408 -360 -43 -401 -142 763 287 -411
1760 -411 20 18 -15 274 -224 -355 194 181 -37 317 369 -144 -573 -40 314 -391 -265 -1027 45 -337 -141
1781 -141 -155 1 93 79 341 -414 320 -282 550 -127 -90 60 28 -316 -618 721 -326 -24 328 756 127
1802 127 621 -444 -289 266 582 -353 -455 193 10 294 -267 335 519 -408 -67 271 178 -1055 -720 127
1822 127 163 241 -804 772 13 -265 -144 7 -973 229 -434 253 -253 -529 -469 -251 -227 -155 561 -540
1842 -540 32 376 589 592 -578 -557 -708 -46 295 813 -455 -167 -15 327 119 -230 62 166 570 -596
1862 -596 -184 307 114 -416 120 -130 560 941 293 476 -17 197 349 -74 991 309 -618 -444 690
1881 690 -265 379 -452 8 218 273 603 -248 564 -430 -207 -222 347 49 63 30 359 332 875 -240 158
1902A58k08M37o0N9j56m15O67j45L75l68J29o19o6R7K06n44Q6N39l86N60j73m44
1924b71J288j238l92L48J49L21l96J12j95M69L6J54r0J32J10j331J231l93k51
1943b07J81P76n67N9n90M8O14P26r01L3L3m13n74P23O5j33l61l04L34j74J337
1964G05o11N36N03j201K98K34Q9r78K22K46L0L45k59n99O49P79l19J05m27n93
1984b46k31q82J746j271O19l9P17n48k14J79M81n72o4K77j92K07K97j56O83m79
2004C12r78M71r2p4M30O75l7q86N36j62k52Q17j166j69O73R2L0k21K12l19j50
2025b58L82k13K4l79K26P78n39R17r13l55j01k7N36o33J130j083j10P53m74P58
2045D19o32M8O48j47m18J70O39p27l55M33J10l63k33O09l26P4R7J12n69l4M36
$$ plain form
1902 158 -50 387 327 386 230 -185 482 337 712 344 473 -146 -212 -115 91 -453 -367 172 -214 346 173 -271
1924 -271 1017 -221 -613 -265 -116 205 -191 -79 -274 195 231 385 295 427 537 -794 437 44 -207
1943 -207 -26 750 183 242 -348 -300 314 1040 139 172 205 -208 -782 -59 6 -127 -488 -792 -458 -632 705
1964 705 94 630 1133 -68 230 464 553 -425 -203 43 73 418 159 -440 209 988 669 774 347 -246
1984 -246 -477 -1359 387 -884 -265 -304 413 -135 -349 -170 311 -261 -325 -48 -240 -33 264 108 791 312
2004 312 -666 -195 -287 -361 69 744 707 -179 357 195 -57 760 -406 -575 98 190 220 -1 211 -108 -258
2025 -258 124 -89 -65 -444 -218 560 21 938 25 -330 -431 -458 78 -555 575 -508 -618 135 -339 419
2045 419 -213 -165 483 336 -82 88 727 0 -355 78 188 -175 -408 201 -125 -51 46 158 -411 -445 -9
2066ik80o0O72l15j23M5k08O85m50J74j61J33K87j032J63O94n45Q42l63o25J140
2087F64k30K33m37o66N21M64j13p40P25J54r57K52M28m24K34n52N65k81j90N03
2107A53l09K08m64J77L75o57O43n55J030q51M53k07j33O35l64L5r50K94Q14m49
2127a22m24N71n59m8N41O67j221O65L17j216J233R1p65M90P3k37k8J15R8m91N65
2148C15k06M59o07K37q96Q68K42q43K75mn10N75l87L99K05M81n21N67o24k04O61
2169D82r99O34j69k89m89L73l90R17o8J59p82M84p2M88k26o30N63L25p55o07Q27
2190b24k02M95q77J210m45j23P70k43J18k92N42k29k06l28j36O58j85j658J615
2209B60l78l88M40M18L79L2l14n18l60J3J466q12o32J328p77j25k66k30m03P67
$$ plain form
2066 -9 -289 -349 323 8 -115 -70 -278 407 -43 131 -30 103 390 -642 -479 215 -330 512 149 -476 664
2087 664 434 667 230 -436 85 549 436 -304 421 575 -382 -130 298 -126 108 -444 121 -160 -350 153
2107 153 -156 52 -412 -235 140 -517 126 -429 601 -250 203 -4 -137 498 134 169 -781 -487 327 -122
2127 -122 -546 25 -534 -582 -41 626 -595 70 387 -829 404 495 -270 220 293 56 28 143 241 -250 315
2148 315 109 568 -39 198 -698 170 412 -431 -156 -160 -670 -95 -482 -83 122 603 82 649 25 -179 482
2169 482 -517 117 -52 -341 -830 -457 -847 70 2 161 -621 -137 -209 279 53 -577 -14 311 -444 -1051 -224
2190 -224 -426 69 -808 402 -43 -166 604 361 479 187 729 500 294 -34 -170 488 303 -1355 260
2209 260 -118 -506 -66 352 731 763 449 -69 -429 -416 1050 238 -394 934 157 32 -234 -464 -867 -100
2229a00j049k16J672j51r09J160j1o54M89q08K84J023q82p84K64J482j158O58
2247C10o19L85K46k62n51N71k83M72n43N35n15J9M21K04p94J49Q2m03J37K058
2267A619j593N16j276O56L50J64J62j176l27J094j9O30j384J107m1n18L56o63
2285c43k6O71L32j550J058j49J74J453j224m34r83J991j277J444q63k36K62l53
2303e3R58j2j532O79K15r5k19o12P76l99M11p32l62J239j93j176J013o11L25Q76
2323D96k83O2k75J60m77O52K61L01k871J379l5J36j75K73k42j24q4J181k11P18
2343H42j063j419K410r20j093N88J266n03L81k31M0n9n59l43J405j185K75J42
2361b6m45m98Q53L16J015k048R61l1N22k84M38j250J279j053p72M18J159J000
$$ plain form
2229 -100 -1149 -1365 307 156 -753 407 396 -258 231 -577 -293 730 -152 -936 -672 810 -348 310
2247 310 -309 76 322 60 -491 80 -203 269 -274 261 -254 -235 186 390 -404 -255 -173 -576 -439 1619
2267 1619 26 542 -734 -78 272 436 598 -578 -905 189 170 800 -584 523 482 -36 320 -343
2285 -343 -369 302 634 -916 142 -7 167 1620 396 -38 -1021 970 -307 1137 274 38 300 -53
2303 -53 905 893 -639 40 255 160 -59 -671 105 -294 117 -615 -977 262 69 -1107 -94 -705 -380 496
2323 496 213 275 0 160 -317 335 596 897 -1974 -595 -630 -494 -669 -396 -638 -762 -846 335 124 842
2343 842 -221 -1640 770 -150 -1243 -655 611 108 489 258 298 239 -320 -663 742 -443 -168 -26
2361 -26 -471 -969 -116 200 1215 -833 128 97 619 335 773 -477 802 -251 -1023 -605 554 1554
2379A554j849k71J094N55k113R33k46R03j428J402q8k82K37n37J188j23N20j575
2397a26P16M11j604M10m06J56P11N09j628P24j055K120q90K77K20O24o52p99K67
2416a5j205J366J050k914K460k49L45l89q01J426m04j026R61j79j054k18J008
2433A62P97l14M24o51j392Q73m81n4M61m96R07j579J713p4O35j565O99P04p35
2452C4J614m89k485L51R72l9K33O1r30q40K147j0J390k475M04j166J222l22J116
2471G88j323J658k712J023J523m66k72j550K324j274m43J236r15J030K25oj463
2488f17O78k2j09R77j340j395J365R02P5m29J56P95q96N27lK36J94m53p15j249
2508a323J403p30M43O91l24q41J267P18k292J493n48o48j54lR74K70j526J012
$$ plain form
2379 1554 -295 -566 528 1083 -1030 -97 -343 560 -868 534 446 164 401 -136 1052 929 1449 -126
2397 -126 590 1001 -603 -193 -599 -443 268 777 -851 -127 -1182 938 48 325 545 1169 517 -282 -15
2416 -15 -1220 146 1196 -1718 742 493 838 449 -352 1074 670 -356 605 426 -628 -846 162
2433 162 959 645 1069 418 -974 -101 -582 -636 -175 -671 236 -1343 370 296 931 -634 65 769 34
2452 34 1648 1159 -1326 -975 -3 -42 191 252 -678 -1518 629 619 2009 -466 -62 -1228 -6 -328 788
2471 788 -535 1123 -1589 -566 957 491 219 -1331 993 -281 -724 512 -403 627 852 846 -617
2488 -617 61 39 -70 907 -433 -1828 -463 439 514 85 241 1036 140 667 664 900 1094 641 -74 -1323
2508 -1323 80 -650 -207 484 160 -681 586 1304 -988 505 -43 -691 -845 -848 126 396 -1130 -118
2526a18P86j114J477o23k81O4j84l86N95l1m50Q03p28N42l43o5Q95j992R88PN19
2547C61j213K8n08K865j451j15J86N04l04j213J578j853J206K85j821R9J441o01
2565e26J087j455J150n5l21O1o1Q6J05l07p70P8J084r91J375p10O43L75q42l6
2585c0l78m3M95K84l98L42r43J094j46j5K36j539K335k016k21J067o99O5O04q16
2605g22R85o43Q88k09p52N67j131P40jr7J190r95J54o7O31j630J129j52Q77j416
2625f54N94K21M49k21q44k66K48o4J758j355O29n01j03m5J065l64m9j291J546
2644G53j272J58N84j211J203j452J311k6l83O71n48n39O27k39j08J36J472m05
2662G32k337J41R80L39n9M62o29M2P7P13j158N18m26k05J314l54k85n97R64J28
$$ plain form
2526 -118 668 -446 1031 408 127 191 7 -379 216 185 -265 538 -190 352 9 -56 839 -1153 -165 -158 361
2547 361 -852 -824 -1332 1533 82 -33 153 657 353 -860 718 -1135 71 356 -1465 -1366 75 -526
2565 -526 561 -894 256 201 -120 -59 -120 -34 71 -236 -1006 -928 156 -835 540 -170 473 848 6 -30
2585 -30 -408 -451 44 328 -70 272 -671 423 277 262 498 -1041 1294 -722 -943 124 -575 -510 94 -722
2605 -722 263 -380 508 299 -453 114 -1017 -277 -278 -375 815 -180 -26 -93 538 -1092 37 -115 762 -654
2625 -654 -60 161 610 389 -455 -721 -473 -537 1221 -134 495 -6 -109 -154 911 547 498 -793 753
2644 753 -519 -361 223 -988 215 -1237 74 48 -335 336 -212 -751 -124 -363 -471 -335 1137 732
2662 732 -1605 -1464 -484 -145 -204 258 -371 -329 -252 461 -697 -179 -605 -810 504 150 -135 -732 232 360
2682C60k05L26J06q30L89J046j213k7m50Q65M4q04k91M16n38J34J073j282O14
2701b67P33q20K89q40J417m51l3J3Q90r79l67Q65p28J2o08J631r89J031j136N72
2721B35n95K96L45l43L58j215R62M29n11l74L01N80J07q2j248P32r2K9r73M53
2741f06J150o42k6J39M5k03P08M5J60o55k3R98j757R02l27l8M82j27j014J537
2761G48j071k20L71j82L21J67l54P13p12J61L58j044qj79L89O90j40l20n6o06
2781i74J543l92ln28P92j137N97n02O38p18N87k18m35P94OL7P8m2q24P43K83l31
2803fQ14m46j041P61p04P00j320M75J666p25p44L63N50q11N34J18m41N90p73J063
2823F23m46r9j45n06Q23m56j33N93J01m90N3j36K50L17o50k34M11J80k47J40j49
$$ plain form
2682 360 155 481 587 -243 146 1192 -21 -48 -498 367 411 -393 -684 -268 -806 -672 401 -881 -267
2701 -267 466 -354 -65 -905 512 61 28 41 931 -48 -415 450 -278 -266 -874 757 -232 799 -337 235
2721 235 -360 -64 281 -62 296 -919 43 472 -39 -413 -112 468 575 493 -755 -23 -115 -86 -1059 -606
2741 -606 544 -98 -124 15 60 -143 565 610 770 115 92 1090 -667 235 -92 -130 352 225 -789 748
2761 748 -323 -543 -172 -354 -33 134 -220 493 -219 -58 300 -744 -752 -931 -542 148 8 -312 -368 -974
2781 -974 569 177 174 -354 438 -699 -102 -604 34 -684 -97 -315 -750 44 50 87 165 123 -701 42 325 -6
2803 -6 808 362 -679 82 -622 78 -1242 -767 899 174 -570 -207 343 -468 66 184 -257 333 -440 623
2823 623 177 78 -67 -573 250 -206 -339 254 355 -135 -82 -218 32 349 -301 -535 -124 56 -191 -51 -200
2844b00K38j49l7k34O66k45M76j041N26l98J15M4P9P1l37N60l2O1l11O8j55L18
2866H3N9j00k42O18m30j10M29k55np8Q4K24n42N17k47K14l36L87O1m50oR6M48
2889D19j85k85K6j58K07j75q6r4L48q5K63K21q50K98J39K47k42J25l98q7R35k57
2911C26l21j19L2J22m78M81M39n59L55m61J64k70L53j75O7K82P1n25J23J60m34
2932c67R6K43K04k19RqJ21K4m42k6O85p37M84l34J27K48q6K53j81m6j28J28l49
2955c01M47n54O32K20p41L95J7j60k95O31l57o55P69K26r29j70J309m98k19L3
2975b00jM76j63o54O77k1k86K74j05m48L47l3o5j52J67J57rk62P43n67k17K22
2997a20M26J9k86M35l21j13j73j26j01L2K10p8K97k72L09q6j60j52L19k4k18K87
$$ plain form
2844 -200 38 -111 -148 -382 284 39 515 -526 0 -398 -283 -239 -160 -89 -426 134 102 163 -148 -80 -235 83
2866 83 142 42 -200 418 -12 -122 307 52 47 -31 53 277 -265 252 5 219 -117 270 331 -119 -125 -29 419
2889 419 234 -51 -25 -183 24 -151 -237 -331 17 -68 195 416 -434 -136 3 250 8 133 -265 -352 583 326
2911 326 5 -114 -82 40 -438 43 482 -77 278 -183 -19 -289 64 -111 -44 238 309 -216 -93 67 -367
2932 -367 -271 -28 176 -43 -34 -42 79 103 -339 -365 320 -417 67 -267 -140 108 22 275 94 48 -80 48 -301
2955 -301 146 -408 224 444 -297 98 115 -45 -340 291 -66 -721 48 274 -655 -825 484 -14 -233 -200
2975 -200 -201 275 112 -542 135 114 -172 102 -3 -451 -104 -137 -202 -354 -187 -30 -39 -301 442 -125 -342 -120
2997 -120 306 325 39 474 153 40 -133 -259 -360 -328 -118 -196 101 -171 138 52 -108 -260 59 35 -183 104
3019A04l26K38k60K73j07o1l2l09M48O9J85m54J25M36m08J67k5J6jm67M91l5k27
3042a60K15J12l47j89N24j42j82J52K23o17K77o8j19P15o46L87K30l43K9J04n8
3063I7q3K24k86j07O2K07l43L45L5J4j16j8l9M19k10k37J7j95L50r8j51k13M81
3086A55j0m1K18m02M06o6o18R0j8L52q0j30J19K4J10j95j81J58J92J91m06L10
3108A78l74J29J75m42J90r4O0K06J20l71K90k00L91j26j56M51m87L23J69k81p8
3129G3j9O4p5l2J9j32J80J62j58M8k28K65J27p9m15K01o05N25l30L96n53K24K26
3152a16J21L70J15n51K87k44j85K24J91j95K0l27M16m1k63j7M15r7k91k0p9K80
3174A3L9j36o6J04L4J04P4R8k33l00M34K16j73k92k09M92o5k85J22L16k55l2j01
$$ plain form
3019 104 -222 16 -244 29 -78 -139 -171 -480 -32 37 222 -232 -107 329 -79 88 63 79 78 -389 102 67 -160
3042 -160 55 167 -180 -369 155 13 -169 -17 206 -411 -134 -202 -321 394 -252 135 365 22 51 155 97
3063 97 14 238 -48 -155 -93 114 -229 116 151 165 49 31 -8 411 201 -36 -19 -214 136 38 -113 -326 155
3086 155 145 104 322 -80 326 260 -358 -268 -286 66 -14 -144 -25 -1 109 -86 -267 -109 83 274 -132 178
3108 178 -196 -67 108 -334 -144 -238 -178 28 148 -223 67 -133 258 132 -24 427 -60 263 432 151 73
3129 73 54 118 43 11 30 -102 78 240 82 130 -98 167 294 215 -200 1 -604 -79 -409 -13 -566 -342 -116
3152 -116 5 375 490 -61 226 -18 -203 21 212 17 37 -290 126 85 -178 -195 220 123 -168 -188 -267 13
3174 13 52 -84 -150 -46 -12 92 166 264 31 -269 165 381 208 -84 -293 199 134 -151 -29 287 32 0 -101
3197a01l0n0JM30l30R7RP8K50k60l32N7O07J30q04N53o21N16j71k36M7J90j97
3220a67N5j9j72N11l24N22m55K38l43J98o5M16o59L95k63J9K40J35m80L28J94
3241C04q03Q89o20N49j60j33O5l45M62m99J71J3L16n4l29N0q7N02l42j95M23j47
3263C0k76L44Q8K63l13J57k51k53l09M62r3P6j59P07o32K30K06m51L93j76k59
3284b16L39n52M35m3K58k41k91N0K6P0K67R9k46k49M58%l0n46L79j07k69M35k84
3307b58J24J06l4J06oK28o41L86j16j2m0N5J00J7L55j69l91j16P77j01j73k66
3329f9k20O14p06L83j24L88l89L32l96M54j20K23o74j34O63j97j44L50n35K8M31
3350A58j58K31o47L09j13J84Q7K7J26j37K45n33O2K59k36p5M10N2j70Q4k00j61
$$ plain form
3197 -101 -131 -181 -180 250 -80 17 26 104 354 94 -238 -181 426 556 -248 305 -316 200 29 -207 -160 30 -167
3220 -167 -112 -131 -303 208 -116 406 -49 189 -154 44 -21 395 -264 131 -132 -113 127 262 -218 110 304
3241 304 -499 390 -230 319 159 26 91 -254 208 -291 -120 -107 209 155 -174 -124 -211 291 -51 -246 177 30
3263 30 -246 98 186 449 136 293 42 -211 -520 -58 -151 -75 -234 473 -159 71 277 -174 219 43 -216
3284 -216 123 -429 6 -37 221 -20 -311 -261 -235 -165 102 201 -45 -294 164 164 134 -412 -33 -140 -409 26 -258
3307 -258 -134 -28 -62 44 38 266 -375 11 -105 -117 -157 -102 -2 15 370 201 -190 -306 471 370 197 -69
3329 -69 -289 325 -381 2 -122 266 -123 209 -187 267 147 370 -304 -438 225 28 -116 234 -301 -273 158
3350 158 0 231 -416 -107 -220 -36 51 78 204 67 312 -221 -159 100 -136 -211 199 251 81 165 -35 -196
3372a96M58l80q4j76M52j48J33n9L13m31j70N0oL3L90l28M23J52n90K93m5Q2j87
$$ plain form
3372 -196 262 -118 -202 -378 74 -74 59 0 313 -118 -288 -238 -244 -211 179 -149 274 426 -164 129 84 166 -21
$$ [...]
8191a3
##END NTUPLES=NMR FID
##END=
