##TITLE=1H_IAMT-158
 PyO5
 8 sc, 
 11.05.2022
##JCAMPDX= 6.0         $$ Bruker NMR JCAMP-DX V2.0
##DATA TYPE= NMR FID
##DATA CLASS= NTUPLES
##ORIGIN= UXNMR, Bruker Analytische Messtechnik GmbH
##OWNER= root
$$ XWIN-NMR		Version 3.5
$$ Wed May 11 15:51:31 2022 Russian Standard Time (UT+4h)  she@DPX200
##.OBSERVE FREQUENCY= 200.1313499996
##.OBSERVE NUCLEUS= ^1H
##.DELAY= (6, 6)
##.ACQUISITION MODE= SIMULTANEOUS
##.ACQUISITION SCHEME= undefined
##.AVERAGES= 8
##.DIGITISER RES= 18
##SPECTROMETER/DATA SYSTEM= spect
##.PULSE SEQUENCE= zg30
##.SOLVENT NAME= Pyr
##.SHIFT REFERENCE= (INTERNAL, Pyr, 0, 15.7039)
##AUDIT TRAIL= $$ (NUMBER, WHEN, WHO, WHERE, WHAT)
$$ ##TITLE= Audit trail, XWIN-NMR		Version 3.5
$$ ##JCAMPDX= 5.01
$$ ##ORIGIN= Bruker BioSpin GmbH
$$ ##OWNER= she
$$ F:/spectra/data/she/nmr/H-F/1/audita.txt
$$ ##AUDIT TRAIL=  $$ (NUMBER, WHEN, WHO, WHERE, WHAT)
(   1,<2022-05-11 15:49:55.35 +0400>,<she>,<DPX200>,
      <created by zg, POWCHK disabled, PULCHK disabled
       configuration hash MD5:
       00 E9 B6 7A A2 85 ED C7 34 08 36 98 17 FE 4E 26
       data hash MD5: 16K
       68 57 42 DD C5 0A CC 06 9C FB 0F 65 68 E9 06 98>)
$$ ##END=
$$ 
$$ hash MD5
$$ 22 5E 49 E2 78 DC 67 98 B0 5E EC 06 B1 2F CC 6D
##$RELAX= 
##$RELAX= 
##$RELAX= 
##$RELAX= 
##$RELAX= 
##$RELAX= 
$$ Bruker specific parameters
$$ --------------------------
##$DU= <F:/spectra>
##$EXPNO= 1
##$NAME= <H-F>
##$PROCNO= 1
##$TYPE= <nmr>
##$USER= <she>
##$AMP= (0..31)
100 100 100 100 100 100 100 100 100 100 100 100 100 100 100 100 100 100 
100 100 100 100 100 100 100 100 100 100 100 100 100 100 
##$AQSEQ= 0
##$AQ_mod= 1
##$AUNM= <au_zg>
##$AUTOPOS= <>
##$BF1= 200.13
##$BF2= 200.13
##$BF3= 200.13
##$BF4= 200.13
##$BF5= 200.13
##$BF6= 200.13
##$BF7= 200.13
##$BF8= 200.13
##$BYTORDA= 1
##$CFDGTYP= 0
##$CFRGTYP= 5
##$CHEMSTR= <none>
##$CNST= (0..31)
1 1 145 1 1 1 1 1 1 1 1 1 1 1 1 1 1 1 1 1 1 1 1 1 1 1 1 1 1 1 1 1 
##$CPDPRG= <>
##$CPDPRG1= <>
##$CPDPRG2= <>
##$CPDPRG3= <>
##$CPDPRG4= <mlev>
##$CPDPRG5= <mlev>
##$CPDPRG6= <mlev>
##$CPDPRG7= <mlev>
##$CPDPRG8= <mlev>
##$CPDPRGB= <>
##$CPDPRGT= <>
##$D= (0..31)
0 1.2 0 0 0 0 0 0 0 0.06 0 0.03 0 0 0 0 0.0002 0 0 0 0 0 0 0 0 0 0 0 0 
0 0 0 
##$DATE= 1652269794
##$DBL= (0..7)
120 120 120 120 120 120 120 120 
##$DBP= (0..7)
150 150 150 150 150 150 150 150 
##$DBP07= 0
##$DBPNAM0= <>
##$DBPNAM1= <>
##$DBPNAM2= <>
##$DBPNAM3= <>
##$DBPNAM4= <>
##$DBPNAM5= <>
##$DBPNAM6= <>
##$DBPNAM7= <>
##$DBPOAL= (0..7)
0.5 0.5 0.5 0.5 0.5 0.5 0.5 0.5 
##$DBPOFFS= (0..7)
0 0 0 0 0 0 0 0 
##$DE= 6
##$DECBNUC= <off>
##$DECIM= 24
##$DECNUC= <off>
##$DECSTAT= 4
##$DIGMOD= 1
##$DIGTYP= 9
##$DL= (0..7)
0 120 120 120 120 120 120 120 
##$DP= (0..7)
150 150 150 150 150 150 150 150 
##$DP07= 0
##$DPNAME0= <>
##$DPNAME1= <>
##$DPNAME2= <>
##$DPNAME3= <>
##$DPNAME4= <>
##$DPNAME5= <>
##$DPNAME6= <>
##$DPNAME7= <>
##$DPOAL= (0..7)
0.5 0.5 0.5 0.5 0.5 0.5 0.5 0.5 
##$DPOFFS= (0..7)
0 0 0 0 0 0 0 0 
##$DQDMODE= 0
##$DR= 18
##$DS= 0
##$DSLIST= <SSSSSSSSSSSSSSS>
$$ [...]
##$SUBNAM2= <"">
##$SUBNAM3= <"">
##$SUBNAM4= <"">
##$SUBNAM5= <"">
##$SUBNAM6= <"">
##$SUBNAM7= <"">
##$SUBNAM8= <"">
##$SUBNAM9= <"">
##$SW= 26.0245750270697
##$SWIBOX= (0..15)
0 0 2 0 0 0 0 0 0 0 0 0 0 0 0 0 
##$SW_h= 5208.33333333333
##$TD= 16384
##$TD0= 1
##$TE= 0
##$TE2= 300
##$TE3= 300
##$TEG= 300
##$TL= (0..7)
0 120 120 120 120 120 120 120 
##$TP= (0..7)
150 150 150 150 150 150 150 150 
##$TP07= 0
##$TPNAME0= <>
##$TPNAME1= <>
##$TPNAME2= <>
##$TPNAME3= <>
##$TPNAME4= <>
##$TPNAME5= <>
##$TPNAME6= <>
##$TPNAME7= <>
##$TPOAL= (0..7)
0.5 0.5 0.5 0.5 0.5 0.5 0.5 0.5 
##$TPOFFS= (0..7)
0 0 0 0 0 0 0 0 
##$TUNHIN= 0
##$TUNHOUT= 0
##$TUNXOUT= 0
##$USERA1= <user>
##$USERA2= <user>
##$USERA3= <user>
##$USERA4= <user>
##$USERA5= <user>
##$V9= 5
##$VALIST= <valist>
##$VCLIST= <CCCCCCCCCCCCCCC>
##$VD= 0
##$VDLIST= <DDDDDDDDDDDDDDD>
##$VPLIST= <PPPPPPPPPPPPPPP>
##$VTLIST= <TTTTTTTTTTTTTTT>
##$WBST= 1024
##$WBSW= 4
##$XGAIN= (0..3)
0 0 0 0 
##$XL= 0
##$YL= 0
##$YMAX_a= 107253
##$YMIN_a= -65783
##$ZGOPTNS= <>
##$ZL1= 120
##$ZL2= 120
##$ZL3= 120
##$ZL4= 120
##$ABSF1= 10
##$ABSF2= 0
##$ABSG= 5
##$ABSL= 3
##$ALPHA= 0
##$AQORDER= 0
##$ASSFAC= 0
##$ASSFACI= 0
##$ASSFACX= 0
##$ASSWID= 0
##$AUNMP= <proc_1d>
##$AZFE= 0.1
##$AZFW= 0.1
##$BCFW= 1
##$BC_mod= 2
##$BYTORDP= 1
##$COROFFS= 0
##$CY= 11.3945322036743
##$DATMOD= 1
##$DC= 2
##$DFILT= <>
##$DTYPP= 0
##$F1P= 2.36226072786647
##$F2P= -0.459571619588291
##$FCOR= 0.5
##$FTSIZE= 0
##$FT_mod= 4
##$GAMMA= 1
##$GB= 0.15
##$INTBC= 1
##$INTSCL= 1
##$ISEN= 128
##$LB= 0.24
##$LEV0= 0
##$LPBIN= 0
##$MAXI= 10000
##$MC2= 0
##$MEAN= 0
##$ME_mod= 0
##$MI= 1.114404
##$NCOEF= 0
##$NC_proc= 0
##$NLEV= 6
##$NOISF1= 3.799351
##$NOISF2= 2.8
##$NSP= 1
##$NTH_PI= 0
##$NZP= 0
##$OFFSET= 15.70392
##$PC= 1
##$PHC0= -17860.13
##$PHC1= 17.40075
##$PH_mod= 1
##$PKNL= yes
##$PPARMOD= 0
##$PSCAL= 0
##$PSIGN= 0
##$REVERSE= no
##$SF= 200.130013532006
##$SI= 16384
##$SIGF1= 3
##$SIGF2= 2
##$SINO= 400
##$SIOLD= 16384
##$SREGLST= <1H.CDCl3>
##$SSB= 0
##$STSI= 0
##$STSR= 0
##$SW_p= 3612.71676300578
##$SYMM= 0
##$S_DEV= 0
##$TDeff= 0
##$TDoff= 0
##$TI= <>
##$TILT= no
##$TM1= 0
##$TM2= 0
##$TOPLEV= 0
##$USERP1= <user>
##$USERP2= <user>
##$USERP3= <user>
##$USERP4= <user>
##$USERP5= <user>
##$WDW= 1
##$XDIM= 8192
##$YMAX_p= 0
##$YMIN_p= 0
$$ End of Bruker specific parameters
$$ ---------------------------------
##NTUPLES= NMR FID
##VAR_NAME=  TIME,          FID/REAL,        FID/IMAG
##SYMBOL=    X,             R,               I
##VAR_TYPE=  INDEPENDENT,   DEPENDENT,       DEPENDENT
##VAR_FORM=  AFFN,          ASDF,            ASDF
##VAR_DIM=   8192,          8192,            8192
##UNITS=     SECONDS,       ARBITRARY UNITS, ARBITRARY UNITS
##FACTOR=    0.000192,      1,               1
##FIRST=     0,             0,               0
##LAST=      1.572672,      0,               0
##MIN=       0,             -65783,          0
##MAX=       1.572672,      107253,          0
$$ Real data points
##PAGE= N=1
##DATA TABLE= (X++(R..R)), XYDATA
$$ plain form
0 0 0 0 0 0 0 0 0 0 1 -7 8 -8 8 -9 16 -16 22 -24 31 -32 39 -47 55 -63 70 -81 93 -105 119 -134 152 -170
32 -170 190 -214 237 -266 295 -328 363 -402 447 -493 545 -604 671 -744 826 -921 1030 -1155
50 -1155 1305 -1480 1700 -1977 2338 -2837 3566 -4740 6958 -12674 62352 107253 44578 49624
64 49624 51748 51780 14676 -8112 -11896 5532 3125 -6958 -13654 2050 10002 3443 -13277 -17985
78 -17985 -11848 -8987 -21697 -33294 -30575 -13087 -1192 -181 -5946 -3927 3365 7128 -462 -11348
92 -11348 -16283 -15876 -14361 -15671 -15257 -8623 543 5003 1556 -379 304 2165 -2825 -12529 -16978 -14507
108 -14507 -11629 -9671 -5431 800 8673 10731 10514 11543 14019 12871 7183 2674 4126 11658 14865
123 14865 13972 14842 22420 28080 26007 19168 13907 12704 7839 -1108 -8111 -8806 -3500 -598 -4653 -6236
$$ packed form
0@%%%%%%%%JqJ5j6J6j7K5l2L8m6N5o3P1q6J02j18J33j51J74j98K24k53K86l22
32a70L60m04M51n03N61o23O91p65Q49r40J038j149J275j415J570j747J951k185
50a155K460k785L180l677M315n175O403q306J1698j9632P5026M4901o2675N046
64D9624K124L2l7104k2788l784J7428k407j0083o696J5704P952o559j6720m708
78a7985O137K861j2710j1597K719J7488J1895J011n765K019P292L763p590j0886
92a1348m935M07J515j310M14O634R166M460l447j935O83J861m990r704m449K471
108a4507K878J958M240O231P873K058k17J029K476j148n688m509J452P532L207
123A4865q93Q70P578N660k073o839n261j203m865q947p003o95N306K902m055j583
$$ plain form
139 -6236 -1426 2255 -584 -10135 -14702 -14827 -16127 -20138 -22728 -21532 -13714 -4590 -2755 -3989 -873
154 -873 2604 2684 260 -6565 -8242 -7090 -5163 -5088 -5961 -1638 6336 10249 8435 5690 4296 4984 1983
171 1983 -5383 -9564 -7046 -1883 -144 949 3704 10234 15919 16625 13014 10151 8105 7041 5868
186 5868 3174 3319 6342 9039 11087 12089 12511 12540 9956 5260 681 -5409 -8695 -10716 -11689 -11683 -10305
203 -10305 -9180 -7013 -5777 -5218 -6968 -10199 -11855 -11520 -14394 -15370 -14587 -11228 -6127 -1423 898 3392
219 3392 7212 7053 6522 4738 1002 -1421 415 -1364 960 370 5499 9049 11182 10349 8345 7049
235 7049 4349 2678 -675 -3018 -4202 -839 317 2466 5271 8357 10440 9698 7203 3213 3551 2798
251 2798 -61 -1851 -1477 353 2322 5540 3138 5355 1874 909 -957 -4363 -9404 -12447 -13050 -11495
$$ packed form
139f236M810L681k839r551m567j25j300m011k590J196P818R124J835j234L116
154h73L477Q0k424o825j677J152J927P5q73M323P974L913j814k745j394O88l001
171A983p366m181K518N163J739J093K755O530N685P06l611k863k046j064j173
186E868k694J45L023K697K048J002M22K9k584m696m579o090l286k021r73OJ378
203a0305J125K167J236N59j750l231j656L35k874r76P83L359N101M704K321K494
219C392L820j59n31j784l736k423J836j779K324n90N129L550K133q33k004j296
235G049k700j671l353k343j184L363J156K149K805L086K083p42k495l990L38p53
251B798k859j790L74J830J969L218k402K217l481r65j866l406n041l043o03J555
$$ plain form
267 -11495 -10975 -10431 -8507 -6250 -2647 -2205 -3356 -5521 -6229 -5600 -7249 -6925 -6341 -2320 1691 3637 5322
284 5322 8142 10621 11093 9633 6901 4513 3107 2998 2466 1195 2742 4780 7762 7970 6577 5385
300 5385 4220 3232 -170 -3460 -4901 -4621 -2619 -1537 -925 1510 3103 4270 4000 1654 706 -189 -2158
317 -2158 -4238 -4366 -4639 -3055 -830 -231 166 300 250 -1602 -3357 -5969 -8550 -9805 -8942 -8120 -7359 -6529
335 -6529 -3942 -1032 493 1057 387 110 -148 287 -1290 -1442 -391 2691 5546 6797 7236 8910 11047
352 11047 10707 7836 4412 3634 3406 1840 48 -102 343 3277 4377 2538 1397 1076 1404 -601 -4417
369 -4417 -6538 -5926 -5208 -4728 -4673 -3480 -616 2057 1763 -378 -918 -1198 -792 -3078 -3933 -5375 -3590 -2026
387 -2026 -231 -538 -123 863 1131 -610 -1434 -4929 -4088 -4137 -4614 -4313 -3113 -930 1480 3222 3088 3487
$$ packed form
267a1495N20N44J924K257L603M42j151k165p08O29j649L24N84M021M011J946J685
284E322K820K479M72j460k732k388j406j09n32j271J547K038K982K08j393j192
300E385j165r88l402l290j441K80K002J082O12K435J593J167k70k346r48q95j969
317b158k080j28k73J584K225N99L97J34n0j852j755k612k581j255Q63Q22P61Q30
335f529K587K910J525N64o70k77k58M35j577j52J051L082K855J251M39J674K137
352A1047l40k871l424p78k28j566j792j50M45K934J100j839j141l21L28k005l816
369d417k121O12P18M80N5J193K864K673k94k141n40k80M06k286q55j442J785J564
387b026J795l07M15R86K68j741q24l495Q41m9m77L01J200K183K410J742j34L99
$$ plain form
405 3487 4601 3182 2338 2544 273 1763 2606 5078 5116 6241 7090 8540 7071 6788 4575 1547 152
422 152 -1079 -1804 -1833 -2298 -2433 -451 -474 -1182 -1744 -2220 -2696 -3324 -4956 -6779 -6125 -4487 -4029 -3898 -2778
441 -2778 -777 1570 951 -264 272 -82 -381 -1868 -2471 -2237 -625 802 1748 639 1113 2189 2204 1552
459 1552 -177 -1933 -1275 -1614 -2653 -1795 -812 1566 3651 4576 3625 4489 4420 4776 2321 1040 1863 2770
477 2770 2192 2358 2727 4458 3621 4145 3047 1718 1652 -612 -1774 -3722 -4527 -5094 -4373 -4392 -3816 -2205
495 -2205 -4237 -2914 -2212 -3538 -3086 -4532 -4050 -5026 -3601 -2012 -2389 -354 604 2505 2482 1646 1675 2149
513 2149 1045 -45 -116 -380 1092 1217 2414 1872 2584 2941 3081 2242 -446 -736 -960 -769 -1362 -562 -342
532 -342 789 2469 2474 1947 2886 2887 2093 1249 -298 -1309 1628 698 1753 833 1028 2077 469 419 -654
$$ packed form
405C487J114j419q44K06k271J490Q43K472L8J125Q49J450j469k83k213l028j395
422A52j231p25k9m65j35J982k3p08n62m76m76o28j632j823O54J638M58J31J120
441b778K001K347o19j215N36l54k99j487o03K34J612J427R46j109M74J076J5o52
459A552j729j756O58l39j039Q58R83K378K085R25r51Q64o9L56k455j281Q23R07
477B770n78J66L69J731q37N24j098j329o6k264j162j948q05n67P21j9N76J611
495b205k032J323P02j326M52j446M82r76J425J589l77K035R58J901k3q36K9M74
513B149j104j090p1k64J472J25J197n42P12L57J40q39k688k90k24J91n93Q00K20
532c42J131J680Nn27R39Jp94q44j547j011K937r30J055r20J95J049j608n0j073
$$ plain form
551 -654 -2285 -2494 -4649 -4068 -6151 -4954 -3668 -4796 -3780 -2464 -2613 -1127 -1486 -1471 -2400 -2777 -1861 -1746
569 -1746 -640 456 1045 2933 3398 4415 4276 3673 3541 3034 1700 1039 835 1049 1549 1773 2292 2267 2252
588 2252 2583 1750 25 -497 -818 -1580 -563 -953 -1155 -32 1014 1611 965 932 914 1960 957 -1572
606 -1572 -1314 -1247 -690 -158 -914 -2048 -792 105 470 -1886 -2001 -2726 -2732 -2756 -4786 -5118 -3747 -3566 -2467
625 -2467 -1484 -1235 -727 1115 1554 -557 -776 -184 703 1074 1464 1327 2611 5264 4653 4577 3805 4067 4338
644 4338 3871 1740 843 1132 1737 1817 734 411 1320 1739 912 -552 -1525 -944 -2293 -1872 -1505 -2780 -2006
663 -2006 -191 -292 449 0 175 613 -205 -40 -2112 -1125 -1428 -853 -1468 -1585 -501 198 15 -637 -2189
682 -2189 -1385 -1653 -2652 -2357 -3512 -2141 -1241 -985 -337 -29 107 1726 1990 1310 1084 1356 2371 2558 2114
$$ packed form
551f54j631k09k155N81k083J197J286j128J016J316j49J486l59J5r29l77R16J15
569a746J106J096N89J888M65J017j39o03j32n07j334o61k04K14N00K24N19k5j5
588B252L31q33j725n22l21p62J017l90k02J123J046N97o46l3j8J046j003k529
606a572K58O7N57N32p56j134J256Q97L65k356j15p25ok4k030l32J371J81J099
625b467R83K49N08J842M39k111k19N92Q87L71L90j37J284K653o11p6p72K62K71
644D338m67k131q97K89O05Q0j083l23R09M19q27j464r73N81j349M21L67j275P74
663b006J815j01P41m49J75M38q18J65k072R87l03N75o15j17J084O99j83o52j552
682b189Q04k68r99K95j155J371R00K56O48L08J36J619K64o80k26K72J015J87m44
$$ plain form
701 2114 2233 2978 4201 4324 3962 3269 3493 3266 2586 1355 73 -60 -48 -334 -895 -1124 -814 -583 -324
720 -324 -1421 -2111 -2101 -2273 -2196 -2684 -2943 -2880 -1920 -757 -412 -643 -323 139 534 -292 -796 -1307 -791 -223 -802
741 -802 -893 -910 165 780 585 -75 -442 -26 8 -1039 -2119 -1096 -180 517 320 511 934 2144 2974 2694
761 2694 1910 2000 2195 2193 2065 1365 1743 2623 3051 2400 2055 1871 1841 1301 346 -776 -1323 -1420 -1497 -1975 -2313 -2224
783 -2224 -1653 -1363 -2040 -2361 -2464 -2234 -2228 -2509 -2780 -2403 -1514 -888 -933 -402 283 766 658 913 -7 82 106 168
805 168 534 93 337 460 1133 1560 901 636 844 876 709 58 -233 -467 949 870 1037 817 1588 2170 1882
826 1882 1591 753 1100 1486 1314 756 93 423 1183 1176 883 115 58 196 -174 -1553 -2398 -2304 -1904 -2266 -2594
847 -2594 -2667 -2239 -1717 -1235 -1744 -2069 -1504 -1211 -1352 -1771 -1943 -955 44 340 487 860 1068 2060 1897 818
$$ packed form
701B114J19P45J223J23l62o93K24k27o80j231j282j33J2k86n61k29L10K31K59
720c24j097o90J0j72P7m88k59O3R60J163L45k31L20M62L95q26n04n11N16N68n79
741h02r1j7J075O15j95o60l67M16L4j047j080J023R16O97j97J91M23J210Q30k80
761B694p84R0J95kj28p00L78Q80M28o51l45j84l0n40r55j122n47r7p7m78l38Q9
783b224N71K90o77l21j03K30Ok81k71L77Q89O26m5N31O85M83j08K55r20Q9K4O2
805A68L66m41K44J23O73M27o59k65K08L2j67o51k91k34J416p9J67k20P71N82k88
826A882k91q38L47L86j72n58o63L30P60pk93p68n7J38l70j379q45R4M00l62l28
847b594p3M28N22M82n09l25N65K93j41m19j72R88R99K96J47L73K08R92j63j079
$$ plain form
867 818 864 816 1210 1112 521 92 834 1443 1727 930 970 990 1213 583 370 -361 -630 -12 764 500 821 564
889 564 2293 1529 1599 129 142 -172 209 -232 -425 -635 -817 299 317 -712 -1055 854 -249 -388 -3008
908 -3008 -2242 -1044 -1131 -2245 -2273 -2298 -935 167 423 142 -627 165 343 104 -613 -278 613 1301 1126 1056
928 1056 1184 2513 2553 1697 515 707 1262 1472 938 61 927 1195 1091 775 495 47 824 481 101 -1186
948 -1186 -1214 -437 -416 -411 -1045 -140 65 591 323 -436 -268 -221 -545 -782 -1035 -1423 -861 -297 -128 -908 -752 -131
970 -131 365 -442 -1190 -1590 -995 -956 -795 -1360 -635 -26 677 623 444 395 602 1110 932 548 832 1204 896
991 896 627 754 1110 1591 2504 1749 1417 189 491 608 -426 -860 -758 -133 -197 66 -111 -626 -680 186
1011 186 -927 -922 -1148 -749 -515 -48 -727 -946 -277 224 376 -1168 -508 -988 1081 -281 -1133 120 -745
$$ packed form
867H18M6m8L94r8n91m29P42O09K84p97M0K0K23o30k13p31k69O18P76k64L21k57
889E64J729p64P0j470J3l14L81m41j93k10j82J116J8j029l43J909j103j39k620
908c008P66J198q7j114k8k5J363J102K56k81p69P92J78k39p17L35Q91O88j75p0
928A056J28J329M0q56j182J92N55K10n34q77Q66K68j04l16k80m48P77l43l80j287
948a186k8P77K1No34R05K05N26k68p59J68M7l24k37k53l88N62N64J69p80J56O21
970a31M96q07p48m00N95L9J61n65P25O09P03n4j79m9K07N08j78l84K84L72l08
991H96k69J27L56M81R13p55l32j228L02J17j034m34J02O25o4K63j77n15n4Q66
1011A86j113Nk26L99K34M67o79k19O69N01J52j544O60m80K069j362q52J253q65
$$ plain form
1030 -745 -295 -659 -4 -739 632 924 300 600 -288 470 241 27 -106 875 339 901 421 588 1141 1356
1050 1356 964 1148 438 399 940 414 158 -695 -51 1113 639 1811 562 -287 171 -1139 -788 -3 -409
1069 -409 -466 -1137 -239 -521 -679 -48 141 -343 -1153 -1373 -1365 -625 -1032 -633 -899 -392 16 254 276 546 97
1090 97 1 166 29 -1026 57 -3 783 83 398 783 787 288 87 352 353 220 -337 -452 -730 -224 378 560
1112 560 271 527 624 622 369 207 -49 -838 476 393 -452 117 101 11 1333 1209 0 -392 -677 -435 -835
1133 -835 -1165 -1187 -846 63 -699 -878 -489 -134 -82 -288 -587 -109 -897 1197 199 -323 211 549 282 568
1153 568 104 -476 375 1213 525 -43 -262 230 478 623 139 216 559 506 223 494 202 273 283 93 -106
1174 -106 -507 -260 335 121 85 369 555 18 116 -105 -664 -235 -501 -132 -271 -210 -72 288 482 -72 -191
$$ packed form
1030g45M50l64O55p35J371K92o24L00q88P58k29k14j33R81n36N62m80J67N53K15
1050A356l92J84p10l9N41n26k56q53O44J164m74J172j249q49M58j310L51P85m06
1069d09n7o71Q98k82j58O31J89m84q10k20QP40m07L99k66N07M08K38K2K70m49
1090I7r6J65j37j055J083o0P86p00L15L85Mm99k01K65Jj33n57j15k78N06O02J82
1112E60k89K56R7kk53j62k56p89J314q3q45N69j6r0J322j24j209l92k85K42m00
1133h35l30k2L41R09p62j79L89L55N2k06k99M78p88K094r98n22N34L38k67K86
1153E68m64n80Q51Q38o88n68k19M92K48J45m84P7L43n3k83K71k92P1J0j90j99
1174a06m01K47N95k14l6K84J86n37R8k21n59M29k66L69j39O1J38L60J94n54j19
$$ plain form
1195 -191 -572 -176 -593 -634 -708 -448 -83 55 -21 -425 -128 659 177 340 -16 -155 293 361 576 147 525
1216 525 1183 762 266 1129 -269 686 857 60 -248 -266 777 134 23 -518 2 449 556 224 -515 -346
1236 -346 -151 -115 -604 -588 -392 -168 358 -317 -295 11 10 682 -290 -246 -237 308 145 -332 -247 -555 554 -135 468
1259 468 -397 319 287 475 299 -380 151 268 20 392 -69 -182 241 645 67 354 239 163 -351 76 -50
1280 -50 -600 588 757 -374 441 1112 390 581 91 -66 -1072 -416 -530 3 356 857 293 852 -249
1299 -249 -218 -489 -734 -284 -668 -663 -397 -863 -123 250 -94 436 151 591 48 -512 429 32 686 404 -88
1320 -88 -855 30 243 -530 568 656 -90 696 -452 -386 -17 63 791 560 -46 196 -722 400 726 -61
1340 -61 -278 -585 1136 737 -571 -674 -679 202 -355 -610 131 -154 234 -96 456 -3 -390 -872 -982 -1050 -759
$$ packed form
1195a91l81L96m17m1p4K60L65J38p6m04K97P87m82J63l56j39M48O8K15m29L78
1216E25O58m21m96Q63j398R55J71p97l08j8J043o43j11n41N20M47J07l32p39J69
1236c46J95L6m89J6J96K24N26o75K2L06jO72r72M4RN45j63m77Q5l08J109o89O03
1259D68q65P16l2J88j76o79N31J17k48L72m61j13M23M04n78K87j15p6n14M27j26
1280e0n50J188J69j131Q15O71p22J91m90j57j006O56j14N33L53N01n64N59j101
1299b49L1k71k45M50l84NK66m66P40L73l44N30k85M40n43n60R41l97O54k82m92
1320h8p67Q85K13p73J098Q8p46P86j148O6L69Q0P28k31o06K42r18J122L26p87
1340f1k17l07J721l99j308j03nQ81n57k55P41k85L88l30N52m59l87m82j10o8K91
$$ plain form
1361 -759 -132 -835 -53 335 -673 19 -162 -523 -571 -310 179 -525 -24 907 275 -158 399 418 -13 357
1381 357 -311 318 633 -456 -152 -266 504 149 345 372 79 49 261 -50 -28 -101 242 311 197 148 -102 157
1403 157 614 142 -25 356 -412 403 -928 -135 -146 88 65 724 -71 -737 273 491 146 174 -163 -693
1423 -693 -5 462 -244 -261 -472 -383 150 -797 -261 196 420 393 -346 277 297 40 -1008 -424 -354 197 524
1444 524 500 287 117 -122 219 312 -399 34 -380 255 441 -228 -629 -89 75 -133 223 127 -317 653 177
1465 177 -528 -517 -1073 -900 142 -623 -74 223 668 -461 59 -388 -223 -58 -240 -65 -36 278 250 245 -698
1486 -698 314 43 -20 -1090 -420 -619 456 145 937 -310 -61 508 -8 171 -360 -203 388 -293 249
1505 249 -957 -284 -234 871 -121 55 407 -406 -70 105 136 282 81 -136 -83 -116 -170 -27 214 62 314
$$ packed form
1361g59O27p03P82L88j008O92j81l61m8K61M89p04N01R31o32m33N57J9m31L70
1381C57o68O29L15j089L04j14P70l55J96K7k93l0K12l11K2p3L43O9j14m9k50K59
1403A57M57m72j67L81p68Q15j331P93j1K34k3O59p95o66J010K18l45K8l37n30
1423f93O88M67p06j7k11Q9N33r47N36M57K24k7p39O23K0k57j048N84P0N51L27
1444E24k4k13j70k39L41R3p11M33m14O35J86o69m01N40J64k08L56r6m44R70m76
1465A77p05J1n56J73J042p65N49K97M45j129N20m47J65J65j82J75K9L14k8nr43
1486f98J012k71o3j070O70j99J075l11P92j247K49N69n16J79n31J57N91o81N42
1505B49j206O73N0J105r92J76L52q13L36J75L1J46k01k17N3l3n4J43K41j52K52
$$ plain form
1526 314 20 -287 -177 254 117 -275 -260 221 459 257 -244 -345 301 130 -181 -370 -271 -159 383 -6 -127
1547 -127 241 441 332 -173 -238 -272 343 -3 -399 32 -125 177 264 -3 -45 -82 43 70 169 -45 -131 148 58
1570 58 -145 -304 4 389 236 386 -62 -173 343 411 -191 -284 -181 -521 -175 26 76 -107 203 -54 164
1591 164 -422 -521 76 114 -4 -12 -274 65 93 280 -25 10 -10 206 -211 -214 -98 -127 228 238 -120 -348 181 214
1615 214 429 -112 -196 -27 179 -173 -393 -57 165 -78 87 -242 83 283 262 310 -3 -293 -43 -23 -49 59
1637 59 -111 29 169 251 41 -70 105 52 -196 -259 -221 -422 222 46 162 65 52 -205 -212 -330 -100 -49 220
1660 220 -94 80 -114 4 -25 269 198 -325 -101 -1 -43 -119 -291 -137 204 -166 279 -78 -120 77 369 123
1682 123 37 2 171 210 -50 -249 -70 93 650 -158 -186 96 178 229 169 55 33 450 145 153 -379 190 101 400
$$ packed form
1526C14k94l07J10M31j37l92J5M81K38k02n01j01O46j71l11j89R9J12N42l89j21
1547a27L68K00j09n05o5l4O15l46l96M31j57L02Q7k67m2l7J25K7R9k14q6K79r0
1570E8k03j59L08L85j53J50m48j11N16O8o02r3J03l40L46K01N0j83L10k57K18
1591A64n86r9N97L8j18qk62L39K8J87l05L5k0K16m17lJ16k9L55J0l58k28N29L3
1615B14K15n41q4J69K06l52k20L36K22k43J65l29L25K00k1M8l13k90K50K0k6J08
1637E9j70J40J40Q2k10j11J75n3k48o3L8k01O44j76J16r7j3k57pj18K30N1K69
1660B20l14J74j94J18k9K94p1n23K24J00m2p6j72J54L41l70M45l57m2J97K92k46
1682A23q6l5J69L9k60j99J79J63N57q08k8K82Q2N1o0j14k2M17l05Qn32N69q9K99
$$ plain form
1706 400 -138 153 228 -31 -63 -264 -108 -204 396 277 -133 -171 118 199 361 -292 201 -189 196 391 67 62
1728 62 59 156 81 -117 2 -74 -105 105 -302 -138 -291 37 -159 -148 64 -443 26 17 268 215 137 26 281 -110
1752 -110 -100 -149 -243 436 -385 24 -14 70 339 120 50 53 -83 170 67 -547 -366 -123 47 152 -288 -159 109
1775 109 43 81 -337 54 405 58 -306 162 -6 154 84 63 -262 -383 269 38 -52 -127 -241 276 41 180
1797 180 30 -8 -4 559 14 -94 -335 -124 148 21 -206 -119 -45 351 -665 468 120 -443 836 -397
1817 -397 -247 -788 -96 -491 786 -48 674 982 215 -227 -64 -906 -268 167 88 -336 -153 61 568 -117
1837 -117 -152 197 -116 337 15 -341 -391 -164 246 -129 207 -421 129 498 -91 94 -360 36 174 -89 -320
1858 -320 -301 122 78 -149 15 -248 429 491 -103 -499 -395 51 67 -102 -296 -688 -423 258 -76 -266 91
$$ packed form
1706D00n38K91P5k59l2k01J56r6O00j19m10l8K89Q1J62o53M93l90L85J95l24n
1728F2lR7p5j98J19p6l1K10m07J64j53L28j96J1K12n07M69rK51n3p8j11K55l91
1752a10J0m9r4O79q21M09l8Q4K69k19p0Lj36K53j03o14J81K43J70J05m40J29K68
1775A09o6L8m18L91L51l47l64M68j68J60p0k1l25j21O52k31r0p5j14N17k35J39
1797A80j50l8MN63n45j08k41K11K72j27k27Q7P4L96j016J133l48n63J279j233
1817c97J50n41O92l95J277q34P22L08p67m42J63q42O38M35p9m24J83K14N07o85
1837a17l5L49l13M53l22l56n0K27M10l75L36o28N50L69n89J85m54L96J38k63k31
1858c20J9M23m4k27J64k63O77O2n94l96J04M46J6j69j94l92K65O81l34j90L57
$$ plain form
1879 91 332 -9 121 -684 90 -54 113 109 -411 -324 387 65 66 158 65 242 289 -361 -216 23 -3 521 366
1902 366 -547 -71 322 280 -116 -294 200 -326 50 256 -937 -134 282 -322 -27 -25 -611 -670 222 -74 151
1923 151 330 -205 404 -41 98 -291 -84 -117 180 -31 -239 130 -113 19 209 -71 -51 178 257 200 -279
1944 -279 246 170 308 -233 -575 144 103 -102 224 -260 -61 19 321 361 13 -63 -369 547 166 -63 237 24
1966 24 -40 -379 482 -416 -128 253 165 -71 -233 -339 -165 99 -180 -264 434 170 -76 296 -126 -805 -63
1987 -63 -220 -280 -348 62 12 -448 257 -109 108 274 349 -264 296 -443 218 -137 -275 73 -144 291 388 -4
2009 -4 33 -279 239 -229 -189 296 -404 237 319 543 31 385 638 -22 -60 285 436 4 253 276 -40 -428
2031 -428 -153 70 288 358 135 61 36 251 -230 -288 39 -145 -8 -167 310 -22 329 10 53 -252 125 -188
$$ packed form
1879I1K41l41J30q05P74j44J67mn20Q7P11l22JR2r3J77M7o50J45K39k6N24j55
1902C66r13M76L93m2l96j78M94n26L76K06j193Q03M16o04K95Kn86n9Q92k96K25
1923A51J79n35O09m45J39l89K07l3K97k11k08L69k43J32J90k80K0K29P9n7m79
1944b79N25p6J38n41l42P19m1k05L26m84J99Q0L02M0l48p6l06R16l81k29L00k13
1966B4o4l39Q61q98K88L81q8k36j62j06J74K64k79q4O98k64k46L72m22o79P42
1987f3j57o0o8M10n0m60P05l66K17J66P5o13N60p39O61l55j38L48k17M35R7l92
2009dL7l12N18m68M0M85p00O41Q2K24n12L54K53o60l8L45J51m32K49K3l16l88
2031d28K75K23K18P0k23p4k5K15m81n8L27j84J37j59M77l32L51l19M3l05L77l13
$$ plain form
2053 -188 -283 -21 -315 -97 -338 216 -36 -350 170 44 292 -221 -20 455 103 -110 -209 -150 -99 281 -203
2074 -203 -110 -1 -225 -187 199 272 87 -273 578 -39 138 226 540 419 185 -440 229 78 283 -203 -451
2095 -451 -368 432 487 -193 -221 -48 412 86 -418 -434 70 133 108 186 -431 -453 -374 51 47 18 295 359 264 -72 -274
2120 -274 -119 -81 269 -253 -29 127 228 -59 -144 -268 -16 349 540 -22 393 -63 -91 2 145 371 -135
2141 -135 49 -207 288 -192 466 376 -155 -170 -158 -344 45 196 540 -266 146 -300 -337 -49 -180 -83 -123 -72
2163 -72 -431 -280 -495 -295 20 142 -453 342 -99 -67 239 202 50 -83 -133 96 47 195 -224 -44 276 -253
2185 -253 449 403 82 -405 -40 59 -75 228 -189 181 -328 -108 79 63 75 202 -162 194 53 -352 106
2206 106 -351 158 -405 290 -303 -266 774 53 212 -234 255 17 101 -307 101 137 -703 557 -95 -197
$$ packed form
2053a88r5K62k94K18k41N54k52l14N20j26K48n13K01M75l52k13r9N9N1L80m84
2074b03R3J09k24L8L86P3j85l60Q51o17J77Q8L14j21k34o25O69j51K05m86k48
2095d51Q3Q00N5o80k8J73M60l26n04j6N04O3k5P8o17k2P9M25mk9K77O4r5l36k02
2120b74J55L8L50n22K24J56J01k87q5j24K52L65J91n62M15m56k8R3J43K26n06
2141a35J84k56M95m80O58r0n31j5J2j86L89J51L44q06M12m46l7K88j31R7m0N1
2163g2l59J51k15K00L15J22n95P95m41L2L06l7j52j33n0K29m9J48m19J80L20n29
2185b53P02m6l21m87L65R9j34L03m17L70n09K20J87j6J2J27l64L56j41m05M58
2206A06m57N09n63O95n93L7J040p21J59m46M89k38Q4m08M08L6q40J260o52j02
$$ plain form
2226 -197 -361 249 524 408 -88 -210 -299 -144 -152 485 -473 -9 -58 -241 -284 -276 78 291 -19 -192 -149 295 86
2249 86 -181 -25 -12 310 -126 257 -186 -90 368 272 -671 -303 -161 -39 -126 -19 234 0 -135 -251 558 613
2271 613 387 -233 -165 -170 -105 -90 566 873 -45 225 215 195 -219 270 412 10 -170 -42 198 6 -370 -35
2293 -35 -58 -101 56 -148 100 -88 229 1052 -481 115 -101 1198 -59 328 -339 -288 10 -65 -30 -350 774
2314 774 173 433 -225 -313 -406 367 22 41 123 220 25 537 380 -1 304 86 -423 71 -53 418 22 -297
2336 -297 51 -238 155 -324 573 -413 501 -150 432 -117 325 -65 -278 183 -345 -74 935 -215 425
2355 425 121 102 132 -743 -204 -72 823 27 230 -576 612 525 -656 403 75 329 -85 -564 -277 202
2375 202 -116 -723 -410 -87 83 393 345 289 -267 424 -2 -317 -278 -310 -336 173 160 352 -603 -478 -536 -194
$$ packed form
2226a97j64O10K75j16m96j22q9J55qO37r58M64m9j83m3QL54K13l10j73M3M44k09
2249H6k67J56J3L22m36L83m43R6M58r6r43L68J42J22q7J07K53k34j35j16Q09N5
2271F13k26o20O8nO5J5O56L07r18K70j0k0m14M89J42m02j80J28K40j92l76L35
2293c5k3m3J57k04K48j88L17Q23j533N96k16J299j257L87o67N1K98p5L5l20J124
2314G74o01K60o58q8r3P73l45J9Q2R7j95N12j57l81L05k18n09M94j24M71l96l19
2336b97L48k89L93m79Q97r86R14o51N82n49M42l90k13M61n28K71J009j150O40
2355D25l04j9L0q75N39J32Q95p96K03q06J188q7j181J059l28K54m14m79K87M79
2375B02l18o07L13L23J70L10m8n6n56O91m26l15L9l2k6N09j3J92r55J25n8L42
$$ plain form
2397 -194 312 -225 611 -196 -500 -238 173 296 16 332 317 41 -389 171 -516 -127 -492 397 498 -231
2417 -231 46 -180 -491 -510 -582 300 -231 -864 45 -40 -116 25 -224 217 -437 95 -151 -375 539 -960 -314
2438 -314 496 29 -534 357 -76 -258 340 287 306 -145 511 284 -763 -423 -823 357 292 602 -223 352
2458 352 -273 -924 -77 -329 605 14 -117 123 -692 319 -945 -866 522 -261 -669 254 432 -58 -68 -461
2478 -461 938 -736 209 389 184 139 152 -270 402 52 50 -28 343 -70 -203 -1399 426 144 -12 29 327
2499 327 620 -156 194 -264 272 421 59 -249 712 100 -78 -45 303 258 -304 312 978 326 410 -61 480
2520 480 -264 -137 206 -111 -52 -88 491 -301 -556 126 213 328 -138 210 -240 5 -827 0 -73 -302 588
2541 588 71 -899 -123 111 510 353 170 563 43 220 -156 -492 -146 -7 116 136 -143 -997 -279 220
$$ packed form
2397a94N06n37Q36q07l04K62M11J23k80L16j5k76m30N60o87L89l65Q89J01p29
2417b31K77k26l11j9p2Q82n31o33R09q5p6J41k49M41o54N32k46k24R14j499O46
2438c14Q10m67n63Q91m33j82N98n3J9m51O56k27j047L40m00J180o5L10q25N75
2458C52o25o51Q47k52R34n91j31K40q15J011j264P9J388p83m08R23J78m90j0l93
2478d61J399j674R45J80k05m5J3m22O72l50kp8L71m13j33j196J825k82j56M1K98
2499C27K93p76L50m58N36J49l62l08R61o12j78L3L48m5n62O16O66o52Q4m71N41
2520D80p44J27L43l17N9l6N79p92k55O82Q7J15m66L48m50K45q32Q27p3k29Q90
2541E88n17r70P76K34L99j57j83L93n20J77l76l36L46J39J23K0k79q54P18M99
$$ plain form
2561 220 155 385 -173 994 624 285 95 413 -222 -17 620 359 141 604 333 -230 -553 -70 -315 -417
2581 -417 178 -426 -202 136 636 74 163 413 88 -8 300 76 -262 -115 378 87 -304 -294 189 13 -87
2602 -87 57 -373 -552 382 -223 -80 384 -566 -25 35 -67 401 -58 -254 -273 -689 314 179 -400 -523 213
2623 213 386 -289 -35 -761 648 346 -27 -104 -297 -231 -149 417 -118 28 -394 -36 92 364 432 -3 374
2644 374 -94 487 -171 -325 -228 233 -182 -194 -196 369 -169 506 139 144 383 36 507 169 54 584 217 261
2666 261 36 229 380 -375 821 -302 -73 -178 546 335 396 283 -170 -316 -282 67 -278 -78 -568 -32
2686 -32 -303 -221 -121 -222 586 -54 158 -27 717 154 830 -650 227 -424 -1 -375 -431 121 14 233 587
2707 587 -377 -127 -807 -158 56 -210 183 -27 514 520 233 -24 -273 313 -69 271 195 73 607 -74 207
$$ packed form
2561B20o5K30n58J167l70l39j90L18o35K05O37k61k18M63k71n63l23M83k45j02
2581d17N95o04K24L38N00n62Q9K50l25r6L08k24l38J47M93k91l91J0M83j76j00
2602h7J44m30j79R34o05J43M64r50N41O0j02M68m59j96j9m16J003j35n79j23P36
2623B13J73o75K54p26J409l02l73p7j93O6Q2N66n35J46m22L58J28K72O8m35L77
2644C74m68N81o58j54R7M61m15j2kN65n38O75l67NK39l47M71l38j15N30l67M4
2666B61k25J93J51p55J196j123K29j05P24k11O1j13m53j46L4L49l45K00m90N36
2686c2k71Q2J00j01Q08o40K12j85P44n63O76j480Q77o51M23l74n6N52j07K19L54
2707E87r64K50o80O49K14k66L93k10N41Ok87k57k49N86l82L40p6j22N34o81K81
$$ plain form
2728 207 247 -252 -502 -439 -34 -305 79 84 -80 374 -102 -114 347 69 -434 92 -377 619 734 5 504 201
2750 201 290 -241 -252 453 670 196 -464 -331 -59 191 -136 -306 112 361 -173 202 -179 -215 44 618 397
2771 397 172 -294 -7 -491 55 21 813 -259 968 -31 -368 44 -515 -224 495 -25 -106 80 -365 485
2791 485 194 382 189 -541 950 -546 156 450 146 81 407 195 185 -579 -90 234 395 -1059 -123 -333
2811 -333 -980 -210 123 59 -779 -518 -848 -795 386 155 -667 -137 104 -28 -669 -855 421 -190 -2 -207
2831 -207 423 -42 -461 559 -600 -760 398 -410 258 25 315 -66 440 247 705 586 -267 -467 -206
2850 -206 167 198 140 -708 -456 397 98 81 162 -936 579 -358 -395 191 126 336 421 -82 47 -1256 627
2871 627 -473 134 -59 555 385 -425 -932 -283 263 -916 1375 427 117 475 -99 -560 -295 -270 390
$$ packed form
2728B07M0m99k50O3M05k71L84Nj64M54m76j2M61k78n03N26m69R96J15p29M99l03
2750B01Q9n31j1P05K17m74o60J33K72K50l27j70M18K49n34L75l81l6K59N74k21
2771C97k25m66K87m84N46l4P92j072J227r99l37M12n59K91P19n20q1J86m45Q50
2791D85k91J88j93p30J491j496P02K94l04o5L26k12j0p64M89L24J61j454R36k10
2811c33o47P70L33o4q38K61l30N3J181k31q22N30K41j32o41j86J276o11J88k05
2831b07O30m65m19J020j159j60J158q08O68k33K90l81N06j93M58j19q53k00K61
2850b06L73L1n8q48K52Q53k99j7Q1j098J515r37l7N86o5K10Q5n03J29j303J883
2871F27j100O07j93O14j70q10n07O49N46j179K291r48l10L58n74m61K65K5O60
$$ plain form
2890 390 417 -40 -341 110 -359 7 108 -404 179 -938 172 226 644 -78 -195 -271 -722 -133 -795 133
2910 133 409 645 148 627 627 1036 694 -792 -46 555 296 575 739 -462 60 62 -847 -339 546 914 299
2931 299 62 -62 320 -374 -663 -268 -247 323 1330 273 -879 156 228 -52 -181 -697 416 394 -343
2950 -343 -235 -156 1197 88 -357 -367 715 -667 160 67 899 -110 -223 795 591 495 -662 235 -122
2969 -122 -157 -97 296 -300 -863 -173 221 -611 339 -623 -734 976 -162 109 829 -166 159 -264 395 543
2989 543 -629 -274 382 45 49 -368 853 -45 14 72 -590 914 570 902 -46 83 -817 -268 1564 -614
3009 -614 346 -458 485 -100 -173 -497 -253 -133 -216 -167 484 235 448 41 -681 551 -496 688 767 30
3029 30 332 216 372 -147 381 811 849 -635 -77 122 -573 141 2 91 -171 -533 -265 -463 -746 -402 111
$$ packed form
2890C90K7m57l01M51m69L66J01n12N83j117J110N4M18p22j17p6m51N89o62R28
2910A33K76K36m97M79%M09l42j486P46O01k59K79J64j201N22Kr09N08Q85L68o15
2931B99k37j24L82o94k89L95K1N70J007j057j152J035P2k80j29n16J113k2p37
2950c43J08P9J353j109m45j0J082j382Q27r3Q32j009j13J018k04r6j157Q97l57
2969a22l5O0L93n96n63O90L94q32R50r62j11J710j138K71P20r95L25m23O59J48
2989E43j172L55O56l37Mm17J221q98N9N8o62J504l44L32r48J29r00N49J832k178
3009f14R60q04R43n85p3l24K44J20q3M9O51k49K13m07p22J232j047J184P9p37
3029C0L02j16J56n19N28M30L8j484N58J99o95P14j39Q9k62l62K68j98k83L44N13
$$ plain form
3050 111 -466 797 -171 -389 -659 -296 73 -16 333 119 281 -22 989 -45 -367 390 -804 -407 346
3069 346 116 -880 694 247 -650 -285 -162 -164 206 816 -470 894 -1 -285 -110 -304 -383 585 118 1782
3089 1782 -382 -953 -324 516 188 412 -458 168 -505 403 -495 -896 -308 -721 479 44 384 292 -465
3108 -465 231 -539 149 146 390 -380 107 75 51 -360 72 508 -136 75 -215 123 -317 -247 192 -307 -674 361
3130 361 325 -7 -104 179 401 -237 551 -837 489 359 322 -646 410 -405 -51 34 -376 231 -224 164
3150 164 -117 563 283 -175 -143 37 210 -244 335 -238 -24 -191 -252 -62 -221 544 550 -176 -147 184 62 681
3172 681 -157 -136 -208 317 -490 -289 -141 -136 -56 232 -111 195 -637 -293 5 -510 -397 -15 0 263 63 -68
3194 -68 -309 472 32 88 -1221 -969 -1257 605 1159 -552 -327 -402 472 -98 165 1149 237 -254 516 -305
$$ packed form
3050A11n77J263r68k18k70L63L69q9L49k14J62l03J011j034l22P57j194L97P53
3069C46k30r96J574m47q97L65J23kL70O10j286J364q95k84J75j94p9R68m67J664
3089A782k164n71O29Q40l28K24q70O26o73R08q98m01N88m13J200m35L40r2p57
3108d65O96p70O88lK44p70M87l2k4m11M32M36o44K11k90L38m40P0M39m99l67J035
3130C61l6l32r7K83K22o38P88j388J326j30l7r68J056q15L54Q5m10O07m55L88
3150A64k81O80k80m58L2J80J73m54N79n73K14j67o1J90j59P65Op26K9L31j22O19
3172F81q38K1p2N25q07K01J48NQ0K88l43L06q32L44K98n15J13L82J5K63k00j31
3194f8k41P81m40N6j309K52k88J862N54j711K25p5Q74n70K63R84r12m91P70q21
$$ plain form
3214 -305 979 714 -162 45 536 789 17 365 -68 -1325 332 398 -136 -20 -303 309 -1106 28 -160
3233 -160 784 504 -491 126 -41 52 1304 967 -946 56 -620 -4 -321 278 -65 238 44 247 57
3252 57 251 462 105 -389 112 530 -996 -478 620 -31 1088 361 417 -574 -623 -412 -1166 518 412 -117
3272 -117 336 -1199 297 -1086 -11 -267 806 54 208 469 428 51 101 93 -762 -36 -9 -375 -451 592
3292 592 303 -21 75 -306 -507 529 -82 545 77 -894 -615 431 -330 -407 -819 -380 296 -321 -156 811
3312 811 21 -517 43 -24 122 26 1002 343 -70 -527 184 -1069 132 721 -235 -466 234 -85 -682 -900
3332 -900 -185 131 537 -41 -508 -279 -675 -318 -137 -714 256 -424 -148 153 -249 95 -769 -331 -837 -585
3352 -585 -373 -773 331 -112 -92 109 302 -15 -484 463 296 -3 -306 -639 35 -32 -441 107 -327 -58
$$ packed form
3214c05J284k65q76K07M91K53p72L48m33j257J657O6n34J16k83O12j415J134j88
3233a60R44k80r95O17j67R3J252l37j913J002o76O16l17N99l43L03j94K03j90
3252E7J94K11l57m94N01M18j526N18J098o51J119p27N6r91m9K11p54J684j06n29
3272a17M53j535J496j383J075k56J073p52J54K61m1l77N0qq55P26K7l66p6J043
3292E92k89l24R6l81k01J036o11O27m68r71K79J046p61p7m12M39O76o17J65R67
3312H11p90n38N60o7J46r6R76o59m13m57P11j253J201N89r56k31P00l19n97k18
3332i00P15L16M06n78m67K29l96L57J81n77R70o80K76L01m02L44q64M38n06K52
3352e85K12m00J104m43K0K01J93l17m69R47j67k99l03l33O74o7m09N48m34K69
$$ plain form
3372 -58 -138 -58 684 -717 30 344 -323 -112 -306 -640 87 853 -406 514 983 -172 694 -269 -531 22
3392 22 -173 -682 -559 460 256 -665 801 211 -65 328 -113 -315 -66 -1422 -459 -148 -470 -1159 451
3411 451 396 361 -640 -79 -318 315 -165 -595 -213 652 518 -552 -364 360 431 174 642 -283 561 178
3431 178 1047 59 -798 915 -233 -1145 -742 -285 182 -799 96 -179 -372 549 673 355 131 38 139 -622
3451 -622 -14 -776 -204 -127 687 391 -491 -372 -56 -76 -94 235 82 603 -169 -115 -269 374 648 378 341 -60
3473 -60 272 -30 40 6 -515 -49 631 26 249 274 -19 100 -20 143 -225 -166 116 45 61 105 -93 -16 27
3496 27 -48 495 -240 -88 99 57 20 -58 235 -143 -133 -60 -112 -163 91 -242 -179 -196 -140 -114 -282 -241 -160 203 -391
3521 -391 -354 -152 -267 -222 95 353 41 -100 46 117 96 61 267 294 -13 132 -80 -9 88 113 -166 117 189
$$ packed form
3372e8q0Q0P42j401P47L14o67K11j94l34P27P66j259R20M69j155Q66r63k62N53
3392B2j95n09J23J019k04r21J466n90k76L93m41k02K49j356R63L11l22o89J610
3411D51n5l5j001N61k39O33m80m30L82Q65j34j070J88P24P1k57M68r25Q44l83
3431A78Q69r88q57J713j148r12M03M57M67r81Q95k75j93R21J24l18k24r3J01p61
3451f22O08p62N72P7Q14k96q82J19L16k0j8L29j53N21p72N4j54O43K74k70l7m01
3473f0L32l02P0l4n21M66O80o05K23K5k93J19j20J63l68N9K82p1J6M4j98P7M3
3496B7p5N43p35J52J87m2l7p8K93l78J0P3n2n1K54l33O3j7N6K6j68M1Q1L63n94
3521c91L7K02j15M5L17K58l12j41J46P1k1l5K06K7l07J45k12P1R7K5k79K83P2
$$ plain form
3544 189 -64 180 -332 50 38 45 99 -143 45 221 18 -43 -220 -254 -200 0 -50 14 -61 121 -583 153 -66
3567 -66 -38 121 -31 13 -312 -193 86 24 112 -140 -82 -53 -569 -62 -191 98 -341 36 191 -104 22 -165
3589 -165 -62 -84 -37 -50 251 138 100 264 -98 100 29 -125 324 -31 137 -26 -140 72 -53 -66 -135 53
3611 53 59 -2 -119 -41 38 -339 -105 -57 262 280 -101 2 30 -165 210 -93 135 -53 -173 159 -35 53 -137
3634 -137 172 200 -51 152 -167 178 113 113 -105 -213 42 98 119 -50 211 -247 -163 161 222 -79 -142 132 -144
3657 -144 19 -42 -13 23 93 28 267 -193 -109 67 -282 -442 -131 405 -263 -214 -9 -213 113 -59 -36 102 -255
3680 -255 -292 405 168 -120 -137 -43 -84 16 -214 -47 69 -34 152 -301 27 149 115 119 -56 72 150 26 324
3703 324 -68 108 -115 86 -43 142 80 62 338 73 116 105 -38 -104 -294 229 -117 -17 172 -108 -160 -86
$$ packed form
3544A89k53K44n12L82j2PN4k42J88J76k03o1j77l4N4K00n0O4p5J82p04P36k19
3567f6K8J59j52M4l25J19K79o2Q8k52N8K9n16N07j29K89m39L77J55k95J26j87
3589a65J03k2M7j3L01j13l8J64l62J98p1j54M49l55J68j63j14K12j25j3o9J88
3611E3Oo1j17P8P9l77K34M8L19J8l81J03K8j95L75l03K28j88j20L32j94Q8j90
3634a37L09K8k51K03l19L45o5%k18j08K55N6K1j69K61m58Q4L24O1l01o3K74k76
3657a44J63o1K9L6P0o5K39m60Q4J76l49j60L11N36o68M9K05k04L26j72K3J38l57
3680b55l7O97k37k88j7R4m1J00k30J67J16j03J86m53L28J22l4Mj75J28P8j24K98
3703C24l92J76k23K01j29J85o2j8K76k65M3j1j43o6j90N23l46J00J89k80n2P4
$$ plain form
3725 -86 -179 -98 -1 -489 -42 29 -47 129 -19 -25 7 -165 -207 -114 191 54 -206 244 204 49 260 -54 149 178
3749 178 82 271 -205 100 152 237 53 -20 191 -125 -102 -121 -36 -100 46 63 185 -83 -50 375 -160 -8 113
3772 113 -31 202 -78 94 204 230 267 49 -123 148 138 -40 -212 -10 242 -114 46 -168 0 16 21 -119
3794 -119 -82 208 58 169 -134 -90 14 -57 -87 -7 23 83 311 187 187 32 67 41 -29 326 -260 -308 -102 392
3818 392 -279 768 57 308 257 -287 -147 -238 -129 379 1130 -80 128 -142 152 -248 -198 354 351 -262 55
3839 55 34 -195 26 -127 113 -158 -153 16 -366 25 -193 -121 -118 144 364 10 211 -99 -42 -447 58 -47 -410
3862 -410 20 -204 164 30 236 -46 -115 -39 389 17 -4 223 48 369 -133 -535 653 692 -617 -34 -434
3883 -434 262 -85 473 -222 329 -136 -562 -1344 -411 235 185 -14 -25 -497 467 489 597 996 -404 725
$$ packed form
3725h6r3Q1R7m88M47P1p6J76j48oL2j72m2R3L05j37k60M50m0j55K11l14K03K9
3749A78r6J89m76L05N2Q5j84p3K11l16K3j9Q5o4J46J7J22k68L3M25n35J52J21
3772A13j44K33k80J72J10K6L7k18j72K71j0j78j72K02K52l56J60k14J68J6Nj40
3794a19L7K90j50J11l03M4J04p1l0Q0L0O0K28j24%j55L5k6p0L55n86m8K06M94
3818C92o71J047p11K51n1n44J40r1J09N08P51j210K08k70K94m00N0N52lo13L17
3839E5k1k29K21j53K40k71NJ69l82L91k18P2LK62K20l54K01l10N7m05N05j05l63
3862d10M30k24L68j34K06k82o9P6M28l72k1K27j75L21n02m02J188L9j309N83m00
3883d34O96l47N58o95N51m65m26p82R33O46n0j99j1m72R64K2J08L99j400J129
$$ plain form
3903 725 41 -71 -719 -227 43 221 -430 -794 -264 271 254 405 397 -474 -75 281 1014 -111 -325 -332 743
3924 743 457 -764 -401 -293 -210 -82 -549 306 -282 -1030 445 157 13 955 70 619 -1001 -791 303
3943 303 -56 253 1084 205 297 258 -221 91 647 323 -502 -29 -5 33 248 261 -40 638 698 -620 -272 -39
3965 -39 185 -652 156 -28 321 259 -188 -121 -87 -219 960 -363 471 662 -346 -87 -53 -2 -434 -276 395
3986 395 58 181 -501 182 146 0 242 149 599 485 164 -456 -146 -164 -873 -22 -487 309 414 -60 109
4007 109 -384 351 -185 232 318 742 -186 160 255 216 -45 -109 450 341 624 -125 151 -427 181 241 -176 -363
4029 -363 -249 -411 -560 528 253 -199 -104 -468 -313 50 288 419 -85 15 70 -175 -302 574 -69 -187
4049 -187 17 -128 -168 -123 237 169 -160 -223 142 461 15 -291 122 -9 111 -94 -137 162 56 9 -160 -139
$$ packed form
3903G25o84j12o48M92K70J78o51l64N30N35j7J51qq71L99L56P33j125k14pJ075
3924G43k86j221L63J08Q3J28m67Q55n88p48J475k88j44R42q85N49j620K10J094
3943C03l59L09Q31q79R2l9m79L12N56l24q25M73K4L8K15J3l01O78O0j318L48K33
3965c9K24q37Q08j84L49o2m47O7L4j32J179j323Q34J91j008K59L4N1m32J58O71
3986C95l37J23o82O83l6j46K42r3M50j14l21o20L10j8p09Q51m65P96J05m74J69
4007A09m93P35n36M17Q6M24r28L46R5l9k61o4N59j09K83p49K76n78O08O0m17j87
4029c63J14j62j49J088k75m52R5l64J55L63K38J31n04J00N5k45j27Q76o43j18
4049a87K04j45m0M5L60o8l29o3L65L19m46l06M13j31J20k05m3K99j06m7j69K1
$$ plain form
4071 -139 -240 -363 72 -118 18 11 119 -151 -433 -27 263 72 106 378 -159 34 128 3 110 389 -291
4092 -291 -362 106 -204 97 -105 -128 144 -116 216 81 99 220 28 -28 -57 -106 -544 -42 -75 159 -292 -161
4114 -161 -7 -23 106 38 -158 -263 247 -302 -144 53 -43 -113 -136 129 -70 205 2 -303 138 174 -255 -379
4136 -379 -283 291 79 644 218 -333 110 410 -124 -241 -36 -270 -196 -173 -87 214 54 108 209 -130 -191 46
4158 46 350 151 39 -275 -96 53 -22 -139 -135 208 50 -51 -100 -311 -100 -79 111 -326 209 -331 -32 -31 -48
4181 -48 38 122 1 384 -21 -472 -73 386 300 74 -361 248 160 178 28 362 98 114 385 68 -359 -142
4203 -142 448 132 -150 139 274 -779 168 -248 183 -525 -303 -627 -366 -220 -533 -363 -356 537 -90 525
4223 525 -636 -123 326 -40 79 124 -514 -28 -419 -181 293 -389 -262 -2 958 376 534 1402 269 -731
$$ packed form
4071a39j01j23M35j90J36pJ08k70k82M06K90j91L4K72n37J93R4j25J07K79o80
4092b91p1M68l10L01k02k3K72k60L32j35J8J21j92n6k9m9m38N02l3K34m51J31
4114a61J54j6J29o8j96j05N10n49J58J97r6p0k3K65j99K75k03l05M41L6m29j24
4136c79R6N74k12N65m26n51M43L00n34j17K05k34P4K3Q6L01j60N4J01l39o1K37
4158D6L04j99j12l14J79J49p5j17ML43j58j01m9k11K11K1J90m37N35n40K99Jj7
4181d8Q6Q4j21L83m05m51L99M59q6k26m35O09q8J8j50L34k64J6K71l17m27K17
4203a42N90l16k82K89J35j053R47m16M31p08K22l24K61J46l13J70PQ93o27O15
4223E25j161N13M49l66J19M5o38M86l91K38M74o82J27K60R60n82J58Q68j133j000
$$ plain form
4243 -731 666 210 430 1442 -114 405 143 -559 654 205 -287 733 -1108 103 -466 832 -734
4260 -734 491 -13 136 459 -73 169 -39 202 320 652 935 88 572 1010 -403 243 87 289 -656
4279 -656 520 -137 -662 686 370 194 248 156 -136 -253 -76 755 1091 -883 -81 700 293 857 -421
4298 -421 627 -413 445 -130 -795 201 -398 897 339 484 11 -901 -17 162 272 -641 -222 -186 965
4317 965 312 325 743 448 -182 -374 661 448 -58 -397 -35 121 101 -380 11 -400 -137 7 -904 28
4337 28 -45 251 -144 -112 -105 -143 -248 197 80 110 159 -120 68 62 71 316 -170 261 -103 -84 5 18 -2 40 -349 72
4363 72 -78 -83 12 -197 109 -86 -45 23 -93 -483 -183 -72 -238 -148 56 332 -104 19 323 71 -11 -140 -12
4386 -12 -347 400 40 -210 227 -235 125 -154 -21 -74 -170 -197 91 -231 123 -156 -148 -49 -116 55 42 182 -126
$$ packed form
4243g31J397m56K20J012j556N19k62p02J213m49m92J020j841J211n69J298j566
4260g34J225n04J49L23n32K42k08K41J18L32K83q47M84M38j413O46j56K02r45
4279f56J176o57n25J348l16j76N4r2k92j17J77Q31L36j974Q02P81m07N64j278
4298d21J048j040Q58n75o65R96n99J295n58J45m73r12Q84J79J10r13M19L6J151
4317I65o53J3M18k95o30j92J035k13n06l39L62J56k0m81L91m11K63J44r11R32
4337B8p3K96l95L2Pl8j05M45j17L0M9k79J88oRK45m86M31l64J9Q9J3k0M2l89M21
4363G2j50nR5k09L06j95M1O8j16l90L00J11j66R0K04K76m36J23L04k52q2j29J28
4386a2l35P47l60k50M37m62L60k79J33n3r6k7K88l22L54k79QR9o7J71j3J40l08
$$ plain form
4409 -126 373 -377 236 378 181 -130 6 408 113 7 -21 -51 219 73 -219 -125 -71 343 -163 -316 -21
4430 -21 57 207 12 194 -58 131 288 -163 53 -80 91 -136 -10 -256 103 -296 -132 -585 -92 43 -109
4451 -109 125 -149 237 -195 398 15 -47 -88 28 161 1 269 -22 10 -290 357 88 -212 18 -279 -227
4472 -227 -359 -47 -9 -19 -292 40 -495 71 65 -223 -136 -165 270 -249 -143 -343 -9 117 -160 -100 3 -44 -281
4495 -281 93 -148 -224 -120 106 161 168 -46 99 202 43 -16 539 -337 173 -80 -148 -88 131 177 14 175 97
4518 97 -210 -135 222 61 40 259 219 -352 -159 -1 50 -530 72 100 414 -336 35 346 107 100 65 127 196 -220
4542 -220 103 -634 -239 28 -170 -63 132 -280 254 218 -50 -21 -281 -550 -474 115 -22 3 171 -382 162
4563 162 -237 80 75 2 651 37 58 -411 -78 68 -250 385 273 -467 -511 116 -223 95 -327 -149 212 -184
$$ packed form
4409a26M99p50O13J42j97l11J36M02k95j06k8l0K70j46k92R4N4M14n06j53K95
4430b1P8J50j95J82k52J89J57m51K16j33J71k27J26k46L59l99J64m53M93J35j52
4451a09K34k74L86m32N93l83o2m1J16J33j60K68k91L2l00O47k69l00K30k97N2
4472b27j32L12L8j0k73L32n35N66ok88Q7k9M35n19J06k00L34J26k77O0J03m7k37
4495b81L74k41p6J04K26N5Pk14J45J03j59n9N55q76N10k53o8O0K19M6j63J61p8
4518I7l07P5L57j61k1K19m0n71J93J58N1n80O02K8L14p50L71L11k39pl5O2O9m16
4542b20L23p37L95K67j98J07J95m12N34l6k68K9k60k69P6N89j37K5J68n53N44
4563A62l99L17np3O49o14K1m69L33J46l18O35j12p40m4O27l39L18m22J78L61l96
$$ plain form
4585 -184 -173 32 -11 -53 -188 92 69 15 243 -414 -128 22 -100 23 170 -318 -235 -185 -1 17 190 -95 -259
4608 -259 -345 -139 50 108 -286 -217 -89 -267 -25 -437 244 208 63 159 -586 -279 290 301 -22 367 -692 -241
4630 -241 -66 73 688 173 189 398 215 0 170 462 290 590 -416 663 -561 -755 -571 631 892
4649 892 581 461 -606 -236 211 -592 -618 -54 -406 -152 381 1117 105 706 -31 66 -69 71 244 316
4669 316 52 -85 173 125 -416 -11 66 307 261 184 -347 469 99 -167 232 280 434 284 184 398 132 -720
4691 -720 118 -192 -316 282 30 -425 817 -160 184 52 126 578 -1345 -258 237 -390 356 13 537
4710 537 72 -70 104 -7 -163 66 -106 -336 29 -140 205 233 -120 256 -56 -42 -5 39 19 13 -60 53 115
4733 115 -101 -298 77 -26 -39 123 -270 187 326 -65 -142 51 -116 24 -10 255 230 121 -183 22 -212
$$ packed form
4585a84J1K05m3m2j35K80k3n4K28o57K86J50j22J23J47m88Q3N0J84J8J73k85j64
4608b59q6K06J89N8l94O9J28j78K42m12O81l6j45R6p45L07N69J1l23L89j059M51
4630b41J75J39O15n15J6K09j83k15J70K92j72L00j006J079j224j94J84J202K61
4649H92l11j20j067L70M47q03k6N64l52K54N33P36j012O01p37R7j35J40J73P2
4669C16k64j37K58m8n41M05P7K41m6p7n31Q16l70k66L99M8J54j50j00K14k66q52
4691g20Q38l10j24N98k52m55J242r77L44j32P4M52j923J087M95o27P46l43N24
4710E37m65j42J74j11j56K29j72k30L65j69L45K8l53L76l12J4L7M4k0op3J13O2
4733A15k16j97L75j03j3J62l93M57J39l91p7J93j67J40l4K65k5j09l04K05k34
$$ plain form
4754 -212 -145 -107 208 7 -32 88 221 310 -125 147 168 103 -171 -26 141 -20 -150 160 135 -248 -102 64
4776 64 31 136 124 -241 -179 15 33 -26 230 -78 -31 -21 -76 -171 -67 -201 -221 -51 -155 -261 -208 -354 -3 203
4800 203 -261 179 -348 -164 127 165 -59 74 44 181 118 -18 -102 -257 244 -26 -329 -326 -79 5 -360 -40
4822 -40 -114 88 -183 -43 81 -50 254 131 -65 327 139 181 -62 -162 3 -22 124 -216 17 26 -18 -11 139
4845 139 178 54 -88 -254 18 -269 62 -334 315 -237 80 -216 -87 -219 -265 -200 82 338 -48 354 -45
4866 -45 32 -23 -28 -307 -286 139 -182 -89 261 212 304 -60 -137 -71 -36 -234 347 56 -75 112 65 294 86 -369
4890 -369 204 197 -82 195 80 188 -136 -157 6 187 165 7 -68 333 -24 138 10 -172 -60 99 25 96
4912 96 37 -183 173 279 -226 28 -178 -51 -194 215 -55 -145 -262 -132 -29 130 72 199 473 328 214
$$ packed form
4754b12O7L8L15k01l9J20J33Q9m35K72K1o5k74J45J67j61j30L10k5l83J46J66
4776F4l3J05j2l65O2J94J8n9K56l08M7J0n5r5J04j34k0J70j04j06N3j46L51K06
4800B03m64M40n27J84K91L8k24J33l0J37o3j36q4j55N01k70l03LK47Q4l65L20
4822d0p4K02k71J40J24j31L04j23j96L92j88M2k43j00J65k5J46l40K33Rm4PJ50
4845A39L9j24j42j66K72k87L31l96O49n52L17k96J29j32m6O5K82K56l86M02l99
4866d5P7n5nk79K1M25l21R3L50m9R2l64p7O6L5j98N81k91j31J87m7K29k08m55
4890c69N73pk79K77j15J08l24k1J63J81k2j58p5M01l57J62j28j82J12J59p4P1
4912I6n9k20L56J06n05K54k06J27j43M09k70r0j17J30J03J59n8J27K74j45j14
$$ plain form
4933 214 127 -96 21 -244 -244 -266 -153 65 -24 -60 -154 122 66 126 36 -37 -71 170 9 10 44 403 -6 -74 -54 58
4959 58 -136 153 246 122 280 -242 181 262 -205 417 -108 14 -328 -8 -417 -123 -194 126 -59 -460 -83
4980 -83 671 85 309 -377 11 60 721 158 34 -65 -147 -254 261 725 -553 238 494 -453 -182 -157 416
5001 416 -112 -56 -208 10 -185 161 207 206 60 -446 5 168 56 161 -130 -44 26 -11 -225 430 -4 22 -108
5024 -108 57 145 -70 42 269 -97 -59 56 164 -73 77 53 39 80 45 208 -72 -168 -21 181 -258 116
5046 116 124 188 -225 12 289 101 -228 188 -92 -666 60 536 140 209 -583 170 312 243 313 -107 -52 -132 -11
5069 -11 393 -645 -91 72 28 277 -10 -232 -239 -115 45 -728 -265 23 92 -144 -25 -364 228 -23 -360
5090 -360 93 -601 321 5 435 -130 -80 -275 561 -270 -287 208 338 353 238 -149 129 -180 624 -272 220
$$ packed form
4933B14q7k23J17k65%k2J13K18q9l6r4K76n6O0r0p3l4K41j61JL4L59m09o8K0J12
4959E8j94K89R3j24J58n22M23Q1m67O22n25J22l42L20m09K94p1L20j85m01L77
4980h3P54n86K24o86L88M9O61n63j24r9q2j07N15M64j278P91K56r47K71K5N73
5001D16n28N6j52K18j95L46M6jj46n06M51J63j12J05k91Q6P0l7k14O55m34K6j30
5024a08J65Q8k15J12K27l66L8J15J08k37J50k4j4M1l5J63k80r6J47K02m39L74
5046A16QO4m13K37K77j88l29M16k80n74P26M76l96O9p92P53J42o9P0m20N5q0J21
5069a1M04j038N54J63m4K49k87k22pJ24J60p73M63K88O9k36J19l39N92k51l37
5090c60M53o94R22l16M30n65N0j95Q36q31j7M95J30J5j15l87K78l09Q04q96M92
$$ plain form
5111 220 261 31 -194 479 62 681 577 191 -36 -162 229 -607 -720 -8 356 74 163 -228 101 -127 -260
5132 -260 -4 68 -25 -49 54 87 382 -22 29 925 319 125 -687 -394 -207 387 -104 181 261 -482 683 -211
5154 -211 -153 57 -348 -136 -393 343 45 -164 -290 -234 -296 -266 -58 -217 263 675 -606 63 412 526 -988
5175 -988 1313 -129 771 199 -679 -409 -276 -72 -264 -263 108 -306 -490 912 945 -272 151 622 828 381
5195 381 200 536 50 142 -587 818 -41 567 167 292 509 -14 656 394 516 -275 423 170 224 624
5215 624 -424 -129 117 164 -300 113 691 560 -972 301 410 -355 21 12 72 -138 156 55 -164 -48
5235 -48 41 -200 145 -34 -129 -204 73 30 -117 4 64 -18 -21 16 55 48 -11 147 -27 138 -280 274 -4 -125 -181
5260 -181 -167 -273 -12 -125 -231 -153 -49 -48 -22 -30 -402 27 167 -190 30 14 -197 -20 74 -278 50 18 117 -60
$$ packed form
5111B20M1k30k25O73m17O19j04l86k27j26L91q36j13P12L64k82Q9l91L29k28j33
5132b60K56P2r3k4J03L3K95m04N1Q96o06j94q12K93J87N94m91K85Q0p43J165q94
5154b11N8K10m05K12k57P36k98k09j26N6o2L0K08j59M80M12j281O69L49J14j514
5175i88K301j442R00n72q78K70J33K04j92JL71m14j84J402L3j217M23M71K06m47
5195C81j81L36m86R2p29J405q59O08m00J25K17n23O70k62J22p91O98k53N4M00
5215F24j048K95K46M7m64M13N78j31j532J273J09p65L76rO0k10K94j01k19J16
5235d8Q9k41L45j79r5p5K77m3j47J21O0q2lL7L9pn9J58j74J65m18N54k78j21n6
5260a81J4j06K61j13j06P8J04JK6ql72M29J40l57K20j6k11J77R4l52L28l2R9j77
$$ plain form
5284 -60 87 290 -107 -32 63 275 102 273 82 -191 335 -165 278 101 -262 77 287 -167 200 24 -34
5305 -34 -4 -359 -17 285 70 -95 3 166 -89 -23 -170 -63 -267 89 181 -176 -49 71 -111 53 -144 201
5327 201 -210 210 49 8 83 -380 -58 359 269 -241 -95 324 123 101 -72 131 93 -98 -229 49 -46 196
5349 196 -45 -25 29 145 334 95 248 -148 83 -147 -391 -298 -277 -71 -113 -97 -48 -401 339 -47 -102 169 -176
5372 -176 10 -45 -95 -207 103 397 -357 -84 285 275 204 114 262 194 372 -155 32 445 -444 -239 466 152
5394 152 -285 -7 -527 566 -512 76 42 -75 326 94 27 175 -145 274 -593 35 19 130 217 -102 -467
5415 -467 -232 -119 358 -362 249 158 -440 159 -241 -202 -472 387 -115 2 -175 -1075 68 548 -200 -286 -116
5436 -116 -181 -561 330 1037 481 -166 741 185 -294 757 198 -168 -622 295 -307 -83 836 213 739 -176
$$ packed form
5284f0J47K03l97P5R5K12j73J71j91k73N26n00M43j77l63L39K10m54L67j76n8
5305c4L0l55L42L02k15j65R8J63k55O6j47J07k04L56R2l57J27J20j82J64j97L45
5327B01m11M20j61m1P5m63L22M17r0n10J46M19k01k2j73K03l8j91j31K78r5K42
5349A96k41K0N4J16J89k39J53l96K31k30k44R3K1K06m2J6M9l53P40l86n5K71l45
5372a76J86n5n0j12L10K94p54K73L69j0p1r0J48o8J78n27J87M13q89K05P05l14
5394A52m37K78n20J093j078N88l4j17M01k32o7J48l20M19q67O28j6J11Q7l19l65
5415d67K35J13M77p20O11r1n98N99m00L9k70Q59n02J17j77r00J143M80p48q6J70
5436a16o5l80Q91P07n56o47R07n56m79J051n59l66m54R17o02K24R19o23N26r15
$$ plain form
5456 -176 114 -384 271 -412 120 439 -653 -36 925 416 -107 247 74 940 -137 294 -1230 -783 439
5475 439 545 754 -498 -613 -513 -412 600 667 -79 115 205 -1033 -789 523 -135 671 -73 -743 -509
5494 -509 210 -677 324 3 381 274 49 -1247 166 405 257 -1499 -276 841 -245 -749 -473 808
5512 808 -412 112 -923 883 -351 -428 671 -454 -952 -433 52 706 -840 -412 -700 -918 990 400
5530 400 -946 530 -1030 241 1 -21 -158 -1057 -1239 -189 -427 1855 -288 -859 -808 330 350 1220
5548 1220 219 433 43 619 -192 309 1217 768 124 -471 -42 -584 1204 -516 302 -113 -128 186 272
5567 272 -319 606 502 -338 69 -92 -696 455 -201 -72 247 -83 255 -90 -862 -279 -550 -330 133 -194
5587 -194 303 192 122 120 -271 -30 -15 171 271 40 296 -120 295 552 -87 67 -111 398 -22 -265 -23
$$ packed form
5456a76K90m98O55o83N32L19j092O17R61n09n23L54j73Q66j077M31j524M47J222
5475D39J06K09j252j15J00J01J012O7p46J94R0j238K44J312o58Q06p44o70K34
5494e09P19q87J001l21L78j07k25j296J413K39j48j756J223J117j086n04K76J281
5512H08j220N24j035J806j234p7J099j125m98N19M85O54j546M28k88k18J908n90
5530D00j346J476j560J271k40k2j37q99j82J050k38K282k143n71N1J138K0Q70
5548A220j001K14l90N76q11N01R08m49o44n95M29n42J788j720Q18m15j5L14Q6
5567B72n91R25j04q40M07j61o04J151o56J29L19l30L38l45p72N83k71K20M63l27
5587a94M97j11p0kl91K41J5J86J00k31K56m16M15K57o39J54j78N09m20k43K42
$$ plain form
5608 -23 -501 255 139 -208 -47 -5 349 36 -159 -32 -198 -197 253 -81 -258 287 210 283 -215 -146 -10 316
5630 316 199 114 -332 117 -106 506 218 -216 -230 176 -130 245 42 13 34 122 100 -44 194 121 327 230 61
5653 61 -179 60 437 78 21 89 -15 -120 -33 -78 27 176 -122 -59 351 -78 -151 300 106 -179 -3 -110
5675 -110 314 171 -106 -42 124 132 60 -323 -146 193 -97 121 233 -59 15 93 96 -28 -67 75 29 179 36
5698 36 -18 -59 145 152 89 -80 -21 35 102 -48 -149 -236 19 233 30 163 -174 -125 -47 57 -95 28 203 128
5722 128 -171 -94 61 311 66 -164 199 137 251 -66 30 58 247 -36 325 40 141 -306 85 -256 -276 17
5744 17 -164 -255 32 374 -129 -212 43 -59 117 -16 -172 66 -109 60 27 140 -115 -83 -56 48 18 135
5766 135 56 4 85 260 -46 32 42 91 101 100 275 -33 -105 27 -354 268 -67 -326 -149 -207 -131 65 -609 283
$$ packed form
5608b3m78P56j16l47J61M2L54l13j95J27j66JM50l34j77N45p7P3m98O9J36L26
5630C16j17q5m46M49k23O12k88m34j4M06l06L75k03k9K1Q8k2j44K38p3K06r7j69
5653F1k40K39L77l59n7O8j04j05Q7m5J05J49k98O3M10m29p3M51j94k85J76j07
5675a10M24j43k77O4J66Qp2l83J77L39k90K18J12k92P4P8Lj24l9J42m6J50j43
5698C6n4m1K04Po3j69N9N6O7j50j01q7K55K14k03J33l37M9P8J04j52J23J75p5
5722A28k99P7J55K50k45k30L63o2J14l17R6K8J89k83L61k85J01m47L91l41k0K93
5744A7j81r1K87L42n03q3K55j02J76j33j56K38j75J69l3J13k55L2K7J04l0J17
5766A35p9n2Q1J75l06P8J0M9J0jJ75l08p2J32l81O22l35k59J77n8P6J96o74Q92
$$ plain form
5790 283 23 268 -432 408 -345 79 639 675 -27 -241 -228 -1257 -227 -1324 -904 -703 194 -684 -79 -835
5810 -835 38 -117 -432 -204 178 -356 363 324 97 -132 -42 147 -206 -45 1 -149 101 13 52 117 32 -8 103
5833 103 180 81 -115 275 343 -31 -126 -55 -100 217 84 174 12 29 -6 -86 -153 91 468 -42 10 -88 -62 34 105
5858 105 -165 -44 88 -123 -164 53 141 -7 238 262 144 -123 9 65 3 -345 247 221 -522 178 98 138 -55
5881 -55 85 148 -2 -162 -41 -96 269 241 -201 22 173 491 -131 -145 -546 -87 -112 11 -86 438 254 -46
5903 -46 -123 238 141 -54 -157 -250 -181 -178 -94 -126 47 11 111 31 -84 -5 -29 -288 249 133 -22 -307 234 -120
5927 -120 194 53 -163 -24 -86 -131 197 10 50 0 -115 -60 -230 44 -281 349 -244 -3 115 -243 228 81
5949 81 -228 -85 -12 -70 -167 -280 -27 -331 -187 -33 100 125 -322 132 -135 -362 -129 -44 -226 -145 -1 -157
$$ packed form
5790B83k60K45p00Q40p53M24N60L6p02k14J3j029J030j097M20K01Q97q78O05p56
5810h35Q73j55l15K28L82n34P19l9k27k29R0J89l53J61M6j50K50q8L9O5q5m0J11
5833A03P7r9j96L90O8l74r5P1m5L17j33R0j62J7l5q0o7K44L77n10N2r8K6R6P1
5858A05k70J21J32k11m1K17Q8j48K45K4j18k67J32N6o2l48N92k6p43P00q0M0j93
5881e5J40O3j50j60J21n5L65k8m42K23J51L18o22j4m01M59k5J23r7N24j84l00
5903d6p7L61r7j95j03r3O9LQ4l2J73l6J00q0j15P9k4k59N37j16j55k85N41l54
5927a20L14j41k16J39o2m5L28j87M0n0j15N5j70K74l25O30n93K41J18l58M71j47
5949H1l09J43P3n8r7j13K53l04J44J54J33K5m47M54k67k27K33Q5j82Q1J44j56
$$ plain form
5971 -157 -244 18 -22 -266 -117 99 -109 -60 -180 178 397 84 44 -122 -204 -84 228 -81 -205 61 -27 -71
5993 -71 98 264 -243 -175 52 15 -8 27 80 -141 103 280 20 44 159 -80 -113 -239 178 147 127 17 177
6016 177 -5 -184 -95 105 282 100 52 162 71 108 -146 25 109 -397 108 -125 1 -172 -31 331 112 -121
6038 -121 -120 122 68 22 -161 161 -233 -48 -96 -327 254 37 67 -281 -85 1 -46 -42 154 151 139 -156 -144 247 297
6063 297 -202 13 -217 -95 -63 67 102 -86 -241 -130 479 262 -107 160 -298 -70 -50 29 -231 -50 -140 169
6085 169 220 -18 -275 444 39 256 -482 -421 237 56 -218 90 -128 -289 -156 98 -29 -112 152 38 25
6106 25 -298 58 64 168 20 277 78 59 -286 -80 -259 62 -269 -135 -17 287 78 248 -78 -10 -138 -75
6128 -75 -91 -82 65 -160 -30 177 -40 -39 -122 345 240 -257 -405 -175 300 -280 310 158 -67 -47 -185 -165 -180
$$ packed form
5971a57q7K62m0k44J49K16k08M9j20L58K19l13m0j66q2J20L12l09j24K66q8m4
5993g1J69J66n07O8K27l7k3L5N3k21K44J77k60K4J15k39l3j26M17l1k0j10J60
6016A77j82j79Q9K00J77j82m8J10r1L7k54J71Q4n06N05k33J26j73J41L62k19k33
6038a21JK42n4m6j83L22l94J85m8k31N81k17L0l48J96Q6m7MJ96lj2k95J2L91N0
6063B97m99K15k30J22L2J30L5j88j55J11O09k17l69K67m58K28K0P9k60J81r0L09
6085A69N1k38k57P19m05K17p38O1O58j81k74L08k18j61J33K54j27q3K64j14j3
6106B5l23L56OJ04j48K57j99j9l45K06j79L21l31J34J18L04k09J70l26O8j28O3
6128g5j6RJ47k25J30K07k17Jq3M67j05m97j48K30M75n80N90j52k25K0j38K0j5
$$ plain form
6151 -180 -136 174 71 -137 33 -67 157 36 -163 272 -22 31 131 -162 628 253 151 120 164 -211 244
6172 244 38 7 123 -188 -231 213 -13 -67 -131 74 52 -67 -24 -19 -175 71 285 -126 -123 38 -36 -224 142 -167
6196 -167 78 -257 190 191 237 188 107 -1 -94 86 -84 -383 140 146 -93 307 278 -269 -125 -122 177 91 -285 150
6220 150 -87 -5 109 62 -15 81 9 -232 42 98 -143 221 -129 -50 124 125 -195 -9 -76 162 -23 -33 175 152
6244 152 -30 14 120 -188 -102 -4 -12 -17 -133 -125 44 -125 90 180 -73 -106 115 302 -49 -206 175 -118 -235 -109
6268 -109 -138 59 -120 -89 28 146 203 168 -247 -366 135 -121 1 -144 -131 -251 123 123 -155 241 -210 203
6290 203 134 219 359 -142 -165 37 283 174 133 -10 -241 71 -20 -87 -169 -6 191 120 -70 319 -1 45 121
6313 121 -169 -330 -93 68 -752 -878 236 92 -33 -255 -210 -392 -27 333 -69 -268 47 -232 -384 239
$$ packed form
6151a80M4L10j03k08J70j00K24j21j99M35k94N3J00k93P90l75j02l1M4l75M55
6172B44k06l1J16l11m3M44k26n4o4K05k2j19M3Nj56K46K14m11LJ61p4j88L66l09
6196a67K45l35M47JM6m9q1j08r3J80j70k99N23Ok39M00k9n47J44LK99q6l76M35
6220A50k37Q2J14m7p7R6p2k41K74N6k41L64l50P9J74Jl20J86o7K38j85j0K08k3
6244A52j82M4J06l08Q6R8qnj16QJ69j69K15R0k53l3K21J87l51j57L81k93j17J26
6268a09k9J97j79L1J17J18N7l5m15j19N01k56J22j45J3j20L74%k78L96m51M13
6290B03o9Q5J40n01k3K02K46j09m1j43k31L12r1o7q2J63J97p1j90L89l20M6P6
6313A21k90j61K37J61q20j26J114j44j25k22M5j82L65L60m02j99L15k79j52O23
$$ plain form
6333 239 103 124 234 48 177 228 393 15 105 -267 -170 65 -343 -124 179 -73 -31 -22 114 36 143 -160 -230
6356 -230 -267 -204 -97 31 51 -98 91 20 184 -63 -40 224 -41 84 -220 8 -133 92 -196 -135 25 -59
6378 -59 205 98 -121 -71 -187 -163 -123 -79 77 -92 -48 31 184 -62 18 -394 81 -292 -108 139 194 50 -139
6401 -139 30 67 261 -170 327 251 34 232 -90 74 -133 -200 275 45 170 -116 159 314 37 3 105
6422 105 -43 -165 -32 -137 190 126 48 -190 115 41 -270 109 40 -147 -110 -150 141 -161 114 288 36 -90
6444 -90 -40 -193 -154 -127 -73 50 34 -115 -72 128 310 -211 220 132 -403 4 -202 128 -167 247 76 -317 152
6467 152 -233 362 314 25 -36 -49 213 19 -156 -459 302 190 -233 -69 96 95 -124 -235 27 -56 -224 89
6489 89 118 176 -121 -59 -28 151 77 -113 206 -234 85 26 -135 167 -75 -307 -257 294 -239 12 -6 338 -126
$$ packed form
6333B39j36K1J10j86J29N1J65l78R0l72R7K35m08K19L03k52M2RJ36p8J07l03p0
6356b30l7O3J07J28K0j49J89p1J64k47K3K64k65J25l04K28j41K25k88O1J60q4
6378e9K64j07k19N0j16K4M0M4J56j69M4P9J53k46Q0m12M75l73J84K47N5j44j89
6401a39J69L7J94m31M97p6k17J98l22J64k07o7M75k30J25k86K75J55k77l4J02
6422A05j48j22J33j05L27o4p8k38L05p4l11L79o9j87L7m0K91l02K75J74k52j26
6444i0N0j53L9K7N4J23j6j49M3K00J82n21M31q8n35M07k06L30k95M14j71l93M69
6467A52l85N95m8k89o1j3K62j94j75l03P61j12m23J64J65jk19j11K62q3j68L13
6489H9K9N8k97O2L1J79p4j90L19m40L19n9j61L02k42k32N0N51n33K51j8L44m64
$$ plain form
6512 -126 -123 -119 -526 302 71 -924 176 -239 74 -130 344 446 320 248 277 596 -22 33 208 -72 -13 -128
6534 -128 429 -9 -287 12 -272 -236 350 15 -126 -202 487 -311 -160 -352 -239 249 257 354 -170 288 -374 -86
6556 -86 -142 -307 -289 -144 6 -94 200 -91 454 147 -270 -637 -92 583 78 -120 -157 618 18 223 -44
6577 -44 797 -465 223 -343 510 590 -174 -259 -146 552 -269 -531 87 484 284 356 204 -13 41 274 1067
6598 1067 89 -68 512 -24 818 -302 24 -57 91 238 432 -51 263 383 251 -270 435 -619 -394
6617 -394 -940 -1077 -264 -432 604 408 -165 -255 -71 -555 -260 95 362 -26 -515 445 227 -13 -558 -118
6637 -118 782 82 -1214 636 425 429 -674 -1325 -263 -129 -272 -628 270 -292 352 137 -514 -340 -160
6656 -160 154 -97 489 68 1080 -29 315 309 -519 114 1180 401 323 -753 -105 329 -489 -1114 277
$$ packed form
6512a26LMm07Q28k31r95J100m15L13k04M74J02j26p2K9L19o18N5J75k80N9j15
6534a28N57m38k78K99k84L6N86l35j41p6O89p98J51j92J13M88QR7n24M58o62K88
6556h6n6j65J8J45J50j00K94k91N45l07m17l67N45O75n05j98l7P75o00K05k67
6577d4Q41j262O88n66Q53Q0p64q5J13O98q21k62O18L97k00P2j52k17N4K33P93
6598A067r78j57N80n36Q42j120L26q1J48J47J94m83L14J20j32n21P05j054K25
6617c94n46j37Q13j68J036j96n73r0J84m84K95L55K67l88m89R60k18k40n45M40
6637a18R00p00j296J850k11Mj103o51J062J34j43l56Q98n62O44k15o51J74J80
6656a60L14k51N86m21J012j109L44oq28O33J066p79p8j076O48M34q18o25J391
$$ plain form
6675 277 -87 -341 114 141 -292 -788 503 -1178 -403 -186 -231 -29 580 -260 104 -625 -143 -249 -569 128
6695 128 -56 -706 -960 -228 -370 30 330 -4 512 -457 -266 -234 535 -449 366 -11 -4 118 -166 -740 267
6716 267 -712 430 266 300 -411 600 551 481 -40 77 -527 72 591 -715 -115 -488 620 -507 -300
6735 -300 163 -249 433 -408 -204 25 149 456 -30 -406 -166 293 -2 -1529 424 272 -219 389 80
6754 80 -54 530 -402 -592 287 -122 24 -768 20 -859 654 -769 -319 597 -638 177 -11 -492 214
6773 214 -701 -206 213 -532 -773 -83 -557 317 -1886 -766 82 -590 324 34 762 303 690 -291 -283 -798
6793 -798 770 45 -325 672 -384 -496 -477 -694 -74 -233 156 -286 600 216 -185 -233 -689 285 -89 -1278
6813 -1278 -123 796 321 -40 43 -460 31 196 295 337 874 788 -66 -108 -368 -100 -670 208 439 -402 -324
$$ packed form
6675B77l64k54M55K7m33m96J291j681P75K17m5K02O09q40L64p29M82j06l20O97
6695A28j84o50k54P32j42M00L00l34N16r69J91L2P69r84Q15l77PJ22k84n74J007
6716B67r79J142j64L4p11J011m9p0n21J17o04N99N19j306O00l73J108j127K07
6735c00M63m12O82q41K04K29J24L07m86l76K40M59k95j527J953j52m91O08l09
6754H0j34N84r32j90Q79m09J46p92P88q79J513j423M50R16j235Q15j88m81P06
6773B14r15M95M19p45k41O90m74Q74k203J120Q48o72R14k90P28m59L87r81Qn15
6793g98J568p25l70R97j056j12J9k17O20j59L89m42Q86l84m01m8m56R74l74j189
6813a278J155R19m75l61Q3n03M91J65R9M2N37q6q54m2k60K68n70Q78K31q41P8
$$ plain form
6834 -324 -485 -32 215 -65 -56 -378 -184 -245 -42 299 -117 242 253 7 -296 416 43 -21 318 -385 -175 -273
6856 -273 -236 -298 -288 693 -336 -379 167 98 123 -422 -28 -85 -517 -401 196 331 54 -712 -72 180 258 327 46
6879 46 115 -719 -282 114 41 -401 -236 158 219 9 -168 168 410 547 -414 306 -254 206 -30 90 184 291
6901 291 389 2 187 248 346 -204 94 279 116 -337 27 -44 -17 -337 -493 -323 47 216 -86 334 -65 -191
6923 -191 525 -49 -24 245 234 617 659 -525 372 560 15 -250 408 -1 -20 -1 169 103 -111 507 -59 27
6945 27 139 -326 49 -238 258 -15 -168 213 372 -136 27 -554 -318 4 630 -248 435 19 -169 311
6965 311 -468 -125 -20 70 133 304 -209 -162 -600 -107 234 207 41 -76 54 345 151 560 -36 -90 -165 148
6987 148 -201 333 -95 -324 -240 100 -93 -513 -280 -503 148 -96 44 -220 -348 170 -92 -278 -255 -239 -242 -5
$$ packed form
6834c24j61M53K47k80Rl22J94o1K03L41m16L59J1k46l03P12l73o4L39p03K10r8
6856b73L7o2J0R81j029m3N46o9K5n45L94n7m32J16N97J35k77p66O40K52P8O9k81
6879D6O9q34M37L96p3m42J65L94O1k10j77L36K42J37r61P20n60M60k36J20R4J07
6901B91R8l87J85O1R8n50K98J85j63m53L64p1K7l20j56J70L70J69l02M20l99j26
6923a91P16n74K5K69j1L83M2j184Q97J88n45k65O58m09j9J9J70o6k14O18n66Q6
6945B7J12m65L75k87M96k73j53L81J59n08J63n81K36L22O26q78O83m16j88M80
6965C11p79L43J05R0O3J71n13M7m38M93L41k7j66j17J30K91j94M09n96n4p5L13
6987A48l49N34m28k29Q4L40j93m20K33k23O51k44J40k64j28N18k62j86K3J6lK37
$$ plain form
7009 -5 301 526 -176 -84 433 241 220 -75 -396 318 -20 -530 172 84 26 112 542 243 -140 -29 226 19
7031 19 -159 92 -257 138 -112 -145 145 289 -84 -231 100 -64 93 676 198 0 125 236 115 26 -440
7052 -440 275 197 -314 -17 -122 369 -45 -65 -154 123 245 -279 33 90 114 82 -51 267 -270 -350 133 194 676
7075 676 158 120 -17 66 277 -18 -1 26 -170 -200 211 65 -12 -484 399 -25 23 -22 -299 165 200 301 308 -82
7099 -82 457 231 -9 110 -305 271 319 -385 47 269 -89 53 -417 -169 -108 9 -26 27 -207 -437 -62 -97
7121 -97 336 -43 -81 373 314 31 -536 -63 274 47 -33 314 -194 -120 -287 261 149 -164 16 -85 267 -99
7143 -99 -65 161 173 -194 -71 106 -20 156 -187 -174 -221 17 85 -135 -159 -4 -150 -148 54 -114 -5 -107 -90
7166 -90 -154 4 -255 -336 32 42 -165 45 90 18 151 -82 165 -47 -94 -446 -29 148 -68 -316 -518 174
$$ packed form
7009eL06K25p02R2N17j92k1k95l21P14l38n10P02q8n8Q6M30k99l83J11K55k07
7031A9j78K51l49L95k50l3K90J44l73j47L31j64J57N83m78j98J25J11j21q9m66
7052d40P15p8n11K97j05M91m14k0q9K77J22n24L12N7K4l2j33L18n37q0M83O1M82
7075F76n18l8j37Q3K11k95J7K7j96l0M11j46p7m72Q83m24M8m5k77M64L5J01Pl90
7099h2N39k26k40J19m15N76M8p04M32K22l58J42m70K48O1J17l5N3k34k30L75l5
7121i7M33l79l8M54n9k83n67M73L37k27q0L47n08P4j67N48j12l13J80j01L52l66
7143i9L4K26J2l67J23J77j26J76l43J3m7K38O8k20k4J55j46KK02j68J09j02J7
7166i0o4J58k59q1L68J0k07K10M5p2J33k33K47k12m7l52M17J77k16k48k02O92
$$ plain form
7188 174 -31 62 -66 148 -170 -157 70 459 221 252 108 101 -242 101 -666 66 397 -263 -181 -373 193 305
7210 305 321 -287 -579 334 173 -645 284 47 474 -74 75 -146 -6 -215 219 -93 -345 97 222 186 -346
7231 -346 -264 -225 -381 178 -416 -282 440 202 -163 -350 -114 608 454 -186 82 56 160 120 468 96 98 195
7253 195 -94 12 -717 -35 314 -159 -65 -570 -272 -401 -148 -18 -365 -125 177 401 -110 72 79 -216 -87
7274 -87 143 -235 -102 31 -312 367 -200 457 89 177 113 65 28 449 26 -307 -137 -241 -160 259 -464 -731
7296 -731 318 -75 -154 18 19 -111 -7 -364 141 -160 -262 -79 204 79 61 69 316 144 375 72 88 555
7318 555 652 -83 -458 136 -338 -21 -265 28 810 176 -67 690 -11 335 -147 469 174 -92 601 -98
7338 -98 -73 263 -397 -58 161 -136 95 -42 242 245 -132 224 -91 13 -23 180 -46 -242 152 -18 214 -61
$$ packed form
7188A74k05R3j28K14l18J3K27L89k38L1j44pl43L43p67P32L31o60Q2j92N66J12
7210C05J6o08k92R13j61q18R29k37M27n48J49k21J40k09M34l12k52M42J25l6n32
7231c46Q2L9j56N59n94J34P22k38l65j87K36P22j54o40K68k6J04m0L48l72KR7
7253A95k89J06p29O82L49m73R4n05K98j29K53J30l47K40L02K24n11J82Pk95J29
7274h7K30l78J33J33l43O79n67O57l68Q8o4m8l7M21m23l33J70j04Q1M19p23k67
7296g31J049l93p9J72Jj30J04l57N05l01j02J83K83j25j8QK47j72K31l03J6M67
7318E55R7p35l75N94m74L17k44K93P82o34k43P57p01L46m82O16k95k66O93o99
7338i8K5L36o60L39K19k97K31j37K84Ll77L56l15J04l6K03k26j96L94j70K32k75
$$ plain form
7360 -61 -425 36 14 242 -86 -88 5 148 -143 -43 -174 174 104 368 -315 380 293 -273 -120 -93 76 -376 148
7383 148 -509 -89 -178 81 -36 251 -192 335 132 111 46 106 -308 40 190 -309 94 -164 100 47 -43 -245
7405 -245 174 -99 -166 -118 49 -163 300 -328 -31 308 9 -441 -395 47 -107 -138 -470 -190 274 49 -339
7426 -339 15 45 -32 4 92 -86 125 232 -48 8 33 95 42 -26 -86 -354 -210 -47 78 266 295 -145 161 -144
7450 -144 -473 -139 -60 23 148 -2 129 208 267 54 -383 -101 -265 308 -298 62 28 -143 10 -116 239 -333
7472 -333 -55 117 -201 -189 61 -41 129 -82 -34 38 -449 -233 2 -326 -225 -128 -73 -171 -25 -273 138 85
7494 85 -45 14 56 112 -294 302 -359 79 -4 29 242 59 29 106 -223 -148 -254 78 49 -154 -55 -508 205 157
7518 157 -8 176 -22 87 125 -84 -75 -157 47 -212 -36 2 -218 -422 43 -172 258 -440 -177 55 -45 -38
$$ packed form
7360f1l64M61k2K28l28kR3J43k91J00j31L48p0K64o83O95q7n66J53K7J69m52N24
7383A48o57M20q9K59j17K87m43N27k03k1o5O0m14L48J50m99M03k58K64n3r0k02
7405b45M19k73o7M8J67k12M63o28K97L39k99m50M6M42j54l1l32K80M64k25l88
7426c39L54L0p7L6Q8j78K11J07k80N6K5O2n3o8o0k68J44J63J25J88K9m40L06l05
7450a44l29L34P9Q3J25j50J31P9N9k13m37K82j64N73o06L60l4j71J53j26L55n72
7472c33K78J72l18J2K50j02J70k11M8P2m87K16K35l28J01R7N5r8J46k48M11n3
7494H5j30N9M2N6m06N96o61M38q3L3K13j83l0P7l29P5j06L32k9k03R9m53P13m8
7518A57j65J84j98J09L8k09Rq2K04k59J76L8k20k04M65k15M30o98K63K32j00P
$$ plain form
7540 -38 -144 -54 -6 -66 129 -140 -220 285 -118 328 245 -180 -129 248 -95 -301 61 73 -167 -155 168 152 -134
7563 -134 -112 -280 141 -18 60 -221 118 186 -145 153 -183 130 -357 146 55 23 35 -65 1 122 119 85 -155
7586 -155 266 94 -2 90 153 24 276 245 5 21 -2 323 280 -121 -126 107 -282 64 26 -46 30 -81 87 -38
7610 -38 -23 -22 -37 -146 33 -40 18 120 43 -355 -300 -223 -97 391 -358 -267 -12 -20 -143 45 -6 -90 143 27 -29
7635 -29 165 -165 207 -20 32 -112 -110 -105 -153 -56 216 170 -309 365 11 -138 146 -104 78 38 316 -187 -142 39
7659 39 194 142 -193 159 278 380 88 -167 -164 359 154 -104 140 -26 -103 188 10 62 27 -158 159 -92
7681 -92 -162 -186 -41 213 117 92 -286 42 77 -104 84 65 -16 -30 73 -144 117 97 -8 169 0 -65 -107 28
7705 28 42 81 -120 159 42 -18 211 -159 12 -366 261 -72 -190 -115 -102 293 -42 -262 67 -107 -218 214
$$ packed form
7540c8j06R0M8o0J95k69q0N05m03M46q3m25N1L77l43k06L62J2k40J2L23j6k86
7563a34K2j68M21j59P8k81L39O8l31K98l36L13m87N03r1l2J2j00O6J21ll4k40
7586a55M21j72r6R2O3j29K52l1k40J6k3L25m3m01nK33l89L46l8p2P6j11J68j25
7610c8J5Jj5j09J79p3N8J02p7l98N5P7J26M88p49R1K55qj23J88n1q4K33j16n6
7635b9J94l30L72k27N2j44KNm8R7K72m6m79O74l54j49K84k50J82m0K78n03M5J81
7659C9J55n2l35L52J19J02k92k55LN23k05k58K44j66p7K91j78N2l5j85L17k51
7681i2p0k4J45K54r6k5l78L28L5j81J88j9q1j4J03k17K61k0j05J77j69o5m2J35
7705B8J4L9k01K79j17o0K29l70J71l78O27l33j18P5J3L95l35k20L29j74j11M32
$$ plain form
7727 214 49 -176 -233 -138 -131 -24 -162 228 -293 -174 -55 -102 37 46 156 415 -9 110 34 -170 -190 -293 -95
7750 -95 -129 -135 190 -375 -26 87 74 32 42 150 -64 81 -220 -32 89 52 -21 220 -23 -24 28 35 23 178 60
7775 60 -230 -45 62 103 -1 -44 50 86 -81 -6 155 99 168 -55 319 59 51 -94 -132 282 -37 -31 57 -203 60
7800 60 114 12 311 -17 -119 66 -85 -147 40 -133 -344 219 145 455 -37 285 26 -92 78 -6 -302 68
7822 68 -151 110 -379 -4 110 -8 682 -433 285 233 -145 -21 527 106 -42 -194 94 97 -404 229 -86
7843 -86 -179 -31 108 326 -48 -386 37 213 -52 14 -13 -175 343 3 49 -37 57 87 10 88 80 -123 65 -51
7867 -51 97 -168 27 -209 162 -95 -244 -138 -9 31 62 381 40 298 -231 -183 -50 13 -547 232 -435 -315
7889 -315 -298 127 400 -129 103 -203 207 404 114 411 330 -123 6 172 266 -227 -518 507 837 -227
$$ packed form
7727B14j65k25n7R5PJ07j38L90n21J19J19m7J39RJ10K59m24J19p6k04k0j03J98
7750i5l4oL25n65L49J13j3m2J0J08k14J45l01J88J21l7p3K41k43jN2Pj2J55j18
7775F0k90J85J07M1j04m3R4L6j67P5J61n6O9k23L74k60qj45l8M14l19OQ8k60K63
7800F0N4j02K99l28j02J85j51o2J87j73k11N63p4L10m92L22k59j18J70q4k96L70
7822F8k19K61m89L75J14j18O90j115P18n2l78J24N48m21j48j52K88Ln01O33l15
7843h6r3J48J39K18l74l38M23J76k65O6k7j62N18l40M6q6R4L0p7P8qk03J88j16
7867e1J48k65J95k36L71k57j49J06J29M0L1L19l41K58n29M8J33O3n60P79o67J20
7889c15J7M25K73n29K32l06M10J97k90K97q1m53J29J66R4m93k91J025L30j064
$$ plain form
7909 -227 159 129 54 -322 -380 -274 -359 -438 304 30 -238 -189 -500 -156 273 -536 -914 39 137 -463 -200 116
7931 116 593 400 -239 -311 285 217 -331 -420 469 -201 -16 -969 -135 -396 86 430 127 -632 69 -69 535
7952 535 431 -183 -534 -369 369 301 -37 -484 57 134 -224 -148 33 122 -17 -130 -689 -252 -67 -869 -88
7973 -88 -106 192 -449 -42 -98 325 -481 120 -574 175 -165 -678 -108 -111 -155 -45 519 -49 -238 -165 193 121 -81
7996 -81 -142 586 409 -112 720 372 121 -820 198 -257 -51 381 -80 -358 -249 -363 -159 197 -209 107
8016 107 -102 150 -741 263 -524 -384 243 125 123 -94 -1043 -219 105 -410 -193 206 -537 -105 298 -486
8036 -486 478 -607 406 613 -420 -335 -232 -225 512 382 374 -73 -90 251 88 72 -317 -304 341 -390 -125 -13
8058 -13 -226 -218 -240 -83 147 240 -1 -78 203 -161 -171 77 144 81 -233 63 51 259 54 21 -244 -221 -90 282
$$ packed form
7909b27L86l0p5l76n8J06q5p9P42k74k68M9l11L44M29q09l78R53R8o00K63L16
7931A16M77j93o39p2N96o8n48q9Q89o70J85r53Q34k61M82L44l03p59P01j38O04
7952E35j04o14l51J65P38o8l38m47N41P7l58P6J81Q9j39j13n59M37J85q02P81
7973h8j8K98o41M07n6M23q06O01o94P49l40n13N70lm4J10N64n68j89P3L58p2k02
7996h1o1P28j77n21Q32l48k51r41J018m55K06M32m61k78J09j14K04L56m06L16
8016A07k09K52q91J004p87J40O27j18kk17r49Q24L24n15K17L99p43M32M03p84
8036d86R64j085J013K07j033Q5J03PP37j30qm47j7L41j63j6l89J3O45p31K65J12
8058a3k13Qk2J57K30R3k41p7K81l64j0K48O7o3l14K96j2K08k05l3k65K3J31L72
$$ plain form
8082 282 73 -9 -161 -20 -134 40 145 70 -153 188 52 46 70 138 -350 -282 -6 -178 47 210 -155 -331
8104 -331 -280 -179 -119 261 -254 -128 117 18 -174 -50 -115 86 57 -187 143 123 -329 -33 31 36 184 -173 130
8127 130 291 293 242 18 221 190 -29 133 108 239 -193 -288 212 408 61 59 24 -35 267 -315 5 177 -246
8150 -246 -161 -16 353 -204 -81 135 53 52 -103 105 -289 -72 30 390 131 103 92 -234 44 -179 -203 -15
8172 -15 78 -144 20 131 178 33 313 -39 -40 -15 142 -57 -28 198 25 -370 -156 173 -300
$$ packed form
8082B82k09q2j52J41j14J74J05p5k23L41j36oK4O8m88O8K76j72K25J63l65j76
8104c31N1J01O0L80n15J26K45r9j92J24o5K01k9k44L30k0m52K96O4NJ48l57L03
8127A30J61Kn1k24K03l1k19J62k5J31m32r5N00J96l47kl5n9L02n82L20J72m23
8150b46Q5J45L69n57J23K16q2jj55K08l94K17J02L60k59k8j1l26K78k23k4J88
8172a5R3k22J64J11M7j45K80l52jK5J57j99K9K26j73l95K14L29m73
8191c00
$$ Imaginary data points
##PAGE= N=2
##DATA TABLE= (X++(I..I)), XYDATA
$$ plain form
0 0 0 0 0 0 0 0 0 0 0 0 0 0 -1 8 -8 8 -8 8 -13 16 -16 17 -23 24 -29 32 -38 45 -47 55 -61 69 -77 86 -99 108
36 108 -121 134 -148 166 -183 201 -223 246 -275 304 -337 376 -421 472 -533 605 -697 811 -963
55 -963 1169 -1477 1977 -2934 5451 -25526 -65783 -24372 13999 32014 12901 5549 14860 31585
69 31585 23759 6793 1751 17065 28563 27083 21256 29191 43976 46253 30117 12835 7187 12121
83 12121 8123 -6997 -18521 -15474 -3552 4302 3169 -386 1017 3877 2026 -5266 -11507 -12606
97 -12606 -12286 -12500 -13949 -9064 -432 6885 7437 2762 644 769 -2794 -11384 -19331 -19420 -20126 -19258 -18611
114 -18611 -12975 -6078 -3224 -5205 -6785 -6187 -3819 -8333 -13417 -13943 -7567 1571 4035 6315 13305
129 13305 22931 25853 21229 16791 17010 17489 13211 3508 2494 8300 13912 13446 12889 12331 15928 15644
$$ packed form
0@%%%%%%%%%%%%jRj6J6j6J6k1K9l2L3m0M7n3O1p0Q3r2J02j16J30j46J63j85K07
36A08k29K55k82L14l49L84m24M69n21N79o41P13p97Q93j005J138j302J508j774
55i63K132k646L454m911Q385l0977m0257M1411L8371J8015j9113p352R311J6725
69C1585p826j6966n042J5314J1498j480n827P935J4785K277j6136j7282n648M934
83A2121l998j5120j1524L047J1922P854j133l555J403K860j851p292o241j099
97a2606L20k14j449M885Q632P317N52m675k118J25l563q590p947q9p06Q68O47
114a8611N636O897K854j981j580N98K368m514n084n26O376R138K464K280O990
129A3305R626K922m624m438K19M79m278r703j014N806N612m66n57n58L597k84
$$ plain form
145 15644 8409 -1419 -5817 -6213 -8749 -13132 -17819 -13606 -6598 -988 73 -1474 -574 747 -823
160 -823 -8129 -12530 -12769 -9828 -8590 -9406 -7858 -2747 4400 6019 2498 -1333 -867 -3060 -7363 -13278
176 -13278 -16329 -11263 -6970 -5004 -4832 -970 4021 5152 5614 3133 1914 499 -559 -703 548 3288
192 3288 8987 12858 16035 17863 18728 17669 15321 11371 8693 4533 1879 1305 997 823 2779 3725
208 3725 4331 4501 1576 -1266 -6589 -10977 -12041 -13475 -15095 -15245 -11064 -9123 -4733 -2593 -1749 -905
224 -905 -1176 -2801 -5933 -8106 -8229 -6727 -5114 -3834 -1316 1831 5800 7528 5211 3734 960 492
240 492 -2500 -6043 -6896 -4639 -1990 -72 2111 3603 7851 7893 8087 6508 2917 3465 1712 1480 2926
257 2926 3227 6303 9196 12302 12149 9916 10564 8078 5146 1242 -3146 -5706 -4873 -4241 -3877 -5028 -3276
$$ packed form
145A5644p235r828m398l96k536m383m687M213P008N610J061j547R00J321j570
160h23p306m401k39K941J238q16J548N111P147J619l521l831M66k193m303n915
176a3278l051N066M293J966J72L862M991J131M62k481j219j415j058j44J251K740
192C288N699L871L177J828Q65j059k348l950k678m160k654n74l08j74J956R46
208C725O06J70k925k842n323m388j064j434j620j50M181J941M390K140Q44Q44
224i05k71j625l132k173j23J502J613J280K518L147L969J728k317j477k774m68
240D92k992l543q53K257K649J918K183J492M248M2J94j579l591N48j753k32J446
257B926L01L076K893L106j53k233O48k486k932l904m388k560Q33O32L64j151J752
$$ plain form
274 -3276 -2090 -608 -2994 -7184 -9548 -10202 -12071 -12999 -13287 -10867 -8293 -4404 -2383 -732 1588 3057
290 3057 2601 1187 -669 -2853 -777 -1174 -719 498 3354 6961 7447 8324 6919 5659 4305 1799
306 1799 278 -2879 -3210 -1505 -178 1222 2738 4426 6413 7082 5657 3202 1822 1201 88 -137
322 -137 257 265 2362 5092 4846 4902 4662 3422 1867 -278 -4131 -6336 -7338 -7191 -6938 -6217 -5581 -4128
340 -4128 -2672 -2321 -4126 -5573 -6732 -6253 -7178 -8509 -8340 -5435 -1392 524 1307 2862 4969 6860
356 6860 6600 3611 2130 1860 2287 2906 2070 2235 4928 7524 7688 6215 5077 4419 4003 1549 -1712
373 -1712 -3469 -2134 -1041 -872 -672 166 3470 4490 3099 1216 -423 -154 -193 -2562 -4468 -3173 -1774
390 -1774 805 244 250 1260 905 303 -2084 -2672 -5007 -5840 -6878 -6036 -6160 -4390 -3371 -2200 -1245 -1344
$$ packed form
274c276J186J482k386m190k364o54j869r28k88K420K574L889K021J651K320J469
290C057m56j414j856k184K076l97M55J217K856L607M86Q77j405j260j354k506
306A799j521l157l31J705J327J400J516J688J987O69j425k455j380o21j113k25
322a37L94QK097K730k46N6k40j240j555k145l853k205j002J47K53P21O36J453
340d128J456L51j805j447j159M79r25j331J69K905M043J916P83J555K107J891
356F860k60k989j481k70M27O19q36J65K693K596J64j473j138o58m16k454l261
373a712j757J335J093J69K00Q38L304J020j391j883j639K69l9k369j906J295J399
390a774K579n61OJ010l55o02k387n88k335q33j038Q42j24J770J019J171R55r9
$$ plain form
408 -1344 -1313 -1293 -1854 -2462 -2623 -2238 -1125 -636 1762 4194 4577 5528 6953 7823 7107 5037 3665 1956
426 1956 2595 2560 1302 1332 3169 4565 5041 3321 2360 1613 580 -1490 -4071 -5051 -3795 -3682 -3270 -2566
444 -2566 -1266 281 1904 714 -726 -1222 -1680 -2471 -2946 -4195 -3861 -2355 -213 -577 364 330 1298 714
462 714 -1680 -1813 -4247 -3824 -3556 -3397 -3114 -2720 -568 1249 473 972 1674 2178 1201 527 838 591 1034
481 1034 2641 3226 4025 4810 6255 6084 6208 5334 4403 2933 1661 487 203 -667 509 812 692 346
499 346 656 357 -1398 -2056 -4432 -6158 -5228 -5527 -4642 -4275 -3742 -3098 -1471 1374 407 176 -1393 -888
517 -888 -684 -1561 -2002 -1709 309 1135 2361 1531 1546 2072 1575 201 -87 -2147 -863 -2123 -2297 -298
535 -298 632 1280 2821 2358 2869 3263 3108 2342 2030 1195 1298 2347 3394 4479 4039 4178 5365 4981 4151
$$ packed form
408a344L1K0n61o08j61L85J113M89K398K432L83R51J425Q70p16k070j372j709
426A956O39l5j258L0J837J396M76j720r61p47j033k070k581r80J256J13M12P04
444b566J300J547J623j190j440m96m58p91m75j249L34J506K142l64R41l4R68n84
462G14k394j33k434M23K68J59K83L94K152J817p76M99P02N04r77o74L11k47M43
481A034J607N85P99P85J445j71J24q74r31j470j272j174k84q70J176L03j20l46
499C46L10k99j755o58k376j726R30k99Q85L67N33O44J627K845r67k31j569N05
517h88K04q77m41K93K018Q26J226q30J5N26m97j374k88k060J284j260j74J999
535b98R30O48J541m63N11L94j55p66l12q35J03J049J047J085m40J39J187l84q30
$$ plain form
554 4151 1213 -162 564 113 -2098 -1980 -1963 -2662 -1853 -1916 -2262 -2143 -2669 -3380 -3220 -4623 -5235 -4974 -4406
573 -4406 -2880 -2861 -2587 -404 325 663 766 461 1517 974 281 -282 -278 821 2489 2260 2293 1823 2750 3176
593 3176 2103 465 -439 -705 292 -514 -497 479 374 1498 2105 1178 1096 2185 2628 2019 297 -269 273
612 273 1182 721 1130 2300 2868 3155 1971 78 -513 -576 -802 -2373 -3580 -3349 -3394 -2067 -3330 -2324
630 -2324 -3432 -1911 -1833 -3691 -4592 -4275 -3973 -1520 -3154 -2469 -581 287 2663 2015 2473 2309 3045 1710
648 1710 1971 1795 967 2162 2072 2425 2258 1937 2518 3079 1874 400 -273 -202 800 -1070 -1582 -364 735
667 735 1370 698 359 -74 991 1691 1015 -45 -834 -738 207 542 -735 -147 690 1158 1477 -425 -924
686 -924 -2013 -1471 -2469 -4123 -3753 -3499 -2298 -2388 -2866 -2406 -2142 -804 -1013 -1962 -2185 -1747 -806 -542 -563 132
$$ packed form
554D151k938j375P26m51k211J18J7o99Q09o3l46J19n26p11J60j403o12K61N68
573d406J526J9K74K183P29L38J03l05J056n43o93n63MJ099J668k29L3m70R27M26
593C176j073j638r04k66R97q06J7R76j05J124O07r27q2J089M43o09j722n66N42
612B73R09m61M09J170N68K87j184j893n91o3k26j571j207K31m5J327j263J006
630b324j108J521P8j858r01L17L02K453j634O85J888Q68K376o48M58j64P36j335
648A710K61j76q28J195r0L53j67l21N81N61j205j474o73P1J002j870n12J218J099
667G35O35o72l39m33J065P00o76j060p89R6R45L35j277N88Q37M68L19j902m99
686i24j089N42r98j654L70K54J201r0m78M60K64J338k09r49k23M38R41K64k1O95
$$ plain form
706 132 1520 2682 3153 3043 2892 3170 3658 2930 2303 1770 1764 2169 2146 2119 1700 1712 2182 1627 627 -103 -833
727 -833 -748 -781 -1512 -1814 -1308 -1113 -120 -254 -852 -372 54 -95 -842 -1493 -1467 -793 -670 -991 -1240 -886 280
748 280 390 -222 -982 -1342 -1061 -1619 -2266 -3075 -2573 -1852 -946 -1167 -1566 -1142 122 898 170 -260 226 791
768 791 939 704 1010 1773 3023 3369 3552 3266 2827 3679 2811 2031 1319 1020 1086 1223 575 439 613 611 218
789 218 -78 -1167 -1598 -1710 -2019 -2615 -2342 -2297 -1691 -1178 -1281 -932 -1241 -612 -499 -394 -1056 -1343 -858 -869 -476
810 -476 -866 -760 -21 595 404 -400 -572 -332 -243 -714 -1364 -1383 -743 32 256 91 361 1140 1988 1529 976
831 976 293 843 1273 1514 1253 1032 2085 2745 2947 2382 2130 2186 2249 1601 111 12 -365 211 -532 -876 -1140
852 -1140 -512 -518 -966 -1553 -2208 -2192 -1883 -2512 -2714 -2653 -2013 -1199 -1154 -1013 -527 -329 446 -41 -722 -948 -506 -126
$$ packed form
706A32J388J162M71j10j51K78M88p28o27n33oM05k3k7m19J2M70n55j000p30p30
727h33Q5l3p31l02N06J95R93j34n98M80M26j49p47o51K6O74J23l21k49L54J166
748B80J10o12p60l60K81n58o47q09N02P21R06k21l99M24J264P76p28m30M86N65
768G91J48k35L06P63J250L46J83k86m39Q52q68p80p12k99O6J37o48j36J74kl93
789B18k96j089m31j12l09n96K73M5O06N13j03L49l09O29J13J05o62k87M85j1L93
810d76l90J06P39O16j91q04j72K40Q9m71o50j9O40P75K24j65K70P79Q48m59n53
831I76o83N50M30K41k61k21J053O60K02n65k52N6O3o48j490r9l77N76p43l44k64
852a140O28om48n87o55J6L09o29k02O1O40Q14M5J41M86J98P75m87o81k26M42L80
$$ plain form
874 -126 -377 -214 217 598 894 1344 945 538 483 672 755 -621 -835 294 -150 402 137 1136 87 1219
894 1219 1798 723 277 795 1333 49 190 427 464 1205 1685 1211 887 247 1113 1259 -161 -1684 -991
913 -991 -132 -1289 -1368 -1953 -1401 -881 -410 -1257 -2158 -1757 -1314 -1123 -1833 -2178 -1656 -520 -122 -236 -547 4
933 4 917 734 499 -70 631 566 1115 898 147 1169 1634 1673 1127 735 1342 1436 894 115 -468 -260 486 375
955 375 60 295 351 823 941 730 302 84 769 230 -168 -742 -823 171 183 32 -464 -394 -247 -290 -452 -1437
977 -1437 -1402 -1568 -1300 -1661 -1889 -1261 -962 -274 -622 -1014 -1073 7 -453 -933 -1282 -1194 340 722 443 840
997 840 585 2384 1796 882 1451 786 1633 2339 1260 -441 85 871 1739 1149 224 312 662 871 -391
1016 -391 -535 -1107 -517 665 44 -1083 -1193 510 399 -105 -834 -416 -867 934 -950 -1475 -216 -1090
$$ packed form
874a26k51J63M31L81K96M50l99m07n5J89Q3j376k14J129m44N52k65R99j049J132
894A219N79j075m46N18N38j284J41K37L7P41M80m74l24o40Q66J46j420j523O93
913i91Q59j157p9n85N52N20M71q47r01M01M43J91p10l45N22J136L98j14l11N51
933DR13j83k35n69P01o5N49k17p51J022M65L9n46l92O07R4n42p79n83K08P46j11
955C75l15K35N6M72J18k11m28k18O85n39l98n74q1R94J2j51m96P0J47m3j62r85
977a437L5j66K68l61k28O28K99O88l48l92n9J080m60m80l49Q8J534L82k79L97
997H40k55J799n88r14N69o65Q47P06j079j701N26P86Q68n90r25Q8L50K09j262
1016c91j44n72N90J182o21j127j10J703j11n04p29M18m51J801j884n25J259q74
$$ plain form
1034 -1090 -479 -622 -917 -689 -366 249 -425 -633 -1020 -703 -929 -1119 -1810 -802 -382 -127 -230 243 590
1053 590 -181 1327 216 -461 -239 -1344 821 743 70 918 -558 542 1427 947 806 745 742 369 496
1072 496 -414 -839 277 605 -238 -9 527 322 -375 -661 -1306 -1212 -519 -777 -1089 -142 -480 85 -150 -516
1092 -516 -434 -428 104 -666 -1055 -994 -641 -272 -402 -198 -206 493 -56 453 -22 -459 -319 -49 -886 -544 -265 51
1114 51 175 266 -78 549 1209 737 555 -104 306 -532 228 250 190 -141 1089 -109 978 955 649 -92 -160
1135 -160 876 -127 -28 -628 -533 -199 -53 -668 -1352 -848 410 -430 -109 -1527 -1504 -468 -59 -506 -613
1154 -613 -237 340 35 528 183 266 253 110 -359 -480 128 333 143 -354 95 737 167 435 322 335 45
1175 45 -12 -11 -259 -203 270 459 376 348 590 377 354 566 129 -242 33 -121 0 298 343 158 243 285 57 -240
$$ packed form
1034a090O11j43k95K28L23O15o74k08l87L17k26j90o91J008M20K55j03M73L47
1053E90p71J508j111o77K22j105K165p8o73Q48j476J100Q85m80j41o1ll73J27
1072D96r10m25J116L28q43K29N36k05o97k86o45R4O93k58l12R47l38N65k35l66
1092e16Q2ON32p70l89O1L53L69j30K04qO99n49N09m75m37J40K70q37L42K79L16
1114E1J24R1l44O27O60m72j82o59M10q38P60K2o0l31J230j198J087k3l06p41o8
1135a60J036j003R9o00R5L34J46o15o84N04J258q40L21j418K3J036M09m47j07
1154f13L76N77l05M93l45Q3j3j43m69j21O08K05j90m97M49O42n70K68j13J3k90
1175D5n7Jk48N6M73J89q3k8K42k13k3K12m37l71K75j54J21K98M5j85Q5M2k28k97
$$ plain form
1199 -240 -305 -352 94 -491 -745 -965 66 -3 -26 -391 -205 5 67 -290 -693 -345 203 178 -644 -360 -14 527
1221 527 638 144 346 429 1431 278 -57 -598 181 870 376 431 -152 -157 419 335 73 -285 -302 532 915
1242 915 491 69 203 308 405 -388 -88 887 67 -835 27 326 -653 -447 -137 -254 -1046 -28 295 -157
1262 -157 -154 585 -363 -35 -422 -775 167 -746 -121 67 -714 -1035 -113 506 187 537 183 -81 -375 -664 443
1283 443 303 353 -590 -481 164 237 325 71 420 374 -242 464 -619 208 544 925 90 210 1369 285
1303 285 -681 -299 -558 525 -1278 -926 -811 -1445 759 733 -146 -244 457 1315 -36 559 153 561 72
1322 72 -167 -335 -100 637 -24 54 -661 887 724 433 -264 161 -69 43 -840 -63 255 -112 201 652
1342 652 704 463 -34 -310 -98 401 -508 -181 79 -647 76 247 322 79 40 -198 378 -302 -240 -836 415
$$ packed form
1199b40o5m7M46n85k54k20J031o9k3l65J86K10O2l57m03L48N48k5q22K84L46N41
1221E27J11m94K02Q3J002j153l35n41P79O89m94N5n83nN76q4k62l58j7Q34L83
1242I15m24m22J34J05R7p93L00R75q20r02Q62K99r79K06L10j17p92J018L23m52
1262a57LP39r48L28l87l53R42r13O25J88p81l21R22O19l19L50l54k64k94k89J107
1283D43j40N0r43J09O45P3Q8k54L49m6o16P06j083Q27L36L81q35J20J159j084
1303B85r66L82k59J083j803L52J15o34K204k6q79r8P01Q58j351N95m06M08m89
1322G2k39j68K35P37o61P8p15J548j63k91o97M25k30J12q83P77L18l67L13M51
1342F52N2k41m97k76K12M99r09L27K60p26P23J71P5k43l9k38N76o80O2n96J251
$$ plain form
1363 415 -79 436 -632 -262 194 382 -441 -1098 -534 -480 284 -556 -1011 -957 -171 -72 39 322 485 -152 -594
1384 -594 -508 340 -440 -408 210 -265 -278 357 379 501 -483 -53 942 -223 -239 259 -419 201 345 -27 126
1405 126 -591 -16 -401 519 594 450 517 602 -270 -1205 -511 165 340 363 296 67 -343 510 561 -615 47 -111
1427 -111 15 799 -109 -890 -237 -416 129 -815 -537 -374 130 -206 -943 -167 -644 843 -167 -237 -351 -56
1447 -56 414 -252 244 -11 632 -61 391 -962 -718 84 -571 -152 -121 -247 -27 465 -468 221 -205 824
1467 824 605 -159 -601 87 -70 893 -369 -946 512 157 773 -345 52 -702 -359 357 401 -533 223
1486 223 262 603 -323 -294 -186 -524 -328 1136 134 47 240 -809 -183 852 -138 -393 -474 -370 -55 17
1506 17 268 801 162 -48 700 -178 -263 713 251 15 131 -221 -361 100 -692 -232 141 333 -426 -286 259
$$ packed form
1363D15m94N15j068L70M56J88q23o57N64N4P64q40m55N4P86R9J11K83J63o37m42
1384e94Q6Q48p80L2O18m75j3O35K2J22r84M30R95j165j6M98o78O20J44l72J53
1405A26p17N75l85R20P5j44O7Q5q72r35O94O76J75K3o7k29m10Q53N1j176O62j58
1427a11J26P84r08p81O53j79N45r44K78J63N04l36p37P76m77J487j010p0j14K95
1447e6M70o66M96k55O43o93M52j353K44Q02o55M19L1j26K20M92r33O89m26J029
1467H24k19p64m42O88j57R63j262n77J458l55O16j118L97p54L43P16M4r34P56
1486B23L9L41r26K9J08l38J96J464j002q7J93j049O26J035r90k55q1J04L15P2
1506A7K51N33o39k10P48q78q5R76m62k36J16l52j40M61p92M60L73J92p59J40N45
$$ plain form
1527 259 520 156 -35 -218 -55 164 -236 -161 59 98 339 289 260 -140 -229 389 -97 4 -220 -234 -19 50
1549 50 25 -191 -154 386 195 -217 -151 -168 -6 -118 -209 -650 -132 65 67 -275 5 -77 399 114 136 -477 -117
1572 -117 257 -9 -28 138 69 135 320 -317 -118 220 119 -30 -69 -359 -2 -56 213 91 76 -37 141 230
1594 230 -74 -209 -66 16 326 91 -250 -262 60 179 -30 11 1 -144 128 -14 -399 -495 -273 393 42 80
1616 80 -272 201 243 67 -64 -11 244 -19 -175 -367 -137 -101 239 -74 -328 113 -394 162 -103 100 -175
1637 -175 247 381 15 11 -135 240 308 33 -582 14 270 504 -68 -387 -663 35 351 -96 -120 -80 537 151
1659 151 -97 -70 -143 194 357 -91 -173 290 138 46 384 21 -24 79 190 -49 -62 -381 123 -50 -309 392
1681 392 -225 132 -364 -14 43 -67 -47 288 -4 103 -259 -192 62 292 168 -133 38 148 329 -162 -379
$$ packed form
1527B59K61l64j91j83J63K19m00P5K20L9K41n0k9m00q9O18m86J01k24j4K15O9
1549E0k5k16L7N40j91m12O6j7J62j12r1m41N18J97Kl42K80q2M76k85K2o13L60
1572a17L74k66j9J66o9O6J85o37J99L38j01j49l9k90L57n4K69j22j5j13J78Q9
1594B30l04j35J43Q2L10k35l41j2L22J19k09M1j0j45K72j42l85r6K22O66l51L8
1616H0l52M73M2j76j31N3K55k63j56j92K30L6L40l13k54M41n07N56k65K03k75
1637a75M22J34l66mj46L75O8k75o15N96K56K34n72l19k76O98L16m47k4M0O17l86
1659A51k48K7p3L37J63m48q2M63j52r2L38l63m5J03J11k39j3l19N04j73k59P01
1681C92o17L57m96L50N7j10K0L35k92J07l62O7K54K30j24l01J71J10J81m91k17
$$ plain form
1702 -379 -123 -69 57 -26 -376 59 162 193 -29 -255 313 463 283 -114 -293 -221 200 128 -94 -231 361 171
1724 171 -17 208 -125 -216 48 76 -41 -181 -91 270 6 103 27 411 471 -34 68 -111 17 167 -96 -149
1746 -149 -4 67 126 -79 79 -149 14 -153 178 -312 -250 -273 -310 91 101 -86 -65 -16 244 -75 -245 177 187
1769 187 -344 -450 -87 28 209 24 -248 -55 -131 113 187 -6 -85 -207 54 424 -87 -101 32 -127 432
1790 432 365 -373 -50 260 112 65 138 -432 -64 226 -48 -58 106 -180 -12 17 -260 177 -140 529 -110 417
1812 417 172 338 152 582 -129 -370 444 -615 188 22 30 -455 121 -344 108 -1426 557 -52 -135 -183
1832 -183 -494 211 188 87 -200 -594 96 47 103 -309 262 -473 -26 173 -249 -115 116 341 329 -446 -214
1853 -214 30 73 28 -485 -223 292 -1 160 -297 126 29 -10 254 -349 -68 541 146 -232 -111 -176 -84 828
$$ packed form
1702c79K56N4J26q3l50M35J03L1k22k26N68J50j80l97j79P2M21p2k22j37N92j90
1724A71j88K25l33r1K64K8j17j40R0L61k64R7p6L84O0n05J02j79J28J50k63n3
1746a49J45P1N9k05J58k28J63j67L31m90O2k3l7M01J0j87K1M9K60l19j70M22J0
1769A87n31j06L63J15J81j85k72J93p6K44P4j93p9j22K61L70n11j4J33j59N59
1790D32o7p38L23L10j48m7P3n70L68K90k74j0J64k86J68K9k77M37l17O69o39N27
1812D17k45J66j86M30p11k41Q14j059Q03j66Qm85N76m65M52j534J983o09q3m8
1832a83l11P05k3j01k87l94O90m9N6m12N71p35M47J99m22J34K31K25j2p75K32
1853b14K44M3m5n13K62N15k93J61m57M23r7l9K64o03K81O09l95l78J21o5R2R12
$$ plain form
1875 828 348 211 21 140 60 139 -44 -610 -38 195 -295 -181 210 136 -43 153 -45 -264 209 289 -146
1896 -146 -123 -101 35 67 212 -245 -328 977 147 409 244 13 161 -365 274 -937 -19 -63 474 -233 74
1917 74 -140 -1067 635 -349 -297 -31 402 75 156 169 -412 155 251 -225 276 -41 -322 354 -356 767 -266
1938 -266 -382 355 77 -401 -116 6 -29 -73 22 3 -27 -147 74 164 46 -188 118 -327 -705 313 37 318
1960 318 316 231 -98 88 300 381 342 395 143 -158 218 -109 82 182 169 -300 -226 16 -220 -49 -117 240 -174
1983 -174 -491 489 52 -32 17 -36 192 -2 138 -210 -347 174 572 413 -213 137 -345 311 273 -595 -533 109
2005 109 -208 -141 -228 -21 395 -121 -38 -564 -369 -159 -138 -398 95 264 38 561 348 258 -185 16 276 95
2027 95 397 -89 190 -8 -194 27 253 -13 -117 -165 299 621 79 69 -336 -180 -183 280 -83 -396 52 83
$$ packed form
1875H28m80j37j90J19q0P9j83n66N72K33m90J14L91p4j79J96j98k19M73Q0m35
1896a46K3K2J36L2J45m57q3J305q30K62j65k31J48n26O39j211R18m4N37p07L07
1917G4k14r27J702r84N2K66M33l27Q1J3n81N67R6m76N01l17k81O76p10J123j033
1938b66j16P37k78m78K85J22l5m4R5j9l0j20K21R0j18k34L06m45l78J018k76K81
1960C18kq5l29J86K12Q1l9N3k52l01L76l27J91J00j3m69P4K42k36J71o8L57m14
1983a74l17R80m37q4M9n3K28j94J40l48j37N21L98j59o26L50m82O56l8q68O2O42
2005A09l17O7q7K07M16n16Q3n26J95K10K1k60M93J69k26N23k13r0m43K01K60j81
2027I5L02m86K79j98j86K21K26k66j04m8M64L22n42j0m05J56lM63l63l13M48L1
$$ plain form
2049 83 47 267 -107 399 -369 -440 358 125 96 202 522 -318 150 102 91 88 152 -225 -320 -105 -94 -98 -101 -419 148
2074 148 -257 179 55 -34 -290 141 -145 -121 87 -322 0 83 585 126 -27 -399 32 -463 -441 -198 19
2095 19 -129 226 288 -219 -135 -155 311 4 334 -73 164 373 325 -287 145 102 156 -233 -3 -885 590 74
2117 74 223 295 262 -30 -73 -59 125 31 298 -423 -305 33 -218 351 198 -31 33 304 -777 163 -42 -44 -192
2140 -192 110 204 32 124 615 201 88 -186 130 -528 -494 -101 242 -209 90 -47 219 181 -48 -117 155 463
2162 463 -35 -149 -281 -216 -187 -226 613 -137 188 294 -20 -536 48 150 -129 -235 -203 -150 -908 179 -95
2183 -95 -57 474 -212 416 -42 326 354 -27 10 -148 304 -404 155 398 123 180 566 250 -252 142 -172 24
2205 24 82 420 112 -144 -839 -108 -88 108 460 -146 50 14 196 -321 -504 -198 141 305 -255 243 -156
$$ packed form
2049H3l6K20l74N06p68p1P98k33k9J06L20q40M68m8j1lO4l77r5K15J1mll18N67
2074A48m05M36j24q9k56M31k86K4K08m09L22Q3N02m59j53l72M31m95K2K43K17
2095A9j48L55O2n07Q4k0M66l07L30m07K37K09m8o12M32m3N4l89K30q82J475n16
2117G4J49P2l3k92m3J4J84r4K67p21J18L38k51N69j53k29O4K71j081R40k05kj48
2140a92L02R4j72R2M91m14j13k74L16o58L4L93L43m51K99j37K66l8k29o9K72L08
2162D63m98j14j32O5K9l9Q39p50L25J06l14n16N84J02k79j06L2N3p58J087k74
2183i5L8N31o86O28m58L68K8l81L7j58M52p08N59K43k75N7L86l16n02L94l14J96
2205B4N8L38l08k56o95P31K0J96L52o06J96l6J82n17j83L06L39J64n60M98l99
$$ plain form
2226 -156 -157 253 -232 93 -438 -432 -39 -242 177 415 -216 -12 -120 -26 -7 19 330 132 -540 -137 286 -117
2248 -117 -22 265 -51 66 369 253 645 -150 769 -62 105 215 -177 -194 -308 250 252 -49 -286 -27 525
2269 525 306 -90 36 78 153 -973 88 335 -151 -158 65 38 413 -9 -366 78 -541 4 -134 -256 67
2290 67 220 -355 526 86 -143 33 -239 379 348 3 -156 -131 567 466 117 72 -280 25 240 1031 124
2311 124 -582 -371 468 128 -391 -214 -490 -56 580 261 -382 -118 290 -218 134 -796 399 -421 -220 -119
2331 -119 77 40 -157 -244 -257 -228 413 417 -44 125 -9 172 -430 -170 752 -13 617 511 412 305 -231 239
2353 239 -278 91 -266 191 152 -587 64 -127 465 -240 400 -206 -309 -606 -70 -114 -578 605 456 300
2373 300 75 488 -246 107 36 121 348 266 267 32 -266 -700 -273 -697 -80 -359 553 335 160 460 -649
$$ packed form
2226a56jM10m85L25n31OL93k03M19K38o31K04j08R4J9K6L11j98o72M03M23m03
2248a17R5K87l16J17L03j16L92p95R19q31J67J10l92j7j14N58Kl01k37K59N52
2269E25k19l96J26M2P5j126J061K47m86pK23k7L75m22l57M44o19N45j38j22L23
2290F7J53n75Q81m40k29J76k72O18l1l45j59K5O98j01l49m5l52L05K15P91r07
2311A24p06K11Q39l40n19J77k76M34O36l19o43K64M08n08L52r30J195q20K01J01
2331a19J96l7j97q7j3K9O41Mm61J69j34J81o02K60R22p65O30j06r9j07n36M70
2353B39n17L69l57M57l9p39O51j91N92p05O40o06j03k97N36m4m64J183j49j56
2373C00k25M13p34L53p1Q5K27q2Jk35k98m34M27m24O17k79R12k18j75L00j109
$$ plain form
2394 -649 130 14 -139 -402 79 63 290 -104 139 -11 296 194 15 583 -326 -50 804 170 254 277 893
2415 893 -701 -546 -179 26 417 -6 302 413 -132 33 -771 -479 641 278 -384 -458 47 265 -125 -278
2435 -278 47 -297 80 52 346 192 3 162 212 7 83 239 -212 277 110 -293 278 -14 -17 729 -770
2456 -770 -203 245 53 11 -34 400 -594 -291 -164 521 145 56 -91 -192 277 97 681 799 -113 -643 -95
2477 -95 12 -288 -120 -39 548 226 -206 474 -400 -393 151 -544 316 29 -413 -25 332 62 -145 492 -611
2498 -611 -235 310 574 119 -976 -260 -662 -5 -103 344 196 176 64 -434 -94 -600 -220 7 26 -623 417
2519 417 98 510 6 125 72 -127 -543 -49 363 509 -179 317 345 -42 -141 173 212 -453 370 206 407
2540 407 416 -783 -28 321 216 33 -796 -112 -228 303 -181 -369 -216 504 -474 273 106 759 448 -896
$$ packed form
2394f49P79j16j53k63M81j6K27l94K43j50L07j02j79N68r09K76Q54o34Q4K3O16
2415H93j594J55L67K05L91m23L08J11n45J65q04K92J120l63o62p4N05K18l90j53
2435b78L25l44L77k8K94j54j89J59N0k05P6J56m51M89j67m03N71k92lP46j499
2456g70N67M48j92m2m5M34r94L03J27O85l76q9j47j01M69j80N84J18r12n30N48
2477i5J07l00J68Q1N87l22m32O80q74PN44o95Q60k87m42L88L57k70k07O37j103
2498f11L76N45K64m55j095P16m02O57r8M47j48k0j12m98L40n06L80K27J9o49J040
2519D17l19M12n04J19n3j99m16M94M12J46o88M96K8l87r9L14L9o65Q23j64K01
2540D07Rj199P55L49j05j83q29O84j16N31m84j88J53P20r78P47j67O53l11j344
$$ plain form
2560 -896 -708 -112 175 274 -158 -347 353 -161 383 268 -328 -2 -298 240 -92 -189 -196 -721 72 -358 589
2581 589 -669 -450 -150 879 -85 194 213 -41 228 563 -100 -163 479 257 -186 177 337 716 -332 223
2601 223 -174 -443 -117 418 285 -667 385 246 266 -1027 211 113 58 37 -224 360 -323 681 154 -682
2621 -682 776 -416 -388 10 1058 863 225 -447 456 -347 -260 -111 246 407 58 -166 25 -47 -295 -157
2641 -157 -72 520 -395 -77 -590 176 -502 -55 735 -371 -461 226 -285 -65 -276 -846 137 -343 -24 513
2661 513 -124 561 -402 -545 -123 218 -355 157 643 417 72 -129 747 564 441 230 143 277 4 61 -3
2682 -3 -21 714 284 -111 -41 363 9 -418 -44 168 276 -317 311 -504 269 -52 248 683 234 -364 144
2703 144 75 306 233 566 615 -365 233 -170 -456 56 -311 178 558 -276 -183 147 29 409 465 284 254 268
$$ packed form
2560h96J88N96K87R9m32j89P00n14N44j15n96L26k96N38l32r7pn25P93m30R47
2581E89j258K19L00J029r64K79J9k54K69L35o63o3O42k22m43L63J60L79j048N55
2601B23l97k69L26N35j33r52J052j39K0j293J238r8n5k1k61N84o83J004n27q36
2621f82J458j192K8L98J048j95o38o72R03q03Q7J49L57J61l49k24J91p2k48J38
2641a57Q5N92r15L18n13P66o78M47P90j106r0O87n11K20k11n70R83m80L19N37
2661E13o37O85r63j43M22L41n73N12M86k26l45k01Q76j83j23k11q7J34k73N7o4
2682cj8P35m30l95P0M04l54m27L74K12J08n93O28q15P73l21L00M35m49n98N08
2703A44o9K31p3L33M9r80N98m03k86N12l67M89L80q34R3L30j18L80N6j81l0J4
$$ plain form
2725 268 -166 84 38 63 207 -473 216 -147 484 343 -68 31 -304 298 341 -55 -218 776 -164 176 274 306
2747 306 -429 353 -56 -253 989 712 -415 -451 169 137 -121 -103 -273 -176 -237 268 505 1278 470 16 15 84
2769 84 297 -219 116 -247 1141 -75 385 -394 97 -18 135 -275 33 -88 -719 -576 391 384 -608 -93
2789 -93 304 228 -141 616 -81 -24 -157 -1006 478 188 -287 62 -140 738 804 -205 694 273 182 78 172
2810 172 -127 607 713 -307 -574 -1139 116 36 92 458 160 67 -1012 -791 316 469 -985 -175 -781
2829 -781 -393 411 -629 909 60 847 -202 -328 -617 -638 -107 -178 -7 135 -475 -611 -115 601 -638
2848 -638 -237 -359 -231 613 -250 861 425 -1059 -458 -399 348 476 -316 213 -505 160 333 205 657 389
2868 389 373 5 52 30 -118 487 227 -161 240 453 292 -124 1018 933 -1208 -153 740 521 298 -996
$$ packed form
2725B68m34K50m6K5J44o80O89l63O31j41m11R9l35O02M3l96j63R94r40L40R8L2
2747C06p35P82m09j97J242k77j127l6O20l2k58J8j70R7o1N05K37P73q08m54jO9
2769H4K13n16L35l63J388j216M60p79M91j15J53m10L08j21o31J43R67pr92N15
2789i3L97p6l69P57o97N7j33q49J484k90m75L49k02Q78O6j009Q99m21r1j04R4
2810A72k99P34J06j020k67n65J255q0N6L66k98r3j079K21J107J53j454Q10o06
2829g81L88Q04j040J538q49P87j049j26k89k1N31p1J71J42o10j36M96P16j239
2848f38M01j22J28Q44q63J111m36j484O01N9P47J28p92N29p18O65J73j28M52k68
2868C89j6l68M7k2j48O05k60l88M01K13j61m16J142q5k141J055Q93k19k23j294
$$ plain form
2888 -996 131 277 -392 664 -83 -197 304 -136 33 -118 174 229 41 -210 150 1021 404 660 1147 -704
2908 -704 -300 483 487 1098 -434 649 -8 -841 367 1296 -804 404 785 -297 -1103 -406 655 -491
2926 -491 -148 -499 352 -84 60 -301 -54 -740 1184 954 317 -702 194 151 -203 -70 10 -166 -81 897
2946 897 171 110 881 -478 -364 932 -425 446 -429 328 -441 147 198 -90 387 -178 627 124 -354 -1275
2966 -1275 479 -744 565 -269 1109 -140 -232 347 -660 -794 -462 791 -105 -159 -91 166 -672 -81
2984 -81 103 245 391 258 -627 600 642 -366 734 -875 -613 -152 277 -547 -298 955 228 308 -473
3003 -473 608 699 330 151 55 337 -278 -711 207 -435 -110 -58 -396 61 -49 1241 272 202 -227 -215 195
3024 195 -640 -431 -60 -451 -296 -357 81 -746 798 290 -1101 737 -52 331 -659 433 278 -436 -164
$$ packed form
2888i96J127J46o69J056p47j14N01m40J69j51K92N5j88k51L60Q71o17K56M87j851
2908g04M04P83MO11j532J083o57q33J208R29k100J208L81j082q06O97J061j146
2926d91L43l51Q51m36J44l61K47o86J924k30o37j019Q96m3l54J33Q0j76Q5R78
2946H97p26o1P71j359J14J296j357Q71q75P57p69N88N1k88M77n65Q05n03m78r21
2966a275J754j223J309q34J378j249r2N79j007j34L32J253q96n4O8K57q38N91
2984h1J84J42J46j33q85J227M2j008J100j609K62M61M29q24K49J253p27Q0p81
3003d73J081R1l69j79r6K82o15m33R18o42L25N2l38M57j10J290r69p0m29J2M10
3024A95q35K09L71l91J55o1M38q27J544n08j391J838p89L83r90J092j55p14K72
$$ plain form
3043 -164 1001 507 421 1263 -174 416 -5 180 607 95 -186 -633 257 -221 -520 -282 160 -246 353 10
3063 10 -172 909 -793 -1025 136 327 -598 -309 -534 -205 51 -21 90 -383 373 1013 -1030 -98 15
3082 15 656 -583 222 -99 -50 -198 27 -596 -426 159 -110 356 -267 603 555 -235 -793 215 532 -441
3102 -441 362 127 750 -212 186 92 -310 -178 301 -22 -182 -438 109 599 -595 15 -188 141 -422 193
3122 193 -134 316 320 83 396 66 99 524 -568 -345 -106 8 -246 600 363 693 -91 118 -40 -478 152
3143 152 39 425 -24 -465 111 73 190 73 -470 -857 -28 -66 178 703 153 -220 537 101 451 -431 538
3164 538 -196 -272 -277 25 246 370 530 229 -93 342 619 -21 -453 -17 924 -522 -366 130 -238 -416 331
3185 331 224 244 133 -320 -580 449 -466 -129 454 -183 -493 246 167 129 -1126 519 112 -443 -1320 -1089
$$ packed form
3043a64J165m94q6Q42j437N90m21J85M27n12k81m47Q90m78k99K38M42m06N99l43
3063A0j82J081j702k32J161J91r25K89k25L29K56p2J11m73P56O40k043R32J13
3082A5O41j239Q05l21M9j48K25o23J70N85k69M66o23Q70m8p90n58J008L17r73
3102d41Q03k35O23r62L98r4m02J32M79l23j60k56N47M90j194O10k03L29n63O15
3122A93l27M50Mk37L13l30L3M25j092K23K39J14k54Q46k37L30p84K09j58m38O30
3143A52j13L86m49m41N76l8J17j17n43l87Q29l8K44N25n50l73P57m36L50q82R69
3164E38p34p6nL02K21J24J60l01l22M35K77o40m32M36R41j446J56M96l68j78P47
3185C31j07K0j11m53k60J029r15L37N83o37l10P39p9l8j255J645m07n55q77K31
$$ plain form
3205 -1089 -318 782 664 173 258 -568 400 -292 -261 797 -47 -1425 -171 -605 -441 -1052 490 330 -608
3224 -608 -625 -562 -955 -527 -201 113 -1046 -391 378 1233 -71 -376 48 -662 -322 619 186 -431 -268 548
3244 548 -605 -417 243 420 -128 -289 -1099 -1001 997 288 -912 -853 278 -337 -140 -710 842 -1302 351
3263 351 -642 256 -497 71 -101 -433 182 -105 -579 -996 -59 -194 -326 455 -346 370 438 -422 -1093 219
3283 219 310 -363 749 -93 -56 -96 -254 55 40 75 315 449 9 -479 -163 -394 180 129 492 -869 1076
3304 1076 23 230 725 -348 -572 17 -127 -856 370 342 -393 381 136 -708 -614 -254 -477 4 118
3323 118 697 127 90 -276 284 -83 -12 277 -338 483 156 88 -621 -752 195 904 93 290 -38 -355 78
3344 78 61 437 213 -8 218 470 -541 -279 -999 206 -1030 285 127 -658 -279 532 639 -955 -15
$$ packed form
3205a089P71J100j18m91Q5q26R68o92L1J058q44j378J254m34J64o11J542j60r38
3224f08j7O3l93M28L26L14j159O55P69Q55j304l05M24p10L40R41m33o17J63Q16
3244E48j153J88O60J77n48j61q10R8J998p09j200N9J131o15J97n70J552k144J653
3263C51r93Q98p53N68j72l32O15k87m74m17R37j35j32P81q01P16O8q60o71J312
3283B19R1o73J112q42L7m0j58L09j5L5K40J34m40m88L16k31N74n1L63j361J945
3304A076j053K07M95j073k24N89j44p29J226k8p35P74k45q44R4L60k23M81J14
3323A18N79n70l7l66N60l67P1K89o15Q21l27o8p09j31R47P09q11J97l28l17M33
3344G8j7L76k24k21K26K52j011K62p20J205j236J315j58p85L79Q11J07j594R40
$$ plain form
3363 -15 508 279 -414 161 305 562 -296 -541 677 -33 372 88 319 987 -691 -505 -694 313 322 -183
3383 -183 358 110 -6 -325 689 486 34 165 658 346 -80 -525 -894 -535 -1109 240 -189 731 -858
3402 -858 344 69 -268 774 -737 692 391 -301 -373 38 341 477 -37 -133 -275 78 311 -184 -648
$$ packed form
3363a5N23k29o93N75J44K57q58k45J218p10M05k84K31O68j678J86j89J007Rn05
3383a83N41k48j16l19J014k03m52J31M93l12m26m45l69L59n74J349m29R20j589
3402h58J202k75l37J042j511J429l01o92p2M11L03J36n14r6j42L53K33m95m64
$$ [...]
8191A23
##END NTUPLES=NMR FID
##END=
