##TITLE=1H_IAMT-157
 DMSO
 8 sc, 
 18.02.2022
##JCAMPDX= 6.0         $$ Bruker NMR JCAMP-DX V2.0
##DATA TYPE= NMR FID
##DATA CLASS= NTUPLES
##ORIGIN= UXNMR, Bruker Analytische Messtechnik GmbH
##OWNER= root
$$ XWIN-NMR		Version 3.5
$$ Fri Feb 18 10:30:38 2022 Russian Standard Time (UT+4h)  she@DPX200
##.OBSERVE FREQUENCY= 200.131346
##.OBSERVE NUCLEUS= ^1H
##.DELAY= (6, 6)
##.ACQUISITION MODE= SIMULTANEOUS
##.ACQUISITION SCHEME= undefined
##.AVERAGES= 8
##.DIGITISER RES= 18
##SPECTROMETER/DATA SYSTEM= spect
##.PULSE SEQUENCE= zg30
##.SOLVENT NAME= DMSO
##.SHIFT REFERENCE= (INTERNAL, DMSO, 0, 15.7039)
##AUDIT TRAIL= $$ (NUMBER, WHEN, WHO, WHERE, WHAT)
$$ ##TITLE= Audit trail, XWIN-NMR		Version 3.5
$$ ##JCAMPDX= 5.01
$$ ##ORIGIN= Bruker BioSpin GmbH
$$ ##OWNER= she
$$ F:/spectra/data/she/nmr/H-F/1/audita.txt
$$ ##AUDIT TRAIL=  $$ (NUMBER, WHEN, WHO, WHERE, WHAT)
(   1,<2022-02-18 10:29:06.62 +0400>,<she>,<DPX200>,
      <created by zg, POWCHK disabled, PULCHK disabled
       configuration hash MD5:
       00 E9 B6 7A A2 85 ED C7 34 08 36 98 17 FE 4E 26
       data hash MD5: 16K
       83 F3 88 DF EF E3 0F C5 35 62 F0 F8 6C F3 54 19>)
$$ ##END=
$$ 
$$ hash MD5
$$ 2F FC 60 A2 CD 39 E0 17 F1 C3 B4 BA F6 8D 9A 2A
##$RELAX= 
##$RELAX= 
##$RELAX= 
##$RELAX= 
##$RELAX= 
##$RELAX= 
$$ Bruker specific parameters
$$ --------------------------
##$DU= <F:/spectra>
##$EXPNO= 1
##$NAME= <H-F>
##$PROCNO= 1
##$TYPE= <nmr>
##$USER= <she>
##$AMP= (0..31)
100 100 100 100 100 100 100 100 100 100 100 100 100 100 100 100 100 100 
100 100 100 100 100 100 100 100 100 100 100 100 100 100 
##$AQSEQ= 0
##$AQ_mod= 1
##$AUNM= <au_zg>
##$AUTOPOS= <>
##$BF1= 200.13
##$BF2= 200.13
##$BF3= 200.13
##$BF4= 200.13
##$BF5= 200.13
##$BF6= 200.13
##$BF7= 200.13
##$BF8= 200.13
##$BYTORDA= 1
##$CFDGTYP= 0
##$CFRGTYP= 5
##$CHEMSTR= <none>
##$CNST= (0..31)
1 1 145 1 1 1 1 1 1 1 1 1 1 1 1 1 1 1 1 1 1 1 1 1 1 1 1 1 1 1 1 1 
##$CPDPRG= <>
##$CPDPRG1= <>
##$CPDPRG2= <>
##$CPDPRG3= <>
##$CPDPRG4= <mlev>
##$CPDPRG5= <mlev>
##$CPDPRG6= <mlev>
##$CPDPRG7= <mlev>
##$CPDPRG8= <mlev>
##$CPDPRGB= <>
##$CPDPRGT= <>
##$D= (0..31)
0 1.2 0 0 0 0 0 0 0 0.06 0 0.03 0 0 0 0 0.0002 0 0 0 0 0 0 0 0 0 0 0 0 
0 0 0 
##$DATE= 1645165745
##$DBL= (0..7)
120 120 120 120 120 120 120 120 
##$DBP= (0..7)
150 150 150 150 150 150 150 150 
##$DBP07= 0
##$DBPNAM0= <>
##$DBPNAM1= <>
##$DBPNAM2= <>
##$DBPNAM3= <>
##$DBPNAM4= <>
##$DBPNAM5= <>
##$DBPNAM6= <>
##$DBPNAM7= <>
##$DBPOAL= (0..7)
0.5 0.5 0.5 0.5 0.5 0.5 0.5 0.5 
##$DBPOFFS= (0..7)
0 0 0 0 0 0 0 0 
##$DE= 6
##$DECBNUC= <off>
##$DECIM= 24
##$DECNUC= <off>
##$DECSTAT= 4
##$DIGMOD= 1
##$DIGTYP= 9
##$DL= (0..7)
0 120 120 120 120 120 120 120 
##$DP= (0..7)
150 150 150 150 150 150 150 150 
##$DP07= 0
##$DPNAME0= <>
##$DPNAME1= <>
##$DPNAME2= <>
##$DPNAME3= <>
##$DPNAME4= <>
##$DPNAME5= <>
##$DPNAME6= <>
##$DPNAME7= <>
##$DPOAL= (0..7)
0.5 0.5 0.5 0.5 0.5 0.5 0.5 0.5 
##$DPOFFS= (0..7)
0 0 0 0 0 0 0 0 
##$DQDMODE= 0
##$DR= 18
##$DS= 0
##$DSLIST= <SSSSSSSSSSSSSSS>
$$ [...]
##$SUBNAM2= <"">
##$SUBNAM3= <"">
##$SUBNAM4= <"">
##$SUBNAM5= <"">
##$SUBNAM6= <"">
##$SUBNAM7= <"">
##$SUBNAM8= <"">
##$SUBNAM9= <"">
##$SW= 26.0245755471676
##$SWIBOX= (0..15)
0 0 2 0 0 0 0 0 0 0 0 0 0 0 0 0 
##$SW_h= 5208.33333333333
##$TD= 16384
##$TD0= 1
##$TE= 0
##$TE2= 300
##$TE3= 300
##$TEG= 300
##$TL= (0..7)
0 120 120 120 120 120 120 120 
##$TP= (0..7)
150 150 150 150 150 150 150 150 
##$TP07= 0
##$TPNAME0= <>
##$TPNAME1= <>
##$TPNAME2= <>
##$TPNAME3= <>
##$TPNAME4= <>
##$TPNAME5= <>
##$TPNAME6= <>
##$TPNAME7= <>
##$TPOAL= (0..7)
0.5 0.5 0.5 0.5 0.5 0.5 0.5 0.5 
##$TPOFFS= (0..7)
0 0 0 0 0 0 0 0 
##$TUNHIN= 0
##$TUNHOUT= 0
##$TUNXOUT= 0
##$USERA1= <user>
##$USERA2= <user>
##$USERA3= <user>
##$USERA4= <user>
##$USERA5= <user>
##$V9= 5
##$VALIST= <valist>
##$VCLIST= <CCCCCCCCCCCCCCC>
##$VD= 0
##$VDLIST= <DDDDDDDDDDDDDDD>
##$VPLIST= <PPPPPPPPPPPPPPP>
##$VTLIST= <TTTTTTTTTTTTTTT>
##$WBST= 1024
##$WBSW= 4
##$XGAIN= (0..3)
0 0 0 0 
##$XL= 0
##$YL= 0
##$YMAX_a= 178138
##$YMIN_a= -230568
##$ZGOPTNS= <>
##$ZL1= 120
##$ZL2= 120
##$ZL3= 120
##$ZL4= 120
##$ABSF1= 10
##$ABSF2= 0
##$ABSG= 5
##$ABSL= 3
##$ALPHA= 0
##$AQORDER= 0
##$ASSFAC= 0
##$ASSFACI= 0
##$ASSFACX= 0
##$ASSWID= 0
##$AUNMP= <proc_1d>
##$AZFE= 0.1
##$AZFW= 0.1
##$BCFW= 1
##$BC_mod= 2
##$BYTORDP= 1
##$COROFFS= 0
##$CY= 11.3945322036743
##$DATMOD= 1
##$DC= 2
##$DFILT= <>
##$DTYPP= 0
##$F1P= 2.36226072786647
##$F2P= -0.459571619588291
##$FCOR= 0.5
##$FTSIZE= 0
##$FT_mod= 4
##$GAMMA= 1
##$GB= 0.15
##$INTBC= 1
##$INTSCL= 1
##$ISEN= 128
##$LB= 0.24
##$LEV0= 0
##$LPBIN= 0
##$MAXI= 10000
##$MC2= 0
##$MEAN= 0
##$ME_mod= 0
##$MI= 1.114404
##$NCOEF= 0
##$NC_proc= 0
##$NLEV= 6
##$NOISF1= 3.799351
##$NOISF2= 2.8
##$NSP= 1
##$NTH_PI= 0
##$NZP= 0
##$OFFSET= 15.70392
##$PC= 1
##$PHC0= -16416.84
##$PHC1= 17.00078
##$PH_mod= 1
##$PKNL= yes
##$PPARMOD= 0
##$PSCAL= 0
##$PSIGN= 0
##$REVERSE= no
##$SF= 200.130013532006
##$SI= 16384
##$SIGF1= 3
##$SIGF2= 2
##$SINO= 400
##$SIOLD= 16384
##$SREGLST= <1H.CDCl3>
##$SSB= 0
##$STSI= 0
##$STSR= 0
##$SW_p= 3612.71676300578
##$SYMM= 0
##$S_DEV= 0
##$TDeff= 0
##$TDoff= 0
##$TI= <>
##$TILT= no
##$TM1= 0
##$TM2= 0
##$TOPLEV= 0
##$USERP1= <user>
##$USERP2= <user>
##$USERP3= <user>
##$USERP4= <user>
##$USERP5= <user>
##$WDW= 1
##$XDIM= 8192
##$YMAX_p= 0
##$YMIN_p= 0
$$ End of Bruker specific parameters
$$ ---------------------------------
##NTUPLES= NMR FID
##VAR_NAME=  TIME,          FID/REAL,        FID/IMAG
##SYMBOL=    X,             R,               I
##VAR_TYPE=  INDEPENDENT,   DEPENDENT,       DEPENDENT
##VAR_FORM=  AFFN,          ASDF,            ASDF
##VAR_DIM=   8192,          8192,            8192
##UNITS=     SECONDS,       ARBITRARY UNITS, ARBITRARY UNITS
##FACTOR=    0.000192,      1,               1
##FIRST=     0,             0,               0
##LAST=      1.572672,      0,               0
##MIN=       0,             -230568,         0
##MAX=       1.572672,      178138,          0
$$ Real data points
##PAGE= N=1
##DATA TABLE= (X++(R..R)), XYDATA
0@%%%%%%JrJ6j6J7k5L2m0M9n7P2q8J04j21J42j66J92k22K54k92L33l76M31m91
30b60N52o20O94p78Q72r72J082j204J338j482J640j818K012k226K468k736L036
47A598l380L770m219M750n378O139p088Q309r947J2266j5842K2155l6620J31042
61A07555K3463k30582n7603K9995J09782P8827P0631j801p5183j36777p5002L1075
73a25620J10459Q9418M0780j4774n3060r2796p6930k523R2267J15032O1829k8851
85A15231r3369j13840o9205K7576J26885J38917M5943q0020j34085r4812j0672
96a41451N9589R6871R0724L2595n5302j11567q9492j0799N8882Q2662O7121L0876
108A10709k4259q3638j00622m4244N2672J14484R4059J5164o5326j05454q6550
$$ y = [0, 0, 0, 0, 0, 0, 0, 1, -8, 8, -8, 9, -16, 16, -24, 25, -32, 40, -48, 56, -65, 77, -89, 103, -119, 135, -157, 176, -200, 231, -260, 292, -328, 366, -412, 460, -512, 570, -634, 704, -778, 862, -956, 1056, -1170, 1298, -1438, 1598, -1782, 1988, -2231, 2519, -2859, 3280, -3808, 4501, -5446, 6820, -9022, 13133, -23487, 107555, 131018, -99564, -157167, -127172, -17390, 61437, 132068, 130267, 55084, -81693, -156695, -125620, -15161, 74257, 115037, 100263, 47203, -45593, -122523, -125046, -32779, 82253, 144082, 115231, 21862, -91978, -161183, -133607, -6722, 132195, 178138, 98118, -35967, -130779, -141451, -81862, 15009, 105733, 138328, 83026, -28541, -118033, -128832, -69950, 12712, 79833, 110709, 86450, 2812, -97810, -142054, -89382, 25102, 119161, 134325, 68999, -36455, -123005]
119a23005j3491P6138J19506P7584j9984r3555r4023l8330K5311O7587P9390N1260
131A14388j2857p5924q8649m3524J9694N8640O8687N4291R609n9609j02058p0395
143a27707K1831R9196J00396L8923l6578q5725r3233m9006L2455J00041R3590
154I4183J8809n9637q3104n3848p557L4506O4530O7731K8202l5773p5837o5688
166g3483k0347K8409O1869O8506L5813l1741q7461q1111j2819O1970R0223O0749
178A00577m32n8714q5656o1210P103P1827Q5109L9078k4101n9864n8850l3660
190g8793O210M7047O7934M8745m738n5735p1633m6724K036N0751P5058N6391l009
203I3540o7223q6340m3218K7614P5520P1540K5371l1180o8780o5637k0798L6083
$$ y = [-123005, -136496, -60358, 59148, 136732, 116748, 23193, -70830, -109160, -83849, -16262, 63128, 114388, 101531, 25607, -63042, -106566, -86872, -28232, 40455, 94746, 104355, 44746, -57312, -127707, -105876, -6680, 93716, 132639, 96061, 10336, -82897, -131903, -99448, 593, 94183, 112992, 53355, -29749, -83597, -91154, -56648, 7882, 75613, 103815, 68042, -7795, -73483, -93830, -65421, -3552, 64954, 100767, 69026, -18435, -99546, -112365, -50395, 39828, 100577, 100145, 41431, -44225, -105435, -98332, -26505, 58604, 97682, 73581, 13717, -45133, -78793, -72583, -25536, 42398, 91143, 86405, 30670, -40963, -87687, -85651, -34900, 40158, 96549, 93540, 26317, -60023, -103241, -75627, -107, 71433, 96804, 65624, -3156, -68793, -89591, -53508]
215e3508O7681N1740P033l4262n0324m3461j8409K0295N4705O0305K4225l0125
227E5895o4987n8809j8267L1164O5979O4205K0020m4110q2030o1335J250N7333
239c3692P0836M1691o161m7127o1019l9218P599M8462N6378L0469q420l6953m8923
252b6078l8514n389L8211O1729M4819k785m8650o1963l8106Q394N2070O6743L8244
265H8725j9948o5809o4684k0335L1733N8028M8093J4193k4898n0500m6688j4257
277f6347K6448M8020M1693J3236j9444m4123m8588k4006J9422N5515N6548K0067
289G8441k9979n9988n1771j2460L5247O2176M9065K369m5084o1378l7134P135
301f3361M1826M8577L0036k862l3377m4875l0980K643L3472M4213L0830k14l2024
$$ y = [-53508, 14173, 65913, 72946, 38684, -11640, -55101, -73510, -53215, 1490, 61795, 86020, 55895, -9092, -67901, -86168, -55004, 10975, 75180, 95200, 51090, -30940, -92275, -91025, -33692, 37144, 78835, 72674, 25547, -35472, -74690, -67091, -18629, 37749, 68218, 59798, 22845, -26078, -64592, -69981, -31770, 29959, 74778, 71993, 23343, -38620, -76726, -68332, -16262, 50481, 88725, 68777, 2968, -61716, -82051, -50318, 7710, 55803, 69996, 45098, -5402, -52090, -66347, -39899, 8121, 49814, 63050, 43606, -517, -49105, -73111, -53689, 1826, 58374, 78441, 48462, -11526, -63297, -75757, -40510, 21666, 70731, 73100, 28016, -33362, -70496, -63361, -21535, 27042, 57078, 54216, 20839, -24036, -55016, -52373, -18901, 25312, 56142, 55928, 23904]
314B3904m9020l8908j058M1533N8383L6344j0056m8961n5645k7262J6752N0164
326c830N2650K1048k3425n0713m4942j1872K3515M1084L7741J4803j5302l9154
338A603m0390j7626J6417M0432M1066J8085j5897m4631m7518j9223K4868N3323
350A0509M6190Q499l3256n1877l7723j881L4328M9241L2860k910l5708m3380k5384
363e0492M317K8728L7663K7042J795k7299m1666l1211j244L0688M3889L2514j63
376E4561l4823m9000l2037P553M2774M9109K2990j5914m3152m2140j7042J7885
388c9236M0155L8470J3738j7732l6528l3337j2743J3272L2261L4123J6824j2064
400C7203l6530l8946j7269J7162M0355M0356J5129k0614m4359m0233q694K7691
$$ y = [23904, -25116, -64024, -65082, -23549, 34834, 71178, 61122, 12161, -43484, -70746, -53994, -3830, 48820, 69868, 46443, -4270, -49212, -61084, -37569, 3515, 41256, 56059, 40757, 1603, -38787, -56413, -39996, 436, 41502, 59587, 43690, -941, -48459, -67682, -42814, 10509, 56699, 65198, 31942, -19935, -57658, -59539, -25211, 24030, 56890, 53980, 18272, -25108, -50492, -46175, -17447, 20216, 47258, 49053, 21754, -19912, -51123, -52367, -21679, 22210, 54724, 54561, 19738, -29262, -61299, -53746, -10972, 38137, 61127, 45213, 2061, -40079, -57121, -39236, 919, 39389, 53127, 35395, -1133, -34470, -47213, -33941, -1680, 32443, 49267, 37203, 673, -38273, -55542, -38380, 1975, 42331, 57460, 36846, -7513, -47746, -56440, -28749]
412b8749M5479L3255J047l0064m0690k7469J314K7410L7319K5369p52k5007l4350
425a5888k4692k849K2713L5286K8687L212k6271m0479k9231R52L1717M2882K7043
438E3082o342l4821m2178k1461J1763L6373L6901J5500j4783l3464l2172j3207
450d4809J2629L0298L1052J4042j1057k9924l1286j5957J0073L1272L5501J6282
462D8116j3078l5855l6310j2946J8794L8797L3870P272k2840l8242k9854l060
474d5336K4062L5505K5242Q11k2415l1628k2470j901J9984L0316K4647L415k0306
487A9926l3264k5922k772K3439L5189K6166J96k6516l7529k4237N186L0274L6334
500B6470J8619r476k9914l2177j5297R983K8706K9484J3619j0072k6388k7777
$$ y = [-28749, 16730, 49985, 51032, 20968, -19722, -47191, -45877, -18467, 18852, 44221, 43469, 18462, -15888, -40580, -43429, -20716, 14570, 43257, 46469, 20198, -20281, -49512, -48560, -16843, 26039, 53082, 46740, 11919, -30259, -51720, -39957, -3584, 33317, 48817, 34034, 570, -31602, -44809, -32180, -1882, 29170, 43212, 32155, 2231, -29055, -45012, -34939, -3667, 31834, 48116, 35038, -817, -37127, -50073, -31279, 7518, 41388, 48660, 25820, -12422, -42276, -45336, -21274, 14231, 39473, 40284, 17869, -13759, -36229, -38130, -18146, 12170, 36817, 40232, 19926, -13338, -39260, -42032, -18593, 16596, 42762, 42958, 16442, -21087, -45324, -40138, -9864, 26470, 45089, 35613, 5699, -26478, -41775, -31792, -3086, 26398, 40017, 29945, 3557, -24220]
512b4220j3527P201K5218K9369J6363q417k8943l1375j4839J2507L1175L1797
524C2309J1845j5085l3294l1068p897J8918L3021K5938L488j9232k9929k2849
536c3835l194J8306K8358K2589K809j7467k7278k2320m040J6913K9636K4481L662
549C8620k0321l2744k3152j0K3579L1801K1172l477k5455l1551j8180P357K6402
562e959K8764J3747p410k2731k5715j4452N879K3273K6191J3785p751k3394k5956
575b1729j4178O254K4410K9488J4961j0549k8542k8235r730J3340K8204K5716
587B9410Q123j4713k8978k4764m735J6892K6604K0136M018j4199k4304k2006n356
600c3872J5215K6162K1310L338j5166k5767k1344m392J7220K8979K2661J60k1559
$$ y = [-24220, -37747, -30546, -5328, 24041, 40404, 31987, 3044, -28331, -43170, -30663, 512, 32309, 44154, 29069, -4225, -35293, -43190, -24272, 8749, 34687, 38175, 18943, -10986, -33835, -37029, -18723, 9635, 32224, 35033, 17566, -9712, -32032, -36072, -19159, 10477, 34958, 38620, 18299, -14445, -37597, -37607, -14028, 17773, 38945, 35468, 10013, -21538, -39718, -32361, -5959, 22805, 36552, 29142, 6411, -19304, -33756, -27877, -4604, 21587, 35372, 27621, 4227, -21729, -35907, -29653, -5243, 24245, 39206, 28657, 115, -28120, -37850, -24510, 3694, 29410, 37533, 22820, -6158, -30922, -35657, -18765, 7839, 27975, 31993, 17794, -6510, -28516, -33872, -18657, 7505, 28815, 32153, 16987, -8780, -30124, -34516, -17296, 11683, 34344, 34504, 12945]
613A2945k8603j7919K416K0915K6672J6648l789k1780k6381j4383O452K1684K3054
626A7931J2785l864j9713k4201j4586M897K1828K4870J3065o388k2265k4776j3162
639c3579P675K4644K5773J0236j2023k5229k3290o455J2774K3477K1361O524j2537
652A9351k4495k0895m349J3985K1818J8690M877j1743k2896k1191n661J5168K5594
665H253K0253K292j5597k3845j9435k693J6641K6459J8014k728j9758k3346j3798
678b9288K623J7465K2995J5438k883j9274k3185j1891M674J7798K0897J3088k834
691B5623j9018k4196j3440O523K1462K2810J0464p144k0504k2602j0777Q713K2701
704F15K1927O588j0852k1032j8704n911J0036K0847J9320N831j1731k0743j8461
$$ y = [12945, -15658, -33577, -31161, -10246, 16426, 33074, 29285, 7505, -18876, -33259, -26807, -5123, 17931, 30716, 26852, 7139, -17062, -31648, -26751, -4923, 19947, 33012, 26624, 4359, -20417, -33579, -25904, -1260, 24513, 34749, 22726, -2503, -25793, -32248, -19474, 4003, 25364, 31888, 19351, -5144, -26039, -30388, -16403, 5415, 24105, 28982, 17239, -5657, -26848, -32509, -17341, 8253, 28506, 30798, 15201, -8644, -28079, -30772, -14131, 12328, 30342, 27614, 7856, -15490, -29288, -26665, -9200, 13795, 29233, 26350, 7076, -16109, -28000, -23326, -5528, 15369, 28457, 25623, 6605, -17591, -31031, -24508, -3046, 19764, 30228, 23084, 2580, -20022, -30799, -22086, 615, 22542, 29130, 18278, -2754, -21458, -27369, -17333, 3514, 22834, 28665, 16934, -3809, -22270]
717b2270m677J0926K0256J8596N164j2321k2785j8908k722J5278K2351J6515J356
730B6759j4241k2294j6520l55J6150K2610J4351k366j7320j9542j2283J849J4809
743h393K0478J3667k257j7487k0841j1603M301J7163J9937J2199m341j8211k1854
756a7242j0724O897J9519J9531Q812p023j8740j9974q871R114K0566J8811M847
769B5523r189j7628j6642o718Q180J8899J8597N038j1415j9933j6379k807J0744
782a3730J8783J6655M196j1798k1729j6325j211J4557J9772J3871M20j3632j9573
795i744j3996N68J4676J9649J2231j432j4076j8546j3086J205J5163J9524J1535
808B3671l398j6057j7702j0070L843J5430J8885J0744n375j7597j9029q576P696
$$ y = [-22270, -26947, -16021, 4235, 22831, 27995, 15674, -7111, -26019, -28741, -13463, 8888, 25403, 26759, 12518, -9776, -26296, -26651, -10501, 12109, 26460, 24094, 6774, -12768, -25051, -23202, -8393, 12085, 25752, 23495, 6008, -14833, -26436, -22135, -4972, 14965, 27164, 22823, 4612, -17242, -27966, -21069, -1550, 17981, 26793, 19770, 1030, -18944, -27815, -18701, 1865, 20676, 25523, 16334, -1294, -17936, -24654, -16474, 2425, 21022, 26060, 14645, -5288, -21667, -24474, -13730, 5053, 21708, 25904, 14106, -7623, -23948, -25159, -10602, 9170, 23041, 23461, 9829, -9744, -23740, -23172, -8496, 11153, 23384, 21952, 7876, -10670, -23756, -22551, -7388, 12136, 23671, 20273, 4216, -13486, -23556, -19713, -4283, 14602, 25346, 19971, 2374, -16655, -25231, -17535]
821a7535J7373J6554P271p122j6439j7297p100P868J8091J6629M972q272j6836
834a843j5742n604Q134J7962J6759L981j1152j7539j4379k642J0283J7529J4659
847B0406K733j2591j9218j2983L28J2756J6634J2327Q29j1677j8275j3333J230
860b0834J4152J7254J0473k125j2541j6495j1930J445J4657J8691R812m253j5224
873C082j5812q703L729J4341J7047R040n666j6792j6094o053O508J5066J5208
886A4901P060n901j6391j6509n184P909J6119J4496M597p478j5631j4926n072
899b2010R394J7145J4084K168j0172j5593j2607k617R459J6199J3385J956j2111
912H680j6527j1378O52J1524J5398J0604L90j1764j6978j0909J270J2829J6209
$$ y = [-17535, -162, 16392, 23663, 16541, 102, -17195, -24295, -16427, 1664, 18293, 23265, 14993, -1843, -17585, -23189, -15055, 2907, 19666, 23647, 12495, -5044, -19423, -22065, -11782, 5747, 20406, 23139, 10548, -8670, -21653, -21325, -8569, 8065, 20392, 21221, 9544, -8731, -22064, -20834, -6682, 10572, 21045, 18920, 6379, -10116, -22046, -20601, -5944, 12747, 22559, 18306, 3082, -12730, -21433, -17704, -3363, 13684, 22724, 17058, 266, -15828, -21881, -15373, -307, 14901, 21961, 16060, -331, -16840, -22024, -14115, 2004, 16500, 21097, 13619, -2012, -16938, -22010, -12616, 4529, 18613, 20781, 10609, -4984, -17591, -20208, -10749, 5450, 18835, 20791, 8680, -7847, -19225, -18573, -7049, 8349, 18953, 19343, 7579, -9399, -20308, -19038, -6209, 10000]
925A0000R402j645j2683j5453j0062K663J3332J6726P997m245j3124j4396q193
938a9681L395J3842J5654P473n802j4806j4038m872N632J3270J3770O116o067
951A3886j5506j4412m197Q297J4594J2799L657p086j4379j3813l415Q699J5564
964D688J2022J862q937j4327j1918k203R234J5591J1852N82j1092j4530r834J49
978a6861R789J4329J0757r5j1824j5640q954K574J1579J3830Q476j569j1120j5319
992a0048q973L272J3022J3940O837m362j1321j3513p049L677J2709J4304O283
1005A8778n456j3327j2501n334N533J2515J3108N027o107j4002j2474l212P084
1018a0368J3007J1548L603o967j4253j2239k495Q732J3939J0526J272q020j2463
$$ y = [10000, 19402, 17757, 5074, -10379, -20441, -17778, -4446, 12280, 20277, 16032, 2908, -11488, -19681, -16286, -2444, 13210, 20683, 14881, 75, -13963, -18835, -13203, 67, 13837, 19953, 13886, -1620, -16032, -20229, -11932, 2662, 15461, 19118, 12032, -2347, -16160, -19575, -10876, 4688, 16710, 18572, 9635, -4692, -16610, -18813, -9579, 6012, 17864, 18446, 7354, -7176, -17010, -16861, -7072, 7257, 18014, 17919, 6095, -9545, -18499, -15925, -4346, 9484, 17960, 16391, 5271, -10048, -19021, -15749, -2727, 11213, 18050, 13688, 2367, -11146, -18195, -14518, -1809, 12495, 18778, 13322, -5, -12506, -17840, -12307, 208, 13316, 18343, 12236, -1766, -14240, -17452, -10368, 2639, 14187, 17790, 10823, -3430, -15669, -18164, -9432, 4507, 15033, 16305, 8285, -4178]
1031d178j1009j665Q820J4358J0130m92r919j2944q896L90R007J3631R205j76
1045A6262j1166j4122p801K718J0341J2401P945k225j0542j4258o883L384J2118
1058a828J2201N847k882j1318j2225p089L994J2475J2816M703n355j1596j1133
1071a1390m861N007J1827J2312L858o655j2428j0768k390O091J1885J0647L031
1084A6166p105j2593j0586j505P877J2264R485J473p649j2686r807j013R171J2264
1098E756Q744p2q911j1772q170j16Q977J2859Q031j445j0381j1746o564J651R242
1113c917J2021P130j932j0886j2020n752L572J0415J0950N195l248j0413j1588
1126a0473n064M348J1489J0942L732m759j0537j0519m225N128J1338J0570L194
$$ y = [-4178, -15187, -16852, -8032, 6326, 16456, 15964, 6045, -6899, -15795, -15405, -6398, 7233, 16438, 16262, 5096, -9026, -16827, -14109, -3768, 8633, 16578, 14353, 3811, -10447, -17330, -13946, -1828, 10373, 16220, 13338, 2020, -10205, -17294, -13300, -825, 11991, 16694, 11339, -257, -11390, -16251, -11244, 583, 12895, 16753, 10098, -2330, -13098, -15488, -9397, 2488, 13135, 16166, 9061, -3532, -14118, -15623, -7746, 4518, 14003, 15476, 7827, -4859, -14666, -15679, -6508, 5756, 14500, 14428, 5517, -6255, -14425, -14541, -5564, 7295, 15326, 13881, 3500, -8246, -14810, -13159, -3917, 8104, 15234, 13302, 2416, -9604, -15356, -11784, -1369, 9581, 14776, 11528, 1115, -10473, -15537, -11189, 300, 11242, 14974, 10215, -322, -10841, -15066, -9938, 1400, 11970, 15164]
1139A5164o231j1055r887k483N644J1303R985K608p237j1542r132j086P102J1269
1153D422Q230J527p540j1768q624J07Q027J1165P755o26p667j1215p668Q44Q500
1168d531J1886O516j622r088j0367o517J787R120J0675O276k623r923j0593m911
1182a3915L138R330J0180N126l640r625j0417m280M494J0001R760L524m454r664
1196d42r734l752N087J0233R656K734o027r900q653k243N720R918R133J220n755
1211G195j0998p886j039O498J0149Q354L63p042j0247p926M14P570J0091P074
1225A2570r31p666j0027p046J356Q185J0219O084j896p924r949n219J537Q758
1239a949R458N500k669q809r699m618K903Q802R040M745k946r937q934l553M190
$$ y = [15164, 8933, -2122, -12009, -14492, -8848, 2455, 12440, 15048, 7811, -3731, -12863, -13949, -6847, 4422, 12652, 14179, 6639, -5129, -13753, -13646, -5619, 5546, 13301, 12675, 5008, -6207, -13875, -13031, -4531, 7355, 13871, 12249, 3161, -7206, -13723, -11936, -2816, 7859, 14135, 11512, 1589, -9004, -13915, -10777, -1447, 8733, 13859, 10219, 594, -9823, -14103, -9609, 392, 10152, 13676, 9222, -442, -10176, -13928, -8841, 1392, 11048, 13782, 7755, -2145, -10798, -13041, -7321, 2597, 11730, 12950, 7195, -3803, -11689, -12728, -6230, 3919, 12273, 12636, 5594, -4653, -12579, -12165, -4595, 5496, 12570, 11639, 3973, -6054, -13100, -11744, -3559, 6660, 12744, 10848, 2924, -7025, -12244, -10707, -1949, 7509, 13009, 10340, 1531, -8168, -12786, -9883, -1081, 7959, 12704, 9758, -179, -9113, -12666, -8476]
1254h476Q707R127L322m513r211q901k785N321R319P880K297n263q930p868k010
1269a1984N432R191P811J691o264r184p638o62O204R727O806O59o996r355o784
1284a1346Q0P225R108O188q54o853r376n406O38P901Q595N561j498p385q974n277
1300a1673K015P468R027M890k296q378q271m449K872Q226Q346L655l053q358q402
1315h381l450M212Q606P629K947m292q356p832j964M196Q340P419J795m754q378
1330b263p015j797N082Q875P194P21n271q888o442p18O242Q513O261m70o106q469
1346d551n823K36O574Q611N183o81o681q095m888J034O497Q572M668j304p695
1361A657q107m203K357O670Q176L961k462o932q453l435L030P523P640L299l145
$$ y = [-8476, 231, 9358, 12680, 8167, -1044, -9945, -12730, -7409, 1910, 9790, 12087, 6824, -2106, -9974, -11984, -6552, 2639, 10450, 12141, 5877, -3307, -10945, -11607, -5403, 4324, 11130, 11789, 4793, -4562, -11346, -11266, -4041, 5067, 11255, 10401, 3548, -5828, -11234, -10596, -2695, 5900, 11461, 9963, 2578, -6396, -11673, -9658, -2190, 6837, 11727, 9431, 1053, -7218, -11667, -8795, -569, 7777, 11432, 8379, 21, -8381, -11831, -7619, 987, 8616, 11563, 7271, -1085, -8917, -10881, -6685, 1655, 9074, 10869, 6115, -2263, -9278, -11075, -5993, 2882, 10076, 10797, 5526, -3362, -9804, -10522, -4280, 4233, 10494, 10024, 3918, -4551, -10374, -10138, -3564, 5047, 10230, 9549, 2868, -5227, -10115, -9081, -2584, 5988, 10656, 9352, 1657, -6450, -10653, -8296, -1626, 6550, 10511, 8049, 1117, -7336, -10771, -7741, -218, 7422, 10721, 7576]
1376G576q038p464k826L873P746P295K084l843p335o968k222L864P640P110J496
1391I988m143p946o517j710N157Q131O346O67n506p663o144k62N812P750N447
1406I407m08n325p949n076l8O038P813N054p87o231p446m761R86O424P562M701
1422I964j611o708p463l866J941O642P236L197j937o962p079l082K429O895O964
1437F560K784k303p201p065k520L571P049O674J821l438o848o418k039L804P144
1452A575O778R63m340p343n679q74M135P157N892Q91m976p562n340K69M898O755
1468C199N108L42n302p031n053O52N328P026M299q83n207o933m415Q15N919P454
1484E318L499j523o410o318l568J826N903P251K879j982o429o317k649J905O617
$$ y = [7576, -462, -7926, -10752, -6879, 867, 8162, 10246, 6403, -932, -7900, -10122, -6258, 1382, 8492, 9988, 5845, -2101, -8618, -10328, -5171, 2960, 9306, 9973, 4467, -3196, -9340, -9602, -3790, 3960, 9407, 8999, 3674, -4275, -9351, -9389, -3351, 4462, 9516, 8729, 2498, -4948, -9709, -8723, -2299, 5263, 9964, 8353, 1645, -5818, -9684, -7743, -1101, 6135, 9332, 7395, 433, -6646, -9728, -7299, -404, 6560, 9344, 7041, -160, -7225, -9745, -6174, 875, 7549, 9370, 5932, -916, -7334, -9373, -5569, 1575, 8353, 9316, 4976, -2367, -8046, -8920, -4785, 2372, 8264, 9155, 4179, -3383, -8723, -8454, -3556, 3199, 8307, 8649, 3347, -3684, -8737, -8085, -2757, 4269, 8568, 7685, 2478, -4455, -8870, -8055, -2136, 5318, 8817, 7294, 884, -5434, -9002, -7176, -1273, 5978, 8857, 6875, 446, -5871, -8520, -6615, 2]
1499BN790K595k266o397o188k377L149O455N961J661l278o322n730j674L525O874
1515A780N894O57l991o876m770r76M163O642N090R23n222o364m361k36M076O284
1531B713M769N14m931p062l994N91N214O551L615q85m829o838l863J166N983O501
1547E215K855j553n590o081k746J463N592O397L089k610n898n330k709K078N381
1562d47O020K657k230o373n712j649K706N535N603J466k766o083n677r07L787
1577d070N991N121L1l451n419m997r03L924O090M841l1m201n633m245k34L931
1593c255N904M502M19m936o335l541N73M274N666M126m66m795o424l394J369N129
1609a184N443K909j443m640n487l027J391N213N884K007j962n138m766k029J376
$$ y = [2, 5792, 8387, 6121, -276, -6464, -8841, -5692, 763, 6724, 8385, 5107, -1215, -6945, -8619, -5094, 1780, 7674, 8331, 4340, -2536, -7306, -8282, -4119, 2523, 7613, 8536, 3314, -3050, -7411, -7647, -3571, 2713, 7482, 7996, 3065, -3997, -7991, -7400, -2186, 4365, 7980, 7095, 2266, -4572, -8435, -7269, -1286, 5215, 8070, 6517, 927, -5154, -7900, -6437, -845, 5552, 8641, 6031, 133, -5197, -7906, -5828, -447, 5573, 8230, 6000, -373, -6085, -7734, -5028, 507, 6110, 7576, 4810, -1273, -6950, -7857, -4070, 1921, 7042, 7073, 3622, -1797, -6794, -7697, -3773, 2317, 7158, 7127, 2926, -2707, -6952, -7186, -3255, 2649, 7151, 7570, 2634, -3701, -7242, -6669, -2395, 3271, 7397, 6931, 2136, -4288, -7682, -6313, -1184, 4259, 7168, 5725, 1085, -4402, -7429, -6038, -825, 5059, 7066, 5104, -34, -4800, -6829, -5453]
1624e453M933N875K204k307n718n255j068K574M616N300J276k642o010m448r69
1639g092L619N313M030R10k903n247n049o95L532N666M297P6l800n059l956m31
1655f789M005N497M048k55m370n338l418R31L453N293L497l08m838n448k695J128
1671e607M712M929K215j106m025n311k764J895M800M803K111k000m570m576k405
1686f899J659N211N218J809k774m982m318j279K158M894M282J771k550n404m397
1701e601p15L218M618L785O89k455n131m304k80L594M962L530l82l112m624l830
1717f038j81L727N468L463o75m084n186k450M47L831M774L201n99m552m782k770
1733f406J530M160M273K532j070m128n138k144J882M531M310J446j430m027m753
$$ y = [-5453, -520, 5355, 7559, 5252, -466, -5721, -6789, -4215, 401, 5701, 6977, 4335, -1675, -6123, -7092, -3473, 1840, 5870, 6780, 3877, -1370, -6419, -7114, -3582, 2084, 6381, 6457, 2657, -2402, -6358, -6789, -2784, 2713, 6761, 6506, 2136, -3202, -6620, -5689, -2236, 3057, 6554, 6246, 1408, -4040, -6735, -5607, -895, 4034, 6249, 5143, 1118, -4193, -6957, -5062, -262, 4541, 6652, 4652, 82, -4494, -6899, -5240, -29, 5189, 6998, 4224, -758, -5076, -6355, -4197, 697, 4979, 6750, 4200, -1204, -5601, -6316, -3098, 1520, 5305, 5994, 3539, -1592, -5896, -6176, -2582, 2380, 5910, 5528, 2416, -2208, -6038, -6219, -2492, 2976, 6439, 5764, 1680, -3506, -5956, -5509, -1678, 3096, 6297, 5698, 1146, -3636, -6406, -4876, -716, 3557, 6089, 5019, 891, -4247, -6391, -4509, 22, 4332, 5778, 4348, 321, -4432]
1748d432j808J890M494M659J235k445m243l830j308J943M446M393Q60k581m630
1763a357l605o60K422M287L891O56k811m470l947j54L311M749K597K07k915m343
1779b142l644L14L674M867K905j166l174m210k995L41L897M478K694q13l996m545
1795c515k109J267L694L951K670j451l640m761j838K001L585M046J776j709m161
1810a94l983j635J984M669L558P31j693m160l496j323K112M270M231K31k205m373
1826a276k888r54K499L869L435N89k793m327l113q1K865L928K933M01k815m468
1842b196k912K73L905L517K468o52l052l969k399K91L469M549K016j216l528l637
1858c073j789N48L854L856J982j302l906l863j556J737L619L489J418j201l969
$$ y = [-4432, -6240, -4350, 144, 4803, 6038, 3593, -650, -4480, -5788, -3845, 601, 4994, 5854, 3273, -1357, -4962, -5622, -3200, 1087, 4978, 5634, 2823, -1647, -5594, -5748, -2437, 2312, 4909, 5116, 2201, -2142, -5786, -5472, -1798, 3069, 5974, 4808, 1634, -2576, -5571, -5230, -1333, 3145, 5839, 5026, 1030, -3515, -5624, -4357, -663, 3288, 5958, 4507, 867, -3894, -5732, -3731, -146, 3900, 5676, 3967, -194, -4177, -5812, -3828, 841, 4399, 5130, 3437, -723, -4219, -5542, -3430, 840, 5071, 5302, 3097, -1276, -4164, -5118, -2619, 1250, 4685, 5274, 2481, -1846, -4959, -5040, -2175, 1753, 4686, 5087, 2272, -2196, -5108, -4835, -930, 2587, 5055, 4403, 1351, -2618, -5017, -4726, -1257, 3292, 5308, 4092, 564, -3073, -4862, -4314, -460, 3396, 5378, 4076, 170, -3693, -5249, -3512, 107, 3596, 5014, 3813, -156]
1873a56l828j003J845L600L631P28j935l595l630q67K060M176K973O04k200l744
1889a341k970k60K344L791K982L23k729l870k903K00K433L846K519J05k754m232
1905b516k346M19L318L896J826o91k704l810k208L50L785L669J728r10l006l636
1921b836j914Q42L445L451J850j523l341l253j445J453L603L130J351j358l771
1936c16l384j263K385L159L314N11j873l571k748r73K502L679K687R7k011l322
1952a127k975l34K063L975K839j91k502l508k326N5K324L394K474J01k859l498
1968b095k262P70K674L052K180o63k564l619k064Q31L344L705J122j202k610l350
1984b751j615J060L028L345J477j343l574k981j088J735K782L265J193j728l435
$$ y = [-156, -3984, -4987, -3142, 458, 4089, 4817, 2882, -713, -4343, -5210, -3150, 1026, 3999, 4603, 2403, -1341, -4311, -4571, -2227, 1564, 4546, 4869, 2140, -1730, -4633, -4433, -2000, 1846, 4365, 4470, 1716, -2516, -4862, -4443, -1125, 2771, 4597, 3906, 1202, -2608, -4816, -4466, -681, 2988, 4716, 3806, 800, -2836, -4750, -3908, -463, 2988, 4838, 3315, -26, -3279, -4724, -3271, 332, 3462, 4813, 3455, -316, -3700, -4963, -2578, 581, 3895, 4406, 2533, -1038, -3786, -4759, -2257, 1422, 4109, 4206, 2195, -1127, -4102, -4436, -2373, 1602, 4441, 4250, 1748, -1760, -4086, -4031, -1707, 1687, 4161, 4262, 1403, -2095, -4357, -3587, -913, 2139, 4319, 3656, 1092, -2527, -4591, -3760, -416, 3289, 4411, 3209, 599, -2751, -4366, -3306, -278, 3067, 4544, 3201, -373, -3354, -4442, -2707, 75, 3340, 4533, 2805, -630]
1999f30l141k87J740L049K706P92j773l140l003m27K617K640K552K21k042l194
2015a320k630Q1K092L210K685j77k273l483j811j41K462L370K262r38k617k612
2031a840k162M75K527L380J553n52k936l180j562J112K850K963J413j150k532
2046C59k734j599R11K959K800J013q24k990k583j417J452K966K572J051j467k996
2062e27k850m08J271L311K593M45j728l319k234j55J763L121K171K80k186k879
2078a331k134k29K374L062J760q7k545k234k447M46J974L476J551k87k511k913
2094b075j591L40K526K989J341o77k337k853j126O30K641K815R67j244k163k850
2110b667j011J038K406L133Q22j467k424k457q31J181K928K145R17j519k888k330
$$ y = [-630, -3771, -4058, -2318, 731, 3437, 4229, 2456, -684, -3687, -4114, -1497, 1143, 3695, 3916, 1874, -1320, -3950, -3869, -1777, 1433, 4118, 3941, 1668, -1815, -3626, -3767, -1305, 2065, 4327, 3389, 772, -1840, -4002, -3527, -1000, 2380, 3933, 3381, 445, -2735, -4297, -3185, -335, 2628, 4041, 2891, 359, -2375, -3974, -3063, -104, 2696, 3709, 2885, -105, -2688, -4105, -2653, 313, 2885, 3936, 2469, -527, -3377, -3785, -2514, 797, 3390, 3835, 2107, -1212, -3446, -3601, -1838, 1283, 3454, 3734, 1548, -1331, -3465, -3694, -1320, 1742, 3502, 3415, 870, -1364, -3811, -3365, -1391, 2085, 3636, 3349, 838, -2075, -3666, -3326, -800, 2189, 3530, 2853, 516, -2337, -3463, -2833, -192, 2623, 3590, 2346, 183, -2667, -3678, -2640, -234, 2899, 3721, 2254, -170, -2627, -3458, -2277, 651, 2796, 3713, 2194, -694, -3024]
2126c024m64J786K567K187J83j366k884j852n64K098K637J980j59j113l359j904
2142c251K75J919K671J388L93k293k635j973L85K315K829J550q37j786k691j911
2158c652J128J973K700J223p32k244k337j265O84K402K165J184q12k209k326j230
2174c348P35K516K700J188j598k632k167o83J221K524K354N15j565k416k371l36
2190c363J911K353J663N49j477k399k222J77J392K306K063o7j694k415j736j24
2206c083J989K750J542l71j714k811j824P79J948K665J290n30j996k641j360R30
2222b437K015K408J027n16k016k439j243Q12K056K493Q12r46j861k207j055P00
2238b397K593K590L83j403k499j922l11J406K368J668O28j587k337j955j26J350
$$ y = [-3024, -3488, -1702, 865, 3052, 3235, 1869, -1015, -2867, -3431, -1333, 1304, 3284, 3125, 2012, -1347, -3251, -2976, -1057, 1614, 3002, 3395, 1102, -1533, -3506, -3121, -806, 2023, 3573, 2736, 950, -1741, -3652, -2524, -551, 2149, 3372, 2640, 396, -1941, -3206, -2522, -120, 2045, 3229, 2417, 208, -2118, -3348, -2613, -97, 2603, 3791, 2193, -439, -2606, -3289, -2068, 456, 2810, 3325, 1760, -656, -3027, -3363, -1452, 901, 2564, 3113, 1636, -763, -2985, -2808, -1416, 890, 2953, 2886, 1192, -1223, -2959, -3083, -1094, 1656, 3198, 2827, 1113, -1698, -3522, -2743, -795, 1870, 3160, 2630, 634, -2007, -3367, -2437, -422, 1986, 3013, 2497, 481, -1958, -3201, -2389, -333, 2160, 2972, 2026, 165, -2042, -3097, -2397, 196, 2786, 3169, 1766, -733, -2655, -2966, -1560, 808, 2476, 3104, 1517, -820, -2775, -2901, -1551]
2254a551K420J590N49j379k500j726m79J830K118J943l8j216k472j879k3K144
2270f69K463J031n42j376k431j488Q45J761J770J415k3k464k177r72J060J548
2286b49J673J653p63k084k414q51O17K611J673J063j093k315j906o78J131K290
2302C58K074N24j509k165j291l84P58K293J852K06j192j957j478p64J327J834
2318D86K011K83j564k299j722k5J677K439J386j74j561j925j757N61J769J812
2334A397J150m97j612j705j280M11J440K331O77j53j641j995r96M02J739K211
2350A879J123q48k219k361q40J135K253J978O94j051j813k117m32J278J868J565
2366B092M41r66k053j493j46O79J914J869K51j157j986j606n33R57K506J861J14
$$ y = [-1551, 869, 2459, 3008, 1629, -871, -2597, -3076, -1246, 872, 2815, 2777, 1561, -911, -2790, -2813, -669, 1794, 2825, 2283, 907, -1524, -3012, -2167, -406, 1364, 2779, 2756, 292, -1885, -2857, -1797, -249, 1424, 3077, 2314, 230, -2184, -3035, -2418, 193, 1866, 2929, 1836, -479, -2385, -3063, -1932, 358, 2432, 2956, 1447, -718, -2009, -2393, -1635, 658, 2510, 2716, 1524, -433, -1911, -2675, -1348, 486, 2497, 2780, 1216, -1083, -2805, -2830, -1153, 1286, 2672, 2498, 937, -988, -2745, -2184, -415, 1397, 2547, 2050, 438, -1267, -2547, -2136, -696, 1635, 2312, 2159, 518, -1477, -2473, -2071, -332, 1879, 3002, 2154, -65, -2426, -3266, -2131, 122, 2100, 2794, 1743, -70, -2187, -2619, -1341, 527, 2092, 2533, 1567, -486, -1979, -2125, -1446, 468, 2337, 2588, 1431, -555, -2161, -2694, -1737, 769, 2630, 2744]
2383B744j365k818j452K66K156J709J368l30j303j973j465M54J281J850J145n78
2399A689r60j677j744L05J989J913P81j57j939j810j043N59J960K170O76p91k079
2416a58j749o80J193J642J812M09p09j792j949m94J104J846J153O64p91j600j609
2433a708r08J237J885J839K53j403k121j359k4J125K244J178J97j424k429r46
2449b364N52J360J574J054K70j670j847r83M11J256J658Q56l26j115j840j489
2465b643N32J702J919J052o05j984j794o97P25J985J738M24r79j409j728o9O41
2482a190J591J132J67m82j544j356n30Q58J537J505N64n60j988j618o32J171K066
2499F91J424P7j104j858j361l19J763J878R31L2j640j718n78J33J284J370J073
$$ y = [2744, 1379, -1439, -2891, -2625, -469, 1240, 2608, 2278, 975, -998, -2463, -2009, -728, 1122, 2267, 1689, 729, -948, -2692, -2387, -398, 1515, 2296, 2139, 200, -1610, -2653, -2094, -134, 2036, 2712, 1921, -158, -1907, -2587, -1394, 248, 2060, 2469, 1760, -32, -1981, -2475, -1371, 475, 1628, 2292, 1501, -99, -1708, -2616, -1379, 506, 2345, 2598, 1195, -926, -2285, -2309, -1184, 1060, 2238, 2435, 1011, -1418, -2364, -1812, -452, 1122, 2176, 2446, 776, -1071, -2054, -1643, -387, 1271, 2127, 1801, 686, -1154, -2643, -2111, -409, 1510, 2562, 1957, -27, -1821, -2518, -1793, 192, 1930, 2354, 1375, -34, -1762, -1831, -1190, 401, 1533, 1700, 1218, -326, -1682, -2212, -1354, 183, 1688, 2252, 1692, -296, -1914, -2546, -1375, 691, 2115, 2192, 1088, -770, -2131, -2450, -687, 1191, 2122, 2154, 514, -1204, -1782, -1649, -365, 1005, 2078]
2516B078l56j061j475j212j6J271J825J035J47j711j682j408N79J835J696P48
2532B293p44j597j723j02M01J653J484J25o36j453j213o05Q06J154J574O57p54
2549A320j462j443m76M76J787J480N66q05k045j322k85J176J940J120j30j374
2565E23j498q95Q3J242J835O12k69r95j377q34k57J092J536J085j36j121j756
2582a130q10P8J048J852J254k00j995j516p49P49J585J378J29o20j319j196m34
2599a896O20J335Q66Q86o35r64j640j91K91J464J260N96o93j325j658r85J420
2616a249J781J437K45j227j859j174L09J344J412N00j5j016r25j375K82J047J063
2633E80Q52n9p24j394j153J1J139J476J095m2j084j725q88M21J416J380P19l96
$$ y = [2078, 1722, 661, -814, -2026, -2042, -771, 1054, 2089, 2236, 525, -1157, -2565, -1986, -151, 1545, 2293, 1549, -48, -1771, -1873, -1472, 181, 1665, 1790, 1154, -299, -1512, -2117, -1311, -157, 1417, 2074, 1320, -142, -1585, -2061, -1585, 202, 1682, 2248, 1443, -602, -1924, -2209, -1033, 907, 2027, 1897, 523, -975, -1870, -1787, -545, 1290, 1902, 1633, 638, -739, -1573, -1830, -738, 798, 1883, 1747, 626, -1130, -1940, -1862, -814, 1038, 2292, 2092, 97, -1419, -2168, -1419, 166, 1544, 1673, 1053, -266, -1462, -1896, -1276, 59, 925, 1811, 1176, 212, -1428, -1619, -1328, 136, 1396, 1992, 1299, -26, -1684, -2669, -1249, 532, 1969, 2214, 987, -872, -2046, -1737, -393, 1019, 1519, 1504, 488, -437, -1812, -1530, -483, 580, 1432, 1373, 649, -745, -1898, -1887, -748, 728, 1823, 1781, 697, -1028, -1916, -1495, -79, 1301, 2020, 1624]
2651A624j784j450q4N99J527O45N53q66p71j105q38O76J108J181P21k18j429j474
2669a385n90Q23J475J473Q1r12j555j240q4J179J536R11J7r51j666o49r1J007
2687f21J585L25j15k41j272j126r3J224O31J136L74j162j229q35k94J566J344
2704A197P32m10j559j108p27O81J174J336K26o63q59j445l0M62P42J134J99j5
2722A067q89j126q23N81J393J180N35p70j294j351m72R69J418J154J30r45j446
2739f89p89Q1Q86J103O85k20l79j158m12k15O63J048P49K55p02j431r85j20J096
2758e34J273O09K01j049j475o43R8J201J419M98n41j213p29o89P52O47J163N38
2776A526l84r76j050o25L97R94J056N24l05r65j258p19N76J673P33M70o86j609
$$ y = [1624, -160, -1610, -1694, -1095, 432, 1077, 1630, 764, -7, -1112, -1950, -1274, -166, 1015, 1736, 1518, 89, -1385, -1975, -1152, 323, 1796, 1877, 965, -590, -1830, -1914, -735, 801, 1712, 1729, 778, -888, -1537, -1628, -621, 964, 1289, 1174, 933, -339, -1465, -1558, -334, 297, 1433, 1807, 645, -584, -1419, -1713, -147, 1197, 1929, 1519, -40, -1148, -1875, -1194, -20, 1316, 1542, 879, 20, -1425, -1455, -993, -251, 883, 1082, 1067, 178, -948, -1771, -1190, 203, 1383, 1918, 1148, -146, -1497, -1969, -1000, 418, 1572, 1702, 757, -689, -1478, -1397, -511, 592, 1277, 1057, 678, -480, -892, -1107, -444, 604, 1353, 1608, 906, -525, -1510, -1630, -534, 739, 1348, 1549, 500, -975, -1618, -1520, -319, 1100, 1598, 1057, -156, -885, -1574, -822, -175, 988, 1526, 1142, 166, -884, -1509, -1112, -118, 938, 1462, 1157, 192, -1066, -1785, -1209, 464, 1197, 1667, 981, -628]
2794f28r18r0J019J242P93q8n69j281m40k88O54R24O95J63l97j062j052n0Q16
2813e57J058J086j47o43j499j093J84J399J360O99n57j218j140l82M61J242P42
2830I95K98o37n44o60p37M49P43Q96M70K51j588r36l74L13Q50J456K23m40j520
2849d92q95j64O85J226R19N8j034o49p38j39N50J384M09p3l00q58o15n07M38J080
2869B85O18M10p93q99j133K98P23J245P24j23q59j321n19N11M33J492K64o55q77
2888a76p27l18M78Q01N60K86J78q18j038m60j7J168J176L37l30j195j091k30N66
2907h50J093R30L34p95j272q97M95L55J286N77k96m54p39r08K77K22P78O85M62
2926A283k46j142r05l65Q18J252Q45k4r26j405o65K37J316O32N69j39r09j079
$$ y = [-628, -1546, -1636, -617, 625, 1418, 1330, 761, -520, -960, -1248, -594, 330, 1025, 1188, 791, -271, -1323, -1373, -557, 501, 1587, 1440, 797, -702, -1795, -1611, -212, 1148, 1847, 1290, 72, -1068, -1450, -989, 253, 995, 1293, 656, 112, -548, -1285, -836, -93, 803, 1273, 1524, -64, -1000, -1374, -1061, -211, 1245, 1468, 1028, -492, -1387, -1551, -866, 360, 1279, 1337, 303, -346, -1084, -1223, -673, 711, 1120, 1047, 747, -111, -726, -1233, -795, 285, 903, 1313, 520, -379, -1512, -1214, -491, 754, 1478, 1355, 496, -825, -1344, -833, -400, 1092, 1356, 701, -176, -903, -1221, -743, 58, 618, 904, 1082, 264, -774, -1234, -1251, -83, 1093, 1430, 1100, -95, -1186, -1416, -850, 243, 1173, 1507, 712, -560, -1457, -962, -607, 679, 1256, 960, 506, -233, -1141, -864, -642, 136, 821, 1283, 1037, -105, -1010, -1375, -557, 695, 1540, 1516, 590, -815, -1480, -1243, 73, 705, 1274, 1135, 226, -853]
2944h53j74J57P50M70Q29m13p44n55n31K28N30P61Q75j58j277o86k55M6R06R93
2964H99O76l64j389j197l5Q35O40J047q1n11q92m43j90P38N50M39L38q18p12n50
2984a020j04O87O68O07M32p63r42j066O7J046R74P63j78r70j016l07J93R04P14
3003F89L45k30n23o93m51M89K59P62L14l4p11q46p48J59J163J023J05k15o13j418
3023a174j65L75J024O90M72o82o95o94r5M25R75L12L78m06p03p96l05M95Q80N28
3043H39J70k92p90j184J51L89J054J011k20r09p77m90K08L51J231L59j70r07p03
3062f79l05Q6R91N19K95j40k75j165O1k70P05N14Q64J6o79j427j03j4J088P29
3082H11M60o15o88r45J6K74Q93Q20k22k20q16l88j84L22O59L31M23j42r57m04
$$ y = [-853, -1027, -870, -120, 350, 1179, 766, 22, -533, -1064, -836, -306, 455, 1330, 1172, -105, -791, -1046, -1000, -94, 899, 1575, 1211, -178, -1375, -1410, -575, 65, 1112, 1031, 520, -372, -815, -1005, -267, 283, 722, 1060, 242, -470, -1020, -1124, -437, 231, 838, 1270, 507, -435, -1501, -1434, -388, 586, 1349, 1171, 201, -815, -1122, -929, -25, 689, 1034, 804, 281, -412, -863, -374, -115, 647, 961, 927, 216, -630, -1378, -1219, -56, 967, 1072, 857, 244, -1174, -1339, -964, 60, 750, 1222, 540, -155, -849, -944, -519, 456, 768, 1146, 740, 37, -759, -1064, -569, 311, 839, 1009, 717, -73, -1257, -1106, -717, 337, 1348, 1128, 219, -558, -1048, -840, -489, 742, 1101, 931, 24, -679, -984, -898, 93, 612, 907, 767, 492, -673, -612, -882, -177, 337, 1201, 1217, 538, -889, -992, -1006, 82, 811, 1271, 656, -32, -977, -961, -687, 206, 1026, 804, 584, -232, -620, -804, -482, 177, 508, 931, 789, -168, -572]
3102e72k94r0J150J141J43r61q81q06K63O46N96R37l29q20o13m69J12N91P66K69
3122G79N8r46j65p00K86M69R08P4O4k56j175m85L47O67Q51L74l77q49j031k57
3142a364N96J029M40L68o09o94m95k63O05O44L36L69l06q34m90k38P09M06N02
3161G11J71k03q25o74K7J91O83R66n3m38j062q69L49O82P50N10l16n64q77j04
3181i45J20L95R10L67j15n37p90l64L26M59Q54J65J15p94p81m49K79N27J081l
3201H20k0q11p00J57K78O82N9L83l59o57m00o9K95M01L35M03l94p47m42j35M77
3222d44O61J015l73o60k98q53J0O55Q45K30J39p32q04J7j91O00N41N42k89n96
3242A5m14m2j85N29O61L24m79k76n16m83m9N62J029L04m77m15p10l32L15O11O48
$$ y = [-572, -866, -956, 194, 1335, 1478, 517, -364, -1170, -907, -261, 335, 1272, 943, 123, -490, -959, -847, -256, 510, 779, 837, -109, -274, -974, -688, -219, 689, 763, 827, 571, -604, -1089, -742, -75, 776, 1150, 773, -76, -1107, -1364, -768, 261, 701, 1069, 460, -234, -729, -992, -387, 257, 593, 962, 656, -178, -668, -906, -197, 209, 711, 882, 679, -146, -820, -793, -602, 81, 1047, 994, 556, -506, -1375, -1026, -344, 406, 916, 600, 36, -841, -945, -825, -430, 480, 847, 732, 195, -595, -959, -633, -174, 680, 845, 960, 166, -615, -1064, -785, -258, 823, 820, 800, -11, -711, -554, -276, 406, 465, 848, 489, -168, -568, -637, -342, 59, 394, 797, 403, -344, -786, -921, -444, 217, 1232, 859, 199, -99, -952, -942, -287, 558, 788, 927, 195, -609, -592, -783, -183, 358, 900, 611, 15, -399, -441, -626, -97, 564, 888, 409, 133, -383, -866, -915, -353, 676, 980, 503, 88, -622, -954, -639, -28, 620]
3263F20K61m39m96o22k31L77Q45K08M33o00k52m80n43N72P1J107M3j92j226Kl85
3284i27M81J027L71q5m20n99o62oQ11L68J87Q0m38n81l45L0L09J006L98l11l97
3305B97o84l74QO81L95N14K81j044m67j66J16M88M84M77m68p48o02K31Q9P23N66
3326G97o5m17j70n32j76P7N60K24L93k62n14r83L28L70O08L02L8l55n38l61k6
3347g02O51N46J24o1k76p17l31L29J37P76K20O9m06o48k3k45L16O84K34K59o79
3368B57o58l49J56L74R21J56k14q63m43p3M14M77O28k02L2n52p56K55r9O48N24
3389F33K15l72n24n23l89O82M03O83p8l72n11n16k9K02O71N49k63k96o09j19j28
3410f91M73O09J58K61o07n27j39P7J92N79N11l88k86l85p48J14P49M58L51k87
$$ y = [620, 881, 442, -54, -676, -907, -530, 315, 523, 956, 356, 104, -376, -919, -347, -276, 831, 874, 682, -544, -542, -927, -446, 581, 952, 867, 447, -152, -814, -820, -9, 359, 546, 626, 188, -393, -738, -708, -399, 607, 1005, 694, 297, -387, -761, -753, -72, 323, 837, 1118, 74, -393, -559, -443, 45, 529, 1006, 538, -210, -812, -581, -492, 231, 797, 732, 315, 145, -387, -563, -486, 74, 298, 691, 429, -85, -1068, -740, -370, 238, 540, 578, 223, -315, -676, -702, -51, 495, 619, 558, 282, -435, -766, -437, -300, 476, 696, 765, 359, -289, -312, -557, -241, 443, 677, 936, 257, -401, -750, -594, -220, 701, 857, 643, -220, -663, -736, -322, 155, 783, 581, 613, 61, -695, -440, -539, 109, 633, 848, 476, -48, -571, -960, -278, 125, 808, 730, 358, -153, -669, -698, -496, 175, 724, 461, 165, -444, -563, -691, -218, 391, 549, 810, 203, -324, -463, -386, -194, 385, 896, 508, 222, -163, -911, -797, -48, 410, 761, 474]
3430D74n12k90n24M36O86J59O1R6r69n0l92K88K77R06j20j69l64m47j69J80K21
3451b22P24J72m82j43o18k68M35O68K97Q3m85p71R3j99L63M79N55m63l06j02m60
3472f50M6O06M55K67k18k56q84q4K96J54O53K54P0m62n50k47K4N57O59J67l22
3493E35n51m11m39K20N98L43O65p47k86k25k49j98J085q7O33m92o04l13l28M91
3513c60L14O85L37m15o46k13l61j1P66N03k75n5o92k52K7P10L3P99m46m11K50
3534B87r63m3M06O36M78j98m64n38r3O9J68Q15j41J65l22m19m55l00P38O84o3
3555D47O7o36l01K2l05Q06L63J78l07j55q93k2N57K32M14J60j51n21m37r8L40
3576b40K80N35L1j14l32m23q3J42L41N71k14j43o48l10J33j04Q35M15j86l64l60
$$ y = [474, -38, -328, -852, -416, 270, 429, 490, 586, -383, -433, -825, -537, -260, 646, 526, 357, -7, -454, -623, -443, -222, 502, 674, 192, 49, -569, -837, -402, 266, 563, 646, 161, -610, -517, -716, -353, 126, 681, 218, -88, -190, -650, -604, 2, 457, 724, 506, 250, -634, -718, -422, -268, 385, 639, 709, 247, -303, -550, -526, 31, 690, 857, 535, -16, -427, -866, -646, -48, 295, 960, 213, -73, -298, -547, -745, 340, 253, 886, 394, -210, -523, -851, -360, -46, 639, 976, 561, -85, -298, -659, -670, 96, 599, 324, 269, -423, -675, -648, 62, 95, 894, 448, 37, 287, -676, -719, -313, 323, 801, 603, 139, -399, -492, -423, -255, 560, 419, 584, 262, -157, -612, -912, -174, 510, 447, 514, -122, -423, -401, -706, 100, 463, 641, 334, 179, -714, -736, -179, 53, 467, 627, 476, -45, -482, -580, -240, 40, 575, 606, 492, 160, -263, -346, -204, 137, 708, 494, 351, -297, -607, -474, -578, 257, 672, 486, 122, -238]
3597b38l66K60KO68m6L85n84m70j26L18o5N78N37k32l90l98n66J85M75M29K73
3618F29n02m8m83j58K53L10K87L38l56p31m24L15J35P65j34K25m6o87L0j40K62
3639a60j48R80j53k06m19l82j51O83J88L43j47k98j85l72r4M07P54k82M1l35j35
3660g1n46L41M3L73K52Mk73o31M0J11K23O30R6k1p67r6l24J23P21pN76n72j07
3683A18n45p2J79N94K47l10J3l07m92K13k07O16M55K2k11l54m75Q2K86L32K50
3704D34P2l9o17j33k38L78J94M17L33n28n03m42m8Q21J25J74pn4o32k57K97K14
3726c9J34K64l28J03m90J51r7K60M94l86K19j66o24J21J6P05J3K62j74r49O7j51
3748e95Q3K97M16N20j60m57n35O1L45L70L58Nn87m71P0j59J78M43J77j76p1Ln66
$$ y = [-238, -604, -344, -342, 326, 280, 665, 81, -389, -515, -197, -262, 316, 853, 621, 231, -167, -733, -548, -73, 356, 629, 127, 79, -404, -562, -309, 1, 288, 626, 270, -461, -885, -570, -435, 330, 196, 421, 375, -312, -282, -422, -160, -308, 672, 519, 313, -106, -488, -639, 44, 232, 575, 428, 130, -55, -427, -521, -114, 640, 358, 399, 64, -71, -617, -276, -233, 140, 392, 396, 123, -508, -468, -357, -134, 496, 592, 571, -196, -292, -616, -493, 228, 221, 797, 225, 118, -427, -499, -320, 274, 521, 211, 224, -83, -575, -362, -569, 47, 502, 524, 313, -41, -516, -434, -148, 184, 434, 506, 467, -150, -283, -521, -143, 51, 468, 801, 273, -230, -672, -720, 101, 226, 400, 393, 339, -293, -550, -253, -39, 95, 359, 31, 134, -356, -205, -302, -42, 452, 66, 285, 119, -505, -384, -368, 337, 350, 612, 438, -511, -444, -595, -512, -215, 201, 721, 561, 104, -431, -370, -25, 345, 703, 708, 121, -350, -280, -439, -261, 182, 359, 183, 112, 115, -451]
3771d51N6M32K85K85k98k9m11l98J81N64K74m9j56M2m92q5L2K92j00K28J97l88
3793A1l15o8J27L76m4M30k60l51m68J54J51M36J81L00l99n00o4M8J8N76K62l40
3815B61k25l49k76L26N5M98J62J41k60j88o10k21N05K57L54J3n66J1o27J00N40
3836i9J02N6M95k50q82J11M35J30L35P8R8n83k74p0oL63J35M58k18n83m32J43
3858d58P6O66J86J10l01j95k69k56L43K43L75N4l19l70o4j97l3M99L24Nj30m42
3880a53k92K23o8N34j0K07l16l25Nj28M29K2L11lj97l47n17J69M56K31L00m58
3902G3J11o07p3J0O52L80k79K9m53K7l39L36K91L7M05m34l14N0o42O67L0M37P3
3925D67q5n10j58%J54J23L50K84k49m46l28j3j91Q66L20j40k52n15K70j23j24
$$ y = [-451, -395, 37, 322, 607, 309, 280, -131, -529, -348, 216, 490, 441, 285, 327, -165, -250, -218, 74, -26, 202, 399, 11, -304, -372, -245, 131, 87, 517, 257, -94, -562, -408, -257, 179, 360, 660, 261, -239, -303, -255, -237, 339, 601, 261, 36, -313, -589, -263, -208, 290, 452, 593, 333, 145, -465, -686, -181, 76, 430, 443, -123, -112, -739, -639, -99, 3, 59, 554, 304, -578, -467, -32, 98, 433, 511, 609, 26, -248, -318, -324, 39, 174, 632, 414, -169, -601, -458, -382, 284, 470, 580, 279, 84, -185, -441, -98, 145, 520, 574, 255, -115, -179, -376, -409, 90, 414, 419, 289, -153, -445, -222, -290, 244, 234, 441, 125, -200, -195, -323, 106, 128, 439, 436, 239, -108, -625, -456, 0, 231, 531, 73, 184, -423, -496, -486, 166, 546, 267, 296, -157, -130, -469, -133, 158, 195, 600, 166, -148, -98, -740, -73, -43, 394, 467, 382, -128, -286, -286, -132, -9, 341, 625, 376, -70, -398, -411, -602, 264, 584, 444, 192, -323, -53, -176, -300]
3946c00N16J24J02m85j59r5J55j4K54L71m42L2l17P1j67N22R0J06K3m64k99J23
3968b53J18K47L53J89m54n5l82q4L4L34L51K92n18l03j59l09N15R4K67J13j55
3989B35l76k23j01J52N46k3k63L12k41m34n6K18L60J07J25Q1n29j39N8M6J81N72
4011F08l00j23m97J36l5J20N41j8m01Mk56k20K66M2N72n6J37m55l76J08j51L98
4033D4K37J41l44p4k16jm8K60L55n2j02j82o00K02O6L59J56M06m53j30l85n7Q9
4056c29N28M40l20l17L0k64KL32k54N60K06o46O1n26K6L39L12J38K9n82O4P8k14
4079c07M00o4L57k33j10k24j16p9L83J19K00K36m34n41J57l2K14L33m4l25Q4l50
4101c76j4j11N38M09j55k11k88k06J30r7L59L20L71n72l00k34J4J10L92P30p99
$$ y = [-300, 216, 340, 442, -43, -202, -297, -142, -156, 98, 469, 27, 59, -258, -187, -354, 168, 258, 364, 387, -77, -376, -253, -135, 112, 465, 654, 200, 145, -237, -321, -287, 47, 398, 690, 172, -131, -290, -599, -84, 10, 277, 390, 235, -141, -364, -465, -313, 233, 210, -53, 259, 18, -416, -472, -254, 106, 213, 338, 419, -110, -249, -191, -145, 36, 608, 308, 185, -312, -176, -211, -91, 450, 432, 31, 35, -221, -441, -175, -133, 439, 383, 520, 65, -311, -203, -354, 44, 281, 422, 78, 4, -212, -213, -261, -1, 354, 302, 200, 18, -582, -380, -314, 45, 201, 607, 154, 24, -361, -418, -329, 199, 639, 319, 2, 32, -232, -230, 102, -152, 408, 614, -32, 29, -497, -471, -132, 180, 318, 347, -235, -171, -93, -307, 93, 29, 386, 153, 43, -181, -297, -376, 7, 126, 326, 562, 128, -413, -256, -288, -74, 259, 215, -110, -26, -376, -390, -501, 37, 446, 291, 80, -208, -414, -284, -381, -22, 298, 669, 97, -203, -437, -423, -313, 79, 809, 10]
4122A0N6j23l82K15J45K23P1K0k52j54o1M4J26K59PL9j45l39j77L32j33K19K94
4145B94m0l37l6k03K03J41K98J00l77j37k61Q6n7L38K59j43j9l03O7k60N19j33
4167aK10M98p53Pl06r4J70K69K89K16l38m17M7k29L39K70J3J19k45l19K36n27
4189e46O59K8l6L80n48K6j31j79N36l1K56j12k43k18n4m1J88K68K86j16m42j35
4211b05k77K19M10J60J7J75o95o3j2K30j44N43p5jl88j45l7K51K86J6M1k66k05
4234a65J55m7M7q3M15R1m67K01m63j7K68J74J64K36l59k98j42j83J26J44N60j90
4256A67j30p6j02J0K90l1j42J60k08M8j61K1L48Q2Pl30K36o26r7N51L4K74p2k44
4280Il1m84M16J65j04L00k27j04K6l64J09L43M2L34J22p92mm3l7J70N56r5O7l57
$$ y = [10, 66, -57, -439, -224, -79, 144, 215, 235, -17, -171, -232, -188, -62, 197, 204, 243, 98, -241, -418, -86, -219, 0, 294, 254, -83, -119, -322, -119, 22, 320, 420, 43, -94, -355, -269, -326, 12, 271, 128, 109, -194, -127, -387, 132, -1, 209, 707, -46, -39, -345, -439, -269, 0, 289, 505, 167, -250, -203, -432, -93, 177, 190, 309, 64, -255, -19, -546, 113, 141, 105, 485, -63, -37, -168, -347, 189, 158, 414, 302, 59, -159, -213, -254, -66, 202, 488, 372, -70, -205, -482, -263, 147, 307, 324, 499, -196, -259, -271, -41, -185, 358, 283, 282, -106, -251, -288, -37, 249, 265, 306, 40, -165, -10, -57, -10, -93, 322, 413, -54, 147, -316, -333, -65, 109, 273, 509, 150, -148, -290, -473, -347, -203, 357, 167, 37, -39, -141, -131, 159, 128, -14, 146, -62, -14, -175, -154, 194, 276, 283, -47, 189, -437, -534, 17, 51, 325, 253, 9, -22, -506, -90, 75, -29, 271, 44, -60, -34, -398, -289, 54, 96, 430, 552, -240, -244, -287, -324, -154, 402, 307, 374, 17]
4304A7J24l56j19P8L35j7L91n93j08q0J00r3N17o0L29l18l12Q7j69r0P14o2m3
4327B72j79j29k86K33K83M5jk63j17J44k74M3P8M09L11j23p38J62nJ35l4J26k8
4350F4k77OPo9J47R5O1N7J60k62r3k27K44L80j12J9j19l35m8K14K2J28mR3k65
4375a14k82M53L0j83M96k05oq6l89J42N1N0J49J61n00r5N7J9J65m3L12J14m6l27
4399g7O2k53J52K50l4K55m06q4o5j34M82k30O79l92k02j15p0P5J10J50Q7j5l17
4422i2L71l90j72J74mL10K72m91k53J44m6N36j2j22J61m40k76R9J54J99O6Q7k49
4445B6j43J6j14K51L5M3k62L7J25l44K27n4L99r9L7J15l07mj20j8K63J95k68N5
4469I1k59Q1p4k5M06K06m28k22J67j35k67N84R3mn4j14k87J75M7L5L14k97K8N2
$$ y = [17, 141, -215, -334, -256, 79, 62, 453, -140, -248, -328, -228, -321, 196, 136, 465, 147, -165, -78, -247, -337, 377, 315, 272, 93, -36, -322, -89, 194, 239, 238, -25, -142, 2, -272, -229, -151, 258, 569, 446, -292, -130, -135, 0, -34, 92, 64, -213, -207, -200, -269, -122, -27, 34, 91, 251, -11, -104, -331, -87, 293, 181, 200, 81, -254, -302, -88, -66, 62, 58, 151, -114, -396, 57, 87, -96, 400, 195, 189, 103, -286, -144, -93, -43, 106, 267, -233, -328, -271, -252, -87, -130, 182, 296, 250, -77, -15, -268, -116, 134, 100, 355, -51, -135, -200, -334, 148, -82, 597, 205, 3, -112, -182, -107, 3, 153, 240, 225, -92, 279, -111, -283, -109, -113, 197, 469, -22, -275, -131, -177, 359, 347, 225, 386, -54, -330, -231, -77, 122, 188, 275, 26, -117, -101, -215, 36, 71, 114, -148, -111, 14, -330, -103, -157, 242, 143, 180, 295, -12, -16, -136, -154, 109, 304, 36, 91, -168, -87, -161, -186, 220, 426, -2, -224, -57, -192, -459, 125, 218, 214, 160, 46, -241, -66, -19, 16, 330, 33, 61, 113]
4493A13m25J43J19R6PL49P2l54k72j3J19o3L59O4K56n22m95J68M8P34j48j81p
4516A67m24n5K62j00L47j25Q0K05l37q6j88K05j64K57K92n21K98k51j34K16j13
4537a69K02j19M7J29m08L13m2J46M23n93M28l54k93J27J26K00M0j84p4J55j50
4558e0K16j76J85K09j55r3n26j38N67j94M45j41R8k27j80rl26Q28J11m35k2j06
4580a19n8O6o6J85K81l77J8O7k82J16J8K75K30q9k31j86j26K90k02J10K91l0P6
4603B57m79J02k7M8L15l5jl78M78o20K10M7L67J94k40k21l80R4j83J12K93K59
4625B12j69J62j84k27J40mKO17m73k65j48l5P0J73M66k22k79mj6m9K36l7K40R2
4649B98l15j67j25J29M24n8J4j3j2l15j21l2J54M62l00J24l59n6J82J95j50J98
$$ y = [113, -312, -169, -50, 46, 53, 402, 474, 120, -152, -165, -46, -109, 250, 314, 570, 48, -447, -279, -231, 503, 355, 174, 167, -257, -312, -50, -150, 197, 72, 152, 357, 20, -66, -254, -49, -213, 44, 336, -185, 113, -138, -272, -56, -169, 33, -86, -39, 90, -318, -5, -47, 99, 522, -71, 357, 3, -290, -163, -37, 163, 203, 19, -55, 100, -50, 166, -10, 175, 384, 229, 136, -390, -528, 39, -155, 290, 149, 247, 20, -160, -169, -495, 333, 444, 9, -13, -119, -177, -111, -177, 8, 289, -88, -70, -3, -285, -169, -151, 124, 354, 265, 34, -152, -278, 12, -190, -80, 211, 181, 257, -222, -120, -147, -99, 216, 181, 180, -198, 280, -340, -130, -83, 284, 478, 238, 17, -363, -269, -452, -340, -47, 212, 43, 205, 21, -206, -66, -70, -68, 549, 76, -189, -337, -372, -302, -129, 337, 115, -164, -168, -184, -233, 3, -34, 206, 298, -17, -184, -309, -180, 244, 186, 200, 187, 175, -140, -261, -293, -139, 323, 23, 147, -212, -268, -86, 109, -41, 157]
4671A57j32J50k35l04J07j50L85k3k1N34m37k26J43l29L25J32K21J07k15l63K06
4692C2j80K17rm0K56k76L0k51O53o26L46K5j28k67j90L5J39M85J17r3k15j41q4
4715a65j49K74J08L3M99n96o8k87M4L69L92l2k16k86j28Q8m2J81K90j05o5k94
4737a55J41k00j00M12j07O0N3k75nk2J1M36k57N64k23l16o4k04K58J42k37N97
4759E09n92Q4m5j3j7J68jJ70l90P5k84M23k21l7Q9J98J15m90O3J11j72K47K92
4782B82j40j76J65l32J57O0J95Q1q1l26j62O2M7J41N2J13l41PJ52j39q4L05j51
4805a13J98k16J32j79K11J1J37J49k78K4j37r5K07Q0oOJ65l4k62k31N2J92K74
4828B87j52qL48n97J2L34j7l09m7R8J58m58j78K94J14n7N03J17m83k3k65P5Q0
$$ y = [157, 25, 175, -60, -364, -257, -407, -22, -45, -66, 468, 31, -195, -52, -381, -56, 76, 297, 404, 189, -174, 32, -148, 69, 60, 20, 276, 0, 30, -221, 432, -194, 152, 177, 49, -218, -408, -373, -234, 251, 368, 275, 60, -81, -165, -314, -40, 68, 101, 600, 4, -64, -351, -307, 62, 454, 422, 206, -80, -208, -120, -162, 19, 309, 204, 139, -155, -14, -214, -314, 98, -9, 51, 104, -171, -176, -198, -187, 249, -8, 556, 333, 17, -47, -251, 7, 149, -88, 509, -83, 1, -44, -57, -74, 94, 93, 263, -127, -52, -336, 87, -134, -171, -82, 116, 231, -259, -196, -85, -257, -10, 282, 142, -34, 131, -201, -44, 16, 211, 292, 211, -115, -277, -215, -168, -27, 25, 138, -203, -196, -44, -183, -267, 38, -113, 85, -131, 1, -178, 33, 44, 181, 330, 52, 76, -61, -156, 51, 131, 125, 131, 296, 262, 0, -231, -179, 13, 287, 135, 127, 475, -122, -110, 224, 207, -102, -149, -51, 107, -351, -529, -235, -121, -178, 325, 442, -41, -64, -329, -254, -174]
4851a74P69n69L91n43j01M1M07k83K36lJ35k28Q3m27K33K34Jq4J81j24k15l87
4873d27J09K08L14k30l1R6l76R1K07K11k9p0L7p2mk23LL12mj51k9Nj38K94j25
4898b2K40k25P6j66r5k06L91L20j06l3M2n3k23Nj49M10J01J0jk36q1j95K31n1
4922a6Q6K52N4k16j44l02J06M5M79l08k19P9J28l4j42K79O7k0p4l9Q4l01L90j26
4946A08J1K6j02l43K0pK44J84l65J69K10n05N17k39J38K8J13p5j78j74k1K71k33
4969b03J49L1J44k8o7l46M91k45M06k3l15K01k77q3L1J24L06k85j49J9K44L0j62
4992gL28j08j27K39l98j65K92m7j56J66J46J01j66l38J72n4L90L7l32N4J60m72
5014b85p6M26%k42L40l88j9N6j13J50K17M5J2m7k10N41m31j0L20j72J7O4Pm19
$$ y = [-174, 595, 26, 417, -126, -227, -186, 221, -62, 174, 171, 306, 78, 161, -266, -33, 201, 202, 118, 299, 175, -40, -427, -318, -110, 204, -26, -57, 39, -337, -246, -39, 172, 143, 73, 110, 38, 34, -189, -186, 126, 122, -29, -58, -53, -191, 103, -22, 218, -7, 69, -97, -192, -398, -7, 313, 207, 174, 216, 163, -60, -55, -204, 206, 307, 317, 316, 80, -1, -196, 35, -16, 70, 322, 376, 160, 16, -286, -180, -135, 344, 36, -183, -104, 24, -10, -152, 127, 194, 174, 100, 61, 145, -156, 234, 108, 119, 145, 43, -300, -280, -287, -43, 141, -224, -55, 155, -350, 167, -72, 66, 94, 207, 132, -46, -220, -241, 30, -203, -54, -23, 121, 93, 26, -320, 171, -74, 332, 309, -6, 195, -82, -165, -134, -10, 296, 11, -138, -119, 125, 155, -7, 321, 213, 86, 325, -73, -238, 54, 7, -149, 17, 163, 264, 98, -240, -68, -122, 268, 305, -27, 27, 187, -285, -361, 65, 65, -177, 163, -225, -244, -188, -301, -151, 66, 111, 123, 76, -134, 407, -24, -34, 286, 114, 131, 195, 202, -217]
5038b17r6J14l8L53J69n24M3J44l7K53j78M56m23j09M4j36L40j7m6jn3k62j21
5061c42j16N58O2j16m3j57Q5k02J73J21p1NN2P5j02m92N51O6J42j79R3j80o0o
5085h3J04j14K61j02l3jj69j45K53J2K89j11k8k41l31M75l05k4K08M86l31j24
5107e4l8j68K42j91M07r3k39k1p3p3K48K16j98K10m03J63q4K32j79J43K50k21
5129G6j89J4l8O4P2J5l7J81k99J26J06k9J65Q2k54J0j15r0P6k91N99l35J44j5
5153C8k80M52n50K33J95J20q7j50j10J24P0Lk46N08k97R2j89j61O0l23N03K78
5175B83j08o8M1k47k87R7L69j01N1k48K17r9j31K60j11K63l8o0k1q4j91RJ15M37
5199C48l55j3r6r2m0M55r7J2k5J16l20j80M21k82M12R1k10j44J68m75K69J70j45
$$ y = [-217, -313, -199, -237, 116, 285, -239, -196, -52, -89, 164, -14, 442, 19, -90, -46, -182, 158, 141, 95, 94, 41, -221, -342, -458, 100, 162, 46, 3, -154, -69, -271, -98, 23, -48, -43, 9, 84, -18, -510, 41, 107, 249, 70, 163, -17, -77, -83, 21, -93, 168, 66, 33, 32, -137, -282, -29, -17, 272, 161, 133, -108, -439, 36, -269, -293, -85, 401, 70, -54, -92, -260, -18, -209, 198, 105, -134, -155, -228, -301, -53, 163, -35, 175, -228, -65, -149, 83, -96, 47, 297, 76, -113, -99, -137, -73, -1, 14, -23, 158, -141, -15, 91, 62, 227, 309, 55, 65, -50, -140, -64, -355, 244, -91, 53, 38, -242, 210, -340, -107, 88, 208, 121, -29, -139, -15, 55, 58, -188, 320, 23, 115, -74, -235, -175, -498, 5, 283, 175, 107, 148, -99, -386, -289, 80, -21, 30, -218, -1, -100, -231, 29, -82, 181, 143, 83, 62, -22, -213, -204, -89, 348, -7, -20, -116, -208, -248, 207, 110, 122, 97, 213, -107, -287, 134, -148, 264, 355, 145, 1, 169, -306, -37, 133, -12]
5222a2m0J74PJ06m10Q7J36q0J54n0j30P9J9j28R6K71j71m5K6Nm0p9J6o7J95k20
5248a01J46J50j20L25m31j6K54l12O1Q6n61K12K77K88q8n17M78K45l89L05K3k60
5270E5J12r9k67J27q6k0K93j60L20j69J55j89j50j7K82l7MK6l92Q0q3K07M7l2
5294GM4K52k56k55J77Q2j54L79l42l29N10n0l2J53J5j43q0p0o3N1K05k10L72k23
5318D0m15K74J02K04j20p9jj29L78l06l2R9m84N00J7Jk92L46l03J92O7K5N11o07
5342a2K14m61K94N7L1J4j76k30K93l65j09L83Q1K93j98J9l16J20O0K8j59L81k92
5365e0n2P8o9j28Q9K23J78l30J29j71l53M63Q4j17k11K00K56m85K12p0j3K82O1
5388B06k59J06j13L69j75J62l92K64K65m40L22o12K34j12PL57j29J23j1m16L1
$$ y = [-12, -52, 122, 129, 235, -175, -88, 48, -32, 122, 72, -58, 21, 40, -88, 8, 279, 108, 63, 89, 94, 54, -25, -9, -76, 119, -101, 45, 195, 75, 400, -31, -47, 207, -105, -44, 42, -519, -307, -30, 258, 170, -347, 131, 376, -13, 292, 315, 55, 167, 68, -199, -72, -158, -178, 115, -45, 275, 106, 261, 72, -78, -95, 187, 150, 154, 180, -212, -132, -215, -8, 39, 7, 51, 303, 47, -208, -31, 51, -103, 276, -66, -395, 115, 65, 33, 186, 201, 58, -22, -92, -155, -104, 101, -109, 263, 40, -375, -101, 1, 205, 85, 6, 5, -124, 254, -52, -84, 15, -469, 31, 48, 49, -243, 103, -200, -8, 59, 84, 595, -12, 202, -259, 35, 92, 123, 137, -39, -269, 24, -341, -450, -67, 14, 307, 109, 128, -188, -68, -8, 20, -139, 242, -50, -102, -24, -93, -221, -132, 91, 269, -61, 68, -103, -456, 7, 91, -26, -237, -37, 219, -266, -54, -124, -137, 145, 206, -53, 53, -60, 309, 134, 296, -96, 168, 433, -7, 315, -297, -63, -175, -168, 189, 60, 183, 172, -244, -213]
5409b13L62N7n0J26j57j24j71Q8R7J31J38k42Pn9j52k11L41M0J69k96j21O9j30
5432c01J35J43K23R0j57j64o8j29K70j87K08J81m2l21m3j16L53j32K36j02J39
5453B16l76K13k79K77K24j40J74k66j49K5J97j42K30j24N2J20m13K65q0k36Q7
5474a25J96j51l5J94k76J29N02l58j32L03k65K06n53L47Q2K33j27k38k2J65j54
5495g9j48K5L88l42M94n79q2p2M25L30k83k21N59m74k05r1N40O1l51L21m07R9
5517i2q1l9J28K96p7j0o9J17j08k04M37k19l4N7m64J55K83j96M00R8l57J0o6J
5541c4Jj56J05O8L22l93J1O4j26L4J94oj06K01m18k2O1L46J02j51K63n83L32k16
5565a07K88l07N4K0K43J59l57J15k16K70n7k4ppj33k3nJ68K19m5k05k39J46k39
$$ y = [-213, 149, 206, 156, 282, 125, 1, -170, -82, 15, 146, 284, 42, 49, -10, -162, -373, -32, 8, 177, -119, -240, -171, -301, -166, -23, 200, 290, 133, -31, -99, -228, 42, -145, 63, 244, 202, -119, -162, -278, 75, -57, 179, 77, 216, -160, 53, -226, 51, 275, 135, 309, 43, -106, -81, 116, -26, 204, 80, 132, 252, -161, 104, 24, -212, -125, 71, -80, -115, 79, -197, -68, 434, 76, -56, 247, -18, 188, -365, -18, 64, 297, 170, -68, -90, 75, -79, -227, -202, 186, -156, 338, -241, -323, -395, 30, 360, 77, -144, 415, -59, -264, -355, 185, 246, -105, 216, -191, -92, -173, -212, -84, 212, 135, 125, 56, 173, 65, -139, 298, 79, 45, 102, -362, -207, 76, -120, 280, 378, 21, 31, -35, -34, -33, -189, -84, -16, 306, -87, -76, -12, -138, -104, 90, 84, -22, 179, -239, -261, -200, 146, 248, 97, 360, -223, 109, -107, 181, -126, -72, -52, 191, 350, -7, 108, -108, 162, 105, 81, 74, 67, -66, -89, -94, 74, 293, 248, 43, -196, -50, -289]
5589b89L21K10k17k4L0J13nj07j50K45n3q0JKj02k05L16J14l66M93j69M3l51m1
5613b71K2M53j93L77m54L3n9J99j41mJ32P8m94J86Q2l22J82R9K18p9l65L23k16
5636b14J34J03r1M6J29J22k34K58m42K06K43k70o3j00j73M60j95K2q4K41R4j48
5658D4o0j18N14k49k58J53J34J1j88o27O01J13LK10j51j03K14l50j17K76k9K4
5680D7J01j17n6k0j41L01pk48L48L9m21k2o0M40l56L81m58P6K28j54K99k2J26
5703C04k92k23J9K73J09m15J8M72n24O5L8O6m8K64k4o1K62j70n9m08M83k5k76
5726a52J22M9p6j68M80j52k56K20j35J33n7l10M61k17Pl4J41l16J63R8j77K52
5748G6l80N44j39J23q3j56n1j02J11J5J11l00K73j82l03M75k2m2N2P2J2P8j34
$$ y = [-289, 32, 242, 25, 1, 31, 144, 139, 32, -118, 127, 74, -6, -5, -3, -105, -310, 6, 120, -246, 247, 78, 121, -230, -271, -249, 204, 11, 388, -66, -33, -92, 107, -34, -38, 94, 172, -322, -136, -54, -376, -194, -95, 123, 44, -321, 2, -214, -80, 23, -68, -22, 107, 229, -5, 253, -189, 17, 260, -10, -73, -173, -346, 114, -81, -59, -143, 98, 192, 44, -16, -134, 380, 131, -127, 26, 160, 171, -17, -644, -43, 70, 73, 283, 132, 29, 243, -107, -224, 52, 23, 47, 148, 31, -25, -45, -186, 115, 108, -140, 208, 247, -174, -196, -256, 184, -172, 209, -249, -173, 55, -99, 200, 178, 304, 12, -211, -192, 81, 190, -225, -207, 265, -259, -194, -156, -90, -138, 126, 102, 41, 303, 133, 74, -334, 149, 124, -152, -30, 19, -57, -225, 255, 103, -153, 67, -68, 65, 8, -302, 159, -58, -51, -85, 56, -260, -97, 1, -176, 76, -304, 240, 101, 224, 141, -15, -66, -168, -57, -42, 69, -231, 42, -140, -443, 32, 10, -32, 20, 92, 104, 182, 48]
5771D8J47j5l41J65J63j68q0NJ28jPk70J59p5K4K04j60J14K42m31R1m5j1L02J99
5796D01n56K95l56J77K11k1K6l31L27l6n4j60K60k93j9L20l5r1k01L80l13j62
5818b31q2M06J39k38K23k27k5p5J54m4P1J5l2j84Pl7K45R7r2r4J55k62J5j7L1
5843h2M23k96j91J06j17J77j64K10j11L02m3m63P0o9M39j36l9k30K33N3r1P0j2
5866C9R2m9J97l25K31p2l31j58M01J07J1k31M2j14J26J75j84K51o2O4k13j26m9
5889a78K42j53J19R7J13l71k29N45m5J73j54l98k8M03k39K66K12l95K16m37K12
5910b9j09J41q9K99J60l94k51L06j46l1J16k62M74j19n9J65l49J30N6L9R5J82
5932C25l14j48J40Q8j76J09J69N6k78L09o16K93K93j14R7j64q4Q5l02L95R3k55
$$ y = [48, 195, 180, -161, 4, 167, -1, -81, -76, 52, 51, 58, -212, -53, -128, -104, 100, -60, 54, 296, -135, -44, -89, -100, 202, 401, -155, 140, -216, -39, 172, 151, 177, -154, 173, 137, 83, -77, 183, -110, -129, 191, 156, 65, -136, 244, -69, -231, -313, 93, 232, -6, 217, -10, -35, -110, 44, 0, 71, 86, 54, -130, -123, -160, 85, 182, 90, -4, 151, -111, -96, -113, -82, 341, 45, -146, -40, -157, 20, -144, 66, -45, 257, 214, -249, -179, -248, 191, 55, 16, -214, 19, 72, -19, 51, 39, 131, 82, 279, -46, 185, 113, -218, -376, 25, 132, 143, -88, -46, -160, -34, 141, -43, 208, 146, 210, -3, -129, -178, 64, -89, 30, 127, 240, -131, -360, 185, 140, 313, 159, -239, -267, 136, -103, 163, 375, -20, 196, -241, -29, -138, 3, -86, 213, 373, -21, -272, 34, -112, -143, -27, -289, 185, 66, 7, 172, -177, -47, 9, 48, 143, 325, 11, -137, 3, 91, -85, 24, 193, 249, -29, 280, -336, -43, 250, 136, 233, 69, -15, 70, -232, 163, 256, 1]
5954AJ99n35N65m32O8k96M63Pl2k15J15J25l21M16k60nLL85k89N7m9J64K12m50
5978a04R0q1K44j10L0j31Q7J42J70m01J01k65K18R1k13K46j8j04K66l1k40j27
6000a40K40j16K06k97K17m2pl0k07J69q1N0K07j34p5Q7l70P19l10j65j42J14M
6023a03L42k2j13j21j00r9m5L26l34L57J66j48l47K15o3K51k06J68l38L45J20
6044B51j70j31Q8j8K85k67R7r2P4j51K6L09l63j05o4L07m23L60J13j54k42K63
6066gO7J05k23N7J95k92J21o8J81p1N8L0J07k72J4j73J07J40j78J46J10m64q0
6089c90M08L00l85J81Jk9j07o3L8J94m7l46K99j02J17n7O8j66o7L48k10M6M5p6
6113@j39J78L21l77l0l0R7J56k42O9k21q9J29L82k82K17j37j58j63L89j60q4J84
$$ y = [1, 200, -335, 230, -202, -134, -430, 33, 40, 8, -207, -92, 33, -288, 128, -132, -137, -134, 251, -38, 19, -30, 134, 346, -104, -14, -95, 149, 39, 69, -62, 25, 167, 337, -64, 37, -228, -10, 81, -132, 114, 96, -8, 258, 227, -13, -140, 100, -16, 190, -107, 110, 68, 61, 31, -176, -7, -88, -38, 169, 35, -40, 47, -323, 396, 86, -79, -221, -107, -103, 239, 217, 104, -17, -117, -216, -261, 65, -269, 88, 254, 106, -241, -26, -89, 162, -44, 124, -214, 131, 251, 81, -50, 38, 20, 305, 38, 135, 43, 117, -34, -8, 301, -62, -167, -231, 76, -347, 13, 126, -28, -270, -7, 60, 165, -58, -1, 194, -98, 23, -45, 136, 65, 123, 153, 260, -12, 2, -171, -64, 76, -102, 44, 154, -310, -390, 18, 318, -67, 114, 115, 86, -21, -84, -46, 148, 101, -245, 54, -48, 69, 12, 80, -86, -153, 195, -15, 31, 76, 0, -139, 39, 360, -17, -47, -77, 20, 176, -66, 3, -218, -307, -178, 204, -78, 139, 2, -156, -319, 70, -90, -174, 10]
6136A0j01Q8OK01p7r2J66j49j06j45P8J04l6j62K72O7j10J19k07K94l32J31k13
6159a94L10k93J36J97l95K27k8l28N84l12NJ27j56J43q5j01K91j05Pk70J21K43
6181A24r7J25r4K8n0k54M3J75l3J39o3l5l41K08j58K74J33j67K40r8K42l90n1
6204a00q3J77R3J16l99K62k75n4K66M7r6K6M0m76M60j4K89n58M63k69p3k02K69
6227i1M64j17q7j35q4Q6K67k21J89k12nP6Kl53K93o7K1O5n2J11l22J69k0n6J39
6252F0J26k79K6P1J52k05o3J51p7N37m35P4l89J47k5K29j51K2r6M6N5k40J0K24
6276c0n8J01j6k39J94k41M95m6L6l06j27j98J63NK97L72l7j75k76K85l26K07K0
6299A00R6m23J92J56l1j95q9J86J97P4m85M61l55q8L6m4M55N4j75m21L80m30M54
$$ y = [10, -91, -3, 3, 204, 127, 35, 201, 52, -54, -199, -121, -17, -53, -215, 57, 124, 14, 133, -74, 220, -112, 19, -194, 116, -177, -41, 156, -239, -12, -40, -368, 216, -96, -91, 36, -120, 23, -62, -163, 128, 23, 30, -240, -119, 124, 27, 152, 58, 86, 36, -218, -175, 0, -33, 106, 43, 8, -333, -125, -283, -9, 124, -43, 197, 99, 341, -49, -100, -183, -6, 87, 203, -196, 66, -209, -263, 3, 50, -46, -20, 20, -456, 4, -10, 279, -279, 184, -85, -158, -360, -91, 373, 256, 169, 34, -50, 36, 303, 82, 271, 59, 54, 130, 132, -221, 72, 5, 26, 91, 39, 150, -172, -3, -23, -79, 60, 186, -93, -67, 4, 156, -49, -112, 39, -38, 499, 64, 138, -251, -104, -129, 100, -51, -29, -125, -79, -24, -264, -254, -30, -88, 13, -3, -242, -48, -289, 206, 160, 196, -110, -237, -435, -272, -267, 30, 402, 365, 190, -86, 199, -127, 80, 100, 196, -227, -35, 121, 90, -105, -194, -8, 189, 263, -222, 239, -116, -204, -168, -212, 243, 297, 122, -299, 81, -349, 105]
6322A05n3r8M59m63K09J49l00p3l4J94j75R5J94k8N6k17j63J35L16l44j38Q0N04
6345D10j91Qk93J1J18J57k51R2q3j82L18j94L70j05Q1k97j45K78L6j48o5k41L34
6368A8j3l96L10Olo9r7K94K8n0j4p7o1L09m64K02j61J59O1Qj74P5L28m69K70K34
6394B54j09j30J00J23K5l66J28l55J67J58J02j21m4K6L50j67P4O8n18J34J0K55
6416A64k37J16k1J28k98Q6L6j01J40J89l19M83n79J70K15r1j42R8J06P6k4l14
6438a19J67N3l8N7k88K96L5k77j27L04j51j77M35K5k08j39J42k34N64m91L32k09
6460d8M2l4K50m53K97j83j1K17l05K43k69K84m9J16L9R0l61p2K25O4r8k46O7K13
6484A8R0k59K2J35K09j91k88O5K33o3p1J98k19L12r7j11O2R2k11k11L61K21m26
$$ y = [105, 52, -46, 413, -50, 159, 308, 8, -65, -99, 95, -80, 15, 209, 181, 237, 20, -143, -8, 308, -36, -174, -94, 410, 219, 227, -66, -55, 63, 220, -31, 61, -22, -204, 114, -80, 290, 185, 266, -31, -176, 102, 138, -10, -75, -316, 18, 5, -391, -81, -75, -78, -147, -244, 50, 78, 28, 14, -63, -124, 185, -279, -77, -238, -79, -18, -10, -184, -109, 219, -250, 20, 254, 145, 15, 115, 238, 263, -103, 25, -330, -163, -5, 97, -24, -68, -42, 308, 141, 215, 283, -235, -101, -91, 164, -73, 43, 22, 150, -148, -62, -26, -127, 13, 202, -117, 366, -213, -43, 172, 81, -61, 37, 143, 219, 195, -119, 48, 101, 63, 120, -168, 128, 163, -114, -241, 63, -88, -265, 170, 195, -13, -152, -10, -244, 320, -171, 161, -48, -6, -40, 210, -243, 54, -129, -140, 77, -228, 15, -254, 30, -19, 97, 136, 226, -135, -207, 18, 82, -16, -262, -195, 18, 108, -151, -129, 6, 215, 24, -264, -199, 34, -29, -100, 98, -121, 191, 94, -17, 45, 137, -74, -285, 76, 297, -129]
6507a29J0o1J06M68j59o81P11j88r2N2k9j08q6O6M74l18L34l07j34J49K76r1k56
6530GJ68o9om0k88O8K38J56k12Rj16P7k14N73k01k82K88j32j99M13k25K2j2l14
6554b91J93J18J52k48qJ99Rl7J98lk75j17J18j45J64j24J07j73J9L46k7m1Mm6
6578I2j81K21j36K55m46K28J40l99M43m03K86k54J42J25p2j26o5k2j9J49j07M35
6600B86k95j52K91p5l29K50p1J66J45l79L45j88k98N82j15j05p9L1k45M80l34
6621h9J00K4pNj50j22K32j75P6J30K67q9l77j3n3N01l66K63l98K49k6k06J84k8
6645f8J17K68k68mj21p2J7R6j38L32n4K81j76j74p3j13L25o7k9k1m1J75k56o9
6669a33K47j4q6QJ15k50K28l28J12l8K91j01l2p1k5j2L71j80J1P6j35k7J93l15
$$ y = [-129, -119, -180, -74, 394, 235, -446, 265, 77, -15, 37, 8, -100, -186, -120, 354, 36, 370, 63, -71, 78, 354, 263, 7, 175, 106, 100, 60, -228, -160, 78, 234, 22, 31, -85, -8, -222, 351, 150, -132, 156, 24, -175, 238, 13, 35, 23, -291, -98, 20, 172, -76, -84, 115, 124, 87, 285, 282, 7, -110, 8, -137, 27, -97, 10, -163, -144, 202, 175, 134, 138, 92, -89, 132, -4, 251, -195, 33, 173, -226, 217, -186, 100, -154, -12, 113, 41, -85, -150, -172, -191, -42, -149, 286, -9, -161, 130, 55, -274, -24, -95, 71, 216, -163, 182, -6, -304, 278, 163, 58, -21, 10, -235, 245, -89, 11, 35, 28, 33, -117, -239, -7, -182, -106, 24, 291, 202, -175, -188, -241, 260, -106, 157, -241, 8, -18, -224, -40, -68, 49, 317, 49, 45, -76, -148, -131, -35, -173, 159, 105, 386, 210, 36, -37, -150, 175, 108, 79, 58, 17, 192, -64, -133, 114, 100, 14, 22, 137, -113, 115, -213, -101, -139, 152, 51, 19, -52, -77, -89, 282, 102, 113, 189, 54, 27, 220, -95]
6693i5K96Lm35J8L56l14K72k41N28k85k6r5l64L70p9l65Q27m09j28j73K37Q4j27
6716a45L07j48k11K36K33l41J86l10L57r9p0K33l31J54k09L0J03R0k13j0j62j31
6738d51K52J3L4L33o4j95J13j81k24N05k23PK9n5j80K45OL96l87n3L37l49Or2
6762a78J91K42m09L81j59O5j57j33J84j34J46l2m1l09N24m18K44O2k32L18k84
6783a29l8K92k42k47M61m7J1J4j36j42j27m1L53j8q6K24Q9l40J6K2J0K58k3l22
6807a88L55l29J75J17q2j61K91j46Jj89M2N02n94J70K10r9Kk42R5p4M9j7J7K61
6831A66k34O9K08j83J8j59K13k5k02K02k85M89j47l06R6K4N1M3j18L0n8J88j17
6854c7M05o72J61Q0J62J8l49K07J28l61J33k00N16r7k90L07j29P1k46J85O2j36
$$ y = [-95, 201, 204, -231, -213, 143, -171, 101, -140, 388, 103, 77, -18, -382, -12, -91, -456, 371, -38, -166, -339, -102, -18, -145, 162, 14, -197, 39, 272, -69, 117, -193, 164, 65, -5, 228, -103, 51, -158, -128, -25, 65, -148, -158, -320, -451, -199, -186, -152, 181, 117, -78, 35, -146, -370, 135, -88, -81, -52, -107, -287, -42, -36, 360, -27, -80, 257, -92, -86, -178, 13, 255, -154, 227, 68, 133, -24, -157, 27, -107, 39, 7, -34, -343, 181, -237, 7, 69, -163, 155, -129, -167, 125, -117, -364, 97, 50, 61, 75, -61, -203, -330, -371, -18, -36, -122, 102, 191, -149, -133, -111, -101, 157, 134, -188, 167, -162, 13, 130, 48, -113, 178, 32, 33, -156, -114, 388, -206, -36, 174, 75, 77, -165, -70, -144, -95, -112, -95, 166, -68, 1, 209, 26, 44, -115, 98, 73, -129, 73, -212, 277, 130, -176, -80, -56, -5, 38, -80, -50, -108, 80, -37, 368, -304, -143, -63, 99, 117, -232, -25, 103, -258, -125, -325, 191, 94, -196, 111, -18, 53, -193, -8, 54, -82]
6876h2L09j40l6j45r6J17K01l4j10J8O9l4J31j22R1J84m07L57k18k23J74N21m02
6899A23j70J95m64L54J13qjo1K25k77l4j79K19L0j56J87k14J5j90K81K44j68j97
6922a33RK35o5K1k4l91J65jK35j53j55K90%j90j56L16n0M6J30l19j94M07%O4j29
6947d2J00KJ6j53pJ27J19k65J65O0j0j07N3j14N2J79j43j47oJ81O0l8k39K38M09
6972D90m59j09R2K0M9qn0m3K53j52k76k5J23k75L43K48l02K41j83O5k8J0q4J04
6996D4k20J43n8R7j39L60l26N8n3K77j56J50p2j79n8K78k10o6L33k71j64O2j12
7019b82L00pJ02M9l51N25k65K32m52K57j77K52M3k1k11M1Lk04l2K58k41M70k29
7042F0r1J33j62j36K06j09p1MK5K68l39J53l5K13r0kk62MJ27p6J51P7J45q4j10
$$ y = [-82, 227, 87, 51, -94, -190, -73, 128, 94, -16, 2, 71, 37, 168, 46, 137, 321, -86, 271, 53, -170, 4, 525, 123, -47, 148, -316, 38, 151, 143, 142, 81, 306, 29, -5, -184, 35, 65, -91, 96, -118, -103, -293, -12, 232, 64, -133, -124, 111, 46, 67, 43, -348, -183, -184, 51, -102, -257, 33, 33, -157, -313, 3, -47, -1, 129, -190, -384, 23, 23, 87, -42, 58, 60, 76, -77, -84, 43, 162, -103, 62, 122, 112, 5, 58, -56, -4, 175, 32, -115, -121, 60, 120, 82, -157, 81, 490, 31, -78, 14, 34, 83, 75, 25, -18, 235, 83, -193, -218, -95, -370, -27, 221, -81, 160, -23, 42, 14, 24, -60, 44, -176, -33, -91, 6, -133, 227, -99, -41, -94, 183, 27, 177, 105, -74, -132, 146, -64, -130, 203, -68, -232, -170, -282, 18, 11, 113, 162, -189, 336, 71, 303, -149, 108, -69, 183, 226, 205, -6, 35, 38, -166, -198, 60, -181, 289, 60, -31, 102, -60, -196, 10, -99, -170, -166, -141, 127, -212, -59, -94, 119, 29, 27, -235, -231, -104, -180, -29, 48, 193, 109, -1]
7067ark8K1J07j44k99J80N36k36m72J44J50K02k4k51o2N24j19k48R2K3M5l53O5
7091a57K06j32j13M98o90M97l00J16n4J94L4Q9j68j09PL05l59k00L63M2r1j17
7113a39L58m02O2J28J15k05n0K76k09P2k02N19k36l26J79q9M8P3r5M2Q8m1K21
7136A87j40K7j81M21k05j46K04m8j37l9J92j8j99J81M1K31k00j98J27o1Q5J2k30
7159i4K66l15L19k43J19n7l35K78Q0J64r2p9j62K13M7Q8n95L24L82j55M6l79j64
7182c44N17J94l65j48q5L14l20K05K15k57J58n5pj35L46k26J19k80N8J16k82K90
7204B8q9J02J0k8k04J9J01P6J07l6O7O5k36J7N0N5K1j71L8K60j70l69N4J95LJ87
7230A52j78O8k4j66K10K3Ql72N00l98R8N4l57K71o1K67o8n4R9P9l04O1o5J82j9
$$ y = [-1, -10, -38, -17, 90, -54, -353, -173, 363, 127, -345, -201, -51, 151, 127, -124, -186, 338, 219, -29, 63, 86, 131, -222, -157, 49, -83, -196, 302, -388, 109, -191, -75, -129, 65, 99, 188, 20, -89, -82, 223, -136, -336, 27, 69, -22, -139, 219, -183, -121, 7, 122, -83, -133, 143, -66, 6, -196, 323, 87, -239, -60, -149, -101, -28, -123, -81, 7, -34, 187, 47, 74, -107, 314, 109, -37, 167, 119, -18, -57, 135, 117, -82, 99, 140, 371, 171, -27, 100, 39, 124, 136, -94, 172, -143, 176, -67, 52, -5, -340, -62, 18, 182, 90, 11, -151, 62, 109, 197, -398, -74, 308, 153, 199, -180, -344, 173, 367, 2, -146, -231, 83, -237, -32, 183, -74, 84, 29, 22, -113, 233, 7, 126, -154, -96, 20, -262, 28, -61, 41, 51, 23, -181, -162, -61, 15, 122, 86, 153, 218, -18, -1, 49, 104, 125, -46, -8, 252, 82, -287, -233, -38, -35, 152, -26, 42, 18, -148, 62, 85, 93, -279, 221, -177, -79, -25, -382, -111, -172, 95, 27, -27, 72, 151, -153, -92, -157, 25, 6]
7255Fk3K88m07K34m6J64j59P8l36j28L58J11m1J43p4Mj03j66J94q9L8j01J70K22
7279C37k02q5l7n1J98j61l0j2J08j31R0q0J13J27k50K68m43K79l40L29k73L70
7301A24o5j28K62j59L8O6k97K33Nj28M1k22QQ9J30J73j10r0Q4q7p9J42k78M83
7325B35j55J36k91K04n3J97m1k1K16n45K9k9J50R5l91J42R2j91p3M54l84K63J09
7348A48n00L87o0k9j33K02k84L83M3j46J98m38M39l02L29j65J78k31J05N5j49
7369C0O8j38k7j93K55n6J66k80K90k43L8R9J37j85J17j06J71J06o1j17j03M6J81
7392A95m72L35j51n5O8j64L74m88J37K23J62j49P3Or5j86J54J36k1k05K48N1l51
7415a75K17L4k94K25J66n03K86n7J22p7K03J11l34R7k11L10J02j75M4j51M6J59
$$ y = [6, -17, 271, -136, 98, 52, 216, 57, 135, -201, -329, 29, 140, 99, 242, 168, 172, 69, -97, 97, 8, 46, -55, 115, 337, 135, 50, 13, -38, 160, -1, -31, -43, 65, -66, 24, -56, 57, 184, -66, 202, -241, 38, -302, 27, -246, 124, 59, -69, 193, 34, 72, 138, -159, 74, 79, -49, -8, -230, -222, -133, -3, 170, 60, -30, 54, -33, -112, 30, -248, 235, 80, 216, -75, 129, 76, 273, 232, 211, 427, -118, -89, -118, 32, 127, -264, -122, -30, -221, -294, 160, -224, 39, 148, -352, 35, -25, -54, -187, 15, -269, 114, 157, 11, 209, -229, 210, -92, 237, 72, 250, 19, 124, 179, 30, 98, -40, -67, -260, -5, -61, 105, -175, 115, -128, -90, 9, 146, -39, 78, -28, 143, 249, 188, 71, -32, 14, 195, -277, 58, -93, -148, -80, -244, 130, -358, -221, 2, 164, 15, 88, 94, -1, -187, -33, 103, 82, -123, 125, 176, -175, 42, 76, -218, 7, 173, -330, -44, -101, 21, -56, 147, 258, -76, 21, -190, 120, 222, 47, 91, -60, -14, 145]
7437A45l94L43j07k6r6J32%J5k28K54l1q0m4j68J99k50L23l83K28n8N31m13M6
7460f2K18k84J07K26k55N6K43j58l4k03K14j34r9K41l77L09K59j21J03m43l1L15
7482I0m7M9j04j35J89m5j9RoK1p1N5j47OJ80K37k79k01L02K75j89J45j63l22K83
7507A13L0l20L92m38K09Q6m19M92K9k72j70n6K38kJ71J35m78L77m66K6L91J94
7529B62k67j10J88P3k07l3Lq8O4K57J4l05q9K17N6K6J20j96j23L30k42l3K87j52
7553E2k30K72k23K38l23L07l13J53K66n16O07lm3j31j17Ml7K58P4l26j35K69k8
7576G5j9k35l7l8J58P4L51j75J1j67J03m5J28j68jMm4J16k38J12q6O3k0k8R1k74
7602b89N82l75k44n2K86J64l28K40n1K92l81J68l31M51M7m1j32j31Q5Q7r5M18
$$ y = [145, -249, 94, -13, -39, -135, -3, -3, 12, -216, 38, 7, -73, -117, -285, -86, -336, -13, -396, -168, -226, 305, -108, -62, 156, -128, -21, 205, -50, 6, 249, 91, 57, -146, 68, -66, -165, 76, -301, 8, 267, 146, 249, -194, -225, 90, 43, 92, -12, -147, 42, -3, -22, -13, -19, 2, -69, -14, -161, -155, 25, 262, -17, -218, 84, 359, 170, 315, 152, -170, 113, 143, -177, 215, -223, -14, 72, -347, 145, 174, -98, -268, -324, -86, -88, 83, 218, -260, 117, -349, -323, 68, 262, -5, -115, 73, 146, -61, -94, -91, -179, -115, 142, 156, -149, -238, -21, 35, 61, 181, -15, -138, 192, -50, -83, 204, 52, -178, 94, -129, 109, -214, 93, -220, -67, 199, -317, 290, 287, 244, 113, -4, 0, -37, 221, 295, -31, -166, 103, 75, 56, -179, -216, -254, -96, -22, 329, 154, 165, -2, 101, 56, 184, 16, 15, 19, -25, 91, -147, -35, -121, -58, -78, -106, -15, -289, 293, -82, -326, -378, -92, 72, -256, -16, -67, 225, -156, 12, -319, 132, 179, 138, 6, -125, -40, 47, -48, 370]
7624C70k96o7O9k1k1k0j02J17m85L19J32J97j16j91K6JJ47k7n9Qm9K30K7l36K43
7649I6N0j73J90Mj74nJ54p4j62n0j14K57k40N04k17m4J01k0on9J97o6j87j24L80
7674B18l17J98L8k32K59k28MR9M4j99J77L66n34KJ98l22J6O23o12J44J99k74K13
7697H0j14j49L85k19K7Q7m25L83l1J11k41J53l3Q0j32N2Q1k59L12j18P9K6k21
7720h6j89K47J13r9Q3k1j05K2O1J65j36j43J61l20K52k83K72j83o5K81m88L30
7742a31K11j31R0m3q8M17l42lP6P9k10L0m2pO0L0J79j43lK9J86n3j71J32l46j7
7768b11J80J92k74K62k37L9J13l34L65R6k94l9J36r6J58j64m2J57J99k11J28k23
7790a00J98q9j92K23k95K18J98k00k4J32j64k8L49n9k5K2j40j98J67K1J5o0J6
$$ y = [370, 74, 7, 76, 55, 34, 14, -88, 29, -456, -137, -5, 192, 76, -115, -89, -88, 59, 32, -27, -19, -68, 162, 189, -147, 96, 146, -27, 163, 167, -7, -12, 142, 68, -94, -144, -258, -1, -241, 263, 46, 2, 103, 83, 77, 18, 215, 149, -38, -162, 218, -99, 99, 137, -95, 164, -64, -60, 39, 83, -116, 61, 427, -107, -105, 93, -229, -213, 410, -202, -58, 141, -133, 80, -34, -183, 202, -17, 10, 97, -328, 55, 24, 135, -106, 47, 14, 94, -38, 14, 95, -164, 148, 30, 109, 135, -86, -275, -28, 85, -14, 69, 48, -57, -35, 26, 191, 55, -88, 73, -247, 5, -278, -6, -189, -254, 27, -461, -131, 80, -51, 39, -4, -92, 325, -17, -20, 56, 135, -75, -45, -87, -94, -34, -4, 175, 32, 29, 58, 244, 191, 20, 152, -194, -211, -31, 161, -113, 149, -88, -49, 64, -270, 95, 191, -103, -142, -6, -102, 56, -108, -150, 7, 206, -5, 123, -100, 98, 9, -183, 40, -255, -37, 161, -39, -63, 69, -95, -123, 226, 167, 142, 164, 24, -174, -7, 14, 29, -31, -15]
7813a5j81J41J2j92J63Q4p2L82j2l81J87p0j79K16j91M82n26NQJ72jK3J83k85
7837d7l2L4r0r1J48K11j98R5j22q2j7N1pL22Mj81r0p7L37j98l6R8l1%L22K3o07
7864b61l3L87K68l84K18m28K36Jj15j0K01j07k22O47k84ok02K91m97J91K12j67
7886f4J89j41K1K59j18l26K11m36K37J70j49j37L75j65J16j06J20l1k25L92p6
7907A16j14j95R0j66K91J09j5M3lk79J46l25J39L16q4N9N1j81K79n58J50K6p3
7930a78nq6J33M85l04k43J54N5k41O5J64k87O42l27L05l58k2J95j13k43Q6K72
7952A49o9n6l28j74J96M11l38N8K57j76k81O91n36R0K54l33J82l2l5J60j78j7
7974a05J79j75J35j54ML62P2k54j48n0N68m72J20q1J05m32K87k1%K09m29R9L61
$$ y = [-15, -196, -55, -43, -235, -72, 12, -60, 322, 310, -71, 116, 46, -133, 83, -108, 374, -152, -147, -139, 33, 32, 55, 238, -47, -79, -45, -135, -226, -78, 133, -65, 30, -92, -174, -191, -140, -147, 175, 179, -2, -92, -169, 168, -30, -66, 32, 1, 1, 323, 346, -261, -294, 93, 361, -23, 195, -233, 3, 4, -111, -121, 80, -27, -249, 398, 114, 108, -94, 197, -300, -109, 103, -64, 125, -16, 5, 264, 146, -180, 31, -405, -168, 2, -147, -284, 91, -74, 42, -64, 56, 25, -200, 192, 116, 2, -193, -103, -269, 22, 131, 116, 159, 156, -123, 23, -302, -163, 153, 69, 128, 179, -2, 277, -281, -131, -105, -178, -183, -269, -136, 349, 45, -198, -44, 11, -230, -165, -1, -288, 354, 27, 332, -26, -48, 147, 34, -209, -123, 149, 80, 24, -304, -478, -282, 129, -209, -151, 106, -70, -351, 340, -196, -106, 148, -185, -3, -35, -70, 90, -88, -105, 74, -101, 34, -120, -116, 246, 318, 64, -84, -134, 434, -38, 82, 1, 106, -326, -39, -60, -60, 149, -280, -181, 180]
7997A80l68PJ46O1p0o5m8m04P11N9m85J52k42K53J84l19M06k77K22k12J7J51l42
8020b83N87k90l2M2j31K48j18J11q7k48K62k9M17l82j01q7J28KP0nO4j29l0K07
8044A86k11j7l82L55J42j5J5J64k54J6L0k48L84R2k09k89L4M46l05J02rJ4k05
8067a64K98j41J1j36m4J81M0J33l61J04K84n36J04P3K02k29L36p1j75J05K48j41
8089A21k02J01K9q7m2j23J01K89l65m8J68L52m39K14k56M09k41m6J08J8kL03k43
8112A19K1J71p23L90q8J60m1n7j45K6K21Q7j69l4P7j4Q0K07j58J02k29j3k48J46
8136a12J11l91K56K58r6jk81J57K44j13n8j75K8p8J60J68o6k81K20Pl47O69m63
8159a84K18j8j42J97p2K14J20j61l98Q1L85k22n2K0K38j71k40j03L8K95j16J95
$$ y = [180, -188, -181, -35, 26, -44, -109, -157, -561, 150, 209, -276, -124, -366, -113, 71, -248, 158, -119, 103, -109, -92, 59, -283, 304, 14, -18, 24, -107, 141, 23, 134, 47, -201, 61, 32, 449, 67, -34, -121, 7, 9, 79, 74, 138, 9, -21, 186, -25, -42, -424, -69, 73, 58, 73, 237, -17, -1, 29, -219, 165, 257, 48, -241, -207, 239, -66, 36, 27, 41, -164, 134, -7, 4, -132, -176, 5, 45, 178, -183, -79, 205, -331, -227, -154, 48, -181, 155, 84, -91, 14, 262, 121, -81, 20, 49, -38, -80, -203, -102, 187, -178, -226, -58, 294, -145, 69, -187, 222, -19, -65, 43, 61, 59, 362, 119, 140, 311, -412, -22, -110, 50, 9, -48, -193, -167, 54, 141, -28, -62, 15, 1, 81, 288, 130, 232, 3, -10, -258, -112, -1, -392, -136, 122, 26, 25, -256, -99, 145, 32, -26, -201, -173, -251, -91, 77, 11, -270, -50, -43, -390, 279, -184, 34, 16, -126, 71, -1, 213, 333, 172, -226, -145, 240, 18, -34, -14, 224, 53, -187, -290, -252, 43, -73, 122]
8181A22J23l36Q0O2l34L93l28K45J51K00
$$ y = [122, 245, -91, -11, 51, -283, 110, -218, 27, 178, 378]
8191C78
$$ Imaginary data points
##PAGE= N=2
##DATA TABLE= (X++(I..I)), XYDATA
0@%%%%%%%%%Qj6J6j6J6j9K7l2L5m3N1n9O7p8R1j05J24j42J58j76K00k28K55k84
33a50L19l57L98m43M90n44O03o65P38q19R07j006J114j237J378j539J726j947
51a034K213k540K951l486M217n281O990j0175J8116p2985j69554N9649J48246
64b2673J37755M0153k0909p6452j06673r2459P750J07525J24786M2068m4046q4560
76A2265p9123n9205k676P6935J25291Q4804j5319r9399j14636o7648J4346R6894
88b7471J31036P2661n0945j40476j21411j9641P5261J06862Q1616K6179m2728
99I0943r7657r5396k5491O0762R4376O2707N975m0862p0042p5958l9627L8721
111i1549J07402J04097K4250o8823j12316q4922j2055O7567J12990Q7309l366
$$ y = [0, 0, 0, 0, 0, 0, 0, 0, 0, 0, 8, -8, 8, -8, 8, -11, 16, -16, 19, -24, 27, -32, 35, -43, 48, -57, 67, -75, 83, -93, 107, -121, 134, -150, 169, -188, 210, -233, 257, -287, 316, -349, 389, -430, 477, -529, 585, -652, 726, -813, 913, -1034, 1179, -1361, 1590, -1896, 2321, -2960, 4030, -6145, 11971, -61014, -230568, -170919, -22673, 115082, 155235, 134326, 57874, -48799, -141258, -133508, -25983, 98803, 140871, 96825, 12265, -66858, -126063, -128739, -51804, 73487, 158291, 142972, 43573, -71063, -138711, -124365, -27471, 103565, 176226, 125281, -15195, -136606, -156247, -80986, 25876, 107492, 133671, 90943, -6714, -102110, -127601, -66839, 27537, 90244, 96219, 55357, -14685, -90643, -130270, -91549, 15853, 119950, 144200, 75377, -36939, -121861, -133916, -66349, 46641, 133950, 130584]
122A30584r6750j19544n6814L2741Q7053Q6585M9384p408o6304r0959n6610J4057
134i3985O9185P3667M0299l129m6888q0771p2611m180Q2126J11312N6135l2352
146I8808q7150q3133l7726K7247Q4659R3823L4053n6193j02602p2123j449N2164
158d9622O7194N5026K1012l0851p3769p0460j8951M1726P1227O2566K6479k6612
170G4965p6746q5702l2960M9848R6673P3736M443n9583q4184o1659k566O2242
182d1493Q9725N5108j6462o9654o9986l0455J4133M5373N7248M2681M25m9472
194B7171o8625m3907P805N1907O7580M7954j433n7354q3782n3033J7847P6775
206a1095Q0277L1079l3392p1930o5689k2066L5337P2607O3217J3495m0795o3766
$$ y = [130584, 33834, -85710, -142524, -109783, -22730, 63855, 113239, 105831, 39527, -51432, -108042, -93985, -24800, 48867, 89166, 86037, 39149, -41622, -114233, -118413, -36287, 75025, 131160, 98808, 11658, -71475, -109201, -81954, 2705, 96528, 130581, 74388, -28214, -100337, -101786, -49622, 17572, 72598, 93610, 62759, -11010, -81470, -100421, -58695, 12532, 75098, 101577, 74965, -1781, -87483, -120443, -70595, 26078, 99814, 104257, 44674, -39510, -101169, -103735, -41493, 48232, 103340, 86878, 17224, -52762, -83217, -69084, -23711, 33537, 76218, 76643, 27171, -41454, -85361, -77556, -25649, 41931, 89885, 88452, 31098, -52684, -105717, -87870, -11095, 69182, 100261, 66869, -5061, -70750, -92816, -57479, 15128, 78345, 91840, 51045, -12721]
218a2721m7322j2267K2650M8539N3316K7274k1962o1926o1337j9716L2028O4033
230A0589O0380K2527l2451p3927o8020j3412N1256P6707M7345q279n1264o0738
242c9287l7355P089M8017O0330L4949j1789m5445m9252l0381Q53L4381N4092M3723
255F9925J085m6540o4669l9693Q320N1488O4938M0252j0856o0604p0607l2476
267h9437K8084O4560N5717J5579k7734n1440m6853j6240K4182N0540M4422J2935
279F4315k2610m3685m2512j9985J5702M7123N3085K3127k4831n7951n3232j3951
291g5405L2908O0550N0693Q144m0842o3720m3309L942M5649N4742L0488p975l7457
304A8408m6953l0537K247L4675M6792L1587j587l2132m5501l4648k977L4989N5044
$$ y = [-12721, -60043, -72310, -49660, -1121, 52195, 79469, 57507, -4419, -65756, -85472, -53444, 10589, 70969, 93496, 61045, -12882, -80902, -94314, -43058, 33649, 80994, 72715, 21451, -39287, -76642, -69553, -21536, 38794, 73743, 61954, 16509, -32743, -63124, -62271, -27890, 26202, 69925, 71010, 24470, -40199, -79892, -71572, -20084, 44854, 85106, 74250, 13646, -56961, -89437, -61353, 3207, 58924, 74503, 46769, -4671, -51524, -67764, -43582, 6958, 51380, 64315, 41705, -1980, -44492, -64477, -48775, -1652, 51433, 74560, 49729, -8222, -61454, -75405, -42497, 18053, 68746, 76890, 36048, -27672, -70981, -67039, -21390, 33352, 63840, 55865, 18408, -28545, -59082, -56835, -22160, 24632, 56219, 54632, 22500, -23001, -57649, -60626, -25637, 29407]
317B9407M0075m427m6825n8490l2200J3751M8701N3549K5570j8629n0677m8799
329d8994j5974K4986M6407L8798J0815j8887l8676l8504j6932J6247M0436M1035
341D0757J7132j6620m0389m3275j9789J9493M9274M8697J3232l1218n4987m2175
353e9868m090L3958N0432L6590L87l5523m6955k8714M929L2654L9333K5248j004
366D7377k6632l9404l0390k653K8979M3022L1834J011l1501m5834l2388K356L8560
379a5663N0314K7531j3083m4007m6174j9032J7659M1217M0264J5394j7550l8609
391a739l5577j1334J6396L3691L2577J4805j2260l4150l7295j8297J3940L9121
403a22L9945J5675j8143m2352m0294j2706K4175M6298L7286M488k9615m3122l0120
$$ y = [29407, 69482, 65055, 18230, -40260, -72460, -58709, -10008, 43541, 69111, 50482, -195, -48994, -64968, -39982, 6425, 45223, 56038, 37151, -1525, -40029, -56961, -40714, -278, 40757, 57889, 41269, 880, -42395, -62184, -42691, 6583, 55280, 68512, 37294, -17693, -59868, -63958, -30000, 20432, 57022, 57409, 21886, -25069, -53783, -48854, -16200, 23133, 48381, 47377, 20745, -18659, -49049, -51702, -22723, 20299, 52133, 53144, 21643, -24191, -56579, -54223, -15663, 34651, 62182, 49099, 5092, -41082, -60114, -42455, -1238, 39026, 54420, 36870, -1739, -37316, -48650, -32254, 1437, 34014, 48819, 36559, 2409, -34886, -53183, -39243, -122, 39823, 55498, 37355, -4997, -45291, -57997, -33822, 12476, 49762, 54250, 24635, -18487, -48607]
416d8607O86K8278L8309K6359n84k6706l5307k4760p6K3623L3964K6691L454k3908
430B1416l8296k9901j701K9314M1876K7803l626l3465m2335k4446R152L6873M0299
443C2963J8701j3731l5457l3930j3620J3333L1501L0990J2825j1423k9855l1245
455b8948j5461J0682K9934L3430J6746j1197l3146l6123j5309J5860L8051L5247
467C9766J0140k1093l8912l1946n165K3567L7556K7202J383k3351l3828k3555
479c8236p46K0776L0634K3022L186j9781l1538k5540l219K1856L4145K6544J655
492D2758k4684l6831k5686K195K8971L6723K2150p996l0779l3942j6296J0258
504c3159K9454L0317J4494r962k7575k8051j3447Q552K5388K8049J5139p617k6701
$$ y = [-48607, -47921, -19643, 18666, 45025, 44441, 17735, -17572, -42332, -42408, -18785, 15179, 41870, 45324, 21416, -16880, -46781, -48482, -19168, 22708, 50511, 46885, 13420, -28915, -53361, -44209, -7336, 32963, 51664, 37933, 2476, -31454, -45074, -31741, -240, 30750, 43575, 32152, 2297, -28948, -44409, -33727, -3793, 29637, 46383, 35186, 2040, -34083, -49392, -33532, 4519, 39766, 49906, 28813, -10099, -42045, -47210, -23643, 13913, 41115, 42498, 19147, -14681, -38236, -38982, -18206, 12428, 35450, 38636, 18855, -12683, -38223, -41442, -19586, 14559, 41103, 42758, 18074, -18757, -44443, -42248, -13277, 23446, 45596, 37600, 6821, -27121, -43417, -33159, -3705, 26612, 41106, 31144, 3569, -24482, -37929, -29377, -3989, 24060, 39199, 31582, 4881]
517D881l1178j5682J0264L0608L1615J3491j3490l2654l1481j0166J7734L3535
529G477K8510N239j9561l1340k3981l174J8233K8873K2447K852j8197k7682k2541
542c2845l398J7007K8265K3077M915j8062l0918k4375j830K2403L2469K1971k264
555C6415k4140l1965k0036M228K6570L0952J5489p748k5072k6196j3293O413K2451
568e932K6817J4612o492k3489k6553j3408O438K3313K7261J4842p387k7426k9628
581b7032j2413J2427K8623K6936Q822j3451k7861k5846o694J6270K8605K2313
593C0699L465j6329k4504k0536n600J3895K5756K1779M241j5814k5709k0838m039
606c3534J5672K7047K2612K979j9753k9578j9908J593K1778K7233J7247l110k1386
$$ y = [4881, -26297, -41979, -31715, -1107, 30508, 43999, 30509, -2145, -33626, -43792, -26058, 7477, 35987, 41226, 21665, -9675, -33656, -36830, -18597, 10276, 32723, 35575, 17378, -10304, -32845, -36243, -19236, 9029, 32106, 37021, 18959, -11959, -36334, -38164, -15761, 16708, 38679, 36415, 12275, -19690, -39726, -35498, -8928, 22024, 37513, 29765, 4693, -21503, -34796, -28383, -5932, 20885, 35497, 29005, 5516, -21037, -34445, -28007, -4694, 22567, 37409, 30022, 2596, -27032, -39445, -27018, 1605, 28541, 37363, 23912, -3949, -29795, -36489, -20219, 8386, 30699, 34164, 17835, -6669, -27205, -32805, -18910, 6846, 28625, 32866, 17052, -8657, -29495, -33534, -17862, 9185, 31797, 34776, 15023, -14555, -34463, -32870, -11092, 16141, 33388, 30278, 8892]
619H892k6597j5710M886K2198K4902J2915n931k0229k3289j3940L759K1197K5238
632A8291J4437n814k1808k4590j2960O550K2861K5839J2199r878k6133k4927q118
645c4051J3044K4514K1621P072j1863k4025k1286n974J4087K3822J9055L787j3056
658A6747k1570k0261n973J2841K4532K1092L707j5704k4202j8975k227J5379K5323
671A0709J9365O56j9469k5830j5334L182J8397K2440J4066k176j8461k3820j3685
684b9960M550J8816K2037J1688l502j7060k2329j4164M103K1334K3658J1630p263
697B3538k0665k2002j0885O939K1763K2552R637j0997k2328j9596o306J0629K0488
710B767J8900O350j0787k1049j8965m324J1525K0558J7874N491j1280k1561j9578
$$ y = [8892, -17705, -33415, -28529, -6331, 18571, 31486, 25555, 5326, -17963, -31903, -28144, -6947, 18291, 32728, 26914, 5106, -19484, -32444, -25894, -3033, 22806, 35005, 25127, -1006, -25933, -34051, -21007, 3507, 25128, 32200, 20337, -3688, -24974, -30948, -16861, 6961, 26016, 29803, 16747, -4823, -25084, -31057, -18216, 6316, 27408, 31115, 15411, -8791, -27766, -29993, -14614, 10709, 30074, 30730, 11261, -14569, -29903, -26721, -8324, 14116, 28182, 26006, 7545, -16275, -29960, -25410, -6594, 15443, 27131, 23629, 6569, -15760, -29924, -25821, -4487, 19171, 30801, 23538, 2873, -19129, -30014, -23075, -1312, 21240, 30877, 19880, -2448, -22044, -28350, -17721, 2767, 21667, 28017, 17230, -3819, -22784, -27108, -15583, 4975, 22849, 28340, 17060, -4501, -24079]
723b4079m387J3886K3036J7670J402j4984k2067j6204j483J5245K2865J5959p70
736B6089j6804k1591j2848K587J5111J9157J3175j489j6086k1514j2856L784J7783
749e502K0129J1308l705j6876k0836j2448N537K0139K0690Q466p415j8274j9856
762a8643q815P317K0141J9977O807j0142j9116j6731m801P995J7347J7752P052
775B6140r784k0396j7458l396J1885J8484J5737M082j0942k0009j7663k395J3579
788a2136K0865J4702N57j3877j9408j4227l05J4657K0146J3150j899j4340j8294
801a0409j2119P77J4075J8870J2492k234j6165j8757j0681M184J5547J8064J0338
814B3982l981j6309j9802r896O963J8165J7962P127p318j6887j6546p245O541
$$ y = [-24079, -28466, -14580, 8456, 26126, 27528, 12544, -9523, -25727, -27210, -11965, 10900, 26859, 26089, 9285, -12306, -25154, -22567, -7456, 11701, 24876, 23387, 7301, -14213, -27069, -23285, -5502, 14627, 25935, 22230, 5354, -15482, -27930, -22393, -2254, 18436, 26902, 19487, 1213, -18643, -27458, -20141, 0, 19977, 26784, 16642, -2474, -19205, -24006, -16011, 1336, 19088, 26140, 16356, -4040, -21498, -24894, -13009, 5475, 21212, 25294, 14352, -5657, -23320, -25715, -12136, 8729, 23431, 23988, 10111, -9297, -23524, -23829, -9172, 10974, 24124, 22225, 7885, -10409, -22528, -21751, -7676, 11194, 23686, 21452, 5287, -13470, -24151, -19967, -4420, 13644, 23982, 20001, 3692, -16110, -26006, -19043, -878, 17084, 24211, 16893, 6, -16540, -23785, -17244]
827a7244J7698J7213O291q835j7625j5514n382Q246J6982J6557N453r461j8433
840d054j5209l289J0856J6852J4387K979j0948j8689j4587o37J2977J8173J2045
853B0856K79j1770j6983j3253p99J3348J8786J1962k669j3491j6357j0769R56
866a9904J2854J8499J1438k883j5531j7455q895M356J3863J6400R000m141j5678
879A923j7159p449P307J5645J4989O409o018j5435j5678p246P637J6447J5240
892A6612M485p856j5074j4540n209P773J6807J5266L645j0211j6504j3514j228
905a9548Q944J5802J2774K641j0591j7185j2412%J2221J5456J0688M6j1096j5797
919h057j1548J42J2851J6672J0146k348j2143j5731r823K072J2868J6420R112
$$ y = [-17244, 454, 17667, 23958, 15123, -2502, -18016, -23398, -15152, 1830, 18387, 23840, 14379, -4054, -19263, -22552, -11696, 5156, 19543, 22522, 11574, -7115, -21702, -22339, -9362, 8811, 20856, 21135, 9365, -7618, -20871, -21670, -8322, 10464, 22426, 19757, 6266, -10091, -20860, -19904, -7050, 11449, 22887, 20004, 4473, -12982, -21877, -17521, -3658, 12742, 21742, 17601, 1923, -15236, -22685, -15378, 267, 15256, 21665, 15647, 212, -15466, -22712, -15075, 1372, 16612, 21097, 13241, -1833, -16373, -21582, -13809, 2998, 18264, 21909, 11698, -4806, -18320, -19548, -10604, 5198, 17972, 20613, 10022, -7163, -19575, -19575, -7354, 8102, 18790, 18836, 7740, -8057, -19605, -19463, -6612, 10060, 20206, 17858, 5715, -10016, -19839, -17767, -4899, 11521, 20633]
932B0633l966j4060j4969p283L845J2698J5617Q054m346j5017j5055n888O590
945a3147J3646J2986N844n360j4086j4869n764P546J5721J3196L493p693j4066
958b553j2906m371P816J5478J3349K398r486j4640j1689j478Q458J4950J1848
971A7174J935j0777j5503j0400L43R869J4131J0300M56j0401j5631j0166J827
984a6843J2130J4263Q135j868j0924j4081r320J962J2635J4826P885m146j2635
997B019j2997o789L644J1824J4382O771m719j3844j3480m841N293J2783J2561
1010A2607N328n334j3695j2901m463P771J3276J1365L360o456j3561j1904l548
1023a8155P854J4225J1584J646q604j3006j0155k143P895J4046J0998R61j0049
$$ y = [20633, 16667, 2607, -12362, -19645, -15800, -3102, 12515, 20569, 16223, 1206, -13849, -19737, -13147, 499, 13485, 19329, 13969, -117, -14986, -20750, -13204, 2517, 15713, 19206, 11513, -2553, -15459, -19830, -12014, 3464, 16813, 19211, 9725, -4915, -16604, -18082, -9624, 5326, 17174, 19109, 8332, -7171, -17571, -17228, -7359, 6772, 17072, 17528, 7127, -8504, -18670, -16843, -4713, 9550, 17685, 15817, 4893, -9188, -18508, -16546, -3911, 10915, 18800, 14654, 2019, -10978, -17767, -14123, -2299, 12083, 18854, 14135, 291, -13189, -18030, -12737, 46, 12607, 17935, 12601, -1094, -13995, -18458, -10687, 2589, 13954, 17314, 10858, -2703, -14607, -18155, -10301, 3924, 15508, 17154, 8550, -4456, -14611, -16754, -8859, 5187, 16185, 17146, 7097]
1036G097j3806r400P50R178J2977R299n3j0299j3787q603J704J0971J2613P461
1050A6102j870j0452j3048p959K879J1386J3445O200l683j0937j2245o285L046
1063a3421J1798J2995N534m830j2473j1388m170M786J1264J1905M895n633j2715
1076a453j1712k923O691J1799J0408K944o245j2358j1147k421Q056J2620R961
1089A4220J090p983j1460j0128j026Q050J2729R580l30r024j1892q006N4Q601
1103e525J2122Q245l19r749j3284o778K286R790J0931P198j968r909j2155o506
1117a5621L017J0877J1585M988l103j0446j1034n766L843J0978J1540M673n061
1130A0470j0839j0423m005M571J0900J0581L934n703j1450j0270k590O296J1002
$$ y = [7097, -6709, -16109, -15359, -6181, 6796, 16095, 16042, 5743, -8044, -16647, -14943, -3972, 8641, 16102, 14232, 3780, -9268, -17227, -14348, -2962, 10483, 16683, 13000, 2063, -10182, -16467, -13421, -1623, 11372, 16906, 12076, -397, -11785, -15955, -11169, 95, 12000, 16895, 11262, -1453, -13165, -16088, -9397, 2402, 12810, 15754, 9509, -2849, -13996, -16417, -8361, 4259, 14220, 15310, 7327, -4133, -14261, -15287, -7237, 5492, 15072, 14742, 5718, -6174, -14180, -14126, -5525, 6597, 14842, 14523, 4774, -8510, -15288, -13002, -3212, 7719, 14917, 12949, 3040, -9115, -15621, -12604, -1727, 9858, 14846, 11743, 1297, -9737, -15503, -11660, -682, 10858, 15531, 10470, -369, -10792, -14797, -10226, 674, 11255, 15189, 9486, -1964, -12234, -14824, -8528, 2474]
1143B474R530K771o194j1874r781j456P462J1375Q381R62o975j1152q562r09P728
1158f220J1943Q070j13q199j1363p523N19P840J1606P309j544q652j1332o245
1172a3904K179Q927J0202O677k322r402j0869n583K970R812R783M838k832r217
1186A259j0519m821L917R880J0117L943m564r707r928l255M353J0430R639K966
1200A3710n260j0366r181j947N470J0101R075J954o118j0588q641j168O382J0339
1214C762P771J008o547j0469p718n88P791J0336O981n4p988r718o775O01P678
1229c929J0187O583j682q048j0281n447K022P852R834N896k209q874r967m422
1243a2485K745Q690R283M390l139q820r683m183M213R148R069K873m011r070q442
$$ y = [2474, 12004, 14775, 8581, -3293, -13074, -14530, -7068, 4307, 12688, 13650, 6675, -4477, -13039, -13948, -6220, 5723, 13793, 13680, 5481, -5882, -13405, -12886, -5046, 6560, 13869, 12325, 3673, -7659, -13904, -11725, -2798, 7404, 14081, 11759, 2357, -8512, -14095, -11125, -1313, 8470, 13308, 10476, 1259, -9260, -14081, -10164, -284, 9833, 13776, 9212, -495, -10423, -13678, -9325, 1105, 10744, 13710, 8450, -1916, -11097, -13044, -7574, 2527, 11602, 13556, 7438, -3150, -11791, -12959, -6577, 3762, 11533, 12541, 5994, -4475, -12193, -12781, -4990, 5346, 12327, 12273, 4285, -5433, -12208, -11607, -3929, 6258, 12841, 11159, 3111, -7170, -12617, -10595, -2743, 7091, 12987, 10778, 1904, -8063, -12485, -9740, -1050, 8233, 12623, 9484, 664, -9019, -13202, -8989, 159, 9228, 12101, 8090, -980, -9422]
1258i422l009M540R085Q767K431n403r359p543k223N294R121Q222J271n545r128
1273b901q125m14O018R097P325O27o336r731o720j44P009R558N881n3p129r241
1289e279o001R93P138Q701N909j646p141r056n306J798P821Q687M900j964p890
1304A664q659m552K824Q014Q612L619l148q229q568l545L771Q444Q088L068l891
1319G512q241p972k382M136Q347P764J905m397q590p116k032M977Q377P329J471
1334A1088n676q590o688q49N555Q717O516K44o146q356o025Q7O271Q804N346l18
1350I980o857q316n439J307O219Q524N203j723o541q268m607J720P016P972M403
1365A0593k145o977q350l764K434P598Q047K925l012p365p403l005L302P761P441
$$ y = [-9422, -12431, -7891, 1194, 9961, 12392, 6989, -2370, -9913, -12136, -6842, 2279, 10501, 11772, 6227, -2901, -11026, -11440, -5422, 3675, 11000, 11627, 5291, -4440, -11160, -11304, -4295, 5263, 11144, 11091, 3962, -5279, -11280, -10287, -3149, 5552, 11461, 9815, 2674, -6382, -11688, -9890, -2069, 6618, 11518, 9554, 1664, -6995, -11547, -8723, -709, 7903, 11522, 8374, 145, -8423, -11968, -8197, 247, 8335, 11403, 7512, -729, -8701, -11083, -6947, 1400, 9164, 11069, 6672, -1918, -9034, -11066, -6089, 2288, 9617, 11088, 5412, -3178, -9866, -10715, -5160, 3557, 10073, 10317, 4171, -4185, -10210, -10123, -3852, 4952, 10298, 9980, 3123, -5193, -10632, -9325, -3106, 5418, 10621, 8898, 2357, -5911, -10518, -8798, -1782, 6190, 10593, 8448, 1471, -6879, -10643, -8209, -611, 7436, 10361, 7349, -16, -7419, -10424, -7122, 639, 8080]
1380H080K086l662p662o877k252M146P458O849K166m657p522p074j140M608P968
1395B515O118J176m882p894o395o34N713P934N731N0n524p787n559L60N896P416
1411D234N189n91o101p568m382N59N871P638N063j330o832p631l586J512O449
1426a506P380L769j933o748p493l256K874O773O821L113l147o676o577k851K760
1441f697P303O556K274l538p036o027k056L472P440N966K063m157p521o070j007
1456i035M095P250N946J039m618p467n976R1M965P164M950k04m527o664n386q3
1472h460N419P058M862q86n138p331m333Q33N489P392M187j301o236p025l261
1487h731J514N906O798L483j649o619o627k862K662N846O167K651k236o191o391
$$ y = [8080, 10166, 6504, -1158, -8035, -10287, -6141, 1317, 8166, 10332, 5675, -1847, -8921, -10061, -5453, 2515, 8633, 9809, 4927, -2967, -9362, -9996, -4283, 3651, 9382, 9432, 3908, -3879, -9438, -9078, -3182, 4234, 9423, 8832, 2731, -4837, -9219, -8660, -2789, 4849, 9912, 8582, 1750, -5881, -9467, -7955, -1506, 5874, 9643, 7710, 962, -6531, -9787, -6913, -140, 6681, 9794, 6647, -29, -6606, -9457, -6697, 606, 7162, 9436, 5898, -1138, -7165, -9221, -5749, 1691, 7657, 9720, 5563, -1958, -8028, -9035, -4940, 2310, 8256, 9295, 4677, -2790, -8766, -8675, -3710, 3454, 8404, 8200, 3673, -2991, -8377, -8460, -3041, 4017, 8879, 7993, 2855, -4476, -8809, -7976, -2487, 4905, 9092, 7791, 1555, -5470, -8731, -7217, -1311, 5487, 8970, 7321, 702, -5925, -8787, -6125, -279, 5888, 8539, 6303, 112, -6279]
1502f279k597L035O599N945K049l451o270n530k207L493O525O099J243m113o776
1517b235n444o54M078O713N163O42m228o734n483L97M606O067M765K50m494o599
1533c190m933K01N293O581M377j217n114n960m028J074M908O681L736j615n499
1548A295o256k895J421N289O340K869j617n931o428j959J804N620N520K883k057
1563E898n772o020k558L078O148N215J676k857n658n686j814L535O388N266R45
1578G784l914n686m641o55L013O267M715P38m232o024m556j50M145N903M019N55
1594G281m229o251m075P29M226N978L335p77l978n863l681P09M926O159K844j278
1610F055n120n128l053J415M780N813K806j904n349n347k397K009N330M892K732
$$ y = [-6279, -8876, -5841, 758, 6703, 8752, 5301, -969, -6499, -8706, -5213, 1312, 7411, 8654, 4541, -2235, -7679, -8333, -4255, 2458, 7621, 8263, 4035, -2699, -8182, -7785, -3179, 2888, 7653, 7903, 3409, -3190, -8123, -7922, -2629, 3952, 8329, 7112, 1998, -3962, -7990, -6916, -2008, 4673, 8409, 6794, 1295, -4961, -7856, -6435, -1146, 5194, 8063, 6446, 515, -5913, -7872, -6068, -448, 5072, 7955, 5898, 126, -5894, -8452, -5374, 774, 5989, 7665, 4808, -850, -6536, -8350, -4815, 1573, 6839, 7784, 3870, -1816, -6457, -7112, -4099, 2168, 6883, 7621, 3389, -2635, -7191, -7341, -3196, 2707, 6726, 7281, 3052, -3199, -7274, -6545, -2319, 3659, 6994, 6217, 2239, -3624, -7305, -6596, -1670, 4489, 7333, 6055, 935, -4193, -7246, -5831, -1051, 4762, 7568, 5664, 315, -5032, -7429, -5420, -90, 4802, 7534]
1625G534j666n829n985j421K767N493M323J631k198n457m964j621L302N666M216
1640E791R63l163n638l728j021L365N082N317j8m303n200l950L25L428N108M364
1656F722J25m411n783l540J043M394M980K971m01m049n512l543J006M646N484
1671D132K266j380m043m774k763R85M987M853K755j813n173m512j971J725M737
1686A1M841K103k263n313n049j030K854M852L715K072k891m739m676j237L322
1701c428M796M002P66k761m576m545o33K948N715M117r4l715m624l624k38L099
1717b795N114L794l5m021n140l116P14L796M373L255n13l696m986l052J086M027
1733a195M678K124p57l831m704k648J587M607M575J351j570m424l905j795J400
$$ y = [7534, 5868, 39, -5946, -7367, -4600, 893, 5216, 6847, 4649, -808, -5772, -7393, -4091, 1575, 5791, 6754, 3591, -2047, -5775, -6796, -3431, 1651, 6968, 6950, 2647, -2553, -6503, -6178, -2750, 2358, 6722, 6847, 2436, -3347, -6887, -5844, -1450, 3530, 6501, 6100, 2051, -3461, -7004, -5998, -1352, 4132, 6398, 5018, 975, -3799, -6562, -5577, -590, 4263, 7018, 5205, 32, -4480, -6451, -4726, 11, 4852, 6955, 4692, -621, -5670, -6700, -3846, 1006, 4721, 6793, 3902, -837, -5513, -6750, -3428, 1368, 5370, 6136, 3375, -1201, -5746, -6379, -3431, 2284, 6401, 6307, 2592, -2032, -5656, -5894, -2795, 2319, 6113, 6078, 2057, -3083, -6199, -5485, -1689, 2684, 5939, 5426, 1730, -3256, -6308, -5222, -1195, 3483, 5607, 4850, 1019, -3685, -6333, -4746, -139, 4436, 5787, 4217, -207, -4112, -5907, -4507]
1748d507M493M890J747k782m701l927j106K247M370L903J711k264m936m370p56
1763e988K917M390L659O71k462m514l899p22L131M919L577o13k801m546k871L1
1779e121K841M897L068m10l858m150k553N55K959M425K855m97l612n011k039J048
1795d603L656M237K215q89l926m364k295J627M349M065J433j630l496m146j766
1810e533J471M390M132J265k193m172l652r91J892L995L681J115k183m583l488
1825d854n15K712M253K965O18k271m659l163l64L199M365K655j88l012m036k669
1841d964p7K910M751K540n91l330l790k150R6L165M057K799p68l828l894k377
1857e451J247L581L835J828j201l496l712k512K129L600L698J135j079l409l926
$$ y = [-4507, -14, 4876, 6623, 3841, -860, -4787, -5893, -3646, 724, 4627, 6338, 4074, -862, -5232, -5988, -3071, 1319, 4978, 5649, 3187, -1327, -5226, -5948, -2817, 2102, 5679, 5066, 2265, -2281, -5152, -5121, -2280, 2617, 5685, 5275, 1417, -2733, -5286, -4731, -1772, 2653, 5508, 5011, 1399, -3612, -5651, -4603, -947, 3290, 5505, 4616, 690, -3674, -5969, -4342, 7, 4072, 5505, 3875, 379, -3767, -5533, -4062, 328, 4460, 5725, 3532, -640, -4292, -5283, -3391, 604, 4285, 5400, 3217, -1366, -4854, -5369, -2657, 1596, 4561, 5179, 2908, -1751, -4914, -5278, -2079, 2286, 4941, 4753, 1741, -2295, -4964, -5041, -2131, 2620, 5160, 4569, 1239, -2551, -4701, -4605, -1440, 2617, 5416, 4648, 820, -3074, -5451, -4204, -623, 3212, 5040, 3839, 343, -3369, -5881, -3752, -152, 3546, 4681, 3602, 193, -3733]
1872c733j425J598L862L709J267k432l332l361j351K303L780L363Q21k341l783
$$ y = [-3733, -5158, -3560, 302, 4011, 5278, 2846, -486, -3847, -5198, -2895, 885, 4248, 5069, 2728, -1055]
$$ [...]
8191H3
##END NTUPLES=NMR FID
##END=
