##TITLE=1H_IAMT-156
 CDCl3, 8 sc, 
 28.07.2021
##JCAMPDX= 6.0         $$ Bruker NMR JCAMP-DX V2.0
##DATA TYPE= NMR FID
##DATA CLASS= NTUPLES
##ORIGIN= UXNMR, Bruker Analytische Messtechnik GmbH
##OWNER= root
$$ XWIN-NMR		Version 3.5
$$ Wed Jul 28 11:39:38 2021 Russian Standard Time (UT+4h)  she@DPX200
##.OBSERVE FREQUENCY= 200.131506
##.OBSERVE NUCLEUS= ^1H
##.DELAY= (6, 6)
##.ACQUISITION MODE= SIMULTANEOUS
##.ACQUISITION SCHEME= undefined
##.AVERAGES= 8
##.DIGITISER RES= 18
##SPECTROMETER/DATA SYSTEM= spect
##.PULSE SEQUENCE= zg30
##.SOLVENT NAME= CDCl3
##.SHIFT REFERENCE= (INTERNAL, CDCl3, 0, 15.7039)
##AUDIT TRAIL= $$ (NUMBER, WHEN, WHO, WHERE, WHAT)
$$ ##TITLE= Audit trail, XWIN-NMR		Version 3.5
$$ ##JCAMPDX= 5.01
$$ ##ORIGIN= Bruker BioSpin GmbH
$$ ##OWNER= she
$$ F:/spectra/data/she/nmr/H-F/1/audita.txt
$$ ##AUDIT TRAIL=  $$ (NUMBER, WHEN, WHO, WHERE, WHAT)
(   1,<2021-07-28 11:38:00.71 +0400>,<she>,<DPX200>,
      <created by zg, POWCHK disabled, PULCHK disabled
       configuration hash MD5:
       00 E9 B6 7A A2 85 ED C7 34 08 36 98 17 FE 4E 26
       data hash MD5: 16K
       65 CE 03 5A D9 48 56 5A 2A F8 7A 6E 0B 72 F0 80>)
$$ ##END=
$$ 
$$ hash MD5
$$ A4 7E 30 4D C6 54 47 95 38 D4 79 9E 8B 56 4F E3
##$RELAX= 
##$RELAX= 
##$RELAX= 
##$RELAX= 
##$RELAX= 
##$RELAX= 
$$ Bruker specific parameters
$$ --------------------------
##$DU= <F:/spectra>
##$EXPNO= 1
##$NAME= <H-F>
##$PROCNO= 1
##$TYPE= <nmr>
##$USER= <she>
##$AMP= (0..31)
100 100 100 100 100 100 100 100 100 100 100 100 100 100 100 100 100 100 
100 100 100 100 100 100 100 100 100 100 100 100 100 100 
##$AQSEQ= 0
##$AQ_mod= 1
##$AUNM= <au_zg>
##$AUTOPOS= <>
##$BF1= 200.13
##$BF2= 200.13
##$BF3= 200.13
##$BF4= 200.13
##$BF5= 200.13
##$BF6= 200.13
##$BF7= 200.13
##$BF8= 200.13
##$BYTORDA= 1
##$CFDGTYP= 0
##$CFRGTYP= 5
##$CHEMSTR= <none>
##$CNST= (0..31)
1 1 145 1 1 1 1 1 1 1 1 1 1 1 1 1 1 1 1 1 1 1 1 1 1 1 1 1 1 1 1 1 
##$CPDPRG= <>
##$CPDPRG1= <>
##$CPDPRG2= <>
##$CPDPRG3= <>
##$CPDPRG4= <mlev>
##$CPDPRG5= <mlev>
##$CPDPRG6= <mlev>
##$CPDPRG7= <mlev>
##$CPDPRG8= <mlev>
##$CPDPRGB= <>
##$CPDPRGT= <>
##$D= (0..31)
0 1.2 0 0 0 0 0 0 0 0.06 0 0.03 0 0 0 0 0.0002 0 0 0 0 0 0 0 0 0 0 0 0 
0 0 0 
##$DATE= 1627457880
##$DBL= (0..7)
120 120 120 120 120 120 120 120 
##$DBP= (0..7)
150 150 150 150 150 150 150 150 
##$DBP07= 0
##$DBPNAM0= <>
##$DBPNAM1= <>
##$DBPNAM2= <>
##$DBPNAM3= <>
##$DBPNAM4= <>
##$DBPNAM5= <>
##$DBPNAM6= <>
##$DBPNAM7= <>
##$DBPOAL= (0..7)
0.5 0.5 0.5 0.5 0.5 0.5 0.5 0.5 
##$DBPOFFS= (0..7)
0 0 0 0 0 0 0 0 
##$DE= 6
##$DECBNUC= <off>
##$DECIM= 24
##$DECNUC= <off>
##$DECSTAT= 4
##$DIGMOD= 1
##$DIGTYP= 9
##$DL= (0..7)
0 120 120 120 120 120 120 120 
##$DP= (0..7)
150 150 150 150 150 150 150 150 
##$DP07= 0
##$DPNAME0= <>
##$DPNAME1= <>
##$DPNAME2= <>
##$DPNAME3= <>
##$DPNAME4= <>
##$DPNAME5= <>
##$DPNAME6= <>
##$DPNAME7= <>
##$DPOAL= (0..7)
0.5 0.5 0.5 0.5 0.5 0.5 0.5 0.5 
##$DPOFFS= (0..7)
0 0 0 0 0 0 0 0 
##$DQDMODE= 0
##$DR= 18
##$DS= 0
##$DSLIST= <SSSSSSSSSSSSSSS>
$$ [...]
##$SUBNAM2= <"">
##$SUBNAM3= <"">
##$SUBNAM4= <"">
##$SUBNAM5= <"">
##$SUBNAM6= <"">
##$SUBNAM7= <"">
##$SUBNAM8= <"">
##$SUBNAM9= <"">
##$SW= 24.9337051412577
##$SWIBOX= (0..15)
0 0 2 0 0 0 0 0 0 0 0 0 0 0 0 0 
##$SW_h= 4990.01996007984
##$TD= 16384
##$TD0= 1
##$TE= 0
##$TE2= 300
##$TE3= 300
##$TEG= 300
##$TL= (0..7)
0 120 120 120 120 120 120 120 
##$TP= (0..7)
150 150 150 150 150 150 150 150 
##$TP07= 0
##$TPNAME0= <>
##$TPNAME1= <>
##$TPNAME2= <>
##$TPNAME3= <>
##$TPNAME4= <>
##$TPNAME5= <>
##$TPNAME6= <>
##$TPNAME7= <>
##$TPOAL= (0..7)
0.5 0.5 0.5 0.5 0.5 0.5 0.5 0.5 
##$TPOFFS= (0..7)
0 0 0 0 0 0 0 0 
##$TUNHIN= 0
##$TUNHOUT= 0
##$TUNXOUT= 0
##$USERA1= <user>
##$USERA2= <user>
##$USERA3= <user>
##$USERA4= <user>
##$USERA5= <user>
##$V9= 5
##$VALIST= <valist>
##$VCLIST= <CCCCCCCCCCCCCCC>
##$VD= 0
##$VDLIST= <DDDDDDDDDDDDDDD>
##$VPLIST= <PPPPPPPPPPPPPPP>
##$VTLIST= <TTTTTTTTTTTTTTT>
##$WBST= 1024
##$WBSW= 4
##$XGAIN= (0..3)
0 0 0 0 
##$XL= 0
##$YL= 0
##$YMAX_a= 334324
##$YMIN_a= -374106
##$ZGOPTNS= <>
##$ZL1= 120
##$ZL2= 120
##$ZL3= 120
##$ZL4= 120
##$ABSF1= 10
##$ABSF2= 0
##$ABSG= 5
##$ABSL= 3
##$ALPHA= 0
##$AQORDER= 0
##$ASSFAC= 0
##$ASSFACI= 0
##$ASSFACX= 0
##$ASSWID= 0
##$AUNMP= <proc_1d>
##$AZFE= 0.1
##$AZFW= 0.1
##$BCFW= 1
##$BC_mod= 2
##$BYTORDP= 1
##$COROFFS= 0
##$CY= 11.3945322036743
##$DATMOD= 1
##$DC= 2
##$DFILT= <>
##$DTYPP= 0
##$F1P= 2.36226072786647
##$F2P= -0.459571619588291
##$FCOR= 0.5
##$FTSIZE= 0
##$FT_mod= 4
##$GAMMA= 1
##$GB= 0.15
##$INTBC= 1
##$INTSCL= 1
##$ISEN= 128
##$LB= 0.24
##$LEV0= 0
##$LPBIN= 0
##$MAXI= 10000
##$MC2= 0
##$MEAN= 0
##$ME_mod= 0
##$MI= 1.114404
##$NCOEF= 0
##$NC_proc= 0
##$NLEV= 6
##$NOISF1= 3.799351
##$NOISF2= 2.8
##$NSP= 1
##$NTH_PI= 0
##$NZP= 0
##$OFFSET= 15.70392
##$PC= 1
##$PHC0= -12819.78
##$PHC1= 16.80099
##$PH_mod= 1
##$PKNL= yes
##$PPARMOD= 0
##$PSCAL= 0
##$PSIGN= 0
##$REVERSE= no
##$SF= 200.130013532006
##$SI= 16384
##$SIGF1= 3
##$SIGF2= 2
##$SINO= 400
##$SIOLD= 16384
##$SREGLST= <1H.CDCl3>
##$SSB= 0
##$STSI= 0
##$STSR= 0
##$SW_p= 3612.71676300578
##$SYMM= 0
##$S_DEV= 0
##$TDeff= 0
##$TDoff= 0
##$TI= <>
##$TILT= no
##$TM1= 0
##$TM2= 0
##$TOPLEV= 0
##$USERP1= <user>
##$USERP2= <user>
##$USERP3= <user>
##$USERP4= <user>
##$USERP5= <user>
##$WDW= 1
##$XDIM= 8192
##$YMAX_p= 0
##$YMIN_p= 0
$$ End of Bruker specific parameters
$$ ---------------------------------
##NTUPLES= NMR FID
##VAR_NAME=  TIME,          FID/REAL,        FID/IMAG
##SYMBOL=    X,             R,               I
##VAR_TYPE=  INDEPENDENT,   DEPENDENT,       DEPENDENT
##VAR_FORM=  AFFN,          ASDF,            ASDF
##VAR_DIM=   8192,          8192,            8192
##UNITS=     SECONDS,       ARBITRARY UNITS, ARBITRARY UNITS
##FACTOR=    0.0002004,     1,               1
##FIRST=     0,             0,               0
##LAST=      1.6414764,     0,               0
##MIN=       0,             -374106,         0
##MAX=       1.6414764,     334324,          0
$$ Real data points
##PAGE= N=1
##DATA TABLE= (X++(R..R)), XYDATA
$$ [...]
2768a309k337K974M649j882n268o06N699K635m931m394L495N492j711n581l28
2783c403M815K129l466l004J243L394J031k714l220J497M212N85m888k461M481
2798B31M270l362n504J393O225O52n864k571M797L802k811m305N51M036J336k564
2814C12l254R90L899J179l804k972K768M707j337n354q33N401K691m285m414K617
2830a689N297r29m714j581L911L220j900m182p40M843K495l887m362K458N423
2845C663l68n427k063N154L386l399m649J490M717O72l849k374J981L480J78l622
2861a030k370K866M389j484n407o79N895K603n154m317L516N512j471n985l17
2876c433M911K091l637l245J613L651Q98l391k773K027L931L42m857j978M094
$$ plain form
2768 -1309 -3646 -672 3977 2095 -3173 -3779 1920 4555 -376 -4770 -1275 4217 2506 -3075 -3403
2783 -3403 1412 3541 75 -2929 -1686 1708 2739 25 -3195 -1698 2514 3099 -1789 -4250 231
2798 231 4501 1139 -4365 -2972 3253 3905 -1959 -4530 267 4069 1258 -3047 -2496 1540 2876 312
2814 312 -2942 -1952 1947 3126 -678 -3650 -882 3825 2488 -2866 -3699 1702 4393 108 -4306 -1689
2830 -1689 3608 2679 -2035 -3616 295 3515 1615 -2567 -3307 1536 4031 144 -4218 -1760 3663
2845 3663 3295 -2132 -4195 959 4345 946 -3703 -2213 2504 3176 -673 -3047 -1066 2414 2592 -1030
2861 -1030 -3400 -534 3855 2371 -3036 -3715 2180 4783 -371 -4688 -1172 4340 2869 -3116 -3433
2876 -3433 1478 3569 -68 -3313 -1700 1951 2849 -542 -3315 -1288 2643 2985 -1872 -3850 244
2891B44M159l215n143R91N678J202n654k440L907L953k076m140l36L748J962j832
2907A008l899M33M367J580m356l134L000M567j599m973m98M852K555m054l745
2922c896K544M129k90l938j448K836K641j092l592r47L884K578k785m252J813
2937a815M592L28m539k224M052L244k286m573J166M166O75l188k294J767L089
2952B160L90l541k001K756L553j729m145r3M624J528l872l108K619M235j293m305
2968b222m61M095J609l079k481J255K898Q41k819k269J737L430k24m085j206L764
2984G83K719k889l843J281M514M49m489j875L620K842k155l263K95L131J447k361
3000B06k940J201L691M37l681k167K936L472j774m130K68L985J557l516k923K515
$$ plain form
2891 244 4403 1188 -3955 -2964 2714 3916 -1738 -4178 -271 3682 1606 -2534 -2870 878 2840 1008
2907 1008 -2891 -2458 1909 3489 -867 -4001 -1001 3566 1967 -3006 -3504 1348 3903 -151 -3896
2922 -3896 -1352 2777 2487 -1451 -2899 -63 2578 1486 -2106 -3053 831 3409 624 -3628 -1815
2937 -1815 2777 3105 -1434 -3658 394 3638 1352 -3221 -2055 2111 2786 -402 -2696 -929 2160
2952 2160 2550 -991 -2992 -236 3317 1588 -2557 -2650 1974 3502 -370 -3478 -859 3376 2083 -2222
2968 -2222 -2683 1412 3021 -58 -2539 -1284 1614 2455 -364 -2633 -896 2534 2310 -1775 -2981 783
2984 783 3502 613 -3230 -1949 2565 3014 -1475 -3350 270 3112 957 -2306 -2011 1120 2567 206
3000 206 -2734 -1533 2158 2595 -1086 -3253 -317 3155 1381 -2749 -2481 1504 3061 -455 -3378 -863
3016h63L458o73l540j037L116K212j364l681k45L835K041l321l480K184M340n20
3032B462m418j289L724K949k678l913J164M186K77l400j934K217L150m75l537
3047a515j304L182K786k055l916M28M503Q89l784k619K814L935j456m375j94L965
3063A284J732k791l064J313L539O74l484k170K372L749r48m360n06L752K315k898
3079E09l605J382M487rm103j594L229K902k044l467J60L434J620k602k913R32
3095a682M087N97m329j904L355K978j849l979O4M421J405l656k765K569L401n91
3111B122l596j180K846K695j678l609j41M207J602l587l049K011M011n43m012
3126a901j235L694K679k699l510J015L793P52l426k184K407L002o05l473j244
$$ plain form
3016 -863 2595 1922 -1618 -2655 461 2673 1309 -2372 -2617 1218 3259 -62 -3542 -1358 2982 2462
3032 2462 -1956 -3245 479 3428 750 -3163 -1999 2187 2464 -936 -2870 -653 2497 2022 -1515
3047 -1515 -2819 363 3149 1094 -2822 -2394 2109 2998 -786 -3405 -591 3344 1888 -2487 -2681 1284
3063 1284 3016 225 -2839 -1526 2013 2687 -797 -2967 -595 3154 2206 -2154 -2660 1092 3407 509
3079 509 -3096 -1714 2773 2764 -1339 -2933 296 3198 1154 -2313 -2153 1281 2901 299 -2614 -1682
3095 -1682 2405 3002 -1327 -3231 124 3102 1253 -2726 -2662 1759 3164 -492 -3257 -688 2713 2122
3111 2122 -1474 -2654 192 2887 1209 -2400 -2541 1666 3268 -319 -3368 -1357 2654 2111 -1901
3126 -1901 -3136 558 3237 538 -2972 -1957 1836 2588 -838 -3022 -615 2387 1782 -1691 -2935
3141b935L484K673k404l799R76M045Q77l882k527L024L464j297m240j02L883J735
3157B975k615l127J235L305O18l131k247K395L479r36m011p98L844K228k890l514
3173c190J578M238L6l935j832K943L110j642l509j69L308J965k401l344J406L976
3189B538P1l872j663L090K915j666l949L41L648J644l222k942K062L440l23l271
3205a159j305K478K853j468l688n7L750J754l373l152K426L780p52l723j323L495
3221E36K481k247l435J010L437O19k879k447J995L180m93l239j324L230K603k322
3237G05l408O67L733Q04l146k327K361L141q80l541o27L002K170k195k911O17
3253a835L546R90l120k520K287L474r60m027o26L708K011k675k986J163L472L41
$$ plain form
3141 -2935 549 3222 818 -2981 -2005 2040 2917 -965 -3492 -468 2996 1699 -2541 -2643 1240 2975
3157 2975 360 -2767 -1532 1773 2391 -740 -2987 -592 2887 1951 -2060 -2858 986 3214 324 -3190
3173 -3190 -1612 2626 2662 -1273 -3105 -162 2948 1306 -2203 -2372 936 2901 500 -2844 -1438 2538
3189 2538 2609 -1263 -2926 164 3079 1413 -2536 -2195 1453 3097 -125 -3067 -1005 2435 2112 -1159
3205 -1159 -2464 14 2867 1399 -2289 -2346 1404 3158 -215 -3367 -941 2839 2087 -1636 -2959 536
3221 536 3017 770 -2665 -1655 1782 2401 -478 -2925 -930 2250 1757 -1482 -2806 424 3027 705
3237 705 -2703 -2036 1697 2501 -645 -2972 -611 2530 1650 -1891 -2518 484 2654 459 -2452 -1835
3253 -1835 1711 2701 -419 -2939 -652 2822 1862 -2165 -2791 917 2928 253 -2733 -1570 1902 2243
3269B243l458j441K630K507j466k851l46K998J633k102l048J103L824L03l708
3284a179j723K931K899j708l465L26L287J239k886k070J465L304l38l165j109
3299b192J995K855j386l321p4L580J564l461k405J860L508n51l642o81L063K005
3315B717k203k770Q25K868P84k706j767J531K921k25l076j533K892K628j871l647
3331b632O20L969M40l185k139K461L046j147l260o30L111J928k293k764Q99L216
3347A640O20l019k147K287L334j124l870k2L459J754k935k572J417K855K50k845
3363i18j484K268K574r36l140r51L050K193k275l217J065M050M15m042j676L092
3379F8K846j905l248L77L021J254k620k215J371K813J46k762j393J997K456n24
$$ plain form
3269 2243 -1215 -2656 -26 2481 1015 -1836 -2182 816 2449 347 -2701 -1598 2226 2529 -1179
3284 -1179 -2902 29 2928 1220 -2245 -1919 1368 2607 -279 -2349 -884 2420 2082 -1083 -2192
3299 -2192 -197 2658 1272 -2049 -2123 1457 3021 -440 -2845 -985 2523 1972 -1670 -2351 712 2717
3315 2717 514 -2256 -1431 1437 2221 -485 -2252 -721 2200 1975 -1101 -2634 258 2886 1015 -2632
3331 -2632 -2012 1957 2397 -788 -2927 -466 2580 1433 -1827 -2457 654 2582 289 -2475 -1576 1640
3347 1640 2260 -759 -2906 -619 2715 1591 -2279 -2301 1158 2912 -23 -2595 -1178 1677 1927 -918
3363 -918 -2402 -134 2440 1504 -1636 -2587 463 2656 381 -2836 -1771 2279 2694 -1348 -3024 68
3379 68 2914 1009 -2239 -1862 1159 2413 -207 -2422 -1051 1762 1908 -854 -2247 -250 2206 1682
3395A682l551l67L137K075k880l009J863L385m00l485j045K990K090j514l010
3410b039L99K667J003j910k167R43K905L0k516j731K377K632j690l100N57L302
3426A662N78k589j992J869K650p13k688p85K429J835j554k434L11K647P16k295
3442c53j926J759K839r55l338lK975J164k368j771J013K403K09k383j220J684
3458b71K084p68k369o06K287J802j712k774Q57L209J91l298j158K811K225k160
3474C50k449Q88K243P12j953j829J548K012k13k121j242J790K069o32l015k59
3490b101L215J412k833k377J896K838o83k825n09K399J603j549k451O67K719P05
3506B126k526j792J517K468j73l062p89K630K161k163k716J021L034J02k749j212
$$ plain form
3395 1682 -1869 -2236 901 2976 96 -2913 -1050 2335 1935 -1550 -2595 395 2485 971 -2039
3410 -2039 -1640 1027 2030 120 -2047 -1104 1801 1831 -685 -2416 -39 2593 903 -2197 -1640 1662
3426 1662 2240 -349 -2341 -472 2178 1465 -1223 -2008 421 2256 702 -1732 -1421 1226 1942 -353
3442 -353 -2279 -520 2319 1364 -1974 -1977 998 2162 -206 -1977 -964 1439 1648 -735 -1955 -271
3458 -271 1813 1045 -1324 -1930 357 2159 447 -2327 -1470 1739 1930 -1368 -2526 285 2510 350
3474 350 -2099 -1211 1032 1744 -209 -2038 -490 1522 1309 -812 -2054 -264 1805 1173 -1842 -2101
3490 -2101 1114 2526 -307 -2684 -788 2050 1367 -1458 -1967 432 2035 486 -1965 -1298 1421 2126
3506 2126 -400 -2192 -675 1793 1620 -1442 -2231 399 2560 397 -2319 -1298 1736 1838 -911 -2123
3522b123J875K334r47k411l77K210J596j665k407N61K960N81k755j795K127K592
3538B356q81l397J72L055P89k263j800R87K631K1k337j366J987J941q80k262n46
3555a793K598J450j807k742R58L106K69l263j148K745K003j649k713O78K500O51
3571A843k076j662J188K039J3j917j315J832K008r95k707j09K921J066k581j975
3587b427J659K646o20k861k93K457J404j487k540P98K402N18k093j437J197K474
3603A797l48k547j050K670J946k244k646J311K775m6k526j144J821K090p12k440
3619a293l57K365J250j544k254O73K622N29k688j746K494K164j069l032j1L162
3635A265P19k211j751J338K274k54k093j086J863J791p27k689q4K310J542j939
$$ plain form
3522 -2123 -248 2086 1139 -1272 -1649 561 2157 492 -1915 -1354 1606 2187 -568 -2363 -236 2356
3538 2356 1475 -1922 -1750 1305 2094 -169 -1969 -982 1649 1670 -667 -2033 -46 1895 1015 -1247 -1793
3555 -1793 805 2255 448 -2294 -1336 1770 2039 -1224 -2372 373 2376 727 -1986 -1308 1192 1843
3571 1843 -233 -1895 -707 1332 1345 -572 -1887 -55 1953 958 -1749 -1858 1063 2129 -452 -2427
3587 -2427 -768 1878 1258 -1603 -1896 561 1965 478 -2062 -1264 1138 1656 -437 -1874 -677 1797
3603 1797 1449 -1098 -2148 522 2468 224 -2422 -1111 1664 1618 -908 -2052 -231 1859 1147 -1293
3619 -1293 -1650 715 1965 421 -1833 -1160 1462 1991 -697 -2443 51 2215 1146 -1886 -1897 1265
3635 1265 1984 -227 -1978 -640 1634 1380 -713 -1799 64 1855 1128 -1561 -1645 665 2207 268
3651B68k495J171K856J51l097j047K511J843j607k405O58K371N05j869j770J441
3667e15K212k53k501q86J934K031j089k839J77L007R44k810j804J903K564j026
3683A049k512m03K241J573j262k485O00K315N32k041j630J517K322m81k711p83
3699b159K488J775j722k573J128K482J91k188j048J212K201q24k169m86K102J504
3715A914j705j926L82K591O17k339j759K150K099p22k876q3K747Q43k172j569
3731a808J203J838q2k021p34J754J781j162k192k25K466J333k038j986J027K580
3747A734k84k506p25K194J624j579k231M99K476M69j788j860J626K094m88k119
3763h64p46J983J696j425k393M47K547P87k426j864J823K297q08k607o8K147J323
$$ plain form
3651 268 -2227 -1056 1800 1951 -1146 -2193 318 2161 554 -1851 -1193 1178 1683 -186 -1956 -515
3667 -515 1697 1444 -1057 -1943 -9 2022 933 -1906 -1729 1278 2222 -588 -2392 -489 2075 1049
3683 1049 -1463 -1866 375 1948 686 -1799 -1199 1116 1648 -393 -2023 -506 1816 1335 -1376 -2159
3699 -2159 329 2104 382 -2191 -1063 1419 1610 -578 -1626 -414 1787 963 -1206 -1692 410 1914
3715 1914 209 -1717 -1335 1256 1873 -466 -2225 -75 2024 1302 -1574 -1657 1090 1933 -239 -1808
3731 -1808 -605 1233 1151 -870 -1604 150 1931 769 -1423 -1648 818 2151 113 -1873 -846 1734
3747 1734 1450 -1056 -1781 413 2037 458 -1773 -1274 1202 1671 -117 -1977 -351 1743 1255 -864
3763 -864 -1610 373 2069 644 -1749 -1302 1245 2032 -394 -2258 -435 1862 1054 -1553 -1621 526 1849
3780A849j576j977M40K487N51k301j239J308K307n35k811m70K618J573j957k544
3796b277J230K621j64k339q53J408K254r19k519j26K342J292j668k205P62K426
3812A265N43k431j657J964K342r65k728q0K602J277k040j942J037K092K05k380
3828h96j024J798J831q21k432j22K582R79j994j901J022K564M9k671q91K252J533
3845A858j173k121K82J870J003j890j634J096K220O8k572r38K059J907j327k253
3861a545M11K391N82k158j612J436K186p86j991o44K143J263j048k079N97J902
3877A048L54j611j506J322J874k45k345n66J981J529j571k114J015K066K22j796
3893c43j139J006J992o45k235k39K122J161j591j825Q94K304J73k380j211J930
$$ plain form
3780 1849 273 -1704 -1264 1223 1774 -527 -1766 -458 1849 1314 -1497 -1967 651 2224 267 -2277
3796 -2277 -1047 1574 1410 -929 -1782 -374 1880 961 -1558 -1684 658 1950 282 -1923 -1161 1265
3812 1265 1808 -623 -2280 -316 2026 1061 -1667 -1747 855 2132 92 -1850 -813 1279 1484 -896
3828 -896 -1920 -122 1709 888 -1544 -1666 916 1895 -99 -2000 -978 1586 1635 -1036 -1927 325 1858
3845 1858 685 -1436 -1154 716 1719 -171 -1805 -709 1511 1579 -993 -1931 128 2035 708 -1545
3861 -1545 -1134 1257 1839 -319 -1931 -495 1691 905 -1086 -1730 413 1676 628 -1451 -854 1048
3877 1048 1402 -209 -1715 -393 1481 1236 -1109 -1675 306 1835 264 -1850 -835 1231 1453 -343
3893 -343 -1482 -476 1516 871 -1364 -1603 519 1680 89 -1736 -842 1462 1635 -745 -1956 -26
3909b6J931j038k310Q5K324O03j657j685R28K172Q1k211q18J460J986j183k015
3926a373k40K216J224j812j908J021K475k13k616o41K069J554j324k046K67K278
3942I31Q05j878j766J304K069j61k290r42K160J712j166k351J69K545N25j920
3958b54j663J563K024n12k187m54J700J593j157k244M38K203O93j825j758J325
3974e15K329n33k463p00K336J459j567k070Q64K078L17j983j250J489J686m24
3990A053j927n22J939R39j098k000P31J936L97k019j363J779J878q24k059m00
4006a560K171Q94j440j521N09J993M01k058r86J394J862q80k176k1J861J131j696
4023a22j512Q91K098l26k023o12J762J423j147j673L88J694L88j380j274Q90J815
$$ plain form
3909 -26 1905 867 -1443 -1358 966 1569 -88 -1773 -845 1327 1408 -803 -1621 -161 1825 642 -1373
3926 -1373 -1613 603 1827 15 -1893 -872 1603 1390 -1226 -1867 202 1756 432 -1614 -1347 931
3942 931 1736 -142 -1908 -604 1465 1304 -986 -1928 232 1944 778 -1573 -1404 1141 1666 -254
3958 -254 -1917 -354 1670 1158 -1029 -1483 217 1810 653 -1591 -1153 1050 1743 -82 -1840 -515
3974 -515 1814 1281 -1182 -1882 454 1913 346 -1724 -860 1218 1535 -448 -1698 -209 1477 1053
3990 1053 -874 -1396 543 1482 384 -1616 -885 1051 1448 -571 -1934 -155 1723 899 -1160 -1560
4006 -1560 611 1505 65 -1456 -947 1046 1447 -611 -1597 -203 1659 779 -1397 -1418 443 1574 -122
4023 -122 -1634 -743 1355 1029 -994 -1606 156 1579 432 -1241 -853 841 1229 -151 -1425 -535 1280
4040A280k70j887m95J435J436j028j979M23K008M40j767j356J460J803n92j924
4056a013l94J726J120j016j838J60K276M51j883j193J318K093r70k059l97K304
4072F85J111j613j724P59K191l39j635q99J352J530o56j805k90J729J183j592
4088a3j645O07K140M04k125j133J642J986p85k465R0K188Q33j710j451P49J621
4105I33L27j656j264J557J788r00j888j72K095R33j615j754R24J990M1k157q72
4122a690J589J547q83j706j01J654R82j242j634O08K148k8j876r15J771J420j064
4139E80k063K32K151N53j847j010R72J584m68j232o76J252J204n90j725K1J834
4156G72O39j590j394J158J556j27k150j67J664J206j454j316M57J662J70j317
$$ plain form
4040 1280 1010 -877 -1372 63 1499 471 -1508 -1085 923 1363 -404 -1760 -300 1503 911 -1013
4056 -1013 -1407 319 1439 423 -1415 -1255 1021 1472 -411 -1604 -286 1807 837 -1222 -1619 685
4072 685 1796 183 -1541 -782 1409 1070 -565 -1464 -112 1418 762 -1043 -1333 396 1579 -13
4088 -13 -1658 -1051 1089 1493 -632 -1765 -123 1863 1078 -1387 -1297 891 1724 14 -1437 -688 933
4105 933 1260 -396 -1660 -103 1685 785 -1103 -1275 820 1753 138 -1616 -692 1298 1339 -818 -1690
4122 -1690 -101 1446 563 -1143 -1244 410 1392 150 -1484 -876 1272 1244 -632 -1547 224 1644 580
4139 580 -1483 -1251 900 1453 -394 -1404 -432 1152 684 -548 -1224 28 1232 642 -1083 -1062 772
4156 772 1411 -179 -1573 -415 1141 1014 -1136 -1303 361 1567 113 -1203 -746 916 1086 -231
4172b31j013R63J275q2j722l76J437J156j180j655O48J761K62j933p25J455J622
4189A662r23j839K50J538M74j253j258P45J659k0j583r29J552J552r83j833J97
4206i92J688O98j344j435J088J563l30j794l68J532J005r93j477L68J625O18j608
4223a56j429J105J911l86j849o62J733J271j275j562M64J923L17j809j114J422
4239i6J377p55j371n17J542J198j025j790M10J892N73j758j046J046J597n44j727
4256i94n76K378N13j259j459R11J377j2j309p84J032J186k70j876j78J611J122
4273A413j497j238O24J888j02j750q19J447J366p32j816L41J511O44j344j217
4289a281P30J420K13j743m26J068J258o87j668kJ925M54j511q84Q08J631n59j216
$$ plain form
4172 -231 -1244 -281 994 912 -810 -1186 251 1407 227 -1428 -780 981 1243 -690 -1415 40 1662
4189 1662 739 -1100 -850 688 1162 -91 -1349 -604 1055 1035 -548 -1477 75 1627 644 -1189 -992
4206 -992 696 1394 50 -1385 -297 1266 936 -858 -1226 306 1311 318 -1159 -791 834 1452 -156
4223 -156 -1585 -480 1431 1045 -804 -1466 267 1538 263 -1299 -835 1088 1405 -404 -1518 -96
4239 -96 1281 526 -845 -1362 180 1378 353 -1437 -1027 865 1438 -320 -1366 -320 1277 733 -994
4256 -994 -1570 808 1321 62 -1397 -486 891 879 -430 -1214 -182 1004 734 -1142 -1320 291 1413
4273 1413 -84 -1322 -698 1190 1088 -662 -1481 -34 1332 600 -1216 -875 636 1280 -64 -1281
4289 -1281 -551 869 1082 -661 -1087 -19 1239 552 -1116 -1118 807 1261 -250 -1134 -326 1305 746 -470
4307d70o20J479O16r26j045L07J323N10j216j411J107J512k44j707l49J606Q66
4324A338j212j382O58J546O6j650p92J355J144m66j377r8J348O49q06j604M11
4341h72J800L04j900n87J270J318q35j579P8J665P07j552j206Q86J464j20j478
4358f37n54J206J207p54j507k50J840R20j611j345J107J386j74j720o83J741J236
4375A408j116j673N05J563O16j588r67Q19J645p2j785p92J348J432r26j656k6
4392a265K131L74j686j129J289J677o52j557m45J414R68r36j288J59J708N20j217
4409F5j352R96J678m14j654m51J528J217j246j745N76J786K03j591q29J198J268
4426A233n76j354k97J095J174p85j686M14J650N39j626j093J231J359n74j422
$$ plain form
4307 -470 -1090 389 1005 79 -966 -659 664 1174 -42 -1453 -346 1166 922 -785 -1134 472 1338
4324 1338 126 -1256 -598 948 1014 -636 -1428 -73 1071 605 -772 -870 478 1127 321 -1283 -872
4341 -872 928 1232 -668 -1255 15 1333 498 -1081 -1003 662 1369 -183 -1389 -503 961 841 -637
4358 -637 -1191 15 1222 468 -1039 -1289 551 1471 -140 -1485 -378 1008 834 -886 -1569 172 1408
4375 1408 292 -1381 -876 687 1303 -285 -1252 -433 1212 1140 -645 -1437 -89 1343 417 -1239 -1265
4392 -1265 866 1240 -446 -1575 -286 1391 739 -818 -1263 151 1119 183 -1105 -946 762 1282 65
4409 65 -1287 -291 1387 973 -681 -1132 396 1613 367 -1378 -802 984 1187 -404 -1233 -35 1233
4426 1233 657 -697 -994 101 1275 490 -1196 -782 868 1407 -219 -1312 -81 1278 704 -718
4442g18k01J236J063j301j187O44J370J96j389p36Q93J242l98j671k8J643O68
4459A326j355j240P37J549r6j445p79J216J275r45j308K47J415J50r18r28Q51
4476b48J193n7j426p51J337J303r97j580K05J796L18j263j278J122J443m37j381
4493g01n60J535J027j022j483L29J773L63j653r14J114J314n65j507j81J580P83
4510A232j208j132N29J389R0j579o24J253J244n26j430m27J700P79r57j558M27
4527g98K000j4j623q92J430J266p17j697o2J801R00j384j491P32J574N1j659n98
4545a181J110J307m80j751k41J974N43j295j377Q11J686j3j597q16J421J166o47
4562F20j776J85J464P42j245j245P66J294J50j455q11J350J236q50j790O53J426
$$ plain form
4442 -718 -919 317 1380 79 -1108 -464 906 1102 -287 -1023 -130 1112 714 -957 -985 658 1326
4459 1326 -29 -1269 -532 1017 921 -524 -1303 -87 1188 243 -1065 -818 597 747 -171 -1099 -248
4476 -248 945 888 -538 -1289 48 1351 354 -1226 -1021 775 1093 -170 -1448 -326 1117 680 -701
4493 -701 -1261 274 1301 279 -1204 -875 898 1261 -392 -1306 -192 1122 557 -950 -1131 449 1232
4510 1232 24 -1108 -579 810 900 -679 -1303 -50 1194 668 -762 -1189 511 1290 333 -1225 -798
4527 -798 1202 1188 -435 -1327 103 1369 652 -1045 -1107 694 1594 210 -1281 -549 1025 1076 -583 -1181
4545 -1181 -71 1236 756 -995 -1236 738 1281 -14 -1391 -580 1106 1093 -504 -1320 101 1267 620
4562 620 -1156 -971 493 1235 -10 -1255 -489 805 955 -500 -1311 39 1275 425 -1365 -712 714
4579G14M64j515q11P95J332k99j715J02J205P06q60r55K49J270N37j411r68J013
4597a47J298l98j672k66J405Q14q69j166M79J275K20j474p27R53J235m41j392
4614h73kJ175P93j116j212M87J602L8j425n13J153J096m93j579J05J477M77j265
4632g5j064R16J020j7j392n29J200R78m49j367JJ644K81j363j061R31J442j78
4650I18j408o29J573Q59p45j460J19J382M36j206q44P07J119N2j548l59J342R17
4668A225r21j347K76J314L80j089j223J161J457m63j368m82J333Q44p92j291J42
4685h44J314N32j224r82R31J522n87j458k20J326P05q19j359M19J425J57j032
4702a94j015R74J280n95j107m56J269Q80q14j440N89J441n1j289m91R52J139m07
$$ plain form
4579 714 1178 -337 -1148 -353 979 680 -1035 -933 272 978 118 -837 -588 682 1219 -192 -1160 -147
4597 -147 1151 753 -919 -1185 220 1034 165 -1001 -522 753 973 -501 -1228 -275 960 519 -873
4614 -873 -875 300 1093 -23 -1235 -748 854 892 -533 -1046 107 1203 710 -869 -764 713 1190 -75
4632 -75 -1139 -223 797 780 -612 -1141 59 1037 588 -779 -778 866 1147 -216 -1277 -346 1096 918
4650 918 -490 -1119 454 1313 568 -892 -773 609 1045 -161 -1005 -298 821 873 -675 -1034 308 1225
4668 1225 304 -1043 -767 547 927 -162 -1385 -224 1233 770 -598 -1080 253 1097 305 -986 -844
4685 -844 470 1002 -222 -1204 -273 1249 662 -796 -1016 310 1015 196 -1163 -744 681 838 -194
4702 -194 -1209 -235 1045 450 -657 -1113 156 1036 222 -1218 -629 812 761 -528 -1019 -67 1072 665
4720F65j773J06J394O51j269q45O30J233o4r11p42O05J341n62j332pJ313N39q96
4739G6r63M84J360k12j202m01Q97J019o79j237K71J055L96p54j010O47J228k15
4757G60j345k54J093Q01o50j355K64J487J07j020r42R95J052m55j105r2J123L54
4775H18o78q67R8J274K94j198o65Q51J139l98j589O7J467M42j035q56N71R92R5
4794H22j153p00R53J106o50j144O7R68O81q72j183N91J384j12j283m88J131Q32
4812I50p13q33l15J295L79q64r13N54J201r1j126m94J025R09o71j333L07J481
4830G48J19j212o20N29J503o65j114j33J005P60p44r46Q8J397K39j319o05M88
4848d82J267o1j339j99J135P72r62j153M04J093K32j162m18P70R65l73j085j43
$$ plain form
4720 665 -1108 -1002 392 1043 -226 -1071 -441 792 728 -183 -925 -320 1021 459 -873 -880 433 972 76
4739 76 -887 -403 957 745 -457 -858 39 1058 379 -858 -587 468 864 110 -900 -253 975 760
4757 760 -585 -839 254 1055 405 -950 -686 801 908 -112 -1054 -59 993 538 -567 -659 464 818
4775 818 140 -727 -629 645 939 -259 -924 -73 1066 668 -921 -854 613 1055 20 -836 -265 727 822
4794 822 -331 -1031 -78 1028 378 -766 -699 269 950 78 -1105 -514 870 758 -525 -1013 118 950
4812 950 237 -596 -911 384 763 -101 -1014 -460 741 650 -476 -970 55 964 293 -1040 -733 748
4830 748 867 -345 -965 -436 1067 402 -712 -845 160 920 176 -770 -682 715 954 -365 -970 -482
4848 -482 785 724 -615 -814 321 1093 131 -1022 -618 475 707 -455 -873 -103 862 489 -596 -739
4866g39R63N73p22q62L67J078M75j275p86R24J178q00r31j74J042N51r07p92N62
4885b75J156j07j176m17R99P78n81r36R1Q20M55q27p65N22J204k85j291k92J267
4904C40M11m96r83M24P41M88j067o99O39R44j09j204k28J022P46r10q73K18J109
4923E13K71j234n85J033P10m61j028O5J176K86o18r12L10J005K84j100o44R50
4941B1Q90k67j336j14J165N60r94q59N43J118J52j445k74R37O77l42j226K4J175
4960D05N53q81r55M43R16K59j153o06J024R74o50q52r5J199L19j160o37L81J473
4979I57k12j382j40R71O35o22j008J25J302L52j164r17P89J347k28j304k42R97
4997B56Q66q29j018K96Q28M05r48p02O29R42j59j303j01R45Q18o90j103J83J419
$$ plain form
4866 -739 224 797 75 -787 -420 658 1133 -142 -928 -4 1174 374 -557 -731 311 862 -45 -837 -275
4885 -275 881 774 -402 -819 180 958 377 -559 -468 352 807 -20 -785 -263 941 656 -635 -927 340
4904 340 751 255 -728 -304 437 925 -142 -841 -202 742 633 -571 -799 223 969 59 -814 -596 513
4923 513 784 -450 -1035 -2 708 247 -781 -716 460 746 128 -784 -474 531 815 -285 -929 21
4941 21 911 644 -692 -806 359 919 -75 -934 -391 727 879 -566 -840 97 774 432 -794 -770 405
4960 405 958 77 -878 -435 481 740 -413 -1019 5 979 329 -523 -618 581 900 -260 -897 -516 957
4979 957 745 -637 -777 194 829 207 -801 -676 626 978 -186 -1103 -314 1033 805 -499 -741 256
4997 256 1122 293 -725 -429 399 804 -144 -846 -217 725 566 -737 -838 107 925 235 -868 -685 734
5016G34R1j204o17R73Q54k82j141k68R15P15l64j256J18J380J78j056p93Q88J151
5035A016m44j299k1J129N41r46r23N14J290j99j032m46Q31Q59o00j002J54P09
5053A31P15j004p32M46J005L11j230o15J068R04o57j251K94J018K81q36o38M56
5071c34J134k28j195k17R65O88p11j046M33R30N04r69q77P09R60j95j045k75Q63
5090I4P73o66j025K45J106M45j130o22P03J002l34j187j27J092N60p26j138L95
5108e40J027L79j186o06R21Q47l38r45q8P09P47o20j139L49J084K20r39r59R57
5127a20Q45lj375k11J033P54p52j183P20J147j12j106m82R21P78m61j121j34J319
5146D57L27o89r24M88R26Qr54m45Q14R35p17q99r1J253M02j056q07N26J206r9
$$ plain form
5016 734 825 -379 -996 -23 831 549 -592 -860 55 770 406 -850 -732 648 826 -230 -1023 -135 1016
5035 1016 572 -727 -748 381 922 -24 -947 -433 857 658 -374 -820 11 870 270 -732 -578 131
5053 131 846 -158 -890 -444 561 872 -358 -973 95 999 342 -909 -615 403 684 -152 -790 -334
5071 -334 800 572 -623 -840 125 813 102 -944 -511 419 923 -46 -923 -214 746 551 -494 -769 94
5090 94 867 201 -824 -579 527 972 -158 -780 -77 925 591 -596 -723 369 929 203 -935 -540
5108 -540 487 866 -320 -926 -5 842 504 -441 -529 180 927 307 -832 -483 601 821 -118 -1077 -120
5127 -120 725 722 -653 -864 169 923 171 -1012 -292 855 743 -363 -845 76 854 393 -728 -862 457
5146 457 784 95 -829 -341 585 593 -361 -806 8 943 226 -673 -764 489 891 -165 -972 -446 760 661
5166F61j109l58J000N47l34r89QQ14P17q75r85O81J022k00j282m8J164M07p15
5185A26p85j04J234L10r64o85O91R44k68r08m08J082N47o01r34J71R75J68q43
5204b52o58P61R69l32r62j17P84Q03p70j050L25J069K71j100o35Q87Q31m20j083
5223f79J01Q89O03p69q03L48R04O0q60n67P29O25k03j078J02R15M89o85q92K27
5243e44R66L47j104o10R33O94m34q42k69J296L56p45p92K90J114O8j023o57R58
5262BP19n32r40J88R45M15q46o79L13J163k00j084j05P97N32o16o39J00Q05M10
5282G48q32q03N88Q04j1r70k52P83O24m45r79K98J013j2r99k60O98P94n32p23
5302d68j97Q24M45n70p03L85P37J31p23m69Q38M51k84r48l8Q61M69o88r01O19
$$ plain form
5166 661 -448 -806 194 741 407 -582 -574 240 957 82 -903 -222 800 600 -682 -730 434 841 126
5185 126 -659 -763 471 781 -183 -868 -177 767 499 -409 -817 265 812 211 -723 -552 423 591 -252
5204 -252 -910 -149 820 488 -474 -591 193 996 226 -824 -499 570 841 -259 -894 -7 824 404 -679
5223 -679 -578 311 914 145 -658 -310 594 654 -206 -773 -44 581 378 -700 -598 317 806 121 -771 -544
5243 -544 422 769 -335 -945 -12 682 248 -594 -863 433 789 44 -748 -458 656 724 -299 -956 2
5262 2 721 189 -751 -563 382 797 -49 -728 -415 748 548 -536 -641 156 688 72 -567 -467 338 748
5282 748 -84 -887 -299 505 494 -476 -728 55 679 234 -745 -447 566 554 -445 -705 -7 787 255 -468
5302 -468 -665 159 604 34 -669 -284 453 584 -139 -608 230 681 397 -551 -589 272 741 53 -848 -229
5322b29R83k83p58l92O14Q43n14p81q2R40M17p83n80N11Q52j79j076k06O35P97
5342G29m77j020R8J211K67r70n88N10J062l11r24l60Q93O11m92r83L67Q08L47
5361G78j017n08O59R42l21j220jP20N81o25o81R2R76J21o06o97P92P08n61n58
5381d26j67Q03O78q86n99R7J086J22q41o24P31Q04n29p37k8P83M48o24p03J63
5401d49J072j28p10l25N04Q51l25r33j95R84K80o05p56M80P43j33p25l78O96Q15
5421G63n54q25R0R59L70r05p25M98J078k6j125k21P56O54n48r34K95Q66J64o88
5441e8o46K97R99k14q11k65Q87N73n66q12J04J106r0o04p62O87R79n74p54r8Q05
5462A83L54k85q41K22P03K72p72n91N35Q81l92p05l58Q97O16o37q17K11J135m1
$$ plain form
5322 -229 754 471 -287 -679 -65 778 264 -517 -599 341 758 -25 -605 -94 758 579 -497 -703 -68 729
5342 729 252 -768 -670 541 808 -162 -750 -240 822 511 -413 -773 120 731 239 -744 -377 431 778
5361 778 -239 -747 -88 854 533 -687 -688 32 613 -12 -693 -601 375 496 -110 -807 -15 693 132 -426
5381 -426 -593 210 888 2 -597 -500 586 708 -133 -757 -26 778 249 -488 -516 267 715 91 -612 -449
5401 -449 623 495 -215 -540 -36 815 490 -443 -638 346 626 21 -735 -255 488 355 -370 -748 -52 763
5421 763 209 -616 -526 433 803 -102 -827 -329 749 723 -402 -623 133 787 239 -695 -400 466 630 -58
5441 -58 -704 -407 592 378 -433 -698 189 762 196 -616 -512 594 504 -100 -862 -175 804 230 -524 -622 183
5462 183 537 252 -589 -367 336 608 -164 -755 -220 661 269 -436 -794 103 719 82 -735 -524 611 570
5482E70j034j29M70O32j6r95KN11O27o36o99L15R50P8q85m55O34O65k38r33PJ019
5504D60J65p70o76N37O45J52q49m05O08P14l87o73m6Q65K04n05p28M07P11j37
5524B92o45l33P61N02m22p40K50O81J42m46p71M80Q55r2r90N6N59P54q05n77L93
5545i6P10p8p88k32N36N91n76o37J22O27L67k93q36L85N13K20o30n95P52O46l47
5566C61p73rN85O50q55n30K41O49K38p90m76P86N52m42r19K80P35K29m64p32N48
5587a36O00J39r70l32Q18M34m46p25J59R05J33p13m41L82P70k32o03j64N48M47
5607E73l98r34K08Q72L44j014m67O83N77o0r23j60R02M64o64o78K67P09J23o89
5627b65k30L50O50j25q73j7P19N72o37o20J08P33L13j068m08P71N75j76q13J07
$$ plain form
5482 570 -464 -593 -123 509 493 -502 -500 11 638 2 -697 -382 568 646 -239 -694 -60 605 367 -566 -559 460
5504 460 625 -145 -821 -284 361 513 -336 -741 -133 581 194 -479 -525 340 544 39 -689 -282 429 292
5524 292 -353 -686 75 577 155 -585 -335 346 488 42 -729 -249 606 514 -476 -420 139 893 88 -489 -96
5545 -96 614 536 -252 -484 52 643 67 -570 -448 179 546 253 -583 -198 315 535 -95 -690 62 708 361
5566 361 -412 -421 164 814 -41 -571 -330 319 557 -233 -709 77 629 187 -732 -452 283 512 48 -684 -136
5587 -136 464 603 -367 -699 119 553 107 -618 -459 446 579 -134 -575 -193 577 345 -258 -422 126 573
5607 573 175 -759 -551 321 665 -349 -816 -133 444 384 -539 -699 203 667 3 -675 -408 301 424 -265
5627 -265 -495 -145 505 380 -493 -510 209 781 144 -476 -368 365 678 -390 -798 -27 548 372 -441 -334
5647c34O13J97l51p83L63P48J2p65m18O89N65k32q14L7Q40L05o83o13N14N62j74
5668B78n73k54O03L67j75n99pP68J26m06n61j2R90q5p26m07O28P57n49n71NQ72
5690D69J06o19m44L87M62Q2q42k58P27O00l39p33M1P79J33o20o74M82P62k34q54
5711e87r8P83M53n88n89L29O52L9n57n23N49O36l13o31q0Q41L56p60m84J25Q34
5732C87K79r55m82Q11P52m68r66J88O18N35o14o55K82P71l2p28n25P60O70m64
5752A64o43J49N92L42n15m04R4Q51j01p37m59Q05M80m30p57J26Q06L34o26p94
5772g23M21R92k32p99r1N11M23k68m58k48P28L24p37l88K76Q99l55q16o4P54M65
5793F14k78o65j51Q66J30o70k15K43O75l68n15l79Q98N02n34o77J61P66m9l64
$$ plain form
5647 -334 279 476 125 -658 -295 453 465 -300 -718 -29 536 304 -510 -473 367 672 -11 -624 -110 452 278
5668 278 -295 -549 54 421 246 -353 -360 408 534 128 -433 -445 545 460 -266 -673 -45 712 163 -408 -403 469
5690 469 575 -44 -488 -101 361 443 -399 -657 70 670 331 -402 -361 418 551 -69 -743 -261 501 267 -587
5711 -587 -685 98 551 -37 -626 -297 355 394 -163 -686 -137 499 186 -445 -525 316 672 -88 -572 -447 387
5732 387 666 -289 -771 40 792 324 -642 -454 164 699 85 -570 -288 483 451 -277 -802 -42 628 164
5752 164 -479 -330 262 604 89 -315 -221 630 529 -208 -667 138 618 188 -569 -443 363 697 71 -723
5772 -723 -302 690 458 -341 -432 79 502 234 -224 -472 256 580 -157 -545 -269 630 275 -541 -605 149 614
5793 614 336 -329 -480 386 516 -154 -369 -126 549 181 -334 -713 185 687 153 -524 -363 403 354 -10
5813a0n25N03M82j04p31n0N60K68k40o54K95N12K27p03k85K91Q08n05n40JN57
5834A57L41l28o02J10M96K88o04p05Q40M93j29q28o9Q53M11q03p10O33M56Q2r54
5855e72RO43N41n47n64J13O18M71p24l49J70Q36l36p35o7N64L86l24n89J92Q02
5876E38J56p54n15O65O05m07m14m50P38N07n54q21L20Q24N3p46k40N06N02k47
5896B66p53RQ22K64o68k89P0O60J51o55l61K74O42j10q43J31N90K19k49p75K35
5917c70R59p2n96n32N37Q02n34n53j35O89K54l16p36L31O87j20n95l58P37M75
5937E54m50m07k91P14M38o49n64M89O07p3q14j02N50M48j08q10J28N52J98l87
5957B3o16L19O87n1o13j59N29M33k61n80j83Q08J57n35m51L84N25j34o31J4N23
$$ plain form
5813 -10 -535 -32 450 346 -385 -435 125 393 153 -501 -206 306 533 -170 -455 -164 644 139 -401 -400 157
5834 157 498 170 -432 -322 174 462 -142 -847 -7 486 357 -471 -540 313 724 -79 -789 -156 300 382 -572
5855 -572 -563 80 621 74 -490 -377 241 712 -12 -361 -191 645 309 -426 -493 71 457 133 -456 -264 538
5876 538 694 -60 -575 90 695 288 -126 -576 162 669 115 -706 -386 438 491 -255 -495 11 513 266
5896 266 -487 -478 344 608 -60 -349 -279 381 532 -123 -484 -210 432 322 -521 -390 200 419 170 -605 -370
5917 -370 589 517 -79 -611 -74 728 194 -359 -494 195 449 133 -603 -272 415 295 -300 -658 79 554
5937 554 104 -303 -594 120 558 -91 -655 -166 441 368 -446 -548 2 450 342 -468 -340 212 410 23
5957 23 -593 -274 413 362 -251 -410 119 552 291 -289 -472 336 493 -42 -493 -109 416 282 -349 -335 188
5978A88J87k94l79j16Q82J20n98m09N10L42k03o10J7N40L39m61n40K28Q09l44
5998B08l39l15K91N11j02l76k48P06K73n25o48L81N08Q6p44j10N93K85k28m69
6018b62o0N69J27m05o32K59P05j9l74j89M17L80l66p92K67P10Q5n30l98M16L90
6039B98j36o15o4O12K37j31o78J60O25K02o33n16L96O27n5o23k87P03L88m31m86
6060d07j14J041l4o66m06O16M96o9p37q2M38K54j24p58K81P07K6o87k11M68M24
6081D56k66n00j62O76K57l90m47J09N56K01n00n13M07N82k21o65J49O25Pl24m57
6102d20L40L61K45p33n2M12K57j31o07J41L43L21o36j41Q0N89Qn87j98M88M90
6123E70m87m41K49K32J87m74k78K26O79o6p22R0K51L71k10p02L21L68K41n29l24
$$ plain form
5978 188 375 81 -298 -414 468 588 -10 -419 91 433 230 -380 -363 177 516 55 -485 -257 552 208
5998 208 -131 -446 -155 356 254 -122 -370 336 609 84 -564 -183 325 411 -333 -443 150 435 207 -262
6018 -262 -322 247 374 -31 -663 -404 301 282 -92 -281 136 516 150 -642 -375 335 420 -110 -508 -92 298
6039 298 162 -453 -517 95 332 201 -477 -317 308 510 -123 -639 -243 384 329 -294 -581 122 510 79 -407
6060 -407 -521 520 486 -180 -586 30 526 457 -280 -362 76 330 206 -552 -271 436 462 -225 -436 32 456
6081 456 190 -310 -472 204 461 71 -376 -267 289 490 -10 -523 -116 466 245 -420 -271 354 361 37 -420
6102 -420 -80 281 526 -207 -259 153 410 279 -328 -187 156 477 -159 -300 -220 369 377 -210 -408 80 570
6123 570 83 -358 -109 123 310 -164 -442 -216 463 397 -325 -235 16 387 177 -525 -204 164 405 -124 -448
6144d48L28N14k23n45j8O85J64n17l78J10M70K69n77k89M60L68k38l37k29O46
6164B15J88l91n79J93O28J09n21k44L29M59j69m60k46Q02R5n01l14K66M35M3m59
6185a22k68L98M68m44n44J54O96L05p19l44K15N05K05p99j98O72K90k60n34M1
6205b83M92K08n65k08J32P08p9q03J18N16L18m64l06m1M79L40n79m74M57O68k50
6226C84n95j72M32L82l23m06K6M76K01k52o78M61N74l17m85j6M73P3k39l45J37
6247b09M67J18l29m05J48P04k21n34p7M82K56l57m28J92N97q5l10k73J76M55k52
6268A15k76j61M85K57n54l95L30M93j12m01k85O96J49k46l05j09O00m6m35k49
6288d49J70M15N3m25k16M39M07l19k11j51N23R5m51k72M47K04J38n28l25P08J32
$$ plain form
6144 -448 -120 394 171 -374 -392 293 457 -60 -438 -328 142 411 -166 -455 5 373 135 -202 -431 215
6164 215 403 12 -567 -374 254 363 -158 -402 -73 386 217 -243 -489 313 408 -93 -407 -141 294 337 -122
6185 -122 -390 8 476 32 -512 -358 338 643 -76 -420 -205 300 505 -294 -492 180 470 210 -324 -283
6205 -283 209 417 -148 -356 -224 484 405 -398 -280 236 554 90 -216 -257 222 562 -17 -491 -34 634 384
6226 384 -211 -383 49 431 108 -298 -272 204 405 153 -525 -64 510 193 -292 -308 165 238 -1 -346 -209
6247 -209 258 376 47 -358 -210 494 273 -261 -338 144 400 43 -385 -193 404 319 9 -264 -88 367 115
6268 115 -161 -322 163 420 -134 -529 -199 294 182 -219 -504 192 341 95 -210 -319 281 235 -200 -449
6288 -449 -279 136 189 -236 -452 -13 394 75 -136 -287 236 331 -120 -392 55 259 397 -131 -456 252 384
6309C84m12k85J62L46Qk95k22K31N06j47n00j79N64J84l08l59J6O87j62l76l49
6330e06P55L32l72m91O5O65o1l12m63K87M34p7m86k53M16N05o8p05N1N01j2j21
6352H4o70L27P25j55m36l23L11L91j93m54L05K47K18m89l93L92L56j7k24l07L81
6373G6L14k26m91K40K61J20k32m71K94M55j31l88k04M79L44m26m56K19N35k48
6393F4k20k31K26L81O9m53k16M84J82j54n00J68L23N3l71j27M20K72p7n85k6M29
6415A11K87m07j77J07L89k43j99m53O24N23n53l02J12L96J22l11l17K54M17k06
6435A74k95j40L84K30k10l93k68P93J11m60j93K01M78J67q35j0L38L16l95k49
6455b56P1L69K94n84j57K84K01n4l64k83N41K64j54o01J87L54Q3m50O1M7L28Q8
$$ plain form
6309 384 -28 -313 -151 195 203 -92 -314 -83 423 276 -224 -403 161 345 37 -322 -306 381 219 -157 -506
6330 -506 249 581 209 -282 -217 448 387 75 -388 -101 333 256 -230 -483 -67 438 370 -335 -284 217 205 84
6352 84 -586 -259 466 311 -125 -448 -137 254 61 -393 -88 159 377 -112 -505 -113 243 226 2 -305 76
6373 76 390 164 -327 -87 174 294 62 -409 -115 340 209 -179 -383 96 440 14 -442 -223 312 64
6393 64 -156 -387 -161 220 289 -164 -380 104 286 132 -368 -200 123 176 -195 -322 98 370 293 -292 -318 111
6415 111 398 -9 -186 -79 310 67 -132 -585 39 562 9 -293 -181 215 337 26 -291 -37 380 174
6435 174 -121 -261 123 353 143 -250 -518 275 386 -74 -267 -66 412 579 -256 -266 72 388 -7 -256
6455 -256 -185 184 478 -106 -263 21 222 168 -196 -479 62 326 172 -429 -242 112 195 -255 -194 -147 181 269
6477B69m71j73M51L36l58m04J53N21l1k99k44J67K95P7n91J05J2O07l08n19J46
6498b59N14L1l57k60K05L55Qm92J26K45J63k57l47j0L61K60m77l01M34M02j32
6519B12l30j08K24K55j45m13J46K85l2l55j03M71J29L5n86L16J94J43k05l52J08
6540a11M65j25l92j15J45K84j37k95rL88K11k58l81L09M02k11k60M4J19L14m23
6561c6j66N8M17m5j98k22L03K89j30n70JM59P5m31k73M67L87j32m46j56L17K08
6583A76P8l51r5M00O1j30m78K60L23J23n29j51L50J76n9l82J35K92J08m42K2j54
6605b67L97K40k99m68O62J00m79j89LN01n2j82m63L82L23L1n86K43J53L42m97
6626a05j55L9N31M9n08k04L98J29J23m34k39L73K92k31m65J97M84O1l82k34J14
$$ plain form
6477 269 -202 -375 76 412 54 -350 -197 324 293 -6 -250 -83 212 289 -302 -197 -185 422 114 -405 -259
6498 -259 255 286 -71 -331 -126 229 237 -255 -129 116 279 22 -325 -335 26 286 -191 -492 -58 344 212
6519 212 -118 -226 -2 253 108 -305 -159 126 94 -261 -364 107 236 271 -315 1 195 338 133 -219 -111
6540 -111 354 229 -163 -278 -133 151 14 -281 -290 98 309 51 -330 -21 381 170 -90 -46 73 387 -36
6561 -36 -202 -144 273 228 30 -192 111 400 270 -300 -299 160 235 -196 -469 -2 385 253 -193 -349 -32 176
6583 176 254 -97 -192 208 269 139 -339 -79 244 367 -162 -313 37 213 154 -228 -93 199 307 -135 -113 -267
6605 -267 130 370 71 -397 265 365 -114 -303 -300 201 149 -33 -496 -114 209 240 -346 -103 50 392 -105
6626 -105 -260 -221 310 359 -149 -353 45 174 297 -137 -376 -3 289 58 -407 -210 274 335 -47 -281 -167
6647a67M42j51k83r9M06J02Ln94K42L45J87m88k20L83K42l22j87k2J35K21q3l98
6669c06J58K98J36m03j89K54N00j32m50rK40J96k56m66K73L11R5l88j50K02L66
6690B80k21j46o7M47kk93m31L32J56K06m26k35M66K33l20j47O3K96J48o16RK02
6712f6L09j24k25k90M48J70k54j98L5M43ok63j77J24K83j66m16K05J84J25o1k52
6734a72Q2K22L4k41k52L49J23M7m25q1K89M15m15j11j01N41q1l74k9M93m4k2m49
6757b02j11M06K25j66l95J22M33N4n42j55L75R4j3l18q9M82J32l17m63M70K89
6778C11j65k36j78K57K31j23k17j55L33K65m74n6j03O96r2m30k11M54R5l92L4
6799a56J18K70rk22l55K94K38J58n14k3K86N6R7l67q4L31R9j03l89L5L95j27j87
$$ plain form
6647 -167 275 124 -159 -258 148 250 253 -341 -99 246 433 -55 -275 108 350 28 -159 -181 -46 175 92 -306
6669 -306 -148 150 286 -117 -306 -52 448 316 -134 -143 97 293 37 -429 -156 155 250 -138 -288 -86 280
6690 280 59 -87 -154 293 291 -2 -433 -101 55 261 -165 -400 66 299 -21 -168 -105 191 339 -277 -268 -66
6712 -66 243 119 -106 -396 52 222 -32 -230 -195 248 242 -21 -198 -74 209 43 -373 -168 16 141 80 -172
6734 -172 -90 132 166 -75 -327 22 145 192 -233 -314 -25 390 -25 -136 -237 304 223 -151 -180 313 269 247 -202
6757 -202 -313 93 318 152 -243 -121 312 366 -176 -331 44 138 125 -193 -282 200 332 15 -448 22 311
6778 311 146 -90 -268 -11 220 97 -120 -275 58 323 -151 -207 -310 386 294 -136 -347 107 202 -190 -156
6799 -156 -38 232 223 1 -354 -60 178 336 -178 -201 85 141 238 -129 -213 118 217 114 -275 -240 155 28 -159
6822a59p9J96Q5L5m27L16L50j04k74k93K49K58K3l74K33N9J32k30k29J41J18J40
6844A66m58MJ35L56J5l76k27M09M47l52j71Q8K49j53p1k36K65J14j30k42m6K06
6866hK43m50J35K00l4K71m44KJ14K63j81k61j0K10K89k42l63K07K38j02k88j49
6888c60M82l2j00j45Q2L4J83k31l19M16kL54m10o2J35L44k82l05K31L11J01m37
6910a2j69J15K76j66l55K22k5L87k16k97M3L49J31m57o2j66O36k31k17P0J23J50
6932A29j58k17M7J67K14l10j46O9L06j20j94j32L03L19k99l24J62K85Qk77j50
6953c18M11Q6j49k10j0L10J15k33j29N5K63k02J71k84R1K40j51o3j35K33R5k33
6975d7q3k6L38p0o2k12J25K90j4m64%K08J66j71k0p1L20Q9m77m7J13M53m21r8
$$ plain form
6822 -159 -238 -42 43 78 -349 -33 317 213 -61 -354 -105 153 176 -198 35 94 226 -4 -233 -92 26 166
6844 166 -292 -288 -153 203 218 -158 -385 24 471 119 -52 36 285 132 61 -175 90 204 74 -168 -214 -8
6866 -8 235 -215 -80 120 86 357 -87 -85 29 292 111 -150 -160 50 339 97 -266 -59 179 77 -211 -360
6888 -360 122 90 -10 -155 -73 -39 144 -87 -406 10 8 362 -48 -110 25 369 87 -218 13 324 425 -12
6910 -12 -181 -66 210 44 -311 -89 -114 273 57 -240 -197 152 283 -174 -236 -402 234 3 -214 -144 -21 129
6932 129 -29 -246 -199 -32 182 -128 -274 -205 101 -19 -213 -345 -42 277 -22 -346 -184 101 109 -168 -318
6953 -318 93 179 30 -180 -190 120 235 2 -127 -72 191 -11 160 -124 -33 207 56 -7 -142 91 186 -47
6975 -47 -130 -156 182 112 50 -162 -37 253 239 -225 -225 -17 149 -22 -42 -113 207 296 -181 -228 -115 338 -83 -181
6999a81P7K97l3k15j33Q0K14j35j17j69L89J66l56K9r6L53O2m10jN8L37J20m14
7022g8k37L04M15k45k72J42R3J06m21j5J91Q0J51m32J04J61K43l37j05K7K96j05
7044F6j66k27L74K2N1l11L7N2J30M5j97p4K26O2l26K0K04P5j80k7m7K11K27k56
7068ij88M8J81j7J24k64J54K74l57j7K05k0R2k36r4k09O12k14k46l4K47J02j03
7091C1j63P7K35J26m00j63M42K3m9l25J09K42np8j70JJ78m0q6j32N2M07j41k87
7115a16J4M6M64m12k16J80Q1n1r2K7J45J52j38k41J57J33J89l14k71L45R3l8l5
7138A02m25M09L29m42n4j96N70j78k26j41J06M73m01O2n3K39j48Mj67p2L63J38
7160B92m74j07K31J61j31J4j00P7K82j90k20pK84J92m80j10J08M55j67m00J76
$$ plain form
6999 -181 -104 193 160 -55 -188 -108 106 -29 -146 -315 74 240 -116 -87 -183 170 232 -178 -179 -121 216 336 -78
7022 -78 -315 -11 404 159 -113 29 122 228 -193 -208 -17 63 214 -218 -114 47 290 -47 -152 -125 171 66
7044 66 -100 -327 47 69 120 -191 -154 -102 28 73 -124 -198 28 90 -236 -216 -12 63 -117 -144 -191 20 247 -9
7068 -9 -197 -149 32 15 139 -125 29 303 -54 -71 134 114 206 -30 -124 -333 279 65 -181 -215 32 134 31
7091 31 -132 -55 180 306 -94 -257 185 208 159 -166 -57 185 180 102 -68 -67 111 71 -15 -147 -95 312 171 -116
7115 -116 -102 -56 408 -4 -220 -40 41 -10 -102 -75 70 222 84 -157 0 133 322 8 -263 82 175 137 102
7138 102 -323 86 415 -27 -81 -277 293 115 -111 -252 -146 327 -74 -12 -65 174 26 30 -137 -209 154 292
7160 292 -182 -289 -58 103 -28 -14 -114 -37 245 55 -165 -172 112 304 -176 -286 -178 277 110 -290 -114
7181a14J91O9j54q4N5J53k3k26l5K04J70j94j97K35j60O7K95n19K62K20k21j17
7203a23J37N2K08k66k58J69J51K30l08j73n1K62K6k14P5J06J76p7k00m0K19p6
7225B5j20k02L4K21L00k63k39K70J42j31j51o4L59p3k21j4K48J70k56j11j12K74
7247H6J76l14j39K72R9j08l1j44J42J85j43l42J32J63K33l42m4p0K14pj6j41n4
7270a93N43l72q8j34K62K05l41q3J54J64J6k64j58J65K08j03k85O7K55J65j27
7291E6k38J43K36j7k66j49L28M4j21k51L11J48J4j57l55J66L42j13r0j40Q2J78
7313A51k25J19k45L34L8k02n6O4O9Q3J2l71L35L13m26p3n4L26j06j60j76K30J26
7336A06j6l92J34m0M35k09k09K31j5K04k13o4Q7o2M7j36j95K21M10m03qm2K14
$$ plain form
7181 -114 77 146 -8 -92 -37 116 93 -133 -168 36 206 12 -185 50 -110 -43 252 -267 -5 215 -6 -123
7203 -123 14 66 274 8 -250 -81 70 300 -8 -181 -232 30 56 -158 -83 23 199 122 -78 -118 101 25
7225 25 -95 -297 -263 -42 258 -5 -244 26 168 37 -114 -178 181 108 -113 -127 121 291 35 -76 -188 86
7247 86 262 -52 -191 81 180 72 41 -103 39 224 81 -261 -129 34 267 -75 -119 -189 25 18 2 -139 -193
7270 -193 350 -22 -110 -244 18 223 -118 -201 -47 117 133 -131 -289 -124 84 -19 -304 -237 18 183 56
7291 56 -182 -39 197 180 -86 -235 93 137 16 -235 76 224 238 81 -274 -108 234 121 31 -109 -27 151
7313 151 -74 45 -200 134 172 -30 -86 -22 47 130 142 -229 106 419 -7 -80 -134 192 86 -74 -250 -20 106
7336 106 90 -302 -168 -208 227 18 -191 40 25 229 16 -48 39 -23 24 -112 -307 -86 324 -79 -87 -129 85
7359H5L5k52O7P8Q7o9j9j09K42o2pj53J4J29M8j40p2J97k2Q4l64J04K22K0k79
7384a36j50K25J05P5j20j56PM26m8l44n0L51l6k27k09J59L30N3k69l98N45M6k51
7407g2m9k10J76J59j18k35M83m8j07j34L3K51l0J8o6l31L97P1j35j55n4K40l7
7430D7k91M6K53K54k56l53Q5L14K8k58J48J08M2p8j95P7J72J20l73J09o6J32L34
7453C99n53r7J19L19k24J4j51K58P3k03q0J99l9J82k49o5k0K68o4j68J9O7n3n6
7477a05J39j23J98o8j91p6J31R8N5j56o0K59J43j66Pj42K17q3k59J41j50L60q3
7500H6k21l3L15J00k80j85K71J9n5j49M7K34j80J29l20K14K7R6k77K04l3P4J5
7523I8k29K14Q4J6j88n9o1K43J1k35Q8M0j26J90J6k82J56J96l80M9K34l5J39k19
$$ plain form
7359 85 120 -132 -65 13 100 31 12 -97 145 83 76 -77 -63 66 114 -26 -98 99 77 161 -203 -99 123 143 -136
7384 -136 -286 -61 44 119 -1 -157 -150 276 228 -116 -166 185 149 -78 -287 -128 202 255 -14 -412 133 179 -72
7407 -72 -121 -331 -155 4 -114 -349 134 86 -21 -155 -122 129 99 117 51 -280 117 188 53 -102 -156 84 47
7430 47 -244 -198 55 309 53 -300 -215 99 127 -131 17 125 167 89 -106 -29 143 263 -110 -1 -67 65 399
7453 399 -154 -251 -132 187 -37 -23 -174 84 157 -46 -126 73 34 216 -33 -98 -118 150 86 -82 -63 4 -49 -105
7477 -105 34 -89 109 41 -150 -226 -95 3 58 -98 -158 101 244 78 85 -57 160 77 -182 -41 -191 169 86
7500 86 -135 -168 147 247 -33 -218 53 72 17 -132 -85 149 -31 98 -222 -8 19 115 -162 42 9 83 98
7523 98 -131 83 167 183 -5 -64 -125 118 129 -106 -18 22 -104 86 102 -180 -24 172 -208 -159 75 40 179 -40
7547d0o2L5K77p8k85K28j03K37r0k97J86J7P9pJ6P7Qk7k17j6Q8J27k34q7n5N07
7573B84k64j0k14L13J64m16R8p2J83j00K46m18P6K50q6p2j44K27M2k67K5j25K80
7596@J03j49p1J17O1J01k53j9J97m5Q5l08L7J27K68k06j77J56k2M6k55l7K88J72
7620B16k5l29J64%M6j86K48j19n8J13j08M4Q6k4k47R2J6J30K5k86l6J32L73l79
7644a12K18r3N0L8j56J1j30K66Jk12J36J6J08k03K2p9J58j4o9j56J52K67j60j76
7668a17L1J73m2j49r8K37Q2R0j77r3L2J42r6j18L9n0K11m8j52M4J11R9k28N3K08
7693A84j84N0n0r3N9J66r2l26K48J19J45k22o2J01L4j46j06J47J1j12K41r1P4
7716I5qJ2k26j46J44L31k02k7o7J78J09q4p4r5J65k40R4j38J72N0R0k71k3K35
$$ plain form
7547 -40 -102 -67 210 132 -153 75 -28 209 119 -178 8 25 104 97 113 190 198 171 -46 -62 26 153 -81 -168 -223 284
7573 284 20 10 -204 109 273 -143 -45 -117 66 -34 212 -206 -130 120 34 -38 -182 45 87 -180 -155 -280 0
7596 0 103 -46 -117 0 61 162 -91 -110 87 42 127 -181 -144 -17 251 45 -132 24 2 48 -207 -244 44 216
7620 216 191 -138 26 26 72 -114 134 15 -43 70 -38 6 92 68 -179 -87 -71 59 84 -202 -238 -106 267 -112
7644 -112 106 13 63 101 -55 -44 -174 92 93 -119 17 33 141 -62 -40 -119 39 25 -44 -200 -48 219 59 -117
7668 -117 -86 87 45 -104 -202 35 117 207 30 -63 -31 111 15 -103 -64 -114 97 49 -103 -59 52 151 -77 -24 184
7693 184 0 50 0 -93 -34 132 40 -286 -38 81 226 4 -58 43 77 -69 -175 -28 -17 -129 112 21 95
7716 95 87 99 -127 -273 -129 202 0 -27 -94 84 193 109 35 -60 105 -135 -41 -179 -7 43 133 -138 -161 74
7740G4Q7j72k25J79j1K20j34R8k87K24k3j88N5K26l3j23M1J73k71M7J2j00K15
7763H4j2r3j45J73J33pl8k05J11ol7o6K0p2M08k56K4P6Q2j60pk9N6J87q7k54J87
7790F7nk3J93m43M7J89J74k24k53L52L45k56l57l3K40M9j23j8KJ69j2k38K8J83
7814E3J28l65K72j22K94l79J3O9O9lj31j1J46l8m7j7r1J68k4N3mm5J32l%j55j98
7841b36L93k09J43j62n9K33n7K6n3j02K24pj44o6N1P3o7j71J03P1K1O1j91K04
7865G9j3L7k44M0L5K62k36l7m8L23k30k10jK51K50j96l64J55J70J27j49r6P0O9
7889D4J04j87k5J04N8j36k26K33L2J40j79j44L74l4j5q8k49J27Q9J26l21K0L29
7912A76Oj46k18K00O8p7J21j64J92j93K08j66k23r6M97j74j66R4J83j54J69j11
$$ plain form
7740 74 161 -11 -236 -57 -68 152 18 116 -171 53 30 -158 -103 123 90 -33 8 181 -90 -43 -31 -131 84
7763 84 72 -21 -166 7 140 133 95 -110 1 -5 -42 -108 -88 -160 248 -8 16 92 174 14 7 -22 34 221 134 -120 67
7790 67 62 39 232 -211 -164 25 199 -25 -278 74 419 163 -194 -227 13 62 -61 -79 -77 92 80 -158 -130 53
7814 53 181 -184 88 -34 260 -119 -106 -37 32 29 -102 -113 33 -5 -52 -69 -160 8 -16 37 33 -12 120 117 117 -38 -236
7841 -236 157 -52 91 -71 -130 103 46 72 19 -83 141 134 -10 -76 -25 48 -19 -190 -87 -16 5 66 -125 79
7865 79 66 103 -141 -101 -66 196 -40 -77 -125 198 -32 -242 -243 8 258 62 -302 -147 23 150 1 -95 -25 44
7889 44 148 -39 -64 40 98 -38 -264 -31 1 141 -38 -182 192 158 143 55 -194 -67 22 148 -173 -153 176
7912 176 182 36 -182 18 86 9 130 -34 158 -35 173 7 -216 -312 185 11 -155 -61 122 -32 137 26
7934B6o6J7o1l5J70j16J37j46l4J55k6j8p5p7K55o0k4n6qJ59j20n0k71L06N7N5
7960I4j58M2j7J50o7k48R3k0K20j60j8J27N6j33L0rJ3J23K0n4R2J40k60k41J71
7985a4J55m3m8q6l1J42j7k41p4K86J70ml66K9J12K46j35k57l9L73l53J80N9M3
8009H7Kj64K39k01K02N6j11k00o6J29mJq7J35K40j98K0k45J46N5J70j89j12P3
8033b2J4L6j87J77L1j82J68r2Q2n3r6R2n1JJ16L2k57L03j13j8j18RP5l0O4j06
8059a25M5J20o2j53J35K4J27j16oJ51k11P4j21J31j90J91K5o2K4m7Q7J9j15O1
8083FQ7r9P0j10O3l8J95k73O4j03J62l2o6Q1Rj22M1m1l4L88k02k94Q8K45L9k42
8109a18K30j10l2K4r2O2P4R4j78M8p7K80n2j08R9k44K07j73L3J06k06J5Q1j2P
$$ plain form
7934 26 -40 -23 -84 -119 51 -65 72 -74 -108 47 21 3 -72 -149 106 46 22 -34 -42 117 -3 -53 -324 -18 39 94
7960 94 -64 -22 -39 111 44 -204 -111 -131 89 -71 -89 38 94 -39 -9 -18 -5 118 138 84 176 316 56 -185 -14
7985 -14 141 98 50 -36 -67 75 58 -183 -257 29 199 195 -171 -142 -30 216 81 -176 -215 158 -195 -15 44 87
8009 87 89 -75 164 -37 165 221 110 -90 -156 -27 -31 -30 -117 18 258 60 80 -165 -19 36 206 17 -95 -22
8033 -22 -8 28 -159 18 49 -133 35 -57 25 -28 -124 -32 -83 -82 34 66 -191 112 -1 -19 -137 -128 -53 -83 -19 -125
8059 -125 -80 40 -22 -175 -40 -16 111 -5 -11 140 -71 3 -118 13 -177 14 39 -23 1 -46 41 60 -55 6
8083 6 93 -6 64 -46 17 -21 174 -99 -35 -138 24 -8 -74 7 16 -106 -65 -106 -140 248 46 -248 -160 85 124 -118
8109 -118 112 2 -30 -6 -98 -36 38 132 -46 2 -75 205 153 45 144 -100 107 -66 -33 73 -133 -118 -37 -49 -42
8134d2L9J45o0r8j3J29K1k35J62l0j25l3L0N4P3p8j4J4L06j45q2O4j92O2J51J3
8160A16k18O3o0J26j39M1P4J20o8J8k40J66Q9k01M9N7k4r7J49O2rQ7M9j85n7q8
8186a20J20O6j91J42O0
$$ plain form
8134 -42 -3 142 82 -16 -29 100 121 -114 48 18 -107 -140 -110 -56 17 -61 -75 -61 245 100 18 82 -110 -48 103 116
8160 116 -102 -39 -99 27 -112 -71 3 123 55 73 -167 -1 88 -113 -64 -7 -31 -128 21 83 74 161 210 25 -32 -120
8186 -120 0 66 -125 17 77
8191G7
$$ Imaginary data points
##PAGE= N=2
##DATA TABLE= (X++(I..I)), XYDATA
0@%%%%%%%Qj6J6j6K4l2L2m0M8n6O9p7Q8j05J25j44J65j92K19k48K83l23L62m04
31b14M58n14N70o37P14p93Q77r73J079j193J321j465J621j795J995k220K471k763
49a461L106l508L992m594N358o359P739r773J3067j9267L4793j39778k49387M19398
63E3326K80998k97089l28357J96008K97140p3980k43994r412J42814O6262l5542
74D8174o4471p7709K6989J58598M7370k05307j30800K02347K12223j60539k61108
85b04233Q5053K72131K152k40467q6834J76074J49690q1825j80024k4096J67988
96C5609J24475j18341j96616M0647K35088M6873k36511j27139K04129J85758j44656
107D9316k11769P2209K02564l616j58629m8926Q9072P5319q505o9317o3997L1590
$$ plain form
0 0 0 0 0 0 0 0 0 8 -8 8 -8 16 -16 16 -24 24 -32 37 -40 48 -57 68 -76 89 -103 116 -132 151 -172 190 -214
31 -214 244 -270 300 -337 377 -416 461 -512 567 -626 695 -770 851 -944 1051 -1169 1302 -1461
49 -1461 1645 -1863 2129 -2465 2893 -3466 4273 -5500 7567 -11700 23093 -116685 -366072 53326
63 53326 334324 37235 -291122 -95114 202026 128046 -115948 -125360 17454 83716 48174
74 48174 -16297 -94006 -67017 91581 138951 -66356 -197156 5191 217414 56875 -204233
85 -204233 -119180 152951 155103 -85364 -172198 3876 153566 71741 -108283 -132379 35609
96 35609 160084 41743 -154873 -114226 120862 167735 -68776 -195915 8214 193972 49316
107 49316 -162453 -90244 112320 108704 -49925 -98851 -9779 65540 57035 -12282 -76279 -44689
119d4689J17685K6893j45364r3162J43805J56980j13426k06981O1084K31793m9
130A34569k23904n7457J86631J01398j28428j24380N9664J20894Q358r1444o5073
141g9172M3743R9824J5550j08504p7280R1905J30539n5720j64232Q468J73483
152G8604L9763j61084p8299J28762J01241q2165j04240L0238Q5906J5341n0728
163C339m4906L093N5216M7564m5507r2912J6779J25300K4708j41244p0164J37898
175A9164J10425j15734j39173P7248J50053l1665j40139j1642J09828M6177o7488
186G054o6279J9576O7097K7871m8139o8103J3339R3116K9309r8489p1688Q5519
198i817J05718n8485j23573K2722J21164J5118r9125m7439O3350O6865j7721o8688
$$ plain form
119 -44689 72996 99889 -45475 -138637 5168 162148 48722 -158259 -97175 134618 134569
130 134569 -89335 -146792 39839 141237 12809 -111571 -51907 68987 77345 -14099 -79172
141 -79172 -35429 64395 79945 -28559 -105839 -13934 116605 60885 -103347 -94879 78604
152 78604 118367 -42717 -121016 7746 108987 26822 -77418 -47180 38726 54067 3339
163 3339 -41567 -38474 16742 64306 18799 -74113 -57334 67966 92674 -48570 -118734 19164
175 19164 129589 13855 -125318 -48070 101983 70318 -69821 -81463 28365 74542 7054
186 7054 -59225 -39649 27448 55319 7180 -60923 -47584 45532 74841 -23648 -95336 -9817
198 -9817 95901 37416 -86157 -63435 57729 72847 -26278 -73717 -10367 56498 38777 -29911
210b9911l0446N2453P1855j9986r7389k3248J04865O9041r4811j07587P0574J33580
222I8990l5565j41328l547J30335L7518j00945n9904N9582O7321j4098n8130k5033
234d4804L2772N2582L329o4428m2867N9473P8513l8622j05606P275J18115K8363
246H4095j12705n9881Q9965Q1692n5236r0770J6026Q3936K1879o2480n2337L0752
258b5064O9126N571o8738m2423N2779P2277k5101q9659r226R1089M3240p7792
270c921o9290N1886Q2754j8318q1487j8299O5679N0090l8502o9655K752P4457
282B8146L4071o3679o5227L9453Q4827n661r1396l0680Q3604O1272o2285q1329
294f8884L1322Q7119L360p7843l5008N3644N8557k0374o8690j6523O4187M8638
$$ plain form
210 -29911 -60357 -7904 63951 43965 -53424 -76672 28193 97234 2423 -105164 -34590 98990
222 98990 63425 -77903 -81450 48885 86403 -14542 -74446 -14864 52457 38359 -19771 -44804
234 -44804 -12032 40550 43879 -20549 -63416 -3943 74570 35948 -69658 -62383 55732 84095
246 84095 -28610 -88491 1474 83166 27930 -62840 -46814 37122 59001 -3479 -55816 -25064
258 -25064 44062 49633 -19105 -61528 -8749 63528 38427 -51232 -60458 30631 73871 -3921
270 -3921 -73211 -21325 61429 43111 -38376 -56675 9004 59094 20592 -49063 -46311 28146
282 28146 62217 -1462 -66689 -27236 57591 51930 -39466 -70146 13458 74730 12445 -68884
294 -68884 -37562 49557 52917 -24926 -59934 -6290 52267 31893 -36797 -53320 10867 59505
306E9505m3892p2790J3154Q3798K2421p9278n6133O0139Q1942l1183r4061k215
318e8593Q9446L5106o9733o0400L8211P4185k064p1760l3195N5272O0975k7659
330B9791p4613o453P2539M1764n6285o9371K8676Q5009N163q4731l9066O9945
342B368O5537m2060p9443O566P9081K9799o5045n8747L9126P5292n327p6779k8966
355e8598O2824N7558l6273p4336J535P7737L3060o6283o0646M1515P6425q499
367D6019p8645k5472O5865N4147m0952p2869R355P7452K2605o6767m9719M2733
379a6248O7024j1437p1419k0976O1775M9211m1369o7877J3681P2365J6532o2901
391a1639m4440M2163O3777j4235p1011j6214O4994M2995m7159o1140K0771O7366
$$ plain form
306 59505 15613 -57177 -44023 39775 62196 -17082 -73215 -13076 68866 37683 -56378 -58593
318 -58593 30853 65959 -3774 -64174 -25963 48222 46158 -25602 -58797 -3525 57450 29791
330 29791 -44822 -51275 21264 63028 6743 -62628 -33952 51057 56220 -28511 -67577 2368
342 2368 67905 25845 -53598 -47032 32049 61848 -3197 -61944 -22818 52474 47147 -29632 -58598
355 -58598 4226 61784 25511 -48825 -47290 30447 63507 -2776 -63422 -21907 54518 46019
367 46019 -32626 -58098 7767 61914 20962 -51907 -42552 34900 57505 -9262 -58981 -16248
379 -16248 50776 39339 -32080 -53056 8719 57930 16561 -51316 -37635 34730 51262 -11639
391 -11639 -56079 -13916 49861 35626 -35385 -51599 13395 56390 9231 -51909 -31138 36228
403C6228Q920o1524l7048M5577N7263k1327o6289o677O2519L2884m6922n2681
415d9077K2345O2368O939o1013l4280M8542N4498k6740o5035k74O4516K7508n2279
428a982m9661L0042O3805l596o5759k2953N5560M4705l4295n8428O935O1420K1336
441D7129n1979m6043L3096O2333p738o6453j9507N7803M4419l8228o1706J2002
453c4872O7535J6482o0840m1325M3678N7449j7806o2504j1216N5467L8411l8022
465A2437n7592J2978O5138J5573o0090m1728M3703O0398j8503o7932j0825O3826
477A7383L7782m9096n6496K5480O3885K911n9166k9899M2271M9982j6401o0501
489c1865j2595N8002L9774m3609n9574J9230O9039R334o6650l6655N2472N7339
$$ plain form
403 36228 45148 -16376 -53424 -7847 49416 28089 -38200 -44877 17642 50526 3604 -49077
415 -49077 -26732 35636 42575 -18438 -52718 -4176 50322 23582 -41453 -41727 22789 50297 -1982
428 -1982 -51643 -21601 42204 38608 -27151 -50104 5456 50161 15866 -42562 -35627 25793 47129
441 47129 -4850 -50893 -17797 44536 36798 -29655 -49162 8641 53060 14832 -46874 -34872
453 -34872 32663 49145 -11695 -53020 -9342 48107 30301 -32203 -43419 12048 50459 12437
465 12437 -45155 -32177 32961 48534 -11556 -53284 -9581 50817 32314 -35618 -46443 17383
477 17383 55165 6069 -50427 -24947 38938 41849 -17317 -47216 -4945 45037 28636 -31865
489 -31865 -44460 13542 53316 9707 -49867 -30637 38402 47736 -18914 -55569 -3097 54242
501E4242k9503o8110K299O5520K3957n0066m5337K5289N6782L603n5921l2091
513d9336M3395N4396k2072o6395m794O5953L1419n3396n3392L2482O5522o056
525C7726o5699k0180N3095M0940l0581n1927K198N1939K6568m0900n0349K1313
537b5857O4559L943o6872l0221N7941N1947l9355o4968J4617O7542J0811n8674
549a4587l1104M0139M2651j5020m4574j1611L6095L5230j7447n1719p119N8166
561A9100L2263n2404n3883L6665O8741j3960p4401j0136O9032L1500n3187m6020
573d6690L0809N0521n947m3174j7778K5718L5690j530m3755k4784M0772M8628
585D8480k7143o6818P426P4559J6544p1755l9918N8785N7065l8144o4217J4179
$$ plain form
501 54242 24739 -43371 -41072 24448 48405 -1661 -46998 -21709 35073 38676 -17245 -49336
513 -49336 -5941 48455 26383 -40012 -44806 21147 52566 -830 -54222 -21740 43782 37726
525 37726 -27973 -48153 4942 45882 15301 -36626 -34428 17511 44079 3179 -47170 -25857
537 -25857 38702 42645 -24227 -54448 3493 55440 16085 -48883 -34266 33276 44087 -14587
549 -14587 -45691 -5552 37099 22079 -22495 -34106 1989 37219 19772 -31947 -39066 19100
561 19100 51363 -1041 -54924 -18259 50482 36522 -37879 -48015 21017 52517 -670 -46690
573 -46690 -15881 34640 28693 -14481 -32259 -6541 29149 27619 -16136 -40920 -148 48480
585 48480 21337 -45481 -38055 36504 53048 -18707 -58625 160 57225 19081 -45136 -30957
597c0957O0072Q863m5253k7067K2359L6153M539l5167l0212K4328N0000o237n9859
610b8438j7423N9278L9932m7895n6629K8200O4065m904o1359j7425M7718L4596
622C9716k5163m3129k944M1886L0100l0912n1670J1868O4788J0736o7757l2819
634e5300N9793N0275m3293o0358K3209O0329l328n0508j2546L2239K0832r258
646A2086j8768j4259P635L3898J0110m6619l1708N0627N3217m4052p1372K9423
658b9782Q2220r948q2757j0719P4833K7622n9472l7000L8818L7948j6323l0171
670a4731l329J5210J7600M573k4405k5617K3167M3226j3675n4258r50N7344J6663
683D0818n2452l0038M1178L8739k4846m0488O526L4043J0340j9789k2884K44K9305
$$ plain form
597 -30957 29115 37978 -7275 -34342 -11983 24170 28709 -6458 -36670 -12342 37658 31421 -28438
610 -28438 -45861 13417 53349 5454 -51175 -22975 41090 36186 -25173 -42598 5120 39716
622 39716 14553 -28576 -31520 10366 40466 9554 -42116 -30248 34540 45276 -22481 -55300
634 -55300 4493 54768 11475 -48883 -25674 34655 31327 -19181 -31727 512 21344 12086
646 12086 -6682 -20941 -13306 20592 30702 -15917 -47625 3002 56219 12167 -59205 -29782
658 -29782 52438 42490 -40267 -50986 23847 51469 -8003 -45003 -6185 31763 15440 -14731
670 -14731 -18060 -2850 14750 19323 -5082 -30699 -7532 35694 22019 -32239 -33189 24155 40818
683 40818 -11634 -41672 -494 38245 13399 -27089 -20563 13480 23820 4031 -18853 -18609 10696
696A0696K0798k8302l9973K0654N4096q054o1724o632O1816K1252n4950l3532
708d3855M2289M0176k6348l8783J0315K9962K363j5824j0343j688J2398K0075
720B0737q377l6502j346M7896J4573n1869k9625M8513M2865l8709n1504K3973
732a9375N3654q433m8252n657L6518J5562j9734j9468o28J6361K0227n860l5806
745b0891r729M4136K7267m4532m3850L7833N6146k4366o2915P850O1973P944n3199
758a6333k0064L7977K5955j9083k3520J27J2861J5695L365k5514k1492K7385L9522
771C6881k1331n4380Q653O2411Q230o1579k5096N2444L8449l7141m4741J8459
783a8741M2747J406l2444j8143J5318K9271N524l2129k6885K7345M4418j5584
$$ plain form
696 10696 31494 3192 -36781 -16127 37969 29915 -31809 -38441 23375 44627 -10323 -43855
708 -43855 -1566 38610 12262 -26521 -16206 13756 16119 295 -10048 -11736 662 20737
720 20737 12360 -24142 -25488 22408 36981 -14888 -44513 4000 46865 8156 -43348 -19375
732 -19375 34279 25846 -22406 -28063 8455 24017 4283 -15185 -15813 548 20775 14915 -20891
745 -20891 -30620 13516 40783 -3749 -47599 -9766 46380 22014 -40901 -33051 28922 36866 -16333
758 -16333 -36397 1580 27535 8452 -15068 -14941 -2080 13615 16980 -8534 -30026 -2641 36881
771 36881 15550 -38830 -30177 32234 40464 -21115 -46211 6233 44682 7541 -37200 -18741
783 -18741 24006 25412 -7032 -25175 -9857 19414 24938 -7191 -34076 -6731 37687 22103
795B2103n4875l88N6586J6888n0020k9948L6778L7543k0028l7049K031K8091J3275
808B0987j1525k2419r194K3633L0633j7645m8464N181N9956J1192o3540k7993
820d9198N8431M2158m5914n0954K8515N2520j0881m4997m579L0238J3873j1432
832G780j5394q403J0111K5544J605l8629j6932M4009L2746m0622m6672K9987N5258
845D0388j5064n6460j248N0464J5493l8502k4793K2202K7180m405k2809j2096
857a9650J2296K4778K459l1022j8803L0053L2701k2528m1749J0244M4915L664
869B7358m1563j7265L2726K7239j8948l1311K680K8723J2618j9700k4236N491
881a6188L1166J0482l1706k5243K6454L6369j6238m2583L271M2776J0261l6493
$$ plain form
795 22103 -32772 -33160 23426 40314 -9706 -39654 -2876 34667 14639 -22410 -20379 7712 20987
808 20987 9462 -12957 -22151 1482 32115 14470 -33994 -28813 31143 42335 -21205 -49198
820 -49198 9233 51391 5477 -45477 -16962 35558 24677 -20320 -24899 5339 19212 7780
832 7780 -7614 -16017 -5906 19638 21243 -17386 -34318 9691 42437 1815 -44857 -14870 40388
845 40388 25324 -31136 -32384 18080 33573 -4929 -29722 -7520 19660 15255 -7554 -19650
857 -19650 -7354 17424 19883 -11139 -29942 111 32812 10284 -31465 -21221 23694 27358
869 27358 -14205 -31470 1256 28495 9547 -21764 -19084 9639 22257 2557 -21679 -16188
881 -16188 14978 25460 -6246 -31489 -5035 31334 15096 -27487 -24216 18560 28821 -7672
893g672k0956K4601K7694j0573k7514l620K1263J5252r528k2615n017K4295K0393
906B6003j9835l3797J0304M2714K043m4589j5574L9875K7920k9917l5811J6231
918a4433L7982j702l4076j0963K4753J9675j1251k2779l890J9809J7899j1598
930I426k8181j17L2540J3359l0766k5702K3629L3548j1341l7344k363L5015J4951
943B6654k7274k4372J5196K8614q70k6895j2947J9150K3939p087l0595o595L0805
956G723J9814k5250k9852J4654L5349j618l4721j1684K8235K2367j7556k8588
968b1127M703K8133R161k2165k0194J0558K7399K894k8342j7167K4008K8800j5078
981A1583l4967K564L5616J0504l0588k1880K1070K9001q185l0631n341K6410J6719
$$ plain form
893 -7672 -28628 -4027 23667 13094 -14420 -18040 3223 18475 8947 -13668 -18685 5610 26003
906 26003 6168 -27629 -17325 25389 27432 -17157 -32731 7144 35064 5147 -30664 -14433
918 -14433 23549 21847 -12229 -23192 1561 21236 9985 -12794 -16684 3125 21024 9426
930 9426 -18755 -18872 13668 27027 -3739 -29441 -5812 27736 16395 -20949 -23312 11703 26654
943 26654 -620 -24992 -9796 18818 17948 -8947 -21894 -2744 21195 14108 -16487 -23082 7723
956 7723 27537 2287 -27565 -12911 22438 20820 -13901 -25585 2650 25017 7461 -21127
968 -21127 -16424 11709 20870 -1295 -21489 -10931 16468 19362 -8980 -26147 -2139 26661 11583
981 11583 -23384 -20820 14796 25300 -5288 -27168 -6098 22903 14718 -15913 -21254 5156 21875
994B1875j6969k3561L641K5904J0575k2772k2651J4916L0476l536l2964r221L0069
1007E782K0017k1162k7874Q948L0969M079k8026j5391K0218K3139q619k6402m211
1020a8533K4223J6078j6519k5619O364K9879N699k8405j6591K0939K5049j0190
1032A2374k8597k595K7528J4112k1145k3213J1182K7834O63k6629j3151K0796
1044h41K2727j0380k8442j636K8365J3681k3516k2980J4009K7723j796k7556j0653
1057b1295K2789K0570j3913k6541K260K7569R351k2820j9558J3520K5967j382
1069A6517k7830j0696K3799K0981j5776k7133M690K8278P413k4539j8075J6235
1081f136K5289n015k7692o603K4483J6584j6285k3564N180K5844P087k3357j7712
$$ plain form
994 21875 4906 -18655 -15014 10890 21465 -1307 -23958 -9042 21434 17898 -15066 -24287 5782
1007 5782 25799 4637 -23237 -14289 16680 20759 -7267 -22658 -2440 20699 12080 -14322 -18533
1020 -18533 5690 21768 5249 -20370 -14006 15873 21572 -6833 -23424 -2485 22564 12374
1032 12374 -16223 -18818 8710 22822 1677 -21536 -10354 17480 18143 -8486 -21637 -841
1044 -841 21886 11506 -16936 -18572 9793 23474 -42 -23022 -9013 18710 16914 -10642 -21295
1057 -21295 1494 22064 8151 -18390 -16130 11439 20790 -2030 -21588 -8068 17899 16517
1069 16517 -11313 -22009 1790 22771 6995 -20138 -15448 12830 20243 -4296 -22371 -6136
1081 -6136 19153 14138 -13554 -20157 4326 20910 4625 -18939 -13759 12085 19172 -4185 -21897
1094b1897J5917K5603o060k8227n183K5514J5779j8241k3441P643K6628M206k4861
1107f620j4559J8437K2364q641k5437l116K3568J4516j7622k2963Q016K7465L136
1120A8544k6410j3658K0676K1482j0499k5809j055K5223J2329k0039k1146J1106
1132i256K5677J26k5070j1354J9720K0801j0605k6334n17K6973J1340k2629j9725
1145b0853J3993K4283l094k4577p924K0495J7335j2298k3244J625K4231R097j9952
1158h83j8497J1824K4504j060k6489r660K3400J8982j6593k4919O995K6262L022
1171A6888k2189j3342J5400J9899n767k1937n040J9476J4265j2426k1321L162
1183a2932K3648P815k2227j7622J6712K4587q103k7544j644K5671J0934j9690
$$ plain form
1094 -21897 -5980 19623 13563 -14664 -19847 5667 21446 3205 -20236 -12593 14035 18241 -6620
1107 -6620 -21179 -2742 19622 10981 -14456 -17572 5996 20512 2890 -20073 -12057 15408 18544
1120 18544 -7866 -21524 -848 20634 10135 -15674 -16729 8494 20823 784 -20362 -9256
1132 -9256 16421 16547 -8523 -19877 -157 20644 10039 -16295 -16812 10161 21501 -1128 -20853
1145 -20853 -6860 17423 14329 -10248 -18172 2323 19658 7360 -15884 -14259 9972 19069 -883
1158 -883 -19380 -7556 16948 15888 -10601 -20261 3139 22121 5528 -19391 -12396 13866 16888
1171 16888 -5301 -18643 -3243 16656 10889 -11048 -16088 3388 17653 5227 -16094 -12932
1183 -12932 10716 18531 -3696 -21318 -4606 19981 11878 -15666 -17310 8361 19295 -395
1195c95j8075J0390K1465L49k0608j0370J5601J7867p227k1782l587K1969J3557
1208A9154j7056k2318R731K7011j08k7326r245K2879J6861j4456k1443L882K1541
1221I107P195j7562j5887R582K1787L24k2633j1185J9003K0903j1882k7362K652
1234a5958K9332P088k6479j5794K0227K1047j0381k2074m77J8880R880j1927j6178
1247a2814K204J8638Q292j6054j8252R296K5813j32k8765j0543K7562J9940k1875
1260C310k6391J2902K8452k314k6196p405J9580J4971r955j8673j181J7513J1805
1273A6418j2048j9328K562K3678P845k3367j7927J8771K5210j0577k9078J220
1285a6621K7379Q503k1216j6189J1548K0240j30j9636j0967J4096J9657n206k4385
$$ plain form
1195 -395 -18470 -8080 13385 13734 -6874 -17244 -1643 16224 8997 -12785 -16372 5597 19154
1208 19154 2098 -20220 -10489 16522 16414 -10912 -20157 2722 19583 5127 -16316 -12434 9107
1221 9107 16302 -1260 -17147 -7565 14222 14546 -8087 -19272 -269 20634 8752 -18610 -15958
1234 -15958 13374 20462 -6017 -21811 -1584 19463 9082 -12992 -13469 5411 15291 3364 -12814
1247 -12814 -10610 8028 16320 266 -17986 -8690 17123 16991 -11774 -22317 5245 25185 3310
1260 3310 -23081 -10179 18273 15959 -10237 -17642 1938 16909 6954 -11719 -12900 4613 16418
1273 16418 4370 -14958 -12396 11282 19127 -4240 -22167 -3396 21814 11237 -17841 -16621
1285 -16621 10758 19261 -1955 -18144 -6596 13644 13514 -6122 -17089 -2993 16664 11458 -12927
1298a2927n999K4725J6698k0475k5639J2792L0913l441l0854o323K5875J3843
1310A9188j6958j7979O038J7844N223j3295j4495N371J9654N241k0851j5804J7367
1323c456K5059j0077l1001R64L2066Q271k8698j5419K1216J9631j1230j9609L05
1336a1978J5730Q853p548j5033k831J7201J3178j3957k2839P438K9131K177l2024
1349a2502j1758L0282J9704k3874k5223J5276K6509n343k3079m108J5926J0676
1361A2486o256j3217m075J1406J3748n858k0555l068K3858J2835k2580k1774J7581
1374e469K7781r591k9664j05K7063Q927k0043j5756J0177J8783R41j7953j0936
1387a5845J2728J8838m366k3198n418K3083J4805j9074k1946J2198K5320m202
$$ plain form
1298 -12927 -18926 5799 22497 2022 -23617 -10825 20088 16647 -14207 -20530 5345 19188
1310 19188 2230 -15749 -9711 8133 13356 61 -14434 -9063 10591 15832 -5019 -20823 -3456
1323 -3456 21603 11526 -19475 -18511 13555 21826 -6872 -22291 -1075 18556 7326 -12283 -11978
1336 -11978 3752 12605 5057 -9976 -12807 4394 17572 3615 -19224 -11786 17345 19522 -12502
1349 -12502 -24260 6022 25726 1852 -23371 -8095 18414 13071 -10008 -14116 1810 12486
1361 12486 6230 -6987 -11062 344 14092 8234 -12321 -15389 8469 21304 -1276 -23050 -5469
1374 -5469 22312 12721 -16943 -17048 10015 18942 -1101 -16857 -6680 12103 13044 -4909 -15845
1387 -15845 -3117 15721 11355 -11843 -17261 5822 20627 1553 -20393 -8195 17125 12923
1399A2923k4266l714J9116R460j0682j2094P97J0620R292o160j6663j751K0430
1412G308J1320k0563k0256J6510K7740r741l1945J657L2015O538k8318j2727K1047
1425E85J5364j1467j5007K549J0862N046l852j0089m656J1282J3273q590k0470
1438a5170K829K5041M740k6014j2568K3543J8721j7739k1741R864K1277j476j7599
1451f292n939J1357J0901k659j2721o221J1104J3672n994j8796j142K0750Q506
1464A6526j9448j4743J5345J8928r262j9914K520J7432M122j2084q937M361J1024
1477E870M003j0045j1188O199J6480k20j9118o853J9287J3294j6353j8518J1202
1490e960K1308n376k0531o88J6594N387j0194p962K635P930M567m968j1087K33
$$ plain form
1399 12923 -11343 -15057 4059 13519 2837 -9257 -8460 2160 11452 5292 -11371 -13122 7308
1412 7308 18628 -1935 -22191 -5681 22059 12318 -19627 -17970 14045 20583 -7735 -20462 585
1425 585 15949 4482 -10525 -7976 2886 7932 4080 -6009 -10665 617 13890 5300 -15170
1438 -15170 -12341 12700 17440 -8574 -21142 2401 21122 3383 -18358 -8494 12783 11307 -6292
1451 -6292 -12231 -874 10027 7368 -5353 -11574 -470 13202 7208 -11588 -12730 8020 16526
1464 16526 -2922 -17665 -2320 16608 7346 -12568 -10048 7384 11506 -578 -9515 -5154 5870
1477 5870 9873 -172 -11360 -5161 11319 11099 -8019 -14872 4415 17709 1356 -17162 -5960
1490 -5960 15348 9972 -10559 -11247 5347 10734 540 -7422 -4787 3143 7710 2742 -8345 -8112
1504h112J4791O427j5823j3527J3909J9522r275k3476L065K4436L358k2531q370
1517a5606J7353J1811j0534j2556K605J0630M575o093r517m33J1410P692j0540
1530G97j4323O847J8978q60k1166n622K0166J1434j6363j5533J0328J6936k755
1543H864j5380m039J0141R993l642j2781l816J2447J0624q777j6245L337J9112
1556I838L541j9234r826J5962J4929j0587j6789L653J5714L048j1529q369N142
1569d507J1340K371j1756r204Q612J5370l316j8405l418J8428J0106j5941j5171
1582a5491J1055J7912m656j7687j599J4392O766q609r796J396J0242N664p811
1595A778j1578L100J4985L061j5664r455J3644J5078r306j8427L317J9183K548
$$ plain form
1504 -8112 6679 13106 -2717 -16244 -2335 17187 7912 -15564 -12499 11937 15295 -7236 -15606
1517 -15606 1747 13558 3024 -9532 -6927 3703 8278 2185 -7332 -7765 3645 11337 797
1530 797 -13526 -6679 12299 11439 -9727 -15349 4817 16251 -112 -15645 -5317 11619 8864
1543 8864 -6516 -10555 -414 9579 5937 -6844 -10660 1787 12411 3634 -12611 -9274 9838
1556 9838 13379 -5855 -15681 281 15210 4623 -12166 -8513 7201 10249 -1280 -9649 -4507
1569 -4507 6833 9204 -2552 -11756 -3144 12226 8910 -9495 -12913 5515 15621 -320 -15491
1582 -15491 -4436 13476 8820 -8867 -10466 3926 10692 2083 -7713 -6317 3925 9589 1778
1595 1778 -9800 -6700 8285 11346 -4318 -13773 -129 14949 5643 -12784 -9467 9716 12264
1608A2264j6766p965J2343J0658n853j1154q27R289O410n242j0496r8J2113N706
1622A0382j0911j0685P088J4468k040j6084l627J4798Q586j1394j1895O496J3229
1635H411r06j1841n198Q638R924l883j2078k005J2044P138r183j1694N001J3952
1649H320L76j3882o086J1960J0421p973j2901K842J2657L020j0247p819N858J0677
1663G223J66j1917n545J0281J0175o391j3440J160J4493M850j2962j0372R370
1676b909J4098m513j4983j109J3465O325r336j0379L855J2129K303j1004q186
1689a0244P817J2251k538j4119l354J2764R263r155j3549L955J5488J840j4578
1702d159p382J1541J0947n743j2678r71J2132P085r031j1610L845J3674K233j2912
$$ plain form
1608 12264 -4502 -12467 -124 10534 4681 -6473 -7300 1989 8399 3157 -7339 -7437 4676 10382
1622 10382 -529 -11214 -4126 10342 8302 -7782 -11409 3389 11975 581 -11314 -4818 8411
1635 8411 7505 -4336 -9534 -896 9028 5145 -6933 -8938 3106 10244 1061 -10633 -5632 8320
1649 8320 8696 -5186 -11272 688 11109 3136 -9765 -6923 5734 8754 -1493 -9312 -3454 7223
1663 7223 7389 -4528 -10073 208 10383 3992 -9448 -8288 6205 11055 -1907 -12279 -2909
1676 -2909 11189 6676 -8307 -9416 4049 10374 1038 -9341 -5486 6643 8946 -2058 -10244
1689 -10244 -2427 9824 7286 -6833 -10187 2577 11840 2685 -10864 -6909 8579 10419 -4159
1702 -4159 -11541 0 10947 5204 -7474 -8445 3687 10772 1741 -9869 -6024 7650 9883 -3029
1716c029q182R971J2215m555j4712j525J4748O789j1492j1417O758J3181o70j2746
1730d666n443R648J0169m584j2748j365J2917O773j0316j1097N354J3757M93j3891
1744d999n943J1343J0716p458j3322K014J3362L633j0836q468O383J1292n45j2117
1758d945n052J0353R720o609j2548J539J2834M316j1233r105P877J2094l120j2936
1772f815k124J1616O589p756j0208L114J1324K923j0725p583P431J1284l270j2497
1786f697k003J1839O828q787j0899M534J2647P65j2301n185R254R139n042j0847
1800f755p57J0977O071q794r893M499J2490M97j2598n551J0244R968o192j2401
1814h195Q86J2802M487j1177q660P068J1360j668j1676m209R764R475n904j3059
$$ plain form
1716 -3029 -11211 -1240 10975 6420 -8292 -9817 4931 11720 228 -11189 -4431 8750 8080 -4666
1730 -4666 -10109 -461 9708 5124 -7624 -8989 3928 10701 385 -10712 -5358 8399 8892 -4999
1744 -4999 -10942 401 11117 3659 -9663 -7649 5713 9346 -1490 -9958 -3575 7717 7172 -4945
1758 -4945 -9997 356 10076 3467 -9081 -7542 5292 9608 -1625 -10730 -2853 9241 6121 -6815
1772 -6815 -8939 2677 9266 1510 -8698 -5584 5740 8663 -2062 -9645 -2214 9070 5800 -6697
1786 -6697 -8700 3139 9967 1180 -9719 -5185 7462 8227 -4074 -9259 -5 9134 4092 -6755
1800 -6755 -7512 3465 9536 742 -9151 -4652 7838 8335 -4263 -9814 430 10398 4206 -8195
1814 -8195 -7309 5493 9980 -1197 -9857 -2789 8571 6903 -4773 -8982 782 10257 4353 -8706
1828h706Q12J3767M794j1923r884P863J3064k395j3872l307J2289Q269q557j1588
1842i374L312J2280K673j0546q117O348J1787q34j3076n075J1908J0133q132j3547
1856a0260K469J4752L464j3330q825R519J2436m268j3408j679J1935O891p720
1869A976j0668K048J1998M098j0858r633P623J2961k258j4375l433J2977Q533
1882A0989r216j2193M133J3393J587j1796o882Q416J0140k943j1333k998J0038
1895A335Q516o940j2474K574J3819K992j2952p743R828J1269n027j2732l84J2101
1909D182N110r212q266M260R911R60q828o204O152J0248k063j2504k842J2252
1923C156P400r782j0649N895J2109q96j1915l557R464P003n527q834J087Q060
$$ plain form
1828 -8706 -7894 5873 10667 -1256 -11140 -3277 9787 7392 -6480 -9787 2502 10771 2214 -9374
1842 -9374 -6062 6218 8891 -1655 -9772 -3424 8363 7529 -5547 -10622 1286 11419 3287 -10260
1856 -10260 -7791 6961 10425 -2905 -11730 -2211 10225 5957 -7451 -9130 2805 9696 1976
1869 1976 -8692 -6644 5354 9452 -1406 -11039 -3416 9545 7287 -7088 -10521 2456 10989
1882 10989 1773 -10420 -6287 7106 8693 -3103 -9985 -1569 8571 5628 -5705 -8703 1335
1895 1335 9851 2911 -9563 -6989 6830 9822 -3130 -10873 -1045 10224 5197 -7535 -7919 4182
1909 4182 9292 80 -8186 -3926 5985 6945 -1883 -8087 -1935 8313 6250 -6254 -9096 3156
1923 3156 10556 774 -9875 -3980 8129 7233 -4682 -8239 1225 8228 2701 -6133 -5046 3014
1937C014L923n740p857J537J0386L191j1047p551R477J1299o297j3311K180J3289
1951F493K376j1691o303Q735Q415m238r038r4P120M019l803o990l84P843N108
1966G568p077r238N124J1587j593j2373k640J1098O755q392r315M418J0387J5
1980F324r605m221O817P317k495q964k423Q828P093p115j0789L778J2871K66j2676
1995d994m187J0362P281o804q583K442Q492J515o169m517K428O020K190o054o434
2010g012L613J0707l10j2970l415J2832P597j1116j0768P963J2418l802j2285
2023f548o38J0445M089p119o270L251O470J249m834n243J937P713K077q803o058
2038h282Q442Q720n624j1169K411J1631J120j0178m632P404O947l679p515m82
$$ plain form
1937 3014 6937 1197 -6660 -5123 5263 8454 -2593 -10144 -667 10632 4335 -8976 -6796 6493
1951 6493 8869 -2822 -9125 -390 8025 3787 -5251 -5345 1775 5794 1991 -4999 -5383 2460 7568
1966 7568 491 -8747 -3623 7964 6371 -6002 -8642 2456 9211 819 -8496 -4078 6309 6324
1980 6324 -3281 -7502 -685 6632 4137 -4827 -7250 1578 8671 1556 -9233 -5455 7416 7682 -4994
1995 -4994 -9181 1181 8462 1658 -6925 -4483 4009 5524 -645 -5162 -2734 3286 5476 -578 -7012
2010 -7012 -3399 7308 6998 -5972 -9387 3445 11042 -74 -10842 -2879 9539 5737 -6548
2023 -6548 -7186 3259 7348 229 -6041 -2790 3680 4929 95 -5148 -3211 4502 6579 -2224 -8282
2038 -8282 160 8880 3256 -7913 -5502 6129 7249 -2929 -7561 -157 6790 3111 -4404 -4886
2052d886O706M067l947o897l9Q506L946q262q055O822J0655l889j1671J85J1335
2067D576L210r261o013O102P335k146p427j375N074M791j948o232k463O715O387
2082G325n573r837L235J2107l52j2078l188J0540O261p735q166L889Q306r5o436
2097a797l344L572N233O49o038m918M910R214k594j2103p61J2979M674j2286p716
2112a0326R590J0098n856j0947J757R887J844p005m665L367N482J455m853n614
2126e786K362Q707J388j0214n384R815R011p712j1531M164J2327J33j1253m229
2140h202Q861P022m831q108K85P239M167m741p372P97R011L529r059p413P529
2155a286R965l952j1292R4J0521L400p767o457M340P480k46o952l375M321O470
$$ plain form
2052 -4886 1820 5887 1940 -4957 -4996 3510 7456 -806 -8861 -2039 8616 4727 -6944 -6759 4576
2067 4576 7786 -1475 -7488 -1386 5949 3803 -3624 -4999 75 4866 2918 -3314 -5777 938 7325
2082 7325 1752 -8085 -4850 7257 6905 -5173 -8361 2179 8440 705 -7461 -3572 4734 4639 -1797
2097 -1797 -5141 -1569 3664 4313 -1725 -6643 -1733 7481 4887 -7216 -7977 5002 9676 -2610 -10326
2112 -10326 -736 9362 3506 -7441 -5684 4203 6047 -958 -5623 -2256 3226 4681 -172 -5786
2126 -5786 -3424 5283 6671 -3543 -8927 888 9899 2187 -9344 -5180 7147 7280 -3973 -8202
2140 -8202 659 7681 2850 -5258 -4973 2266 6433 1692 -5680 -4883 4128 7657 -1402 -8815 -1286
2155 -1286 8679 4727 -6565 -6471 4050 7450 -317 -6774 -2434 5046 4800 -2152 -5527 -1206 5264
2170E264o52q036l465P571P839o355j0452L416J2011o2j1644l356R386O032o338
2185A159p123K325P004J151m935m031J835N519J683n376n575M034Q658j381j0746
2200e799j305J0801M557r443p295O922Q602l573q522N2P291K693m872m444J698
2215b637N096J476l851m723J536P311Q94q050m033P766O561n953q211L006Q824
2230E012j03p774k751N641N487l307o275j57N893L360l768o252J170P683K023
2245E882p750m983O559P444m490q523J348Q544J745p105m175M241N980j162n918
2260b363k277M306N184j531p011j521P294M927o123q267M285R841j168j0132k064
2275f620Q845M863o010o986K990P132N66o226l624L819N763m00o661l039N424
$$ plain form
2170 5264 4612 -3424 -6889 682 8521 2166 -8286 -4870 7141 7079 -4565 -7921 1465 7497 1159
2185 1159 -5964 -3639 3365 4516 -419 -4450 -2615 2904 4587 -789 -6364 -2330 6328 4947 -5799
2200 -5799 -7104 3697 8254 -1189 -8484 -1562 7040 3467 -5055 -5003 2288 4981 109 -4335 -2637
2215 -2637 2459 3935 84 -4639 -3103 4208 5102 -2948 -6981 785 7346 1393 -6818 -3812 5012
2230 5012 4909 -2865 -5616 25 5512 2205 -4070 -4227 1666 5026 1258 -4994 -3824 3859 5882
2245 5882 -1868 -6851 -292 7152 2662 -5861 -4513 4031 5776 -1329 -5504 -1263 4717 3555 -2363
2260 -2363 -4640 -334 4850 3319 -3692 -5213 2081 7008 885 -7382 -3097 6744 5576 -4556 -6620
2275 -6620 2225 7088 1078 -5908 -2918 4214 4780 -1446 -5070 -1251 4512 4112 -2549 -5588 -164
2290a64O673l315r032J97R657L106q829n927O538P502k963q313m64P391M028n340
2306G45o081J952O736J800o146m898L577P624p69q432k790Q051N501n928p481
2321f539L073Q052N03p492l689N406N795k421o438p14N818L852m045o164J371
2336c632P314J781p380m674N918P107l315q237M57P599K664n980m755K997O214
2351D078k25n863k839M577M859k038o057j197O612L754n387o149L295Q258j349
2366D329p831j734O796M176m891n510J736O392Q85n479l358L571N163p74o006
2381b535k047N258M922l852o726J155P685J555p232l946N346N832k640o790j65
2396d180O251K914m751n252K475O262M92n781l732M351O122k067p329p63P382
$$ plain form
2290 -164 6509 3194 -5838 -5641 4016 7122 -1707 -7634 -1096 6406 3443 -4870 -5334 2057 6085 745
2306 745 -5336 -3384 3352 5152 -994 -5892 -2315 5309 4540 -3892 -6682 1369 6870 942 -6539
2321 -6539 -3466 4586 5089 -2403 -6092 -686 5109 2688 -3750 -4464 1354 5206 1161 -5003 -3632
2336 -3632 3682 5463 -1917 -6591 -673 6434 3119 -5118 -4661 2938 5602 -378 -5133 -2136 4078
2351 4078 3853 -2010 -4849 -272 4587 2549 -3508 -4705 1907 5661 274 -5875 -2580 5678 4329
2366 4329 -3502 -5236 1560 5736 845 -4665 -2929 3463 4348 -1131 -4489 -918 4245 3471 -2535
2381 -2535 -4582 676 5598 1746 -4980 -3825 3860 5415 -1817 -5763 -417 5415 2775 -4015 -4180
2396 -4180 2071 4985 234 -5018 -2543 3719 4211 -1570 -5302 -951 5171 3104 -4225 -4988 2394
2411B394L405n810n819L447O707l81o683k505N327M859k827o494N1O503L006n223
2427d3n240K523O953L01p206l457O146O131m004p182R42P481J910o296m432L814
2443a659O248q61o643k185N585M753l304o441M68O710K717n900n392L866P287
2458E249j307p433j919O592M230m082o124J630O215J825n768m356L934N971q85
2473C772o681j949N812M800m150o724J596P066J471o288l904M831N317j988o270
2488c289q20N600L452m026n434J633O352R02n506l899M162N726j695p121n13O679
2504B203L282n578n028L042O383q47n764k403M955M261k541n648k64N917K666
2519D636m622m752K428O230M4o682k764O174M614m059n861J327O254J228n358
$$ plain form
2411 2394 5799 -11 -5830 -2383 4324 3943 -2740 -5245 82 4941 2114 -4380 -4329 2174 5180 -43
2427 -43 -5283 -2760 4193 4494 -2712 -6169 -23 6108 2104 -5078 -4136 3345 5255 -1041 -5473 -1659
2443 -1659 4589 3728 -2915 -5100 485 5238 1934 -4507 -4039 2671 5388 -512 -5904 -2038 5249
2458 5249 3942 -3491 -5410 1182 5412 1330 -4794 -3164 3051 4876 -892 -5248 -1314 4657 3772
2473 3772 -2909 -4858 954 5754 1604 -5120 -3524 3542 5013 -1275 -5179 -348 4969 2981 -3289
2488 -3289 -4109 1491 4943 917 -4517 -2884 3468 4370 -1136 -5035 -873 4853 3158 -3963 -4476 2203
2504 2203 5485 -93 -5121 -2079 4304 3457 -2307 -4710 245 4506 1965 -3683 -3947 1970 4636
2519 4636 14 -4738 -2310 3920 3964 -2718 -5482 692 5306 1247 -4614 -3287 2967 4195 -1163
2534a163l563L318N258m67o155j829N194M472l580o014P86O800J895o131m741
2549e920M769O435k462o827l08N979L026m241n004J799N849J193n650l890M105
2564a147N911j455o462j894O386M403m833o360K195P322M56o567l152N312M804
2579D919k559o104m34O011L528m624n784K102P154M35o566l616N177O097l083
2594B653p133J13P122K696n922m664L436N688k42n358l000M207N344k051o549
2609c660q09O306L873n096o112K697P493P3p707k650O494M945m610o006J692O077
2625C000J219n128l535K761N190j3n401k728M373M914k311o218m04O565L072n943
2641e87n041L807O687j644o536q94N136L391l208m851P46N163J863m521m089K738
$$ plain form
2534 -1163 -4726 -1408 3850 3383 -2772 -4601 593 5065 1485 -4529 -3743 3057 4952 -1179 -5920
2549 -5920 -1151 5284 2822 -4005 -4313 1666 4692 451 -4553 -2754 3095 4288 -1362 -5252 -1147
2564 -1147 4764 3309 -3153 -5047 1339 5742 909 -5451 -3256 4066 4522 -2045 -5197 115 4919
2579 4919 2360 -3744 -4178 1833 5361 737 -5047 -2945 4209 4644 -1922 -5538 -361 5736 2653
2594 2653 -4480 -4367 2755 5451 -471 -5135 -1699 3989 3747 -1611 -4611 -404 4940 2889 -3660
2609 -3660 -4469 1837 5710 614 -5498 -2801 4692 4765 -2942 -5592 902 5847 1237 -4769 -3077 3000
2625 3000 4219 -909 -4444 -1683 3507 3494 -1907 -4635 -262 4652 2341 -3877 -4281 2284 5356 -587
2641 -587 -5628 -1821 4866 3222 -3314 -4208 928 4319 1111 -3740 -2994 2169 4032 -489 -4578 -1840
2657a840N808n26o271j973N467M301l861o121K155O413L88n995k313L942M197
2672C771j702m630r37M195L504k926n125N80O235J471n674l950M383N853k612
2687B436o610K17O448J974n180l495L038M085j20m040k511L032M467r17n435j593
2703d204N482L886m373n704K298P139l79o859k014N958L517l889m772J667M641
2718B394P98l417k975J451M469O05m462l008L761M891k068o208O1O107K456n403
2734e48m223L840N224j864n245o90M581K401k584l940J51M650K109l926m129K490
2750a703N507p52n801j577N228L646l774m948J821N491L9m857j944L331L267j057
2766A917l829j462L671L576k569n098P94N592J582n511l464M188N009k476n599
$$ plain form
2657 -1840 3968 3442 -2829 -4802 665 4966 1105 -5016 -2861 3552 3940 -2055 -4368 -426 3771
2672 3771 2069 -2561 -3498 697 4201 1275 -3850 -3270 2965 4436 -1238 -5188 -805 5048 2436
2687 2436 -4174 -3957 2491 4465 -715 -4210 -1172 2913 2793 -1247 -3758 -726 3741 2824 -2611 -4204
2703 -4204 1278 5164 791 -4913 -2615 4524 4145 -2714 -4728 1230 4747 858 -3914 -2247 2394
2718 2394 3192 -225 -3200 -1749 2720 3325 -1137 -4145 -384 4507 2439 -3769 -3708 2399 4855 -548
2734 -548 -4771 -931 4293 2429 -2816 -3506 1075 3476 892 -3048 -2897 1753 3862 -64 -4193 -1703
2750 -1703 3804 3052 -2749 -4326 902 4548 774 -4174 -2353 3138 3177 -1680 -3624 -293 2974 1917
2766 1917 -1912 -3374 297 3873 1304 -3794 -3000 2592 4174 -1337 -4801 -613 4396 1920 -3679
2781c679L06N369J520m169k757K407L275j9l151k139K304L877o48m811j382M633
2797I36L642m018n034K332N937p4o311j835N606L142l941l848J650M292J93l366
2813f97k007J742L438K05l974k242L575L883k153n082L10N370J883m917l785L722
2829g29M909j753n220m03M441K347l013l832R41M541J568m378l536L124N024j190
2845B841n915p63N454K851m387m166K360M832o16m146j200K543L140j067l634
2860a873j142L317L567k579m985O74N705J501n520l620M615N029k727n957N26
2875c469N974J338m592l021K508L907m09l727j856K796L711j084m478j031M524
2890A091L206l941m640K200N493j37n616j632M607L375l172l988J017L718J394
$$ plain form
2781 -3679 -3373 1996 3516 -653 -3410 -1003 2272 2253 -898 -3037 -733 3144 2496 -2315 -3697 936
2797 936 4578 560 -4474 -2142 3795 3721 -2590 -4425 1181 4323 382 -3466 -1816 2476 2669 -697
2813 -697 -2704 -962 2476 2681 -1293 -3535 40 3923 1770 -3312 -3002 2368 4251 -666 -4451 -729
2829 -729 4180 2427 -2793 -3196 1245 3592 579 -3253 -2312 2229 3797 -581 -4117 -993 4031 2841
2845 2841 -3074 -3837 1617 4468 81 -4085 -1725 3107 2491 -1655 -2855 -312 2828 1761 -1873
2860 -1873 -3015 302 3869 1290 -3695 -3021 2684 4185 -1335 -4955 -340 4689 1962 -3995 -3469
2875 -3469 2505 3843 -749 -3770 -1262 2645 2236 -1491 -3347 -551 3160 2076 -2402 -3433 1091
2890 1091 4297 356 -4284 -2084 3409 3272 -2344 -3976 631 4006 834 -3154 -2137 1581 2975
2905B975l163k956J554M273K97m309k466L818L980k510m713K01N174J615m458
2920f88l200L244M030j554m004l48L228K401k291l159jL980J628l376l439K410
2936a139M290o42m757j096M308L001l332l919J604M252ml786j463K394K937r32
2952A716l203j034L070K799k299m250Q42M912P62m523k387L573L508k092m393
2967b999P97L968J105l599j991K181K572k16k809j694K300L009j179l923l04L958
2983A176K084l264l748K283M375n81m471j109M029K534l050l179J259L536L22
2998B196k697k449J860L694m59l893j050L297K751k468l866Q22M403P40l916k316
3014c351L022L257j456l751K0L227J717k214k942O51L617J159l430k855K772L913
$$ plain form
2905 2975 -188 -3144 -1590 2683 2980 -1329 -3795 23 4003 1493 -3220 -3019 2155 3770 -688
2920 -688 -3888 -644 3386 1832 -2172 -2520 708 3109 818 -2341 -2342 1638 3266 -110 -3549 -1139
2936 -1139 3151 2509 -2248 -3344 964 3965 633 -3286 -1682 2570 2566 -1220 -2683 -289 2648 1716
2952 1716 -1487 -2521 549 3348 1049 -3201 -2359 2553 3315 -1208 -3595 -22 3486 1394 -2999
2967 -2999 -2202 1766 2871 -728 -2719 -538 2034 1818 -991 -2685 -385 2624 1445 -2478 -2782 1176
2983 1176 3260 -4 -3752 -1469 2906 2325 -2146 -3255 774 3308 258 -2921 -1662 1874 2196
2998 2196 -501 -2950 -1090 2604 2145 -1748 -2798 499 3250 782 -3084 -2262 2141 2881 -1035 -3351
3014 -3351 -329 2928 1472 -2279 -2259 968 2685 471 -2471 -1820 1797 2956 -474 -3329 -557 3356
3030C356j442m267o32M431K025l438l479K005M140n30l630j506L249K556j585
3045A253l168n57L525K228k882l377J430M198J91m233j694L287L175k126m093
3060b843N38M312R67l556k407K211L201l00l558j467K896K990j543l971j6M192
3076A646J709l798k869K342L821n82m310r30L812K435k928l151J026L357J063
3091B643l137k319J836L547o49l973q99L702K506k768l504J030M181N68l944k301
3107c481L043L406j488l868k2L074K120k247l300Q96L963N50l429k643L051L532
3123C157j470m223j70L897J965l178l265K037L784j35m038j291L106K635j417
3138A394l666j27L481K131k917l414J677M104n4m061j590L481K986k313l912O74
$$ plain form
3030 3356 1914 -2353 -2985 1446 3471 33 -3446 -1441 2699 2169 -1461 -2967 282 2838 1253
3045 1253 -1915 -2472 1053 3281 399 -2978 -1548 2650 2841 -1392 -3086 201 3376 1250 -2843
3060 -2843 -2305 2007 2974 -582 -2989 -778 2423 2123 -1435 -2902 -6 2984 1441 -2530 -2546 1646
3076 1646 3355 -443 -3312 -970 2851 2269 -2041 -2971 841 3276 348 -2803 -1777 1580 2643
3091 2643 -494 -2813 -977 2570 1921 -2052 -2951 751 3257 489 -3015 -1985 2196 2764 -1180 -3481
3107 -3481 -438 2968 1480 -2388 -2410 664 2784 537 -2763 -1867 2096 2646 -783 -3426 -375 3157
3123 3157 1687 -2536 -2706 1191 3156 -22 -3287 -1250 2534 2399 -1639 -2930 176 2811 1394
3138 1394 -2272 -2399 1082 3213 296 -3118 -1441 2663 2609 -1452 -3042 439 3425 1112 -2800 -2126
3154b126L975J246l471k693K300L261l18l669j358K916L125j737l973M8M113J391
3170C030l386k886K161L972p96l739j213L571K357k518l132P20L403J099k930
3185b87k733K136L689m87m374r03L781K440k529l718J006L977P39l464k348K405
3201f70L288j075l504n49L133K425k443l294N62M045Q93l817k220K592L648j407
3217A607l854l97L839J870l014l120J740L684k38l281j499K344K881j340l184
3232a962m11L187K097k419l452J323M115r3l720j488K899K886j783l373K58L410
3248A474J321k857k587J659L302R0l525j696K750L086j880l668L18L668J294l111
3264c62k364K107L058m85l416q39K754K024j776k888M85L292Q72k714k188J444
$$ plain form
3154 -2126 1849 3095 -376 -3069 -769 2492 2174 -1495 -2853 63 3188 1451 -2522 -2474 1639 3030
3170 3030 -356 -3242 -1081 2891 2095 -1644 -2857 714 3071 553 -2579 -1859 1544 2643 -287
3185 -287 -3020 -884 2805 2318 -2056 -2959 822 3262 733 -2985 -1979 1998 2737 -727 -3075 -670
3201 -670 2618 1543 -1961 -2510 623 3048 605 -2689 -2127 1918 2811 -1006 -3226 -634 3014 1607
3217 1607 -2247 -2644 1195 3065 51 -3069 -1329 2355 2117 -1164 -2663 -319 2562 1222 -1962
3232 -1962 -2373 814 2911 492 -2960 -1637 2478 2385 -1335 -2823 76 2962 1179 -2194 -1936 1474
3248 1474 2795 -62 -2649 -990 2312 2402 -1123 -2819 -69 3017 1137 -2531 -2213 1455 2749 -362
3264 -362 -2726 -619 2439 1954 -1462 -2301 453 2477 701 -2187 -1702 1590 2462 -252 -2440 -996
3280i96L473m00l555j151L458K038k321l094J200L299M63l194j715K135L005j071
3296A574l238p30L145J914k182k855O81L613Q14l566k240L138K761j646l403J07
3312b113L453J318k605k407J294K861J17k977j318K037K330o67l198l80L133K069
3328B947k657l425J917L371J69l565j485K881K584j842l148Q5L312J310k621k336
3344b503J419L109k1l087j811K850K894j717l628K60L874J005l161k267K134K950
3360B300o14l050q78K432K229j545k839P8L226J260k745k472J433L917n67l901
3376a736j193L608K290k483k979J120L177N24l015j635J873K475m11k922o61K114
3392A46K308j248l193N1L501J304l182k503K398L268j280l396l27L131J486k202
$$ plain form
3280 -996 2477 2077 -1478 -2629 829 2867 546 -2548 -1348 1951 2414 -780 -2495 -360 2645 1574
3296 1574 -1664 -2394 751 2665 483 -2372 -1691 1922 2736 -830 -3070 68 2829 1183 -2220 -2113
3312 -2113 1340 2658 53 -2354 -1060 1801 1918 -1059 -2377 -340 1990 1323 -1875 -2255 878 2947
3328 2947 290 -3135 -1218 2153 2322 -1243 -2728 153 2737 895 -2253 -2168 1144 2454 -167 -2503
3344 -2503 -1084 2025 2004 -1083 -2894 -44 2850 1133 -2495 -2235 1639 2644 -517 -2784 -650 2300
3360 2300 1686 -1364 -2242 190 2419 874 -1965 -1887 1339 2599 -146 -2618 -1185 2732 2165 -1736
3376 -1736 -2929 679 2969 486 -2493 -1373 1804 2328 -687 -2322 -449 2026 1615 -1307 -1968 146
3392 146 2454 1206 -1987 -1936 1565 2869 -313 -2816 -418 2850 1570 -1826 -2153 978 2464 262
3408B62k623J177K665M30k638j238J453K437m28k927q27K740K266k284k974J145
3424a364L135L8k793j429K522K083j119k873K1K720J011j857k049P79K644J65
3440A634k699j467K242K737j466l293O16L174P24k950j296J782K023m62k426o15
3456a742K092J510j258k283J26K403J393k278k244J260L160j42l828m64K967J858
3472B530k407k404J329K680r4k414q67J483K033q04k328l55K055J532j394k523
3488a948M58K920R49k949k013K503K566j261k844Q8K570J196k146j949R40K529
3504A609n1k227j166J797J894o81k798k17K860J395k305k348J422K890k73l188
3520a387o43K415J613j385k312K93K537R72j986k161J005K702k7k555j512K513
$$ plain form
3408 262 -2361 -1184 1481 1911 -727 -1965 -512 1925 1497 -1430 -2257 483 2749 465 -2509 -1364
3424 -1364 1771 1809 -984 -2413 109 2192 1073 -1800 -1779 941 1952 95 -1954 -1175 1469 1634
3440 1634 -1065 -2532 -290 2447 981 -2312 -1696 1478 2202 -748 -2044 -262 1761 1299 -1127 -1742
3456 -1742 350 1860 602 -1681 -1555 848 2241 -37 -2281 -1021 2139 1997 -1831 -2295 672 2530
3472 2530 123 -2281 -952 1728 1634 -780 -1647 -164 1869 1065 -1263 -1618 437 1969 575 -1948
3488 -1948 -1490 1430 2379 -570 -2583 -80 2486 1225 -1619 -1531 1039 2235 89 -1860 -920 1609
3504 1609 1558 -669 -1835 -38 1856 1175 -1623 -1840 1020 2415 110 -2238 -816 2074 1801 -1387
3520 -1387 -2030 385 1998 613 -1699 -1406 1131 2103 117 -2044 -1039 1663 1636 -919 -2431 82
3536H2K378j673k989O65K931O31k743j510J909K048l62k534o83J959J865j389
3552E85k193M8K586R57k102k112J152L273p24l086p02L082J479k201k178J092
3568a044K666Nk323j321J828J878q19j859o30J925J631j347k362L24K907N21k938
3585i58j415K418K415j353k800K45K500R25k133j798J316K162k26k033j112J755
3601i2J964p18k669j53K507J541k253k435J745K622m90k746o92K368J498j494
3617E03k168M08K190J074k021j964J297K628l79k741r78K558J817j462k952P07
3633a483L171L29k771j323J943K091p41k540l95K046J606j340k327K77K526R05
3649A974k319k037J693K665n54l114m00K918J375k236k251J446K392J30k590r35
$$ plain form
3536 82 2460 787 -2202 -1537 1394 2025 -718 -2228 -319 1729 1367 -1167 -1850 109 1974 585
3552 585 -1608 -1560 1026 1983 -119 -2231 -1079 2194 1470 -1616 -2318 764 2243 42 -2136 -1044
3568 -1044 1622 1627 -696 -2017 -189 1689 870 -989 -1619 306 1937 590 -1772 -1448 1459 1980 -958
3585 -958 -2373 45 2460 1107 -1693 -1448 1052 1977 -156 -1954 -638 1524 1298 -735 -1847 -92
3601 -92 1872 1154 -1515 -1668 839 2380 127 -2308 -563 2059 1569 -1177 -1869 499 1997 503
3617 503 -1665 -1257 933 2007 -14 -1978 -681 1947 1568 -1173 -2151 407 2224 762 -2190 -1483
3633 -1483 1688 2017 -754 -2077 -134 1957 1216 -1324 -1719 327 1933 593 -1734 -1457 1069 1974
3649 1974 -345 -2382 -689 1976 1422 -1692 -2092 826 2201 -35 -2286 -840 1552 1682 -908 -1843
3665a843J530K229q97k474m76K172J778j690k480Q75K714M83k725j571K331K262
3681B218j393k548J20K490J166k099j888P88K550K08k612j027J898K047r04k725
3697a711q0K742J342k265j967J101K743m15k618n87J953J557j156k103K10K230
3713I76Q22j805j697R44K294P8k649r04K235J790j396k608P80K520M00k344j222
3730a786J461K009o70k041m04J904J358j238j989M23K250O05k435j433J377K439
3746A830o17k652j77K373J168j956j975J108K393k35k051j201J885J696o90k405
3762a506j2K135J423j816k423J436K188K79k703j090K266J831j272k535N03K309
3778A013O72j751j961J298K375j35k348j105J903K280j316k661J36K601J131k210
$$ plain form
3665 -1843 -313 1916 1019 -1455 -1931 241 2019 329 -2151 -1276 1438 1921 -804 -2375 -44 2218
3681 2218 825 -1723 -1603 887 2053 -46 -1934 -1146 1404 1612 -1000 -2027 -129 1918 1014 -1711
3697 -1711 -1791 951 2293 28 -1939 -838 1905 1490 -1128 -1715 238 1795 639 -1464 -1254 976
3713 976 1798 -7 -1704 -760 1534 1612 -1037 -1941 294 2084 688 -1920 -1140 1380 1780 -564 -1786
3730 -1786 -325 1684 1014 -1027 -1431 473 1831 593 -1396 -973 1277 1882 -553 -1986 -609 1830
3746 1830 1213 -1439 -1616 757 1925 -31 -2006 -898 1495 1260 -791 -1992 -107 1589 899 -1506
3762 -1506 -1518 617 2040 224 -2199 -763 1425 1704 -999 -2089 177 2008 736 -1799 -1296 1013
3778 1013 1685 -66 -2027 -729 1646 1511 -837 -1942 -39 2241 925 -1736 -1600 1001 2132 -78
3794g8k370J888K456n65k376p85K120J789j312k225J8K658O59j976j957J182K569
3811A695j04k529j047K187K206j512k834O57K459J130k842j598J811K173m86k449
3827a083o77K166J548j465k140L74K502O88k261j446J280K440o59k543n37K584
3843G71J159j599j883P23K212J94j900j415J281K311p21k479l95J969J663j397
3859D94k400Q82K240N66k638j068J793J807o44k281j33K071R09j670j545O87K287
3876A357j30j969q90J459J776r26k190j06K334J045k041j697J126K263r6k174
3892h59r51J880J812j346k175L39K360O05j809j752J276J973k14k222o47K159
3908D29J543j636k030M96K368L49k090j189J589J582n02k081k97J906J299j281
$$ plain form
3794 -78 -2448 -560 1896 1331 -1045 -1830 290 2079 767 -1458 -1440 1218 1877 -99 -2056 -874 1695
3811 1695 1591 -938 -1985 202 2408 896 -1938 -1281 1178 2308 -534 -2132 -321 1852 1366 -1083
3827 -1083 -1760 406 1954 489 -1651 -1277 1225 1913 -348 -1794 -514 1926 1267 -1276 -1813 771
3843 771 1930 331 -1552 -829 1383 1577 -323 -1738 -457 1854 1133 -1346 -1741 228 1891 494
3859 494 -1906 -1024 1216 1782 -856 -1924 -131 1676 1032 -1249 -1382 689 1598 -72 -1617 -930 1357
3876 1357 1227 -742 -1632 -173 1603 677 -1513 -1619 715 1760 -281 -1978 -852 1411 1315 -859
3892 -859 -1810 70 1882 536 -1639 -1300 1060 1665 -144 -1896 -620 1353 1139 -1083 -1730 429
3908 429 1972 336 -1694 -1198 1170 1519 -571 -1760 -171 1411 909 -1172 -1469 437 1736 455
3924D55k059N69K061N14j866j616J454K288n57k623l67K539J139j643k031P56
3940i87K423M8j806j424J542K178o65k691j22K227J242j751k028R93K445m1k321
3957g38j192J853J760n09k427m77K401J055j449j906O68K307K10k315j334J837
3973b56J989r93k186k34K494J129j981j944J107K380k85k051q47J697J618r41
3989F96j996O7J950R25j703j435O92K046l5k125q02J769J634j130k171M45K152
4006I79L57j711j205R46K093n32j885o59J885J331j145j962K59K323L97j772j471
4023a772J462J759n34j970o01K177R55j569j260O05J743K16j687r98J223J759
4039A508q59j629k32J779J087j683j368Q45J850N7k193o37J680J411q03k026k9
$$ plain form
3924 455 -1604 -1035 1026 1540 -326 -1942 -488 1800 1243 -1380 -1747 792 1931 288 -1743 -987
3940 -987 1436 1484 -322 -1746 -204 1974 1309 -1382 -1504 723 1965 214 -1814 -821 1624 1583 -738
3957 -738 -1930 -77 1683 1174 -1253 -1730 671 1726 277 -1629 -961 1346 1556 -759 -2093 -256
3973 -256 1733 740 -1446 -1680 814 1943 -38 -1982 -875 1505 1220 -831 -1678 19 1637 696
3989 696 -1300 -1233 717 1642 -61 -1496 -804 1242 1207 -918 -1720 49 1683 553 -1618 -1173 979
4006 979 1336 -375 -1580 -634 1459 927 -958 -1617 268 1599 454 -1508 -1249 1074 1471 -301 -1772
4023 -1772 -310 1449 915 -1055 -1656 521 1476 -93 -1353 -748 995 1211 -476 -1474 -251 1508
4039 1508 649 -980 -1212 567 1654 -29 -1397 -552 1298 1355 -838 -1475 205 1616 813 -1213 -1242
4056a242J959R04j510j448N94K066M7k091q00J423J788j025k164K22K242O61k055
4073d29j062J069J752l24j863n54J601J225j117j522M5K042O74j473j819J248
4089e07J854l19k040p66K102J298j248k004N35K149M51k014j025J053J885l13
4105A091j926o28J620J583j243k168K82K472K53j749j370J282K059m91k248k18
4121a399J871R24j041j631M82J571N77j632j174J059J721k05k184n12J669J451
4137A547j253j819O65K092P3j853j053J588J427o75j843N7J479R11j131j394N00
4154f82J948L9j894p91J203J628m90k101j62J932R56j612j237R80J488m00j459
4171f54l57J210R61m48j501n9J496O14j237j462R74J597Rj836o60J676J203j150
$$ plain form
4056 -1242 717 1621 111 -1337 -743 1323 1370 -721 -1521 -98 1690 665 -1499 -1277 965 1626 -429
4073 -429 -1491 -422 1330 1006 -857 -1411 190 1415 298 -1224 -1179 863 1537 64 -1755 -507
4089 -507 1347 1028 -1012 -1778 324 1622 374 -1630 -1095 1054 1505 -509 -1534 -481 1404 1091
4105 1091 -835 -1463 157 1740 497 -1671 -1389 1083 1336 -413 -1783 -501 1558 1067 -1181 -1399
4121 -1399 472 1396 355 -1276 -794 777 1354 -278 -1452 -393 1328 1123 -1061 -1573 96 1547
4137 1547 294 -1525 -860 1232 1305 -548 -1601 -13 1414 739 -1104 -1047 432 1343 212 -1182 -682
4154 -682 1266 1305 -589 -1380 -177 1451 961 -1140 -1302 630 1586 -26 -1263 -283 1205 805 -654
4171 -654 -1011 199 1160 712 -789 -848 648 1262 25 -1437 -463 1134 1143 -693 -1353 323 1526 376
4189C76j897O77J978j88j360p91J012J335k93j773l55J536J354j226j538L66J810
4206A023J22j534j053J309J245m77j625l74K062O25j242j452P41J546J93j435
4222c26r13P91J792n24k164n3J919J051j636j458R03J899j19j986m54J207J525
$$ plain form
4189 376 -1521 -844 1134 946 -414 -1205 -193 1142 849 -924 -1279 257 1611 385 -1153 -787 1023
4206 1023 1145 -389 -1442 -133 1112 635 -990 -1364 698 1323 81 -1371 -630 916 1109 -326
4222 -326 -1239 -448 1344 820 -1344 -1397 522 1573 -63 -1521 -618 1281 1162 -824 -1278 -71 1454
$$ [...]
8191G7
##END NTUPLES=NMR FID
##END=
