##TITLE=1H_IAMT-148
 CDCl3, 8 sc, 
 9.06.2021
##JCAMPDX= 6.0         $$ Bruker NMR JCAMP-DX V2.0
##DATA TYPE= NMR FID
##DATA CLASS= NTUPLES
##ORIGIN= UXNMR, Bruker Analytische Messtechnik GmbH
##OWNER= root
$$ XWIN-NMR		Version 3.5
$$ Wed Jun  9 12:58:15 2021 Russian Standard Time (UT+4h)  she@DPX200
##.OBSERVE FREQUENCY= 200.131506
##.OBSERVE NUCLEUS= ^1H
##.DELAY= (6, 6)
##.ACQUISITION MODE= SIMULTANEOUS
##.ACQUISITION SCHEME= undefined
##.AVERAGES= 8
##.DIGITISER RES= 18
##SPECTROMETER/DATA SYSTEM= spect
##.PULSE SEQUENCE= zg30
##.SOLVENT NAME= CDCl3
##.SHIFT REFERENCE= (INTERNAL, CDCl3, 0, 15.7039)
##AUDIT TRAIL= $$ (NUMBER, WHEN, WHO, WHERE, WHAT)
$$ ##TITLE= Audit trail, XWIN-NMR		Version 3.5
$$ ##JCAMPDX= 5.01
$$ ##ORIGIN= Bruker BioSpin GmbH
$$ ##OWNER= she
$$ F:/spectra/data/she/nmr/H-F/1/audita.txt
$$ ##AUDIT TRAIL=  $$ (NUMBER, WHEN, WHO, WHERE, WHAT)
(   1,<2021-06-09 12:56:48.32 +0400>,<she>,<DPX200>,
      <created by zg, POWCHK disabled, PULCHK disabled
       configuration hash MD5:
       00 E9 B6 7A A2 85 ED C7 34 08 36 98 17 FE 4E 26
       data hash MD5: 16K
       89 FA C6 ED 76 76 12 CD 3B 92 DB B1 E7 E3 49 10>)
$$ ##END=
$$ 
$$ hash MD5
$$ E4 5F 50 1D E6 3F 3C C1 6A 11 C1 CF 9D 97 A4 E6
##$RELAX= 
##$RELAX= 
##$RELAX= 
##$RELAX= 
##$RELAX= 
##$RELAX= 
$$ Bruker specific parameters
$$ --------------------------
##$DU= <F:/spectra>
##$EXPNO= 1
##$NAME= <H-F>
##$PROCNO= 1
##$TYPE= <nmr>
##$USER= <she>
##$AMP= (0..31)
100 100 100 100 100 100 100 100 100 100 100 100 100 100 100 100 100 100 
100 100 100 100 100 100 100 100 100 100 100 100 100 100 
##$AQSEQ= 0
##$AQ_mod= 1
##$AUNM= <au_zg>
##$AUTOPOS= <>
##$BF1= 200.13
##$BF2= 200.13
##$BF3= 200.13
##$BF4= 200.13
##$BF5= 200.13
##$BF6= 200.13
##$BF7= 200.13
##$BF8= 200.13
##$BYTORDA= 1
##$CFDGTYP= 0
##$CFRGTYP= 5
##$CHEMSTR= <none>
##$CNST= (0..31)
1 1 145 1 1 1 1 1 1 1 1 1 1 1 1 1 1 1 1 1 1 1 1 1 1 1 1 1 1 1 1 1 
##$CPDPRG= <>
##$CPDPRG1= <>
##$CPDPRG2= <>
##$CPDPRG3= <>
##$CPDPRG4= <mlev>
##$CPDPRG5= <mlev>
##$CPDPRG6= <mlev>
##$CPDPRG7= <mlev>
##$CPDPRG8= <mlev>
##$CPDPRGB= <>
##$CPDPRGT= <>
##$D= (0..31)
0 1.2 0 0 0 0 0 0 0 0.06 0 0.03 0 0 0 0 0.0002 0 0 0 0 0 0 0 0 0 0 0 0 
0 0 0 
##$DATE= 1623229007
##$DBL= (0..7)
120 120 120 120 120 120 120 120 
##$DBP= (0..7)
150 150 150 150 150 150 150 150 
##$DBP07= 0
##$DBPNAM0= <>
##$DBPNAM1= <>
##$DBPNAM2= <>
##$DBPNAM3= <>
##$DBPNAM4= <>
##$DBPNAM5= <>
##$DBPNAM6= <>
##$DBPNAM7= <>
##$DBPOAL= (0..7)
0.5 0.5 0.5 0.5 0.5 0.5 0.5 0.5 
##$DBPOFFS= (0..7)
0 0 0 0 0 0 0 0 
##$DE= 6
##$DECBNUC= <off>
##$DECIM= 32
##$DECNUC= <off>
##$DECSTAT= 4
##$DIGMOD= 1
##$DIGTYP= 9
##$DL= (0..7)
0 120 120 120 120 120 120 120 
##$DP= (0..7)
150 150 150 150 150 150 150 150 
##$DP07= 0
##$DPNAME0= <>
##$DPNAME1= <>
##$DPNAME2= <>
##$DPNAME3= <>
##$DPNAME4= <>
##$DPNAME5= <>
##$DPNAME6= <>
##$DPNAME7= <>
##$DPOAL= (0..7)
0.5 0.5 0.5 0.5 0.5 0.5 0.5 0.5 
##$DPOFFS= (0..7)
0 0 0 0 0 0 0 0 
##$DQDMODE= 0
##$DR= 18
##$DS= 0
##$DSLIST= <SSSSSSSSSSSSSSS>
$$ [...]
##$SUBNAM2= <"">
##$SUBNAM3= <"">
##$SUBNAM4= <"">
##$SUBNAM5= <"">
##$SUBNAM6= <"">
##$SUBNAM7= <"">
##$SUBNAM8= <"">
##$SUBNAM9= <"">
##$SW= 20.0188882624521
##$SWIBOX= (0..15)
0 0 2 0 0 0 0 0 0 0 0 0 0 0 0 0 
##$SW_h= 4006.41025641026
##$TD= 16384
##$TD0= 1
##$TE= 0
##$TE2= 300
##$TE3= 300
##$TEG= 300
##$TL= (0..7)
0 120 120 120 120 120 120 120 
##$TP= (0..7)
150 150 150 150 150 150 150 150 
##$TP07= 0
##$TPNAME0= <>
##$TPNAME1= <>
##$TPNAME2= <>
##$TPNAME3= <>
##$TPNAME4= <>
##$TPNAME5= <>
##$TPNAME6= <>
##$TPNAME7= <>
##$TPOAL= (0..7)
0.5 0.5 0.5 0.5 0.5 0.5 0.5 0.5 
##$TPOFFS= (0..7)
0 0 0 0 0 0 0 0 
##$TUNHIN= 0
##$TUNHOUT= 0
##$TUNXOUT= 0
##$USERA1= <user>
##$USERA2= <user>
##$USERA3= <user>
##$USERA4= <user>
##$USERA5= <user>
##$V9= 5
##$VALIST= <valist>
##$VCLIST= <CCCCCCCCCCCCCCC>
##$VD= 0
##$VDLIST= <DDDDDDDDDDDDDDD>
##$VPLIST= <PPPPPPPPPPPPPPP>
##$VTLIST= <TTTTTTTTTTTTTTT>
##$WBST= 1024
##$WBSW= 4
##$XGAIN= (0..3)
0 0 0 0 
##$XL= 0
##$YL= 0
##$YMAX_a= 489576
##$YMIN_a= -440519
##$ZGOPTNS= <>
##$ZL1= 120
##$ZL2= 120
##$ZL3= 120
##$ZL4= 120
##$ABSF1= 10
##$ABSF2= 0
##$ABSG= 5
##$ABSL= 3
##$ALPHA= 0
##$AQORDER= 0
##$ASSFAC= 0
##$ASSFACI= 0
##$ASSFACX= 0
##$ASSWID= 0
##$AUNMP= <proc_1d>
##$AZFE= 0.1
##$AZFW= 0.1
##$BCFW= 1
##$BC_mod= 2
##$BYTORDP= 1
##$COROFFS= 0
##$CY= 11.3945322036743
##$DATMOD= 1
##$DC= 2
##$DFILT= <>
##$DTYPP= 0
##$F1P= 15.9154993809931
##$F2P= -4.1035820241983
##$FCOR= 0.5
##$FTSIZE= 0
##$FT_mod= 4
##$GAMMA= 1
##$GB= 0.15
##$INTBC= 1
##$INTSCL= 1
##$ISEN= 128
##$LB= 0.24
##$LEV0= 0
##$LPBIN= 0
##$MAXI= 10000
##$MC2= 0
##$MEAN= 0
##$ME_mod= 0
##$MI= 1.114404
##$NCOEF= 0
##$NC_proc= 0
##$NLEV= 6
##$NOISF1= 3.799351
##$NOISF2= 2.8
##$NSP= 1
##$NTH_PI= 0
##$NZP= 0
##$OFFSET= 15.70392
##$PC= 1
##$PHC0= -11479.65
##$PHC1= 4.00101
##$PH_mod= 1
##$PKNL= yes
##$PPARMOD= 0
##$PSCAL= 0
##$PSIGN= 0
##$REVERSE= no
##$SF= 200.130013532006
##$SI= 16384
##$SIGF1= 3
##$SIGF2= 2
##$SINO= 400
##$SIOLD= 16384
##$SREGLST= <1H.CDCl3>
##$SSB= 0
##$STSI= 0
##$STSR= 0
##$SW_p= 3612.71676300578
##$SYMM= 0
##$S_DEV= 0
##$TDeff= 0
##$TDoff= 0
##$TI= <>
##$TILT= no
##$TM1= 0
##$TM2= 0
##$TOPLEV= 0
##$USERP1= <user>
##$USERP2= <user>
##$USERP3= <user>
##$USERP4= <user>
##$USERP5= <user>
##$WDW= 1
##$XDIM= 8192
##$YMAX_p= 0
##$YMIN_p= 0
$$ End of Bruker specific parameters
$$ ---------------------------------
##NTUPLES= NMR FID
##VAR_NAME=  TIME,          FID/REAL,        FID/IMAG
##SYMBOL=    X,             R,               I
##VAR_TYPE=  INDEPENDENT,   DEPENDENT,       DEPENDENT
##VAR_FORM=  AFFN,          ASDF,            ASDF
##VAR_DIM=   8192,          8192,            8192
##UNITS=     SECONDS,       ARBITRARY UNITS, ARBITRARY UNITS
##FACTOR=    0.0002496,     1,               1
##FIRST=     0,             0,               0
##LAST=      2.0444736,     0,               0
##MIN=       0,             -440519,         0
##MAX=       2.0444736,     489576,          0
$$ Real data points
##PAGE= N=1
##DATA TABLE= (X++(R..R)), XYDATA
0 0 0 0 0 0 0 0 0 0 0 0 -8 6 -8 8 -8 16 -16 24 -24 32 -40 44 -56 64 -72 88 -99 112 -131 152 -172 195 -222
33 -222 252 -283 319 -358 399 -447 500 -555 618 -685 757 -838 927 -1022 1127 -1243 1368
50 1368 -1507 1662 -1831 2021 -2236 2478 -2751 3068 -3440 3879 -4408 5063 -5894 6992 -8516
65 -8516 10777 -14493 21677 -40741 200339 489576 4430 -357989 -238257 246587 430117
76 430117 125934 -300982 -282520 121761 399185 169996 -241031 -324565 24043 338274
86 338274 213881 -190615 -333597 -50886 290439 237343 -124604 -315669 -91791 245325
96 245325 270892 -44537 -282728 -143480 196087 303714 43256 -249022 -192262 130147
106 130147 309558 117113 -200356 -233905 50309 286038 171295 -148220 -255471 -25818
116 -25818 240370 206092 -87191 -260618 -87763 196127 225142 -36119 -249498 -134117
126 -134117 155323 241154 10200 -238256 -170626 121208 254837 58617 -215570 -204717
136 -204717 81817 266609 112068 -178777 -230257 31041 262780 167022 -128767 -243351
146 -243351 -25745 237329 205104 -71819 -239043 -83835 189607 222067 -20058 -221977
156 -221977 -129634 130464 216556 24006 -192325 -158828 78138 206335 62395 -155306
166 -155306 -170420 34678 194737 102905 -113012 -172416 -2133 180337 140062 -64733 -169613
177 -169613 -43268 154650 168461 -18185 -161903 -85887 111766 180757 27808 -147470
187 -147470 -124467 61982 174143 65839 -122372 -149278 13687 158375 96943 -92045
197 -92045 -158767 -21760 140265 119286 -59191 -158521 -48110 125842 138037 -29324 -154524
208 -154524 -70016 111117 155768 1561 -149498 -93297 93358 167680 32174 -140311 -121062
219 -121062 64887 171599 62066 -124430 -143722 27972 163029 88673 -99301 -158408
229 -158408 -9378 146872 108781 -68477 -157179 -41101 125120 125679 -33337 -145300 -64068
240 -64068 103196 136793 908 -127237 -83319 77576 143643 32374 -108134 -101190 45505
251 45505 140535 61422 -87613 -117865 8565 128818 85736 -61990 -127674 -28939 110127
262 110127 107881 -31207 -126624 -60165 85833 123689 3449 -116416 -83574 61000 131303
273 131303 34084 -101097 -100415 33449 130198 59333 -86006 -114044 8337 122664 77863
284 77863 -70498 -125014 -16714 114027 95177 -51353 -130178 -38959 102005 110720 -27099
295 -27099 -129515 -59658 87137 121031 -1717 -121269 -80317 64174 123233 22022 -108798
306 -108798 -96186 38149 117386 42022 -90676 -107848 12126 107869 59333 -68155 -109923
317 -109923 -11775 95566 75514 -42477 -106807 -32116 82051 87919 -16359 -98807 -52918
328 -52918 62470 95915 7945 -88693 -71740 37873 97146 31233 -74799 -88061 10690
339 10690 93015 52919 -56287 -96487 -15954 84784 73034 -34055 -98560 -37815 71931
350 71931 87586 -10891 -94781 -57069 56091 96267 9423 -88686 -73062 36778 98733 28496
362 28496 -80312 -85657 17385 96485 45796 -67562 -93731 -1330 91401 61635 -51161
373 -51161 -96747 -18116 81335 74277 -32468 -96160 -35496 67451 80169 -14510 -91545 -51480
385 -51480 49572 81570 3069 -83242 -64457 30529 78493 19913 -68823 -72575 12224 74232
397 74232 36606 -51389 -75281 -4019 67164 50718 -31529 -74408 -21120 56763 61178 -12484
409 -12484 -71018 -38952 42226 66704 5555 -65554 -54457 24223 67803 21645 -56562 -67188
421 -67188 6125 67136 37252 -43687 -73425 -10512 63421 52009 -28635 -75007 -24592 58075
433 58075 63570 -12813 -72480 -38685 48681 72032 2196 -68238 -49020 36020 75086 15758
445 15758 -62129 -58315 21638 73446 26931 -53839 -65079 6219 67376 36757 -44521 -68690
457 -68690 -7871 59661 44744 -31789 -68233 -19634 50245 51566 -17270 -63176 -29055 39576
469 39576 56229 -873 -55505 -37342 27404 56632 13858 -46009 -44998 12703 52957 25209
481 25209 -35534 -51241 -3035 45233 33727 -24541 -55174 -18073 37024 40379 -12164 -54531
493 -54531 -30414 28431 46765 1767 -50607 -40010 19613 51127 15388 -42832 -47010 10077
505 10077 53175 27006 -34924 -52423 -996 51819 36721 -25832 -56002 -12042 47614 43349
517 43349 -16964 -56384 -22920 40566 48394 -8002 -54383 -31149 31687 50324 1450 -49610
529 -49610 -38002 22176 50308 10168 -43759 -42064 12053 47834 19039 -35809 -43763 2878
541 2878 45005 26948 -25095 -43307 -5839 38914 33926 -14923 -41428 -14890 30423 37225 -4812
554 -4812 -39170 -23985 19928 37013 4631 -36151 -32486 8128 34742 13220 -30577 -38242 -2081
567 -2081 32386 22255 -21543 -40889 -10194 30509 30713 -11242 -40324 -17472 26888 37230 -1099
580 -1099 -38872 -24926 21507 40242 6999 -37119 -32905 13937 41149 13522 -34206 -39051 5586
593 5586 39280 18925 -29270 -42751 -2125 37509 24925 -21804 -42665 -8155 34808 30826
605 30826 -13359 -39916 -13628 30741 34023 -5841 -36229 -19284 24371 35498 1647 -31926
617 -31926 -23530 16688 34725 8379 -27800 -27376 7818 32072 14004 -21475 -28529 -184 28036
630 28036 19630 -14258 -29118 -8032 22771 23769 -6985 -28289 -14997 17112 26909 1590 -26001
643 -26001 -20496 10435 28543 9497 -22377 -24841 4202 28915 16870 -17924 -28757 -2378
655 -2378 27126 21995 -13137 -30899 -8793 24021 25652 -8116 -32245 -14304 20329 27832 -2899
668 -2899 -31897 -19926 16634 29261 2575 -29202 -22976 12256 30424 8149 -25931 -26143 8307
681 8307 30758 13036 -20529 -27007 2868 29276 17124 -15267 -27259 -2127 25481 19266 -10147
694 -10147 -25743 -7409 20422 21164 -4832 -23588 -12015 15169 21684 643 -20367 -15509 9631
707 9631 22005 6131 -16012 -17927 3422 20634 12030 -11515 -19479 -2152 18730 16132 -6248
720 -6248 -20249 -7915 15734 20347 -604 -19713 -13271 11127 21721 4371 -18754 -17442 6379
733 6379 21997 8389 -17105 -20247 1893 21310 12242 -14650 -22620 -1781 20721 15625 -11232
746 -11232 -23811 -4681 19718 18140 -7957 -23495 -8076 17261 20139 -4063 -23173 -11169
758 -11169 14233 20362 21 -20963 -14350 10048 19849 2665 -18878 -16298 6151 18890 6493
771 6493 -14323 -16869 2172 16755 8930 -9936 -16539 -1672 14866 11734 -5309 -15066 -5330
784 -5330 11976 13316 -1455 -13906 -9197 8226 14738 2508 -12532 -12353 3711 15361 7391
797 7391 -9615 -14865 -445 15372 11032 -6391 -15958 -4896 14259 14990 -3093 -15953 -9345
810 -9345 11083 17287 681 -15859 -12078 8252 17546 3214 -15857 -14065 5391 17720 5371
823 5371 -14581 -15910 2783 17657 8198 -12397 -16700 432 17199 10881 -9656 -16983 -2341
836 -2341 15370 12796 -7057 -17452 -4650 12388 12856 -3655 -16617 -7705 9333 13192 -1015
849 -1015 -14348 -9578 6401 12782 2101 -11681 -10307 3893 12203 4871 -9285 -11460 861
862 861 11773 6874 -5456 -12313 -2194 10642 9966 -2599 -12241 -6181 8206 12410 663 -11511
876 -11511 -9190 4977 13379 4748 -10192 -11838 2620 14153 7748 -8425 -13402 -689 14065
889 14065 10038 -6452 -14509 -3126 12808 11812 -4480 -14620 -6197 11240 13332 -2931 -15118
902 -15118 -7831 9947 14558 -522 -14523 -9030 8189 15070 2342 -13497 -10617 6044 14648
915 14648 4401 -11615 -11604 3383 13242 5837 -9748 -12354 334 10994 6712 -7167 -12560 -1865
929 -1865 8736 7471 -3925 -11292 -4022 7236 8113 -1686 -9925 -5753 5149 8597 721 -8498
943 -8498 -7165 3136 9188 3628 -6208 -9079 711 9046 6212 -4550 -10270 -2919 8196 8252 -2063
958 -2063 -11091 -5904 6896 9753 -90 -10489 -8239 4873 10953 2168 -9521 -9595 3709 11795
972 11795 4808 -8390 -10767 1994 12148 6274 -7294 -11122 375 11987 8122 -6278 -11571
985 -11571 -1501 10537 9275 -4321 -11504 -3583 8033 9321 -2341 -11120 -5405 6233 9099
998 9099 -778 -9809 -6027 4303 8685 1501 -7897 -6829 2442 7856 2910 -5754 -7254 944 6885
1013 6885 4131 -3566 -7292 -1340 5382 5439 -2231 -7502 -3818 3788 6218 224 -6720 -5735 2213 6905
1029 6905 2478 -5996 -7662 500 7425 4230 -5030 -8721 -1321 7244 5951 -3090 -9085 -3696 6855
1044 6855 7622 -1718 -9093 -5119 6415 8968 30 -8999 -5755 5652 9521 1147 -8345 -6888 4479
1059 4479 10111 3237 -7288 -7913 2919 9400 3611 -6856 -8659 502 8579 4252 -5372 -8385
1073 -8385 -1075 7468 5995 -3772 -7596 -2011 6256 6526 -1767 -6830 -3087 4754 6702 237 -5338
1088 -5338 -4096 2807 6269 2051 -4842 -5020 693 5236 3074 -3683 -5963 -1304 4373 4473 -2036
1103 -2036 -6294 -2728 3423 5202 -83 -6198 -4495 2799 5715 1784 -5259 -5726 1319 6750 3392
1118 3392 -5250 -6433 398 7294 4160 -4116 -7130 -562 7047 5139 -3735 -8215 -2388 6378 5559
1133 5559 -2467 -8039 -2792 5725 6542 -1017 -7465 -3503 4659 6913 -832 -6777 -4006 3953 6999
1148 6999 347 -5931 -4650 2928 6448 1541 -4815 -4889 1349 6014 2511 -3556 -4212 245 4505 3653
1164 3653 -1975 -4331 -873 3417 4366 -674 -4487 -1995 2169 4466 709 -3377 -3363 1018 4185 2234
1180 2234 -2581 -4206 -323 4136 3555 -2294 -4958 -1257 3884 4713 -848 -5452 -2968 3394 5147
1195 5147 170 -5549 -4101 2702 6080 903 -5538 -5037 2218 6462 1938 -5139 -5795 1371 6363
1210 6363 3020 -4678 -6244 446 5800 3058 -3944 -6165 -242 5612 3763 -3085 -5528 -932 5377
1225 5377 3802 -2174 -5504 -2075 4257 4680 -782 -4752 -2119 3554 4392 -15 -3751 -3118 1698 4701
1241 4701 899 -2903 -3008 972 3704 2147 -1659 -3222 -809 3079 2900 -813 -3713 -1807 2345
1256 2345 3796 509 -2902 -2602 1547 4730 1520 -3287 -3940 859 4695 2419 -2665 -4750 -540
1271 -540 4198 2949 -2610 -5157 -1147 4291 3861 -2088 -5268 -1808 3975 4847 -810 -5611 -2517 3608
1287 3608 4950 -408 -5109 -2942 2643 5574 625 -5053 -4041 1692 4645 805 -4731 -3883 1782
1302 1782 4327 1506 -3286 -3787 982 3858 1819 -1620 -3208 162 3161 2559 -1074 -2991 -727
1317 -727 2778 2447 -433 -2546 -1771 1588 2688 340 -2221 -2426 -23 2438 1493 -1018 -1634 -464
1333 -464 2261 2473 -428 -2472 -1314 1901 2994 281 -2240 -2055 1562 3004 332 -2699 -3305 1430
1349 1430 3678 887 -2672 -3284 475 3605 1984 -2444 -3907 -516 3809 2494 -1872 -3457 -531
1364 -531 3517 2944 -1703 -3612 -636 2729 2782 -1582 -3357 -1286 2109 2482 -474 -2981 -1559 1597
1380 1597 2321 -414 -2689 -1887 1148 2420 85 -2012 -2068 833 1925 248 -731 -1717 199 1237
1396 1237 1307 -125 -1551 -985 267 1444 202 -1270 -1705 -206 1499 667 -403 -1691 -275 1185
1412 1185 1307 -164 -1587 -636 1715 2248 -207 -1401 -1166 2041 3146 553 -2316 -2273 1105 2872
1428 2872 856 -2599 -2361 1206 3269 782 -2654 -2015 252 3171 866 -2231 -2109 957 3526 1775
1444 1775 -1962 -2368 175 2065 1138 -1465 -2326 -158 2058 1263 -1194 -2322 -159 1483 1593 -1151
1460 -1151 -2520 -570 1151 944 -670 -1825 -713 901 1055 18 -1369 -1213 -83 793 341 -810
1476 -810 -1095 -439 423 739 -133 -647 -670 582 940 469 -652 -649 21 1510 815 -955 -1272 -52 1349
1495 1349 865 -764 -1748 -408 1649 1316 -367 -1937 -286 1746 1627 -449 -1934 -489 1454 1318
1511 1318 -382 -1771 -627 1804 1791 -410 -2020 -426 1637 1958 -190 -1730 -732 1522 1655 -75
1527 -75 -1534 -818 843 1658 -303 -1327 -238 1022 549 -404 -1181 -840 419 801 -597 -1257 -245
1544 -245 507 433 -716 -682 -314 685 487 -93 117 -267 173 70 -185 -233 141 96 -303 -133 196 -254 -629
1565 -629 -225 -76 110 492 -294 -350 -61 364 480 -629 -432 -23 433 296 -398 -829 -34 748 226 -643
1585 -643 -822 277 1117 -1 -562 -814 561 1112 223 -600 -570 560 1122 80 -699 -646 33 1098 170
1604 170 -1092 -960 665 1005 215 -1076 -675 283 875 25 -790 -305 646 853 -357 -373 -363 633 629 680
1624 680 -739 -583 619 739 -158 -594 -20 167 435 -515 -494 -278 -90 -103 -488 -401 -26 293 -114 -392
1644 -392 -99 510 -148 -447 -859 -338 463 98 -15 -865 289 581 218 -714 -817 145 474 -154 -590 -840
1664 -840 565 596 -185 -1014 -829 648 979 -398 -936 -336 206 595 -551 -945 -298 653 583 -186 -675
1683 -675 -173 466 1488 -933 -919 -340 357 680 -41 -641 300 658 573 -236 -842 200 365 407 -379 -606
1703 -606 -2 675 -7 -526 -639 -149 255 265 -210 -275 -58 35 337 25 -457 764 191 -20 -315 380 215
1724 215 190 -124 -69 83 386 135 -379 -147 360 -209 137 -428 -447 -196 618 -432 -557 174 35 -47 -587
1745 -587 -497 442 545 -112 -704 -172 250 703 -3 -917 -193 367 692 47 -329 -428 389 1078 123 -1021
1765 -1021 -741 346 1053 -333 -978 -297 545 873 -385 -1213 -249 1115 994 -214 -598 -381 755 518
1783 518 -81 -204 -3 509 1265 32 -1228 -511 645 745 -323 -42 -356 386 566 -206 -527 40 1
1802 1 490 -112 -112 -127 326 -296 319 -86 -361 -55 -371 -150 52 -50 -412 -393 668 476 485 7 -489 91
1824 91 798 6 -768 -792 -349 837 287 -870 -1159 -85 983 112 -380 -1146 130 1183 524 -849
1842 -849 -660 -291 510 1055 -874 -1152 496 1075 495 -354 -1223 -27 598 515 -430 -585 130 602 560 -543
1862 -543 -899 -273 1096 400 -276 -854 -142 825 745 -30 -684 -335 501 1119 15 -1140 -484 84 949
1881 949 165 -309 -64 -410 -34 224 355 -611 -50 222 481 -221 -387 -92 377 521 69 19 -634 -26
1901 -26 458 616 -214 -927 -903 365 849 -236 -1090 -235 805 829 -624 -597 -290 30 889 -107 -992 36
1921 36 327 440 -185 -742 -779 364 1530 238 -1158 -1064 536 970 92 -532 -1122 -8 300 535 -799
1940 -799 -1442 427 863 190 -851 -706 -611 599 452 184 -796 180 70 609 246 -279 -463 205 621
1959 621 417 -13 -396 248 -125 335 31 -529 71 93 823 336 -503 -396 -174 548 313 -502 -1133 -383
1979 -383 958 562 -740 37 -147 322 277 158 -612 -291 516 1003 -855 -1138 -142 922 896 -385 -1031
1998 -1031 -780 -215 1384 -215 -1136 -417 520 880 -202 -712 -253 664 552 -506 -1113 -715 227 383
2016 383 -210 -559 -184 60 461 26 -562 -681 412 -238 908 94 -588 -154 265 202 -406 -269 -371 470
2036 470 283 127 -600 -238 -103 256 576 393 -826 17 984 -171 -116 -1085 -462 446 240 104 -590 -775
2056 -775 159 542 236 -625 -1063 765 667 586 -355 -950 223 400 243 -487 -697 450 904 401 -603
2075 -603 -1140 -208 779 744 -655 -738 -237 1198 533 -251 -595 133 886 922 -869 -898 -342 -448 759 272
2095 272 -338 -424 49 425 -27 -700 -583 250 173 291 -121 47 -598 -107 314 41 -156 172 315 5 302
2116 302 -180 -508 -294 -11 503 -163 -694 -380 417 339 9 -459 -284 931 201 -221 -819 -367 373 596
2136 596 -160 -879 -982 949 758 -316 -497 -519 256 595 -42 -366 -801 543 1325 216 -650 -435 496
2155 496 780 488 -650 -203 -331 1278 447 -536 -643 -164 510 232 -319 148 371 124 595 -611 -485
2174 -485 -188 185 294 267 -525 -71 173 394 494 -99 -343 -256 55 -50 -8 -638 27 -193 -142 166 -717
2195 -717 -21 -370 355 113 -396 23 -169 59 922 -433 -1223 -380 363 466 -596 -318 74 752 736 -47
2215 -47 -829 -390 1089 281 -366 -99 -393 606 771 -203 -446 254 63 268 82 -976 -101 494 268 247
2235 247 -492 -301 634 210 293 -916 -12 399 273 -219 -415 -243 -716 -162 335 -686 -440 209 201 515
2255 515 86 -125 24 160 437 -141 19 -843 20 363 -22 -14 -580 219 178 -339 485 -169 -405 617 -59
2276 -59 -189 -827 -1024 17 612 -477 -109 -538 -71 489 41 -656 -837 48 871 350 -397 -408 137 558
2296 558 -92 -651 -653 -132 -324 404 279 -746 487 -158 -55 -44 -693 -722 -14 -498 -223 -17 -499 148 607
2317 607 -215 -711 -551 -38 916 118 -172 -38 589 572 428 -128 84 -754 347 244 283 -669 -344 0
2337 0 -115 -349 69 73 45 1037 -2 -413 -370 -162 592 -62 33 -704 -705 125 249 110 -323 -376 619 651 -172
2360 -172 -554 94 11 980 -708 -913 -308 217 656 214 -657 -532 -37 436 605 -304 336 628 248 -222
2380 -222 -237 -657 432 -60 -337 -347 282 -657 327 295 -794 -467 636 104 133 -68 8 700 386 218 -705
2401 -705 -544 194 458 515 583 -337 352 386 487 228 -75 -403 102 13 267 -284 -293 -310 -465 -37 109 -173
2423 -173 -230 -63 -170 658 -150 -334 -1200 101 812 108 -318 224 325 -1083 -152 -471 -645 -363 -515 -130
2443 -130 -457 294 36 -164 -77 -667 -73 515 183 -139 -400 -164 98 370 -297 -703 138 -584 192 -141
2463 -141 -57 95 505 527 315 -515 -424 -43 -161 -56 -239 -10 -18 261 -158 -180 -69 -261 649 -234 -151 59
2485 59 1016 651 28 -523 -155 -71 -22 140 513 -377 -563 277 -99 49 -203 -322 645 80 -314 -355 -542
2506 -542 903 -363 260 -896 149 120 -123 589 240 496 -1171 -379 -245 1215 -209 -472 -697 98
2524 98 920 -72 19 -343 421 335 -418 -322 126 361 512 -444 -739 53 -407 -452 -600 -111 -747 -146 645 -555
2546 -555 -147 408 147 215 -578 -268 1099 425 337 17 66 -28 315 25 586 -32 -172 -636 165 671 -254
2567 -254 722 -193 974 -363 547 225 194 -750 -862 -654 386 -242 -6 335 372 101 -453 110 164 -267
2587 -267 580 228 -172 213 573 -601 -77 -102 -405 758 -163 -270 176 740 117 832 -463 137 -279
2606 -279 36 -102 -612 -124 -456 26 178 545 175 237 96 180 476 -165 -116 -280 -351 -376 -204 -193 613 -592
2628 -592 170 355 -590 401 202 -213 -359 454 -91 -103 -603 -14 200 25 -214 833 353 688 -696 -105
2648 -105 -354 896 294 -235 212 80 -206 195 -347 -387 327 -107 -176 -194 -458 -204 276 -479 -113 -198 281
2669 281 -97 -468 -18 364 662 -156 322 -364 -892 -251 1073 -252 -401 282 290 -226 111 -314 -895 670
2689 670 466 85 -186 -513 -219 19 -153 726 240 -135 -687 17 807 -35 149 69 308 812 327 -146
2709 -146 337 35 -234 711 602 -365 55 -498 -61 -308 21 -62 -189 -556 266 -260 -83 -574 152 -19
2729 -19 -18 -331 -364 -180 -142 -54 153 436 -437 -513 -63 -50 272 181 -122 147 827 73 -178 -126 506 -699 -486
2752 -486 -207 -139 -63 -702 -647 127 -357 60 -349 87 -317 -771 -250 -53 181 95 -26 31 235 -170 168 223
2774 223 140 185 398 -76 5 79 -406 161 -8 -226 -308 153 668 23 -151 64 526 -69 -497 64 -571 -301
2796 -301 -24 -264 -144 176 380 308 89 39 -154 -144 -178 270 -47 -115 132 187 212 573 204 -133 -308 -40
2818 -40 -121 161 2 -297 217 27 -116 -1 279 -159 -286 -31 40 -111 -29 -171 726 306 -196 164 -62
2839 -62 195 -212 399 26 -76 152 -459 -190 -191 251 64 40 311 -416 82 -81 -369 -194 -281 57 -50 -322
2861 -322 -290 405 362 7 29 -42 96 -495 -207 328 123 274 206 -678 -326 -164 19 150 506 230 147 -163
2883 -163 -386 13 37 160 82 3 51 -195 101 77 -144 -105 91 250 -340 269 -120 -244 11 -286 182 109
2905 109 29 85 5 0 6 549 260 37 123 254 266 39 -237 -60 -144 128 -286 -14 -276 -28 -93 -80 311 -256
2929 -256 -40 621 190 -222 -494 -123 275 280 -78 116 -18 429 -70 -397 27 180 125 -100 -38 -295 -429
2950 -429 -337 35 3 -433 76 -385 385 66 -48 202 -483 -21 146 43 -247 215 546 -33 -182 420 254
2971 254 -455 62 -74 -154 -256 -272 592 -536 250 -211 28 226 220 -161 -192 -77 -341 -117 192 -169 132
2992 132 187 276 219 -288 -165 127 368 7 -181 298 152 248 -25 113 -87 -275 -27 -101 43 156 -194 12
3014 12 -23 31 -200 177 276 -74 -143 130 -95 -24 189 90 -53 55 130 141 -86 -99 -74 -34 -18 -124 -281 -18
3038 -18 138 -217 -324 274 -18 20 229 -99 -74 -44 72 -38 307 -3 247 -159 -170 -42 -268 60 -267 -161
3060 -161 -234 229 -314 -98 14 -47 263 -48 -95 86 446 219 16 112 -47 -221 -177 -74 -146 -389 191 -152
3082 -152 -345 136 -30 27 315 -155 -290 -111 -321 9 -21 -125 -47 115 109 -102 -324 130 337 170 -81 -114
3104 -114 22 93 207 -405 33 82 62 35 31 246 -206 -58 -193 337 -57 279 128 -106 362 -23 -46 -163
3126 -163 85 100 -57 -357 -94 60 211 -243 280 -280 296 321 358 14 154 29 -16 130 32 -28 -566 -116
3148 -116 214 18 126 -301 396 -274 42 -452 164 -36 392 -76 -52 -164 -286 133 -59 -277 -216 -194 148
3169 148 0 -166 -141 -33 -276 349 -306 -148 66 124 -15 -176 -258 -588 51 -1 -170 -30 41 -65 21 -152
3191 -152 199 -36 -50 93 111 -193 -227 -4 196 -47 342 33 433 -187 -247 108 658 -313 -154 -73 387 -580
3213 -580 13 -208 -14 -5 -424 130 -656 -142 -66 -230 243 -14 -232 218 -316 -165 106 -105 79 162 -332
3234 -332 -231 56 204 -28 -116 -14 33 -317 -238 -409 75 173 -180 -134 -615 356 -256 -104 -333 -289 -18 43
3256 43 284 2 -141 -352 -5 97 68 -315 764 3 28 -424 465 450 114 -167 -423 -172 -648 -259 94
3277 94 96 376 -257 489 -401 82 -168 -110 -87 -180 -368 132 4 -73 -91 -493 330 -517 -14 -601 421 36
3299 36 -397 -121 -273 -191 63 -60 -157 137 149 6 -123 -272 -183 90 141 307 121 314 -132 248 106 -346
3321 -346 -454 134 358 -148 -319 -240 69 74 336 -172 -132 -606 -154 -270 940 -51 281 -590 -243 66 368
3342 368 -244 -117 -33 323 -326 -11 -29 1 -3 -45 49 -6 350 263 444 -131 -258 116 -36 10 216 5 -263
3365 -263 -224 -472 -20 -169 325 290 98 4 -39 -333 42 199 -54 135 209 153 -158 -23 -225 406 31 -111
3387 -111 249 70 249 324 42 101 195 -4 174 329 -150 -54 302 -18 -178 -337 51 183 -191 102 78 -89
3409 -89 21 173 -312 176 -236 293 20 -3 126 54 -325 -127 159 377 378 -202 -191 70 152 -123 24 -46 -322
3432 -322 502 -127 10 -93 -61 4 -116 274 -128 212 -4 325 -132 279 161 -12 -17 -18 623 281 240 -141
3454 -141 -135 -95 -55 -51 -225 -301 22 -35 -400 111 156 133 -331 -46 171 -36 -158 -246 -42 -6 -70 -240 -52 -55 43
3479 43 105 -497 17 -63 33 115 153 -136 -137 -47 169 -284 -155 -79 -58 10 362 -168 138 -25 96 -175 -157 -139 193
3504 193 101 152 -239 -115 418 256 243 -105 -145 -65 -64 -42 -210 69 265 -238 290 53 427 25 196 83 42
3527 42 -179 -190 -126 -199 -5 276 -240 13 -110 -197 139 -74 -150 202 344 75 -153 -122 284 155 208 97 -44
3550 -44 69 273 -419 50 288 289 -347 -165 -5 -690 -670 272 -256 -21 -34 -73 510 34 -867 -194 -605 159
3572 159 297 554 130 247 -558 -210 566 150 59 -267 -4 -1091 656 349 -684 276 -439 351 226
3591 226 211 -228 254 -805 -859 -215 -582 -310 -934 -113 147 -130 -31 157 -580 -201 586 -104 564 456 -985
3612 -985 684 -65 143 566 43 -429 -255 -227 620 -117 423 241 768 -683 25 712 -379 -396 -420 -1118
3632 -1118 170 9 101 248 -3 820 -196 -718 -136 237 -47 301 254 16 132 309 81 438 252 -788
3652 -788 -301 402 383 0 -466 154 -705 -47 -235 -412 261 192 -575 -69 619 -11 -408 -628 437 570
3672 570 237 187 -583 -350 466 -78 88 -40 -229 455 -143 -511 -391 600 326 -454 498 171 16 131
3692 131 -385 -348 263 -342 -324 -180 -446 -605 -108 -29 33 24 -137 -375 -49 -108 -203 129 266 -251 -357 -135 -339
3715 -339 93 507 -44 -69 -72 277 -43 696 465 -240 502 -445 551 75 -86 347 -739 27 204 191 238
3736 238 375 18 17 -339 -96 -48 -619 292 -130 558 -79 94 -838 -559 -335 358 506 -493 -590 -453 794
3757 794 -28 -97 277 520 -324 -95 171 -89 -305 -455 46 -151 441 -614 -256 -66 417 -124 -382 671
3777 671 310 1023 136 394 -766 -51 250 -585 -138 -436 360 -490 645 -441 -408 -429 -262 382 377 -62
3797 -62 -222 -589 10 -400 -657 -367 258 347 -252 292 -976 -389 -271 -55 92 -42 -665 -219 124 -194
3817 -194 927 573 -225 -163 305 253 -842 -539 289 -197 225 -532 -359 -430 -529 -228 -47 -69 432 -307 -399
3838 -399 -201 270 -157 -492 178 105 -124 122 594 216 -253 172 261 -939 -618 736 -212 -328 505 -138
3858 -138 -141 -1133 425 166 -417 -461 200 -403 84 460 130 291 317 -66 48 -265 -5 -692 -502 313 -126
3879 -126 -494 87 -9 29 -592 -163 19 -241 300 552 -301 253 668 -36 -494 -243 -181 3 -91 -7 737 -544
3901 -544 -461 -515 -14 153 -186 -61 -126 252 -170 82 301 -85 319 -378 167 -444 -291 546 -50 -363 204
3922 204 -57 283 -242 -118 -135 535 262 -209 -372 -75 -533 25 -295 -102 -21 -642 -188 140 -314 266 193
3943 193 -488 -103 -296 -193 -114 250 -78 11 609 518 -325 346 -113 -95 79 154 -347 170 298 440 192 552
3965 552 800 -1008 -620 553 -91 183 -125 -539 415 -183 209 432 -397 -350 26 50 559 -190 -208 -246 -256
3986 -256 -420 425 -156 -234 633 -128 384 -121 -35 -477 261 537 -284 534 -123 -339 -60 82 30 350 -151
4007 -151 -32 -258 364 -413 277 843 184 289 61 7 55 -454 -930 -507 -21 -657 -456 -36 534 -357 235
4028 235 112 304 87 103 -50 41 -410 118 211 284 -448 276 -79 -98 -152 -818 51 -17 -583 5 -603 910
4050 910 498 -550 -79 -1082 534 28 -741 159 -461 -116 -795 -248 654 -186 -220 867 985 212 152
4069 152 88 632 18 422 10 -244 21 283 31 270 -716 -510 282 51 -473 339 486 -173 599 10
4089 10 153 325 384 -151 239 -639 759 715 -4 217 -1193 -491 -281 128 -954 231 -513 -217 -399 411
4109 411 54 392 -186 -890 208 -361 23 220 180 -329 -304 -811 218 -325 -1098 246 -257 45 -451 234
4129 234 -39 -106 -65 -72 -105 -115 9 -522 -653 -396 465 -118 -417 336 -510 -142 -344 349 -733 -71 135 -455
4151 -455 21 119 -504 -221 656 20 387 355 -31 -172 -379 491 122 -209 580 -441 -24 6 -222 -651 -640
4172 -640 -26 179 43 -195 -185 171 -65 -1006 764 396 -81 -73 80 -220 -438 826 -92 -80 -52 225 259
4193 259 -528 36 -50 218 172 137 -395 438 -71 -196 -748 -58 414 405 176 768 -196 115 156 -46 -72 233
4215 233 43 90 -145 -611 397 -454 -188 -127 316 -563 243 407 -190 -451 685 394 256 378 206 88
4235 88 -755 -214 -212 210 -171 362 -613 -206 446 -79 639 -194 692 -665 -734 -15 330 281 169 -111 370
4256 370 -305 52 676 -210 596 7 570 249 514 268 -5 -213 -291 -438 296 -351 -433 -230 698 77 -207
4277 -207 -315 -453 -432 33 375 -198 166 141 -624 -476 22 333 159 -307 834 -91 -593 -221 69 -1008
4297 -1008 -9 -547 -267 325 -98 189 -385 -29 -392 -113 -971 -292 -222 -50 -169 82 17 793 110 -43
4317 -43 -246 220 189 522 242 -273 193 572 -426 -577 -299 660 449 -151 396 82 -36 45 -63 -450 437
4338 437 -392 386 -21 -24 -99 -255 404 -266 556 -8 374 -132 -239 -215 38 40 218 -151 -54 973 -200 379
4360 379 -36 99 -614 -811 -34 -130 33 83 594 180 311 -529 -501 18 -473 250 -451 -230 155 -272 597
4381 597 440 -189 928 438 359 -27 447 61 -540 331 -294 352 575 18 36 573 -699 -21 431 -384
4401 -384 -440 214 1090 -154 -455 -415 195 -369 169 452 -1341 -423 144 304 266 381 -405 -562 -171 -196 -595
4422 -595 95 -490 60 -391 156 -573 -454 224 558 73 122 -470 -200 371 581 910 431 203 287 -942
4442 -942 267 169 -731 -309 338 -9 67 -732 -324 1242 -12 586 -675 930 533 -444 -232 400 -55
4461 -55 166 449 417 -340 -355 -664 976 -799 93 92 -225 -101 347 246 -193 -90 594 509 369 -102 -119 -362
4483 -362 402 207 -554 -330 316 -1172 -506 117 -76 -1025 -476 265 310 10 822 -23 345 238 -605 -145
4503 -145 -223 629 -21 81 157 -760 -62 -136 373 591 -224 40 243 99 168 -24 326 -421 67 12 -67 -46
4525 -46 661 -512 8 181 423 338 105 -663 150 400 -364 -238 -293 515 403 -15 -38 121 -90 -398 24
4546 24 -234 -655 -342 112 112 -38 -257 -10 -375 -185 84 -171 12 -58 409 36 345 -195 213 299 198 180
4568 180 387 198 -136 173 -118 -204 -363 -533 122 -472 -336 199 -31 -40 375 204 -43 -142 -90 683 -127 38
4590 38 -58 131 258 -132 -329 -5 -34 59 -124 -136 85 -122 329 453 -122 86 183 7 230 -62 226 -168
4612 -168 148 167 -10 205 -288 201 -1 -100 300 220 190 176 193 484 -269 273 -498 790 -98 636 -75 -2
4634 -2 104 -87 108 -191 688 -64 -260 359 335 -201 349 -127 4 227 -116 -70 -316 -170 -71 -70 265 -552
4656 -552 -157 -182 -646 331 280 130 -249 360 -315 -123 -392 -177 -342 -537 -304 167 454 469 494 -613 402
4677 402 -97 -557 248 2 -147 -16 -46 -215 322 -178 -169 -435 -250 113 -240 -258 -129 -520 -250 47 -668
4698 -668 -23 108 -67 -682 -256 84 520 223 97 -486 84 -71 -17 203 -117 386 -609 -157 620 474
4718 474 -150 -109 -62 -460 -280 -390 -472 -572 1022 246 26 53 841 -104 -446 -300 -212 -80 174 -248 407
4739 407 245 -325 -77 62 199 106 -245 -447 -281 255 482 223 -222 -458 -533 574 142 -196 -227 -551 19
4760 19 -135 -488 822 563 -359 -308 -304 135 -23 338 -499 -248 19 -65 -243 581 415 191 -660 -146 -205 68
4782 68 0 -19 242 705 142 -103 345 27 -294 537 -208 31 489 114 508 -54 48 -941 -262 -65 -651
4803 -651 559 -338 383 35 -454 -134 -139 -470 -128 -154 197 -241 -227 -474 -556 -2 562 873 -609 611 807
4824 807 -703 -370 228 376 247 -243 -33 -349 -85 -290 278 -722 418 -819 -440 345 242 -334 -106
4843 -106 457 -372 673 283 -322 -334 341 -520 -715 -119 -111 -295 6 93 -248 80 368 -295 -512 -224 -183
4864 -183 114 -237 -533 224 -293 -646 418 125 -287 -700 -488 226 154 340 -191 195 529 409 -479 -144
4884 -144 -107 -156 -263 -314 48 17 330 468 -91 134 69 -187 -63 -252 160 238 604 -208 -5 55 168 81 150
4907 150 -147 425 -103 566 793 169 -128 -180 -762 262 354 420 541 46 -186 216 -329 380 85 90 -257
4928 -257 64 100 -483 102 798 -464 53 248 -62 285 94 -266 372 -90 -708 -368 202 -57 270 -5
4948 -5 -82 109 102 278 -613 455 -219 -16 174 509 166 165 -521 -293 -352 405 -328 -252 256 -198 -85 -82 160
4971 160 52 -345 130 -45 171 -151 -708 345 -390 -414 -48 119 228 220 409 -287 474 92 -40 513 8
4992 8 -341 677 250 -466 223 -1013 -398 -203 -21 60 231 392 -108 482 165 431 -360 -262 -607 -588 -711
5013 -711 -232 -661 392 -539 258 763 -171 -553 314 -526 -608 -239 -668 456 -925 718 -123 84 -139
5032 -139 -135 -252 356 241 470 -47 -283 403 -62 396 400 156 477 -289 -400 -307 -593 511 -671 119 89
5053 89 148 -397 131 -159 -83 211 171 -419 -155 -721 -393 323 -137 680 -424 -182 -7 42 -251 -502 422
5074 422 284 30 -419 20 343 95 -277 154 -368 161 238 -87 408 113 -464 -100 -172 -126 -415 -474 299
5095 299 -20 474 -612 -57 475 -572 -154 -409 133 -66 494 -127 -31 -504 184 539 252 134 -334 283
5115 283 452 -381 384 243 206 139 301 417 -316 -159 479 425 -288 229 384 404 36 -128 55 -155 -63 75
5137 75 213 -27 246 -98 67 413 7 -168 195 -41 250 -400 9 -61 444 86 -334 -152 -332 60 -174
5158 -174 634 -214 86 270 -28 -489 -324 381 359 -93 -207 23 132 -174 213 70 45 599 213 -142 -118
5179 -118 -180 45 522 -7 245 -372 -166 -30 6 -182 141 -230 394 273 -691 -262 -450 18 -134 -393 256
5200 256 298 -263 -461 -483 -5 299 -23 -359 340 793 -732 151 143 97 -214 -126 -523 -72 604 522 -259 287
5222 287 456 188 -1127 32 224 625 544 -587 117 178 -611 -53 -85 362 -315 13 -302 391 289 272
5242 272 569 -495 262 310 286 1015 492 -1 257 525 416 249 -309 119 50 -333 376 184 462 -262 -240
5263 -240 -49 -37 -239 96 1139 169 -121 -760 160 247 235 -38 183 403 -141 152 227 -9 436 -114 361
5284 361 -63 -522 44 -2 333 5 258 -74 -230 -648 568 -107 -434 -78 -386 97 -647 256 -253 107
5304 107 555 -121 113 -222 -20 270 -5 335 459 -93 -7 337 -241 -18 470 273 -129 174 -454 442
5324 442 217 -60 25 52 214 252 -211 -95 635 38 97 371 -616 -109 435 562 -97 27 282 226 14 105
5346 105 111 260 199 260 55 14 68 -345 -238 -243 334 -263 241 -189 133 142 -247 4 -348 83 -566 -69 156
5369 156 85 -430 -41 -488 -43 562 292 624 109 -17 -251 -714 -79 -86 45 385 284 19 223 -357 243
5390 243 102 -144 -308 256 586 -167 617 -288 -66 85 263 -163 -264 235 275 522 186 119 405 91 -450
5411 -450 162 587 509 305 -336 -124 -240 -104 -60 -82 -227 59 415 -82 -221 441 -40 -366 280 -335 -66
5432 -66 65 235 -31 -677 -204 119 -139 -309 -323 17 15 163 237 -340 55 -280 -98 -7 -73 -62 349 -437 21
5455 21 193 54 -459 613 -20 -489 -382 -110 188 -192 337 120 -358 -7 43 -234 -30 18 -116 -137 390
5476 390 -436 94 -142 -82 -19 360 -36 -90 -443 43 -52 96 126 -165 -8 -187 -161 369 -437 -102 -243 476
5498 476 243 -305 -168 -221 141 223 89 -136 -151 -669 -62 -48 124 -160 -129 600 58 -120 502 -65 111 273
5520 273 109 32 97 124 481 -401 -339 57 295 529 -48 179 192 -396 106 -287 -253 238 511 -233 434 442 -403
5543 -403 75 -156 -210 310 -31 77 -376 -484 -409 -139 -602 311 -365 9 263 155 182 -245 347 -225 249
5564 249 352 -398 219 -100 233 215 132 409 130 -8 480 -86 -261 52 -568 592 -116 114 194 183 182 -98
5586 -98 378 -85 -69 107 244 126 256 -203 -83 -21 77 -682 -286 391 76 157 749 598 125 -87 -208 -323
5608 -323 -649 -368 98 -21 -528 -43 -691 871 507 -67 -346 -258 98 -51 -76 -86 129 104 25 -32 286 -645
5630 -645 119 203 -223 711 126 38 31 -279 411 -274 -67 219 -214 -437 -285 260 -21 232 -128 -267 110
5651 110 222 -70 214 201 97 117 14 -290 -23 352 -519 -207 -90 -119 264 -34 -65 -73 -240 310 710 237
5673 237 -12 -97 -121 341 89 204 -114 -119 -103 -10 -566 -122 44 100 -272 -20 -33 75 -335 -74 601 -393 -509
5696 -509 64 -52 382 -29 237 30 -462 52 466 178 391 -191 332 -227 180 -127 -511 407 229 -432
5716 -432 -330 53 193 -17 -127 234 122 556 294 -20 29 138 13 18 -572 -259 -97 170 -657 74 -526
5737 -526 -59 28 190 258 159 -104 137 144 626 -145 74 559 47 -247 -180 5 -330 -33 -82 38 275 16
5759 16 -104 -157 137 -100 -258 -31 310 -82 177 30 62 -91 200 -161 -204 455 -140 -227 152 -294 287 148
5781 148 79 148 55 289 -52 105 175 -263 72 -41 -406 67 -366 -161 -378 56 -232 177 54 102 9 28
5803 28 666 60 -5 -512 -111 -361 159 -7 251 -230 -136 47 203 -123 260 -261 40 -433 271 -191 -540
5824 -540 -95 538 -232 46 122 61 -267 -285 119 -205 430 -408 721 91 32 -435 -68 -205 -613 -440 -232
5845 -232 293 -249 -163 -319 61 -21 -208 399 106 -143 88 -193 -20 198 -209 36 387 -642 -271 435
5865 435 -325 200 -74 -385 -170 298 -23 -448 -267 132 350 -111 251 -149 45 142 116 -34 -113 735 241
5886 241 208 163 -221 228 -275 -391 -195 -22 -200 278 225 318 -292 -37 300 167 163 125 -72 -426 -8 241
5908 241 -226 -37 620 -105 -366 -113 -659 282 -586 134 -154 -43 -46 -114 -134 -287 113 -249 69 621 116
5929 116 -16 -565 -812 -2 444 33 -421 17 252 495 -548 -43 661 -15 243 -95 22 -293 -179 155
5949 155 -168 137 -36 247 701 144 -219 386 55 70 97 299 -448 -158 -18 -261 -231 141 -210 -117 -176 -238
5971 -238 -125 -85 127 24 223 243 301 78 223 -383 181 -203 -172 366 -133 105 -89 161 -457 -513 -126 123
5993 123 503 19 389 -243 110 64 -35 71 46 -109 9 390 -45 160 635 -479 564 -309 89 -44
6013 -44 8 -524 519 -826 761 685 -546 0 -497 -659 -495 -233 -87 45 124 164 39 53 -69 -443 165
6034 165 701 -206 596 -351 -41 207 458 -57 119 -13 10 -556 131 419 -283 -249 433 -600 -355 124
6054 124 22 341 -586 -32 647 495 167 -15 -11 200 161 214 -346 528 -418 -48 597 98 230 -183 331
6075 331 -548 657 -394 -80 344 274 292 -92 -192 85 454 -808 365 417 -413 406 -32 112 265 -368
6095 -368 357 -515 277 64 83 18 -334 149 762 350 -509 486 -145 235 -139 43 631 543 426 -282 478
6116 478 -460 -262 -142 396 -96 -227 363 429 20 281 341 215 -367 -243 -516 185 649 -393 288 -145
6136 -145 -618 530 -322 80 -467 -211 -597 -25 -610 263 129 502 -432 -25 22 -68 527 -267 -160 605
6156 605 -153 -181 72 45 767 -741 -436 -375 -81 169 -506 395 221 12 200 470 186 -37 -245 119 -277
6177 -277 -81 -249 -63 502 181 216 2 -633 19 -228 164 35 89 -477 -278 536 -378 185 187 -398 114
6198 114 -157 88 -374 29 -369 -35 -46 -919 839 -78 -62 -481 -153 -219 -150 386 208 310 168 -118 -93
6219 -93 -193 -500 -391 -182 31 215 -392 117 -215 90 1058 35 -31 321 -105 570 -76 233 256 332 -105
6240 -105 407 -114 -137 -282 -502 -178 597 156 446 86 16 500 781 307 8 525 -400 177 491 220 650
6261 650 566 33 -277 125 237 -226 132 247 -293 -323 -722 -502 -308 -237 35 684 132 -91 -380 366 -302
6282 -302 -25 409 -298 289 -322 31 -161 -205 -341 -103 27 107 -328 -299 -505 166 238 49 222 -170 347
6303 347 331 11 -66 -206 246 215 101 482 208 129 -260 193 270 550 -267 270 -1064 169 -346 -101 394
6324 394 52 125 715 495 -307 -375 -53 -139 -301 209 -86 -65 -72 247 216 -498 405 267 433 -227 314 181
6346 181 37 840 -321 -422 -145 241 -826 275 489 399 145 -365 319 710 91 146 -257 -379 180 -276
6366 -276 -209 -418 -501 85 265 273 -229 427 307 138 -108 -113 239 198 -225 -354 -35 113 345 97 209 123 -139
6389 -139 126 -42 95 -541 230 469 -42 -47 -33 15 88 -353 -118 387 -1 -61 -239 -261 938 433 290 42
6411 42 -93 -87 432 -13 -89 25 360 -448 -176 11 72 95 -154 -32 77 -536 311 358 164 -68 -533 474
6433 474 -524 -567 -75 181 -413 -282 59 29 166 41 229 123 -105 498 -93 -247 -27 -382 -138 69 -26
6454 -26 -320 -151 -230 586 -133 -371 255 -491 274 -225 63 -83 114 382 197 -19 139 -111 9 -4 -174
6475 -174 -101 -285 173 280 546 243 275 -259 120 422 302 -388 -242 -347 291 40 -132 205 -410 -122 142
6496 142 212 422 -851 -552 -628 69 306 -239 -380 -317 312 296 130 -320 -41 -107 96 115 195 13 -305 -383
6518 -383 -180 -71 297 460 15 70 -67 70 32 -106 -455 -376 -78 819 147 79 -69 305 -44 710 475
6539 475 -247 354 -555 125 0 175 35 -27 399 -245 -299 105 -193 -318 -78 209 -343 -66 -124 84 -273
6560 -273 -399 387 291 86 -378 -47 35 -126 -7 -345 276 128 -593 245 -1000 135 -273 197 -98 -536
6580 -536 679 -355 246 -156 173 -81 -414 -146 -502 -684 -62 114 625 -66 30 -127 -115 -5 -52 203
6600 203 421 283 406 201 111 -56 -203 -306 116 125 21 239 -640 407 -49 375 -129 -481 -295 -111 16
6621 16 -410 -260 228 253 -213 162 -187 55 137 -7 -192 -23 318 316 -133 -378 -277 -298 163 -62 75 -288
6643 -288 -211 200 271 -333 -259 -135 189 -56 -16 -648 -955 -57 -77 -12 -37 136 -313 -196 83 -308 83 -431
6665 -431 367 -55 362 469 -533 90 1 -145 108 176 119 92 -4 80 13 -327 -224 -333 -368 28 -128 -139 58
6688 58 128 27 580 29 287 83 715 136 58 508 138 -211 106 -23 105 -9 -347 283 1 95 -147
6709 -147 235 249 277 87 -348 136 -91 -431 8 -299 216 -563 86 160 182 -198 274 -537 142 -113 -104 392
6731 392 221 -335 370 85 -406 215 38 110 47 443 267 -317 -483 -299 -823 156 421 -455 74 303 -297
6752 -297 365 -336 -59 -34 286 106 271 -134 111 -239 193 322 95 -199 340 -16 -31 481 -216 -169 147
6773 147 461 -379 215 -340 -85 -278 -134 -84 383 139 -90 -39 759 7 -423 -290 33 -32 -77 -68 -245 290
6795 290 142 -271 -658 169 357 -500 72 -183 -92 136 392 -483 -253 185 -21 -187 -112 225 -229 -725 428
6816 428 529 -401 46 641 252 -547 -234 510 784 85 -511 -209 348 404 -76 -115 265 88 -201 -301 214
6837 214 -632 487 254 -223 442 -178 -302 -85 -144 390 374 -92 186 -860 -46 356 176 -35 -38 -456 -3
6858 -3 334 -437 -282 -701 -185 508 265 -115 371 432 119 234 1002 10 468 11 217 206 -269 550 216
6879 216 299 -652 78 35 9 220 149 374 291 -364 -109 207 -145 454 4 282 452 -1 94 -417 -102 -495
6901 -495 429 -407 -638 -539 -133 -142 -34 -177 131 -362 -67 -323 179 358 -207 116 -66 -43 -487 316 186
6922 186 -121 -291 -302 -304 -202 -140 783 -165 -29 -392 -190 619 -321 253 -14 -228 -371 50 283 -679 -480
6943 -480 341 -32 252 152 -322 -327 -62 351 -145 11 42 -5 90 -121 135 233 -135 177 -384 204 59 364
6965 364 479 -207 544 -151 -78 -301 -191 -181 175 -321 -299 96 423 760 -336 303 -239 -17 6 -390 -144
6986 -144 113 170 -311 -234 695 685 125 506 -308 -189 172 -432 493 461 -133 87 -1 -268 266 -114 312 -97
7008 -97 499 7 -90 -30 -233 -125 205 174 241 445 627 22 538 -341 -15 268 314 414 -308 898 -25 -69
7030 -69 -329 -148 240 -220 -439 291 141 -342 444 -109 287 218 -552 21 75 -8 15 277 -199 117 143 102
7052 102 126 351 -156 523 982 142 39 133 -161 -165 262 -253 -463 -239 -78 243 603 -166 -276 471 -566
7073 -566 293 136 -134 -287 7 664 -373 -228 -261 288 -101 128 142 -181 -333 -377 227 39 -184 14 128
7094 128 298 364 -467 -485 -394 453 -69 -465 613 -150 -66 363 -218 -437 227 -697 235 58 -165 70 -474
7115 -474 -878 -158 -151 -57 -256 322 285 182 -200 -133 -403 33 1 -60 270 244 -427 -171 -298 -158 123 -219 -233
7138 -233 -285 -209 172 36 21 -341 -103 -70 -138 149 147 -443 -270 -124 -120 -197 -85 188 -184 -374 -33 -98 -315 -177
7162 -177 -498 -252 -173 -161 260 -36 -327 -29 162 -64 136 110 157 -134 -370 333 -13 413 146 -504 124
7183 124 28 321 -144 -33 -158 -332 -481 -208 395 330 -331 -509 -238 -676 161 -250 -638 -372 167 406 518
7204 518 299 219 -401 -316 -55 -85 -235 -619 242 -100 518 -253 -292 -224 -137 59 407 -163 448 220 446 -421
7226 -421 -300 -632 -316 -616 -446 -192 -158 292 -366 27 -198 101 -251 277 -683 -427 84 -230 93 674
7246 674 375 -226 102 170 -206 114 340 -350 -505 217 -209 -40 -343 296 25 266 646 -460 136 -106
7266 -106 -100 -113 -588 186 -48 391 -200 -428 -101 421 -462 -223 13 95 -218 -391 72 -28 153 -17 155
7287 155 -237 -58 -105 -423 -155 -304 -297 -162 10 -251 108 144 106 247 418 430 623 -423 -274 -63 -280 -18
7309 -18 -414 -559 281 -157 584 290 290 -296 -145 -253 -296 -298 -40 -129 -376 -75 121 257 87 -1079 -271 -609
7331 -609 475 -633 314 -318 -623 -177 -290 317 216 486 -655 195 -92 435 -264 25 -163 15 -124
7350 -124 -261 -355 39 -393 313 -334 -72 488 -192 -56 224 -123 -84 143 15 -130 -306 173 214 -411 241
7371 241 -20 248 47 -799 -11 940 688 253 -181 -34 -165 -408 90 364 105 32 -93 -107 -265 -522 124
7392 124 -51 124 254 -581 -650 -137 -341 428 -25 -642 -106 382 17 -220 469 -160 -282 572 -86 -237
7412 -237 -254 -79 -253 172 630 181 -341 -571 591 722 -25 21 -365 -682 -241 -129 -173 -77 650 2 647
7433 647 807 -543 650 -656 850 -186 -277 -268 3 -816 279 28 237 122 -477 553 -68 307 -335
7452 -335 -479 237 -221 -28 -198 172 -429 -755 -329 -1120 -219 196 593 -570 0 -379 -46 -377 362 -565
7472 -565 -504 -121 -441 -228 321 361 -679 742 104 611 375 -488 -211 519 479 -4 72 -153 264 -26 -478
7493 -478 -438 -18 -478 162 281 -393 503 325 109 260 248 -72 -450 117 830 155 -489 581 315 16
7513 16 252 348 -274 212 27 210 87 -236 -180 -48 -150 398 -175 446 -80 318 -720 -579 -877 -551 1156
7534 1156 -820 347 223 -422 -569 621 296 -571 -61 209 -580 -666 672 -228 193 -319 -639 710
7552 710 159 611 -732 389 479 475 -500 -4 5 -75 -132 189 -763 -334 -657 466 58 88 242 -208 386 -426
7574 -426 717 -2089 489 -172 356 213 -275 -472 -760 -238 1188 331 27 95 -297 -231 -1220 932 1087
7593 1087 -1285 -758 18 -106 346 686 -394 -703 111 162 -413 -1323 1444 622 -507 382 389 737 549
7612 549 103 665 219 544 377 115 -189 398 455 750 -754 749 -288 1197 535 -202 505 590 71
7631 71 -350 436 157 -394 -308 714 -397 -584 -57 815 -71 606 419 128 -381 -121 694 8 -92 40
7651 40 -888 685 -361 273 -265 -65 -571 -820 559 317 -636 -533 -955 -313 -312 512 554 -79 -431 199
7671 199 427 -349 35 572 74 702 -118 -735 -390 -629 1062 762 203 -146 -118 266 118 474 -622 -385
7691 -385 354 186 -498 357 -186 913 -535 -691 -555 668 -90 25 -98 42 355 -187 -458 79 92
7710 92 650 -521 -277 759 36 -380 -227 -5 43 224 310 930 373 693 414 670 590 163 -1360 -414
7730 -414 -80 -259 -33 551 163 542 745 11 98 -773 -104 306 -702 105 661 -477 70 -1145 834
7749 834 -366 -860 -733 1096 -252 -212 -249 1144 -142 -40 638 537 -735 -609 377 -203 -370 248 477
7768 477 -933 375 301 -355 -558 453 -87 709 54 264 -553 151 134 406 -182 557 126 315 -676 -101
7788 -101 200 -425 -175 -1467 17 748 -340 497 -547 -108 -982 -315 -104 502 -181 -783 -297 -326 -227
7807 -227 -1056 277 655 -265 -88 453 -611 -427 -512 -22 -416 6 509 -753 310 -31 -678 -994 429
7826 429 503 -83 442 -358 299 -165 -1423 -716 172 -641 -608 -471 -1454 -78 -583 -349 132 -672 478 -359
7846 -359 821 152 -245 -689 802 -655 -772 -184 -532 -24 220 -264 -188 -486 20 463 -5 521 68
7865 68 1084 -705 -263 -61 -654 100 663 671 61 567 -492 -237 -438 279 1022 -84 -742 603 -359
7884 -359 -770 -91 -331 -27 342 -200 376 -198 -549 -281 254 -490 521 509 -432 -566 -21 1009 43 936
7904 936 -6 -164 -978 -102 600 -332 -55 -68 145 -250 692 146 -401 462 -236 -213 242 369 -207 1049
7924 1049 -250 -321 -225 -778 608 35 -122 91 -280 271 100 -529 39 -370 -108 65 -239 -275 172 -1109
7944 -1109 417 -285 -413 -67 726 415 161 436 763 581 -121 138 -952 -810 -849 -673 1566 53 -392
7963 -392 666 518 -84 -24 -52 144 493 136 -57 -1191 109 291 532 23 46 371 405 300 169 -328
7983 -328 521 -1651 -551 -405 -957 -413 -270 -85 -523 -915 750 63 -92 92 91 -247 -7 -383 -200 -114
8003 -114 -41 -79 -91 477 441 -190 -218 -135 496 -498 -51 -424 26 1077 683 676 -98 343 454 733 -582 340
8025 340 -1713 -37 255 335 -219 270 886 -242 -501 -838 74 413 -726 288 -104 -608 410 138
8043 138 -679 -44 79 -573 -528 -190 -240 96 -112 586 -245 -646 456 -255 273 -1079 -308 -82 361 682
8063 682 -10 -257 -173 753 -246 385 292 -325 -372 -134 199 253 -150 424 725 -512 -991 -322 5 -43 404
8084 404 -368 149 -537 198 -312 -160 82 280 66 161 120 458 153 540 231 -428 280 700 11 461 251
8105 251 437 -309 -322 234 -647 -438 149 268 600 268 -173 47 -43 420 -35 -24 -340 519 -199 -12 65
8126 65 -286 483 411 -650 -936 423 -198 -10 126 492 -387 390 35 -419 -574 464 122 -438 5 -35
8146 -35 -558 344 456 186 -100 -521 -28 -228 -143 84 602 -187 938 -258 29 -142 16 417 503 284
8166 284 -397 160 -2 0 8 48 -140 -115 -472 337 744 371 357 -1090 -198 538 486 -327 -225 39 13 -98 -198
8189 -198 -455 401
8191D01
$$ Imaginary data points
##PAGE= N=2
##DATA TABLE= (X++(I..I)), XYDATA
0 0 0 0 0 0 0 0 0 0 0 0 -8 8 -8 8 -8 15 -16 23 -24 32 -39 42 -51 63 -71 84 -98 113 -130 150 -173 195 -223
33 -223 253 -285 321 -362 405 -453 505 -565 624 -695 770 -851 941 -1038 1145 -1260 1390
50 1390 -1531 1686 -1858 2048 -2264 2507 -2782 3093 -3458 3889 -4398 5023 -5807 6821 -8191
65 -8191 10159 -13234 18749 -31714 131151 -100666 -440519 -99053 329665 380483 -59043
76 -59043 -377782 -219237 230202 361372 30015 -345711 -263401 135423 356336 103281
86 103281 -274024 -287166 82066 340165 169588 -206998 -278723 34108 317810 214795
96 214795 -133964 -277230 -32215 274080 257938 -64205 -280853 -113019 214500 279267
106 279267 3631 -266034 -183021 137785 283266 69072 -229338 -227601 67215 266644
116 266644 127097 -170886 -247623 2318 247290 171841 -118089 -247589 -46466 223413
126 223413 208207 -68260 -245071 -86350 202907 237335 -22415 -238116 -127760 171073
136 171073 264068 28263 -224991 -170773 123650 274950 82778 -199721 -211692 61263
146 61263 264210 129338 -160395 -234150 -6540 229508 165094 -110840 -236150 -59760
156 -59760 186959 185953 -54949 -216293 -96446 146485 200155 -2481 -186742 -117834 107272
167 107272 203386 45647 -155779 -138104 66590 196216 84129 -124689 -160423 15988
177 15988 176590 116891 -91169 -176589 -37422 144323 141349 -47763 -179362 -85525 108009
188 108009 155993 -1457 -162406 -118328 69422 162351 43644 -134399 -136978 37836 160498
199 160498 77801 -103494 -145444 9413 154473 102935 -78451 -151971 -17606 144912 122721
210 122721 -55895 -160322 -48635 131035 139698 -32228 -164083 -82342 108488 154494 -3050
221 -3050 -160248 -111749 79596 162081 30936 -141314 -133118 47117 163270 64367 -112716
232 -112716 -139638 16573 153680 92677 -79664 -139762 -12076 137213 112762 -49084 -136076
243 -136076 -41670 112898 124714 -21132 -132227 -69779 82740 129881 8413 -122187 -96151
254 -96151 50375 131708 40565 -103124 -114757 17397 127238 74501 -74885 -124384 -13973
265 -13973 115907 100705 -41950 -126273 -44588 96466 116963 -12523 -122609 -70710 72592
276 72592 123447 13524 -115196 -91801 49990 125520 37193 -102804 -108134 29113 127320
287 127320 59628 -87306 -118915 8485 124866 81127 -67301 -126264 -15770 116824 97305
298 97305 -45862 -128873 -41504 99303 108765 -22349 -124176 -63680 78484 114629 3040
309 3040 -110166 -79656 55545 116762 27361 -90775 -87956 32700 113349 50103 -70055
320 -70055 -93831 8638 104295 67172 -49516 -96745 -17858 88214 81137 -28060 -97648
331 -97648 -41991 68003 91225 -2986 -91604 -63376 46224 98536 23583 -78835 -78582 23040
343 23040 99034 49233 -61949 -89450 28 93268 68753 -42852 -95745 -23793 81256
354 81256 82863 -24125 -98294 -43986 66691 91252 -4537 -95617 -61043 51708 96883 15176
366 15176 -87272 -73908 35516 98984 34090 -75849 -84544 17601 94817 49107 -61017
377 -61017 -91145 -2507 86179 60821 -44639 -93204 -21313 73724 69575 -25205 -88549 -36826
389 -36826 60171 76131 -4774 -77917 -48815 44934 79947 14806 -65098 -57976 26923 77963
401 77963 31491 -50782 -65574 6459 71191 44965 -36157 -70328 -14529 60435 56191 -20054
413 -20054 -71271 -32746 48060 65258 -1524 -66245 -47286 33892 72890 17096 -57783 -57479
425 -57479 19600 75597 35780 -46618 -65445 4429 73520 49795 -35258 -70557 -11776 66197
437 66197 60280 -23765 -73927 -26740 55773 66318 -10879 -73467 -40329 43668 69542 1916
449 1916 -69043 -50379 31299 69595 15154 -60471 -56622 19333 68360 28704 -47943 -59575
461 -59575 7210 64182 39967 -33532 -59491 -4669 56877 47662 -19325 -58433 -18351 45423
473 45423 51447 -5969 -54253 -30995 31524 52011 6759 -47873 -41332 17218 51169 19693
485 19693 -37515 -47823 4155 50022 32355 -25016 -49288 -7998 46140 43573 -11601 -49496
497 -49496 -19402 40680 51587 1038 -47363 -30595 31007 56501 10940 -44640 -40121 20232
509 20232 57662 21374 -39935 -47983 8587 56225 30598 -33296 -52004 -2044 52457 39089
521 39089 -24792 -53330 -11834 46562 44991 -15020 -52328 -19826 39669 48788 -5193 -48397
533 -48397 -25859 31076 50029 5964 -42868 -31369 22654 49055 15130 -35663 -35980 11478
545 11478 45322 22468 -27850 -39546 434 38570 27787 -18954 -41331 -10867 31019 32295
557 32295 -9029 -40201 -20646 22890 36140 2866 -35083 -26939 15717 39177 14229 -27251
569 -27251 -31754 8173 40516 24474 -19952 -35727 -914 37999 31021 -13531 -39751 -11863
581 -11863 33251 35622 -7430 -41035 -21246 27217 38737 -840 -40600 -28270 21614 41781
593 41781 7652 -35508 -31927 16020 44272 16223 -29604 -33895 8567 43118 22963 -23564
605 -23564 -35595 1700 39874 27542 -17918 -36483 -6296 33278 29807 -11825 -35898 -13602
617 -13602 25959 31588 -4243 -33610 -18809 18185 31432 3493 -28613 -22420 11498 30912
629 30912 10438 -22417 -26013 3670 28383 17185 -15557 -27757 -4297 24395 22878 -8223
641 -8223 -28811 -10978 19952 26836 28 -27330 -17844 14573 28820 6393 -24720 -23789 8274
654 8274 29659 12979 -21318 -28740 2301 28989 17879 -17343 -30762 -3387 28230 22689 -12161
667 -12161 -31426 -8352 26437 27101 -6729 -30895 -12972 23749 29542 -1377 -28571 -16927 19317
680 19317 30864 3473 -26226 -20818 13833 31047 8034 -22486 -23099 6984 28434 12045 -18325
693 -18325 -23785 1100 24569 15582 -12937 -23652 -3899 21020 18793 -6932 -22032 -8365 15938
706 15938 20561 -1021 -19805 -12262 10927 21502 4746 -16817 -15931 5393 20680 10468 -13014
719 -13014 -19196 -1127 18983 14988 -8955 -21475 -6871 16151 18003 -4003 -22521 -11849 13119
732 13119 20455 659 -21230 -16067 9542 21838 5478 -19329 -18892 7123 23200 9650 -16857
745 -16857 -20698 3878 23384 12404 -14061 -21881 -112 22108 14974 -11293 -23066 -3564 19626
758 19626 16583 -7631 -22381 -7326 16645 17952 -3217 -19871 -10566 13104 18975 741 -16866
771 -16866 -12361 8931 18751 4400 -13384 -13361 4534 17068 7342 -10375 -14401 331 14635
784 14635 9896 -7290 -14952 -4131 11975 12487 -3074 -14505 -7998 8849 15177 1605 -13412
797 -13412 -11432 5316 16134 6484 -11467 -14569 791 15534 10404 -9361 -16779 -3557 13747
810 13747 13402 -6118 -18525 -7108 12440 15265 -3754 -18545 -9696 10478 16267 -515 -18000
823 -18000 -12150 8899 16907 2355 -16016 -13841 6590 17531 5214 -14656 -15769 3732 16619
836 16619 7530 -11954 -16517 815 15510 9233 -8928 -16111 -2380 13749 10980 -5385 -14863
849 -14863 -4693 10962 11649 -2594 -12857 -6448 8712 12663 513 -10800 -8628 5228 11970
862 11970 3637 -9399 -10479 1857 12163 6696 -7195 -11610 -1374 11143 10157 -3959 -12634
875 -12634 -5554 8796 12318 -916 -12609 -8443 6552 14171 2811 -12050 -11161 4257 14566
888 14566 5574 -11091 -13487 882 13816 8041 -9143 -14051 -1207 14082 9999 -7524 -15365
901 -15365 -3016 12900 11560 -5706 -15505 -5463 12363 12965 -3531 -15335 -7468 10050 12967
914 12967 -850 -14292 -8951 7176 12457 484 -12424 -9984 4910 12017 2878 -10214 -10672
927 -10672 2503 10583 4749 -6981 -10011 -14 9960 6060 -4745 -9419 -1831 8462 7829 -2004
941 -2004 -8919 -4150 6571 8741 699 -7970 -7033 3749 9398 2935 -6941 -8915 751 9379 5824
956 5824 -5710 -10109 -1966 9306 8344 -3509 -10783 -4537 8827 10445 -1752 -11129 -5783 7074
970 7074 11565 770 -10707 -7560 5616 12264 2436 -10400 -9314 3812 12203 3997 -9879 -10883
984 -10883 1971 11267 5386 -8220 -11436 -292 10424 6789 -6392 -11523 -1991 8839 7322
997 7322 -3860 -10232 -3110 7367 7878 -1734 -8786 -4262 5379 7951 407 -7589 -5191 3307 7190
1012 7190 2224 -6047 -6241 1158 6901 3543 -4290 -6902 -1364 6210 5294 -1936 -7221 -2947 5012
1027 5012 6569 208 -6661 -5477 3417 7816 2216 -5947 -7029 1977 8818 4190 -5533 -8278 52
1042 52 8853 5460 -4010 -9274 -1375 8635 7286 -3435 -9554 -2873 8203 8696 -2320 -9812 -4730
1057 -4730 6715 9245 -961 -9626 -6035 5436 8999 635 -9091 -6691 3870 8659 2245 -7472
1071 -7472 -7356 1944 8566 3425 -6134 -6894 785 6875 4325 -4491 -7084 -894 5892 4711 -2612
1086 -2612 -7352 -2283 4405 5154 -1088 -5860 -3842 2563 5201 756 -5262 -5039 1067 5047 2665
1101 2665 -3243 -6145 -294 4991 4533 -1803 -5824 -2243 5223 5789 -431 -6245 -3536 4078 7137
1116 7137 610 -7074 -5279 2927 7180 1923 -5486 -5886 2052 7992 3060 -5001 -6882 933 7955
1131 7955 4433 -4192 -7235 69 7988 5387 -3632 -7099 -1165 6741 5927 -2485 -6494 -1802 5636
1146 5636 6487 -1498 -6315 -3078 4330 6259 -543 -5720 -3064 3154 5910 793 -4998 -3848 1607
1161 1607 4623 2024 -4123 -3828 318 3649 2897 -2346 -4353 -1016 3252 3233 -850 -4443 -2290 2372
1177 2372 4035 790 -3758 -3189 1019 4279 1635 -3261 -4595 162 4451 2910 -2872 -5399 -1022
1192 -1022 4566 4124 -2013 -5772 -2225 4722 4458 -1252 -5869 -2648 4459 6415 -241 -5625 -4113
1207 -4113 3781 6325 470 -5123 -4568 2806 6931 1681 -4768 -4981 2113 6809 2304 -4326 -5337
1222 -5337 1055 5765 2937 -3651 -5173 203 5450 3312 -2292 -4471 -724 4314 3412 -1680 -4262
1237 -4262 -1615 3094 3811 -335 -3954 -2492 2069 3926 957 -3100 -3649 658 3094 1755 -2534
1252 -2534 -3157 -545 3068 3229 -967 -4067 -1852 2449 3697 38 -3767 -2709 1605 4221 1030
1267 1030 -3806 -3451 1033 4183 1674 -3543 -4542 739 5320 2247 -3463 -5082 -385 4837 3168
1282 3168 -2696 -5651 -835 4570 3582 -1867 -5461 -1435 4369 4121 -1243 -5629 -2254 3563 4636
1297 4636 -1064 -4386 -2656 2783 4321 146 -4076 -3295 2448 4736 670 -2687 -2680 1367 3911 1305
1313 1305 -2367 -2968 408 2915 2002 -1444 -2794 -526 2210 2066 -594 -2026 -1346 1199 2449 403
1329 403 -2138 -1899 670 2137 1682 -1952 -2251 -30 2439 2132 -913 -2488 -1040 1750 2413 -564
1345 -564 -3503 -2072 1737 3237 -47 -3377 -3051 1437 3985 962 -3291 -2670 868 3880 1959 -3071
1361 -3071 -3490 853 3437 2010 -2476 -3738 442 3921 1900 -2309 -2958 48 3084 2172 -1853 -3377
1377 -3377 -847 2116 2259 -973 -2750 -851 1903 2161 -636 -2426 -1311 1026 2207 270 -1738
1392 -1738 -1638 304 1316 146 -634 -809 -290 1347 1643 -294 -1190 -968 1128 1749 755 -935 -1448
1409 -1448 711 2439 1189 -978 -2009 -251 2052 1553 -610 -2290 -845 1615 1806 -1115 -2869
1424 -2869 -1336 1914 1993 -298 -2909 -1952 1294 2968 5 -3302 -1897 1656 3231 254 -2852 -2117
1440 -2117 866 2975 588 -2707 -2156 541 2993 585 -2442 -2182 414 2238 700 -2242 -2395 710
1456 710 2037 935 -1595 -1874 89 1884 993 -1732 -1855 -376 1340 273 -560 -1379 -420 1111 466
1473 466 273 -848 -1040 197 1050 421 -133 -989 -291 789 1085 -155 -1208 -782 358 1082 593 -959
1491 -959 -1258 493 1365 659 -698 -1246 632 1597 891 -964 -1878 396 1881 853 -821 -1366 -167
1508 -167 1555 1161 -1054 -1845 -248 2019 1387 -1484 -1784 -281 1782 1197 -1117 -2183 -122 1520
1524 1520 1321 -1042 -2071 -290 1373 530 -1051 -1230 -199 1186 648 -1228 -1552 -125 1317 189
1540 189 -711 -1101 -352 670 64 -475 -403 -64 395 151 -403 -72 57 38 409 -108 176 228 -101 -232 -289
1561 -289 248 63 -369 -96 -56 397 195 -387 -595 220 313 296 -703 -827 763 345 -25 -385 -719 401
1581 401 818 219 -497 -852 853 715 299 -532 -318 298 974 82 -1515 -100 498 1145 -79 -1210
1599 -1210 -439 574 945 -138 -1173 -512 918 755 422 -748 -431 847 789 -32 -831 -496 232 679
1617 679 -610 -1192 -136 588 360 -671 -776 -266 552 230 -887 71 -301 547 156 -600 -617 189 499
1636 499 -153 -480 -5 139 336 -122 -440 11 312 204 -213 -44 -258 778 374 -528 72 121 422 -586
1656 -586 -588 -242 415 241 -318 -308 -111 511 477 -423 -825 -15 1118 1100 -434 -1193 16 767 740 -437 -872
1677 -872 -13 533 344 -507 -695 53 944 12 -604 -626 65 852 221 -523 -572 92 1183 305 -370 -309 -270
1698 -270 607 304 -725 -933 72 461 -272 -751 -570 -117 520 137 -285 -94 207 19 30 -928 -373 67
1718 67 327 -300 -556 203 431 173 -354 41 182 414 -67 -40 64 719 570 -60 -374 -419 151 225 -368
1739 -368 -279 10 358 59 -32 -553 442 695 -24 -659 201 152 725 -113 -899 -98 735 781 -2 -484 -488 893
1761 893 1136 -223 -1284 110 425 581 -231 -1109 26 1251 691 91 -1007 -198 852 676 -491
1778 -491 -817 -65 911 472 -152 -543 -93 637 363 -186 -624 -286 957 101 -198 -861 -344 234 690 323
1798 323 -639 -654 -274 -186 136 -634 -29 176 -57 686 167 -685 -235 -155 281 149 -101 -402 -265 328 255
1819 255 176 -364 56 0 777 -68 -750 -259 159 771 -98 -1033 -52 362 954 363 -829 -386 400 1087
1839 1087 -304 -954 -961 437 901 515 -1113 -713 727 1076 520 -771 -336 565 1409 775 -502 -938
1857 -938 255 1208 406 -533 -341 204 781 562 -582 -715 25 790 672 -461 -644 -192 296 430 153
1876 153 -501 60 268 382 -105 -589 -371 105 444 -306 -642 -282 -31 27 215 253 -67 -326 -111 1068
1896 1068 431 -772 -667 560 658 331 -791 -593 -168 963 1042 -414 -729 -23 936 741 -305 -1304
1914 -1304 -674 1509 1030 -538 -554 -317 743 1183 -86 -1273 -697 1294 1122 122 -979 -512 392
1931 392 1002 300 -719 -473 351 1288 -106 -759 -499 283 1261 12 -72 -292 348 1437 862 -138 -272
1950 -272 -9 190 -188 -392 -805 -872 63 1012 22 -217 7 -367 246 -137 236 -149 3 328 314 -52 -45
1971 -45 -481 376 338 65 -602 -475 152 507 186 -585 -885 -49 824 -505 -735 -1135 -140 1008 615 -1249
1991 -1249 -1090 -146 1014 720 -1235 -840 -194 897 997 -509 -869 39 336 343 -113 -1082 -35 442 757
2010 757 459 -1336 -565 730 662 138 -392 36 213 397 386 -315 -447 66 644 442 -65 -555 74 624
2030 624 160 -111 -797 358 102 357 -429 -623 -412 52 544 287 -215 -448 349 -40 -82 -272 -619 413
2050 413 376 804 20 -468 -102 606 988 -311 -366 -647 551 -30 -187 -192 -791 475 565 424 -913 -723
2070 -723 545 759 40 -592 -727 788 1059 409 -915 -784 -8 768 323 -456 -1161 325 789 728 -223
2089 -223 -506 -225 905 706 95 -399 -373 480 516 -293 -407 -7 249 765 303 -588 -470 33 -223 554
2109 554 -276 -616 147 363 -126 -268 53 -421 383 902 125 -359 -189 262 431 281 -365 -1305 577 844
2129 844 751 -754 -430 225 836 802 -611 -627 402 471 539 -555 -917 -833 504 407 -108 -501 -73 543 584
2150 584 -583 -103 -462 362 330 -159 -857 -532 -126 681 166 -986 -116 -195 525 407 -249 -377 77 563
2170 563 411 -647 88 506 437 51 152 -385 456 101 173 84 -666 -65 979 637 60 -308 -302 59 525
2191 525 -292 -376 -155 37 -113 44 127 -641 -481 118 543 131 -313 -859 550 836 58 -10 238 458 652
2212 652 492 239 -653 -691 350 -22 -145 -207 147 370 183 -436 -416 -602 603 815 308 -32 -331 398
2232 398 488 -83 -115 -395 227 198 -56 -652 -35 600 432 314 -209 175 -194 575 27 -127 -508 199 4
2253 4 224 -314 -138 321 519 133 -245 -128 -248 -39 -87 -495 -134 -160 -73 538 500 132 -31 -13 687 -36
2275 -36 -209 -887 -173 723 539 -383 -143 184 -143 551 80 -298 -229 375 358 301 -720 -108 436 541 -250
2296 -250 -536 -162 172 429 417 -532 -310 556 846 -636 -700 101 -360 325 861 -442 -370 894 -407 438
2316 438 69 -1050 -464 -108 -636 -252 -63 388 286 458 234 -15 15 291 322 117 313 -935 -324 -477
2336 -477 307 346 -505 -326 530 86 411 -154 -498 -96 -961 831 -592 -615 -842 131 337 67 434 272
2356 272 -93 -709 31 -622 -420 264 27 302 195 -105 51 152 -189 -608 -386 -107 308 -641 -1029 -186
2376 -186 420 320 -94 -653 471 569 392 227 -456 -141 234 153 -840 49 12 -240 293 129 -448 -89 838
2397 838 -143 -206 -666 462 382 -73 715 411 105 -20 178 233 -798 56 343 265 548 -310 -202 158 296
2418 296 277 197 669 21 316 753 175 126 425 462 581 -159 399 101 -300 518 746 654 190 -459 -255 362
2440 362 735 -66 632 -9 143 8 101 -311 807 1055 -88 -737 -25 -614 251 254 -216 -389 428 332 725
2461 725 -44 -293 255 583 212 146 -194 211 -11 67 -336 -582 475 111 167 416 167 -49 -114 438 50
2482 50 -107 -148 232 -254 -436 264 43 148 463 574 -460 28 239 -84 419 176 550 6 -660 685
2502 685 -467 -89 -309 -2 -144 -439 -282 -4 433 364 -1 983 -99 -642 991 417 190 -14 -465
2521 -465 -494 15 -438 -960 762 141 -141 344 -465 -1104 -357 -649 159 -155 -892 214 -169 30 -762 -153
2541 -153 -531 -255 166 67 -219 -189 -199 251 -340 884 523 1001 196 -531 916 37 -476 -410 332 433 426
2562 426 393 283 550 -55 -592 781 719 349 -451 -104 -2 282 -321 77 -140 -205 451 -260 -710 -10 323
2583 323 487 459 -44 576 837 366 -799 570 146 928 -278 665 -232 830 467 132 1045 234 46
2602 46 69 648 276 262 -124 409 318 131 -773 117 -281 140 -207 -780 180 -124 -402 -320 426 -311 -40 -42
2624 -42 396 457 -657 250 520 213 -867 37 -519 178 233 -18 351 -541 -68 -610 563 -331 101 943
2644 943 -553 317 -31 -182 856 827 -417 -665 386 236 149 -291 -140 -655 528 -324 -126 309 29
2663 29 -578 -295 -464 -158 146 70 -648 -449 300 -81 190 -98 -162 -59 -753 281 139 587 -256 419 -128
2684 -128 358 -453 95 232 145 -24 -220 31 272 243 706 -24 454 -20 -234 -647 268 -202 -331 -233 415
2705 415 -211 221 389 180 -67 582 -82 159 298 -288 521 342 100 42 356 342 -221 -455 -179 -469 79
2726 79 185 607 -454 -380 -71 226 20 -128 -401 -553 -203 -636 959 43 382 253 284 77 -118 -186 507
2747 507 103 2 135 -12 -88 237 372 -636 -443 -339 -489 -991 135 -610 -116 624 509 44 363 -101
2767 -101 -754 109 228 -93 54 210 265 395 -426 -655 -612 -218 89 134 116 102 -193 -393 -383 -456 -248 209
2789 209 331 -33 7 -298 329 95 -86 148 362 92 -93 15 14 294 -87 296 -445 -222 297 110 203
2810 203 -138 83 -248 -54 106 -306 -240 -396 406 145 -86 254 -165 -44 -357 -152 -19 -468 -246 -42
2830 -42 -485 230 -113 -373 210 239 261 163 -221 -162 -305 -164 105 345 427 159 -42 312 -167 35 -170 -423
2852 -423 -92 -499 135 153 616 -346 -116 -75 386 44 479 139 590 32 -164 103 88 120 43 -318 -283 -138
2874 -138 -514 259 174 -30 199 65 -373 381 338 77 -329 -385 477 465 385 227 60 244 189 252 353 -179
2896 -179 158 -120 171 507 134 259 -305 366 7 -50 -81 -260 117 8 -352 -292 -170 225 -40 -146 187
2917 187 -204 339 286 184 -485 -487 223 -37 -191 -493 271 -217 128 29 87 307 98 338 38 -330 -179 148
2939 148 17 -48 368 155 -43 321 -149 271 -251 242 -166 265 384 -289 267 -330 -61 -193 -129 156 -139
2960 -139 279 -270 -351 224 48 -383 89 -119 -300 -124 -6 196 -28 -77 46 -97 326 -8 445 205 -175
2981 -175 -159 -264 -201 -124 216 195 3 -133 -28 14 134 53 106 -232 -22 -119 354 -141 -55 -123 201 222 -188 -203
3005 -203 298 -20 -116 -418 -328 -148 329 -1 -143 -53 201 197 35 -135 -273 -26 -374 -39 104 -53 71 173
3027 173 -117 131 -225 372 20 -208 -142 125 -107 240 100 14 133 -85 -89 40 117 65 6 -93 -110 -297 106
3050 106 99 -150 -141 213 198 214 121 -215 66 -8 -67 357 -121 5 -169 50 191 -72 123 -45 -333 225 -307
3073 -307 -23 102 5 131 -319 164 -168 249 -112 -120 124 159 -178 -372 -90 -153 131 -38 104 -132 -199 308
3095 308 -53 -180 -149 42 28 304 -75 60 -290 -98 59 267 32 -19 213 213 70 -244 -101 93 112 -196
3117 -196 1 42 265 -15 -225 -110 222 92 -209 17 11 -18 -153 7 57 21 -27 -52 -49 -216 105 55 271 -82
3141 -82 -190 351 111 -147 -103 168 125 34 33 82 -26 132 56 -373 365 144 190 -145 -706 -131 584 124 -167
3164 -167 -159 -67 -10 246 39 -34 6 -52 427 73 -86 194 -116 316 95 -154 -261 19 202 387 135 -188
3186 -188 -11 287 -84 -75 -8 -80 180 440 244 -7 398 -316 -195 -228 -293 -322 33 7 67 42 -436 -202 308
3209 308 422 19 1 296 199 -53 -79 355 -95 -519 49 -518 348 455 306 309 -11 490 49 326 72 -305
3231 -305 71 -25 127 357 306 -134 -383 -112 38 -110 -330 -470 113 6 -176 -280 228 76 -86 132 -451
3252 -451 -113 270 97 134 -234 -390 -31 -188 112 102 -381 87 119 425 -190 78 96 268 -420 112 -177
3273 -177 -42 -513 238 64 124 -5 -287 283 431 846 -310 -37 52 -43 87 397 -153 -254 -625 463
3293 463 -494 -68 -6 348 -104 207 -434 -364 -333 402 -250 -434 373 333 -214 162 354 -86 150 -47 60
3314 60 415 -593 68 180 -242 -143 114 262 49 120 185 12 417 -110 -22 -185 -228 -48 260 -249 263 418
3336 418 -250 -187 -24 486 -450 84 -217 2 -564 573 87 254 -346 34 320 -49 188 -497 -282 -102
3356 -102 -224 -212 -1 56 -439 270 -313 -140 -46 -6 79 -371 -21 9 177 108 15 -58 -132 114 -1 214 531
3379 531 211 669 -368 -182 -188 395 512 371 74 -100 210 140 -215 13 82 40 13 -45 -252 -90 163 -130
3401 -130 42 65 194 -192 0 25 -150 -215 206 -144 304 -55 86 -2 387 310 162 -106 -423 23 90 -60
3423 -60 127 -218 -23 150 151 -146 -36 219 -110 389 64 -373 130 -20 -191 -32 -371 205 327 201 -409
3444 -409 -9 -220 276 -524 -22 347 -193 239 180 37 83 -31 136 334 -157 -203 33 129 534 3 39 -243
3466 -243 42 -222 108 214 87 51 143 11 67 223 -202 109 380 -209 -203 168 -22 220 -268 -47 240 257
3488 257 -52 -67 201 55 -13 -43 88 256 -207 -16 -144 -34 -234 183 442 282 179 272 274 73 82 57 -77
3511 -77 172 -1 23 484 318 -98 286 187 809 -88 71 121 -23 61 -4 244 -254 -195 -94 281 652 290
3533 290 167 304 151 236 -141 -272 -71 -311 -142 23 -126 377 -482 118 -78 -88 122 359 4 -447 292
3554 292 -498 -281 -276 12 -146 109 507 363 62 568 -360 -541 222 -210 -57 -104 121 316 489 -567 -290
3575 -290 -203 122 306 22 658 -509 -145 445 837 441 79 264 294 -123 -253 -94 -131 -442 -142 714 598
3596 598 712 161 -330 78 -192 223 175 -336 790 204 972 85 433 401 631 -124 452 -71 166 0
3616 0 -318 518 248 -756 -112 56 -250 -872 -418 82 76 -244 -507 173 820 -171 297 -249 78 182 560
3637 560 833 -832 -544 295 -203 -799 -253 -435 -285 -424 99 -371 397 633 170 53 171 -262 42 -405
3657 -405 294 -204 764 -611 -468 482 -79 416 586 -56 317 -55 142 355 -186 349 -41 -219 -381 182
3677 182 469 -33 -164 -90 232 -215 34 -81 245 -290 124 -198 257 -932 -249 276 255 -8 -575 -173
3697 -173 -926 -530 -136 515 -239 533 114 -17 -338 -172 -100 509 660 632 373 131 256 -847 398 -432
3717 -432 -99 -163 128 376 -137 313 -152 -496 -444 177 -585 42 -531 -487 68 500 95 -185 29 -52 270
3738 270 -26 -73 -94 -84 164 13 -109 500 256 110 75 -336 145 311 -56 60 171 733 41 264 -252
3759 -252 -708 -121 -68 -132 -502 218 -132 -122 73 11 808 329 -398 -457 -6 278 510 504 177 57 153 468 422
3782 422 273 -554 -215 104 184 203 882 360 369 83 417 458 -74 -1379 -467 -159 -189 297 227 -363 -830 428
3804 428 -479 164 160 357 -334 60 -603 4 -96 601 725 -758 314 203 -405 265 -232 -359 576 175
3824 175 94 -1013 -480 575 -264 581 460 208 84 428 -26 -291 62 125 -263 -248 -185 871 -173 356
3844 356 317 199 76 437 135 228 395 -131 532 392 -288 461 366 294 -412 -474 -40 -68 -260 -1016 -112 -3
3866 -3 -281 194 373 -390 425 -464 766 7 812 182 -445 -404 -237 -278 256 176 236 -70 -262 933 -747
3887 -747 11 412 -315 96 -611 -229 -27 -314 182 562 29 -518 -178 215 -577 205 -247 167 -279 -523
3907 -523 -222 22 -359 -49 376 -290 -175 828 -228 367 946 -172 152 116 79 -109 -37 -331 279 355
3927 355 -159 -261 -328 -121 -333 -726 -37 -382 64 -369 -112 -390 533 8 340 159 500 36 4 -43 -103
3948 -103 289 -104 -723 -51 910 516 -381 88 897 261 10 -617 -81 503 -357 259 440 -385 -444 -505 30
3969 30 187 483 103 356 639 -37 -119 88 -348 -158 437 -269 -709 245 198 -36 567 224 110 56 -370
3990 -370 48 833 374 73 197 -295 -358 -74 -458 -17 520 100 253 360 -15 277 273 126 -364 225 74
4011 74 -310 -281 -870 -24 -620 309 -106 138 46 -7 1775 -729 -1403 -248 -396 -481 326 -451 -269 -452 -542
4032 -542 566 -85 -96 291 -260 170 -43 436 380 196 -76 165 -71 290 88 967 301 52 22 36 194
4053 194 -491 617 473 -377 -227 243 247 128 275 489 -354 368 188 -185 190 55 569 -332 529 180
4073 180 -290 -205 277 -18 -102 477 521 -556 -313 331 -567 403 -264 681 -356 -221 40 -238 -293 211 -383
4094 -383 1209 -852 111 -656 -838 -66 110 44 239 -419 198 27 123 -19 484 1271 -82 -40 -270 775
4114 775 -963 -394 155 -68 677 304 -376 -333 -269 -499 568 -1105 -218 46 -166 -868 64 699 183 -284
4134 -284 252 294 -137 139 85 10 -348 50 481 -566 -198 338 -292 -286 -237 361 -333 175 356 242 -40 -76
4156 -76 505 -452 630 -185 319 89 -414 -495 -430 82 112 580 338 -588 115 240 59 -83 461 -676 -551
4177 -551 -274 380 -20 -16 214 -71 -162 -35 -349 -239 -50 -214 112 -199 290 -149 -128 -848 62 10 -128 407
4199 407 217 -224 -448 186 -177 121 251 91 557 409 602 146 682 -177 -569 357 407 77 -85 109
4219 109 101 328 -58 -159 -115 -177 137 -157 142 -221 145 -674 -615 -21 -117 -127 233 272 -245 372 -11 7 186
4242 186 -381 -118 -245 -42 -404 -483 80 -366 441 250 -131 603 332 -12 291 -462 -951 -348 -191 372
4262 372 226 -126 397 368 109 -616 -149 799 -129 406 99 -411 -282 78 -290 404 296 -228 -23 484
4282 484 273 -96 -67 -240 -172 46 -137 -323 460 -8 -48 -173 349 532 -154 -360 43 830 465 37 494
4303 494 -223 366 339 25 276 167 922 360 -566 15 352 -294 -244 462 135 9 -594 -74 440 -147 274
4324 274 -203 673 -323 -578 521 131 199 30 -173 191 -184 -208 708 381 -37 -226 -707 -149 546 214
4344 214 24 377 -151 605 -507 -74 452 -30 430 -429 -194 280 -513 25 -450 734 223 -741 -484
4363 -484 -440 165 66 539 -657 572 517 -113 -540 -141 146 369 -881 391 -366 -140 -85 -150 -192 -301 -256
4384 -256 111 628 -662 343 182 117 -469 101 599 -111 366 -367 162 167 284 270 623 -11 -666 174 204
4405 204 -121 610 251 196 303 242 283 178 -227 -406 -476 85 -289 -260 247 -196 -127 -250 -9 -613 -279 823
4427 823 -13 -368 158 -180 68 168 360 76 4 351 504 44 -348 54 -91 -323 -34 582 75 725
4447 725 -274 -69 -4 -211 -322 -10 607 -316 3 26 449 -354 -592 331 -195 -525 -111 438 318 639 -264
4468 -264 96 -818 -480 34 519 333 106 -302 -100 -121 -405 219 319 -636 -19 -118 36 257 134 17 58
4489 58 -225 -155 -193 585 -252 -137 -242 -594 73 -507 119 919 70 569 861 81 945 375 -68 -227 -390
4510 -390 450 -629 -264 255 -523 402 -492 855 785 -23 58 104 -445 -438 453 128 -528 -142 218 363 -552
4531 -552 -96 100 -243 157 145 367 220 204 -119 -81 -173 -106 -134 329 193 -274 -377 -575 -117 98 28 -454
4553 -454 -232 -277 -406 -309 14 12 -59 -146 97 -37 109 -188 -184 70 -456 184 -147 -399 -97 -193 -83 657 -76
4576 -76 230 -77 370 631 356 77 -11 -127 -205 -4 -24 129 -60 198 31 432 -118 41 -128 405 -196
4597 -196 -191 13 -488 191 93 -56 123 218 177 -243 -192 -147 413 4 -608 -20 -382 381 511 -359 373 -13
4619 -13 -122 284 -619 434 268 -12 250 341 -342 11 162 -377 446 -351 -7 -23 52 472 277 357 -224
4640 -224 -249 42 -342 -443 120 -635 3 -280 5 354 123 171 -400 -337 -627 179 -125 59 -57 -102 362
4661 362 222 -323 362 -73 618 452 -4 633 492 196 -326 341 -196 -73 -81 57 153 497 -482 22 456
4682 456 -363 88 467 146 198 -336 30 -138 234 32 -206 -258 -71 -243 -263 686 333 -48 1 -31 -204 353
4704 353 -68 188 36 89 174 -902 348 -83 80 -156 -252 395 -159 472 -165 182 -115 19 -42 -358 -721
4725 -721 33 429 -83 -245 -668 -203 -195 -503 771 -468 441 -162 -664 43 -533 351 -375 954 45 358
4745 358 -322 199 -85 -588 -98 79 -91 627 -114 -784 545 -306 -130 481 -86 -63 -210 260 125 -262
4765 -262 219 303 -411 -536 368 -583 553 171 -344 -190 -348 58 135 -119 53 691 5 -383 133 890
4785 890 28 587 -176 34 168 139 -791 94 -1045 -580 -413 249 89 172 54 351 38 -607 -55 -211
4805 -211 -832 -169 203 -541 473 493 -97 147 517 -554 99 -245 531 262 170 96 177 122 -183 153 389
4826 389 -318 -246 -388 162 628 -38 545 91 302 -259 -7 -147 -123 370 -66 -573 -408 -217 -215 496 -124
4847 -124 246 267 177 262 14 -436 867 29 -628 -281 -87 222 -107 -263 148 -60 -655 -69 -151 117 13
4868 13 290 -208 -78 818 472 2 169 612 -148 157 178 34 -154 -178 243 -99 -60 1059 -131 -37 -136
4889 -136 -669 449 -347 267 -322 186 -367 545 115 270 -205 -457 64 323 509 130 -468 88 162 -339
4909 -339 380 78 -28 389 -204 -147 -288 543 -479 -110 166 44 -627 167 78 154 380 132 -328 379 851
4930 851 -282 131 -107 696 -89 -253 194 -325 319 447 305 663 -292 -434 -63 -666 -429 -646 -87 14
4950 14 -150 497 88 -257 -411 -211 28 460 223 391 -192 521 87 131 -35 187 359 124 318 -54 517
4971 517 286 9 57 -188 -84 78 -106 463 458 -319 14 4 -130 -9 -213 223 175 -956 -162 393 -265
4992 -265 6 113 48 126 314 -296 -500 -154 534 -820 -322 563 -146 315 -109 235 -252 90 102 -359 158
5013 158 4 15 -517 -176 351 -823 757 901 -555 31 -116 -159 -226 70 231 247 -11 -377 -205 -351
5033 -351 -65 41 118 945 -214 152 242 295 527 467 125 -620 -176 462 -262 7 199 -22 18 -1 -187 -437
5055 -437 410 346 251 -252 86 65 159 213 212 299 21 36 -233 -189 55 222 162 178 -203 -69 -406 375 283 255 127
5080 127 206 40 -62 -199 -103 -91 -103 -193 -46 487 -239 67 -294 -379 38 398 -570 -444 87 152 -8 -476
5102 -476 -437 -536 248 -108 3 86 107 -398 582 46 97 -561 -475 396 92 -199 -277 -33 101 -259 239 9
5124 9 109 227 460 -252 -267 -293 -497 61 38 117 -63 -321 379 -165 -102 90 -348 1 53 -290 31 -87 -84
5147 -84 159 404 114 -275 143 253 -594 -613 398 -100 -179 698 -193 88 135 -345 85 -2 388 -568 402
5168 402 288 98 195 99 -73 -857 -131 -408 -362 -700 12 -121 237 -171 -189 -203 58 217 -254 251 -293 169
5190 169 157 179 -760 339 512 109 403 -93 -233 -182 228 561 344 -29 -339 93 -530 -486 57 -186 395
5211 395 -777 -64 -147 -219 -69 105 -881 216 -564 -84 -578 293 -31 572 16 -109 134 -224 99 -280
5231 -280 -145 -48 144 -977 110 -403 -86 -511 292 -237 -131 564 283 -399 -672 138 375 -330 -499 -926
5251 -926 -709 555 327 419 211 -248 265 273 -153 347 437 410 524 -703 -418 238 215 -996 132 203 403
5272 403 117 -411 -549 -112 372 310 142 -215 221 53 -24 638 299 115 225 841 1081 702 -611 -672 -695
5293 -695 -835 -126 268 356 -288 198 165 820 -292 380 203 280 128 71 197 -362 244 557 223 135 -403
5314 -403 -39 -322 448 383 468 -58 264 119 39 894 -64 21 -41 -69 -203 -204 -61 -545 -304 444 73 -69 297
5337 297 -151 612 -309 -64 -28 -352 -99 -294 201 -310 -111 -33 -345 75 -76 -63 -68 103 16 -329 237 20
5359 20 451 513 -229 142 214 284 137 52 -13 234 94 -64 207 212 -90 -428 -151 110 184 -73 661 146 295
5382 295 -4 -126 508 714 64 166 131 339 35 -5 -169 -597 82 -235 -305 -518 -195 -8 -110 -206 103
5403 103 -180 -345 563 230 85 196 -110 -6 87 -250 -240 200 -56 -47 -183 -159 637 383 458 31 -96 644
5425 644 115 570 -45 -171 -22 104 -476 201 -106 104 -107 25 -87 -145 -373 -90 -207 -1 -240 -6
5445 -6 -815 -453 -218 87 377 -211 -3 350 90 -256 577 962 325 305 -530 -351 -14 -287 101 69 -87
5466 -87 -211 -212 -18 34 -315 -66 -372 -190 -277 109 400 382 -379 511 100 -447 230 323 152 -41 -191 -65
5488 -65 173 199 123 -9 183 -112 566 -243 -166 -342 198 392 168 -35 148 112 638 184 161 -331 -221 132
5510 132 -301 271 -476 275 11 -93 46 103 -506 245 461 -565 382 353 278 -166 -250 -188 188 -154 62
5531 62 440 561 -148 177 -241 1 5 -401 273 -231 379 -286 -273 -35 183 247 -69 51 -33 245 -148 97
5553 97 204 267 -417 172 165 -363 470 491 -325 -195 -514 -40 -32 -397 33 -287 -138 401 -58 -295 -433 143
5575 143 -289 51 -240 174 -214 522 104 -55 -109 -315 90 -440 112 58 375 898 337 282 110 -120 250
5596 250 149 160 17 -291 -166 611 -466 399 -245 -544 -224 610 135 122 122 -544 179 2 -32 88 -24
5617 -24 17 -221 -204 -199 -171 -314 152 -21 -504 357 -135 116 -92 225 -577 -427 -462 510 -131 -361 -268 -31 -445
5640 -445 -57 -272 50 87 -71 -226 -259 48 241 392 235 266 247 102 138 167 552 45 198 -27 -182 -152
5662 -152 -508 -125 45 -188 -28 129 -145 -153 270 179 53 -438 -461 -228 282 -177 213 382 186 -126 323
5683 323 -54 174 249 -319 442 697 -263 209 141 99 -564 -82 56 338 -243 73 271 -45 -193 103 -291
5704 -291 -201 12 203 331 295 -15 181 159 198 143 155 151 28 64 353 14 80 533 121 -120 -133 140 215 -68
5728 -68 -22 -134 -187 3 -299 45 -120 -264 118 -56 104 341 325 -375 118 -131 340 -97 -44 914 -129
5749 -129 -88 -103 485 695 211 -186 192 -125 -75 323 302 230 563 -297 16 112 -85 182 -92 69 66 -126 225
5772 225 -104 -255 317 -112 -110 -24 -101 -237 -120 302 478 -390 -225 43 -45 192 174 191 -32 456 -54 50
5794 50 -141 -203 642 36 -207 -30 263 -36 328 -298 54 588 -178 -254 -250 149 -224 -124 194 81 -36 428
5816 428 90 568 512 345 22 -254 211 -529 -34 225 114 -89 86 28 13 80 177 -17 2 138 -13 61
5838 61 -47 -470 197 -219 -26 30 -264 292 634 -286 539 450 220 -475 -66 -80 -10 -177 -269 463 -1053 169
5860 169 296 -424 -784 111 211 -19 -128 -99 103 522 -21 237 122 -102 357 283 -106 127 160 -209 312
5881 312 -150 -164 -266 626 426 300 -88 -195 413 -116 112 -21 149 -323 215 -296 -41 28 190 -34 68
5902 68 -21 -693 -167 148 350 -149 151 -68 -61 460 -125 -40 60 -129 -295 104 -284 -191 49 -433 -306 -207
5924 -207 -278 58 -105 257 451 -476 -179 -94 236 -546 248 -35 -277 -88 -543 565 -732 237 -301 82
5944 82 298 -2 332 -60 -224 136 327 4 -60 286 43 -491 -39 -633 23 84 12 241 27 -546 -320
5965 -320 -106 208 215 -105 67 -127 -113 -473 -401 -17 478 495 -67 152 -87 -355 -272 -72 442 306 -373 199
5987 199 79 261 -203 -95 262 374 -14 34 -2 -18 203 340 343 166 112 183 244 -355 374 24 -279 -305 478
6010 478 85 444 89 226 143 -258 325 2 -224 -99 -329 -224 150 -117 469 -227 -162 -56 308 57 -294
6031 -294 233 -70 -87 -9 -827 138 -215 418 316 -166 38 -75 -180 -306 343 -227 -61 -69 -103 -257 125 -244
6053 -244 116 -175 -20 351 -396 -303 -447 -563 -138 352 -647 21 210 623 418 43 18 -551 -342 -271 -311
6074 -311 -344 -194 -285 -733 547 86 199 417 275 291 21 178 264 214 599 -531 233 373 -181 -175 -34 -170
6096 -170 337 -237 -638 122 306 -317 115 -194 -235 706 -313 316 -210 -434 -216 143 625 50 -133 227
6116 227 -776 648 -749 -492 334 -139 239 -225 -17 308 338 268 -482 -330 -550 -312 -354 11 22 327
6136 327 608 108 -17 135 363 -503 -13 775 -514 736 -355 922 -69 277 -114 588 -151 -457 314
6155 314 573 287 -177 139 267 -215 -465 86 -77 90 515 73 318 51 64 38 -226 -118 619 -89 265
6176 265 -680 -334 -374 -242 -134 46 -527 -116 472 -107 -34 222 -124 -711 43 256 -431 775 -142 93
6196 93 252 266 376 140 -225 -121 581 -136 -319 -64 271 -533 870 -641 -299 353 -241 340 196 142
6216 142 -759 -211 62 -418 101 -427 -113 -427 -155 744 -279 288 307 -520 -502 14 -304 -706 -31 -490
6236 -490 0 -172 118 -277 372 -102 466 -41 -599 -78 377 154 368 82 -47 -47 -424 250 55 224 372
6257 372 590 -85 -235 121 -528 278 664 465 518 299 -418 224 201 -462 -254 46 -431 -552 605 191
6277 191 460 -85 116 265 -736 -108 311 619 -74 -194 -306 596 -49 687 -185 -145 381 488 134 -469
6297 -469 561 34 -2 363 527 -109 111 431 208 -5 -252 -338 -44 -286 -463 59 -286 175 504 296
6317 296 -40 -315 -135 -614 -30 375 -177 -252 -63 256 155 -131 137 242 -67 90 199 4 75 -353 -17
6338 -17 -507 128 150 438 409 -132 -133 -334 348 128 166 -13 233 174 -247 35 197 46 -19 -222 -378 23 85
6361 85 636 -256 -123 -27 -364 328 123 76 199 1013 2 67 -379 119 -617 504 -255 -754 104 -273 -821
6382 -821 -442 -599 -284 -324 5 -613 -70 87 -155 642 -626 404 442 -294 455 -179 360 385 -140 155
6402 155 294 -11 123 86 -89 624 -28 578 -15 -346 -444 -390 -900 -113 -614 38 -763 233 699 -533 617
6423 617 -64 405 -245 -495 473 -101 140 217 -7 102 4 144 169 474 53 86 99 -235 330 47 -329 222
6445 222 -19 -17 233 -960 143 -536 143 -577 6 61 -76 572 54 -956 -231 573 419 -958 -482 -115
6465 -115 322 -113 -287 -66 520 136 26 -14 180 -67 65 -165 -414 1 363 185 -157 583 481 27
6485 27 -288 -346 137 -65 -53 312 632 -155 462 149 -18 403 354 205 -20 -293 -203 446 366 316 -214 -193 -163
6508 -163 -89 -227 -61 -58 240 122 -232 -20 16 -6 156 698 209 23 -260 24 -31 -397 -252 321 494 -82
6530 -82 374 695 206 58 -602 452 -302 298 -130 25 -25 355 -565 30 -429 -182 -40 942 75 342
6550 342 -73 70 330 -30 160 251 -112 -416 -110 -208 163 306 523 -396 -111 478 465 -39 404 -156 637
6571 637 -212 27 -102 -524 192 82 297 -131 -447 -161 73 0 -149 -171 -447 233 296 68 181 77 -382
6592 -382 380 361 44 85 455 334 1 725 214 -647 -122 24 -166 -77 -299 728 303 -256 17 92 -340
6613 -340 159 -383 42 32 -1 -69 -819 -495 -30 424 -129 -58 249 -367 191 -22 358 38 -386 -526 136
6634 136 -96 -375 275 -234 -291 115 162 -52 291 318 249 576 -221 76 504 -61 41 450 248 522 0
6655 0 312 333 127 4 394 -25 293 -361 264 417 147 -58 30 83 113 -513 179 -25 -282 100 -132 0
6677 0 45 59 -522 10 194 -87 -33 -210 502 -108 -414 -607 -407 -87 3 -232 245 552 -41 100 239 -17
6699 -17 131 100 -16 198 422 340 -268 -213 405 32 392 167 -155 168 -110 198 -63 294 210 -395 -6 -480
6721 -480 -125 1 329 -153 -187 168 -27 -321 53 -130 -102 -307 105 97 180 283 -265 180 320 -6 348 -392
6743 -392 -4 -148 -428 -404 -63 353 66 -174 -130 60 -38 439 2 -54 -171 -55 -218 -239 230 -725 105 -98
6765 -98 319 -21 -78 -142 329 655 408 68 175 125 393 33 -430 294 -271 224 367 96 -244 30 33 543
6787 543 88 -9 427 257 400 14 196 -593 -225 574 109 -88 1088 -634 138 430 -110 384 -392 91
6807 91 265 445 -181 92 -169 -290 175 -72 -362 -22 52 274 -862 475 -18 239 144 504 -38 -99 -279
6828 -279 297 413 -42 308 -552 285 -68 -674 193 94 957 130 -1 208 -397 318 -198 251 331 -189 -503
6849 -503 75 -117 898 -110 -177 -192 -295 142 -488 -463 130 -62 -119 588 -322 194 -473 69 -39 398 588
6870 588 79 -186 -1025 -18 610 -59 149 25 -439 637 -738 -531 -176 152 36 -133 -125 -495 684
6889 684 489 267 -45 -446 -587 98 -634 302 -106 549 230 -728 -125 135 -263 -35 361 697 146 150 460
6910 460 316 -227 -276 406 40 -203 305 -48 -259 634 -126 125 236 -82 -151 -57 121 -199 -75 -60 -91 102
6932 102 92 80 1025 -6 -132 -302 -185 122 -53 -442 -291 -260 170 -405 661 180 -491 390 375 87 -99
6953 -99 -382 207 -368 -48 -313 117 -21 -131 134 -208 106 376 -290 -366 -194 -344 -351 -603 11 -97 175
6974 175 -802 60 -115 -483 180 -495 211 116 -169 -701 159 15 -175 -194 -47 -329 424 -32 94 70 -226
6995 -226 -196 -391 107 -70 103 47 -456 -869 -48 164 -135 -374 144 203 1 -511 -193 87 186 594 460
7016 460 -758 391 -91 67 385 577 -21 -333 -140 61 68 -172 -490 168 529 -52 -23 -142 -467 127
7036 127 -146 -305 102 295 249 -320 238 -178 87 -60 10 -554 -90 94 -106 -141 36 282 307 34 281
7057 281 302 -91 -269 -243 239 707 100 243 -1 -188 -85 -712 -316 -303 -148 -167 -390 255 525 -93 -24 -191
7079 -191 -9 -334 -41 251 293 -60 -252 193 -88 158 62 -684 -166 370 294 235 371 -293 716 439 -207
7100 -207 454 32 310 -69 525 -10 -274 475 -61 136 317 -185 67 287 -461 298 229 -190 250 117
7120 117 -142 287 282 249 435 -9 -101 359 -111 598 -137 347 50 93 -32 45 198 -416 -37 -390 -247 -341
7142 -341 -31 -41 -295 -26 78 -380 -462 106 -98 -37 -47 152 71 -579 -275 -56 -99 68 289 -150 204 176
7164 176 -524 -517 -48 254 -211 429 -321 608 -195 -194 111 -155 169 110 -21 35 -12 -493 351 -93 -403 -197
7186 -197 58 101 357 178 390 -215 92 187 -961 -292 451 -128 452 -147 -843 -360 18 409 175 115 103
7207 103 -348 47 263 677 444 255 18 189 147 181 -54 -10 28 85 -182 -620 365 -4 149 -86 49 -634
7229 -634 -144 -306 182 -424 407 -509 291 -173 -180 -72 915 -444 -591 514 135 431 137 29 -253 261
7249 261 27 315 -41 523 -222 337 148 516 516 -781 339 468 44 -45 276 -500 -238 2 177 -298
7269 -298 -616 -309 -29 454 591 410 77 1062 -410 -62 352 445 664 524 329 117 -193 -571 102 -124
7289 -124 -456 249 -220 -214 -41 -169 -192 81 295 -164 499 -288 192 -93 -173 53 159 172 87 -99 -269 305
7311 305 400 -22 -651 858 145 297 -756 883 536 119 -228 -80 -289 645 -686 -809 153 -408 -761
7330 -761 406 657 -125 203 4 210 95 251 94 -128 22 767 420 105 443 214 690 627 215 629
7350 629 319 -330 95 136 -317 -211 -228 75 -175 253 -66 335 110 12 -225 -221 -100 221 68 261 -707 214
7372 214 382 -314 -15 389 263 239 -351 47 -111 -168 -168 99 -436 436 -267 68 94 -362 -119 162 -245 79
7394 79 458 166 325 -452 -548 949 -59 209 306 -515 632 363 -167 -188 514 -530 -90 -46 -200 328
7414 328 667 301 731 717 -289 -92 -196 -485 -681 -16 -733 818 393 -35 286 332 -279 -142 451 -473
7434 -473 189 972 -221 -287 668 255 735 -464 -2 -358 -37 629 254 369 239 257 -837 556 710
7453 710 215 -487 -330 565 1344 926 262 -187 171 645 241 -359 86 -319 261 -606 195 319 393 206
7473 206 -269 913 388 -174 945 -184 -393 115 1213 -23 370 137 -341 487 238 -622 326 -557
7491 -557 -16 -106 437 -244 -848 687 17 151 595 305 -914 -1044 623 -87 -259 -576 878 356 457
7510 457 728 631 -1027 736 487 60 -805 -438 1254 80 -840 466 -491 818 -314 -892 -431 887
7528 887 1152 39 -1 -638 358 170 -610 133 297 -722 423 -90 -246 -15 -31 -105 -383 -678 -79 271
7548 271 362 752 488 -617 -227 -555 -376 354 611 -224 -297 311 569 146 860 375 393 502 -947 362
7568 362 208 792 181 -205 710 738 -194 -70 198 -663 -591 122 277 -550 83 462 -856 -63 493 245
7588 245 103 -12 603 366 709 78 -351 -486 -727 294 -775 541 -245 212 727 884 521 -788 741
7607 741 -294 -378 238 650 -259 157 -654 105 -56 -87 -151 -320 -355 960 110 -496 278 -560 189 2108
7627 2108 483 123 247 483 -177 -349 381 -209 -490 330 -233 -851 230 -303 685 -79 390 -975 459
7646 459 394 -403 -191 -591 360 132 184 30 271 395 -939 -247 444 -168 89 918 214 26 681 48
7666 48 1119 540 177 18 -370 543 -244 1017 579 1046 309 -127 -627 334 -478 836 -669 370 83
7685 83 -535 277 -647 500 588 -114 297 160 268 -68 -627 -79 -413 66 332 371 130 314 -131 22 -793
7706 -793 125 -667 -432 -110 -167 -325 274 210 472 135 -369 -426 -5 -119 -598 -158 214 -96 -425 -84 -481
7727 -481 560 1213 450 718 -324 -475 -85 70 346 283 823 388 -11 425 508 -677 -74 63 588 354
7747 354 43 -240 -16 456 -71 -4 -395 -208 -611 315 527 519 339 -106 291 -430 1363 295 -740 -133
7767 -133 -327 10 562 -309 -111 -233 860 -290 36 20 -685 252 696 168 -511 392 192 -173 -125 -289
7787 -289 195 400 946 554 326 -105 -735 -1126 -143 -589 722 1058 70 482 106 1533 559 596 77 454
7807 454 297 190 982 124 252 125 1811 -395 1200 447 -307 -261 361 -590 767 16 1179 -342
7825 -342 1091 -39 42 497 325 784 -1015 -366 -396 317 885 173 144 859 293 154 158 833 -115 -167 248
7846 248 -205 216 790 -35 -1081 -74 722 345 604 -370 110 -859 606 274 63 -221 -273 -660 -517
7865 -517 -223 352 -156 833 430 1117 159 560 451 588 -367 528 -283 362 274 -324 242 -475 37 -429
7885 -429 319 -775 580 -452 111 439 -16 -281 -323 455 -68 -112 1061 66 -369 -19 -149 151 -31
7904 -31 -235 1039 916 -108 -618 656 -577 95 132 -530 -462 -514 290 -515 408 548 -206 -357 492 -595
7924 -595 0 -53 -341 -324 283 858 -783 -266 -152 494 -986 -245 529 287 -107 -194 453 -457 -302 -280 973
7945 973 -162 -547 -26 582 -39 -218 341 -281 114 600 -528 559 221 -387 -231 -156 30 221 -598
7964 -598 -943 -449 841 548 808 -72 -794 220 454 -62 1132 -603 220 -49 806 -145 1122 214
7982 214 -939 -220 -435 -411 -339 -466 -713 822 -1052 289 7 920 -429 -14 843 650 -391 -194 -1
8001 -1 1102 204 -446 367 693 518 308 -580 507 -187 -372 123 268 -153 528 -304 -382 -119 112 323
8021 323 143 527 -495 -177 -408 -617 -74 528 263 56 788 231 -3 749 679 378 750 612 778 -209
8041 -209 501 -649 -5 -141 -614 -382 -205 -17 -206 994 -287 -411 -735 -897 44 406 523 -94 39
8060 39 395 -394 -271 128 344 -28 -21 6 233 -365 -856 -299 -155 -464 -134 -1196 522 153 -215 -71 -1002
8081 -1002 -558 -322 -239 -198 916 217 496 -212 317 494 243 261 472 112 85 86 389 555 -258 -89 0 -71
8103 -71 -22 168 161 239 -464 -909 -372 -33 231 110 922 -255 44 271 297 -101 232 289 -134 -241 383 529
8125 529 -503 -119 290 479 -58 8 470 -91 146 -241 -480 90 -163 276 -575 361 -78 301 -214 -68
8145 -68 496 -152 -400 -138 51 -237 287 64 908 -215 -149 -257 -92 87 -301 659 -170 -31 249 124
8165 124 -744 21 267 -436 -140 261 272 470 -363 123 286 174 -82 -152 -157 -113 -534 230 -400 -8 166 -499
8187 -499 -537 -715 379 194
8191A94
##END NTUPLES=NMR FID
##END=
