##TITLE=1H_IAMT-146
 CDCl3, 8 sc, 
 8.06.2021
##JCAMPDX= 6.0         $$ Bruker NMR JCAMP-DX V2.0
##DATA TYPE= NMR FID
##DATA CLASS= NTUPLES
##ORIGIN= UXNMR, Bruker Analytische Messtechnik GmbH
##OWNER= root
$$ XWIN-NMR		Version 3.5
$$ Tue Jun  8 12:36:25 2021 Russian Standard Time (UT+4h)  she@DPX200
##.OBSERVE FREQUENCY= 200.131506
##.OBSERVE NUCLEUS= ^1H
##.DELAY= (6, 6)
##.ACQUISITION MODE= SIMULTANEOUS
##.ACQUISITION SCHEME= undefined
##.AVERAGES= 8
##.DIGITISER RES= 18
##SPECTROMETER/DATA SYSTEM= spect
##.PULSE SEQUENCE= zg30
##.SOLVENT NAME= CDCl3
##.SHIFT REFERENCE= (INTERNAL, CDCl3, 0, 15.7039)
##AUDIT TRAIL= $$ (NUMBER, WHEN, WHO, WHERE, WHAT)
$$ ##TITLE= Audit trail, XWIN-NMR		Version 3.5
$$ ##JCAMPDX= 5.01
$$ ##ORIGIN= Bruker BioSpin GmbH
$$ ##OWNER= she
$$ F:/spectra/data/she/nmr/H-F/1/audita.txt
$$ ##AUDIT TRAIL=  $$ (NUMBER, WHEN, WHO, WHERE, WHAT)
(   1,<2021-06-08 12:34:20.46 +0400>,<she>,<DPX200>,
      <created by zg, POWCHK disabled, PULCHK disabled
       configuration hash MD5:
       00 E9 B6 7A A2 85 ED C7 34 08 36 98 17 FE 4E 26
       data hash MD5: 16K
       24 D4 EF 33 77 BE DF 6A 16 D0 CC C3 07 F2 E3 5F>)
$$ ##END=
$$ 
$$ hash MD5
$$ 6D A7 BE 5E 03 19 93 5C 9C 31 C2 CB 71 16 C0 0C
##$RELAX= 
##$RELAX= 
##$RELAX= 
##$RELAX= 
##$RELAX= 
##$RELAX= 
$$ Bruker specific parameters
$$ --------------------------
##$DU= <F:/spectra>
##$EXPNO= 1
##$NAME= <H-F>
##$PROCNO= 1
##$TYPE= <nmr>
##$USER= <she>
##$AMP= (0..31)
100 100 100 100 100 100 100 100 100 100 100 100 100 100 100 100 100 100 
100 100 100 100 100 100 100 100 100 100 100 100 100 100 
##$AQSEQ= 0
##$AQ_mod= 1
##$AUNM= <au_zg>
##$AUTOPOS= <>
##$BF1= 200.13
##$BF2= 200.13
##$BF3= 200.13
##$BF4= 200.13
##$BF5= 200.13
##$BF6= 200.13
##$BF7= 200.13
##$BF8= 200.13
##$BYTORDA= 1
##$CFDGTYP= 0
##$CFRGTYP= 5
##$CHEMSTR= <none>
##$CNST= (0..31)
1 1 145 1 1 1 1 1 1 1 1 1 1 1 1 1 1 1 1 1 1 1 1 1 1 1 1 1 1 1 1 1 
##$CPDPRG= <>
##$CPDPRG1= <>
##$CPDPRG2= <>
##$CPDPRG3= <>
##$CPDPRG4= <mlev>
##$CPDPRG5= <mlev>
##$CPDPRG6= <mlev>
##$CPDPRG7= <mlev>
##$CPDPRG8= <mlev>
##$CPDPRGB= <>
##$CPDPRGT= <>
##$D= (0..31)
0 1.2 0 0 0 0 0 0 0 0.06 0 0.03 0 0 0 0 0.0002 0 0 0 0 0 0 0 0 0 0 0 0 
0 0 0 
##$DATE= 1623141259
##$DBL= (0..7)
120 120 120 120 120 120 120 120 
##$DBP= (0..7)
150 150 150 150 150 150 150 150 
##$DBP07= 0
##$DBPNAM0= <>
##$DBPNAM1= <>
##$DBPNAM2= <>
##$DBPNAM3= <>
##$DBPNAM4= <>
##$DBPNAM5= <>
##$DBPNAM6= <>
##$DBPNAM7= <>
##$DBPOAL= (0..7)
0.5 0.5 0.5 0.5 0.5 0.5 0.5 0.5 
##$DBPOFFS= (0..7)
0 0 0 0 0 0 0 0 
##$DE= 6
##$DECBNUC= <off>
##$DECIM= 24
##$DECNUC= <off>
##$DECSTAT= 4
##$DIGMOD= 1
##$DIGTYP= 9
##$DL= (0..7)
0 120 120 120 120 120 120 120 
##$DP= (0..7)
150 150 150 150 150 150 150 150 
##$DP07= 0
##$DPNAME0= <>
##$DPNAME1= <>
##$DPNAME2= <>
##$DPNAME3= <>
##$DPNAME4= <>
##$DPNAME5= <>
##$DPNAME6= <>
##$DPNAME7= <>
##$DPOAL= (0..7)
0.5 0.5 0.5 0.5 0.5 0.5 0.5 0.5 
##$DPOFFS= (0..7)
0 0 0 0 0 0 0 0 
##$DQDMODE= 0
##$DR= 18
##$DS= 0
##$DSLIST= <SSSSSSSSSSSSSSS>
$$ [...]
##$SUBNAM2= <"">
##$SUBNAM3= <"">
##$SUBNAM4= <"">
##$SUBNAM5= <"">
##$SUBNAM6= <"">
##$SUBNAM7= <"">
##$SUBNAM8= <"">
##$SUBNAM9= <"">
##$SW= 24.9337051412577
##$SWIBOX= (0..15)
0 0 2 0 0 0 0 0 0 0 0 0 0 0 0 0 
##$SW_h= 4990.01996007984
##$TD= 16384
##$TD0= 1
##$TE= 0
##$TE2= 300
##$TE3= 300
##$TEG= 300
##$TL= (0..7)
0 120 120 120 120 120 120 120 
##$TP= (0..7)
150 150 150 150 150 150 150 150 
##$TP07= 0
##$TPNAME0= <>
##$TPNAME1= <>
##$TPNAME2= <>
##$TPNAME3= <>
##$TPNAME4= <>
##$TPNAME5= <>
##$TPNAME6= <>
##$TPNAME7= <>
##$TPOAL= (0..7)
0.5 0.5 0.5 0.5 0.5 0.5 0.5 0.5 
##$TPOFFS= (0..7)
0 0 0 0 0 0 0 0 
##$TUNHIN= 0
##$TUNHOUT= 0
##$TUNXOUT= 0
##$USERA1= <user>
##$USERA2= <user>
##$USERA3= <user>
##$USERA4= <user>
##$USERA5= <user>
##$V9= 5
##$VALIST= <valist>
##$VCLIST= <CCCCCCCCCCCCCCC>
##$VD= 0
##$VDLIST= <DDDDDDDDDDDDDDD>
##$VPLIST= <PPPPPPPPPPPPPPP>
##$VTLIST= <TTTTTTTTTTTTTTT>
##$WBST= 1024
##$WBSW= 4
##$XGAIN= (0..3)
0 0 0 0 
##$XL= 0
##$YL= 0
##$YMAX_a= 877929
##$YMIN_a= -923868
##$ZGOPTNS= <>
##$ZL1= 120
##$ZL2= 120
##$ZL3= 120
##$ZL4= 120
##$ABSF1= 10
##$ABSF2= 0
##$ABSG= 5
##$ABSL= 3
##$ALPHA= 0
##$AQORDER= 0
##$ASSFAC= 0
##$ASSFACI= 0
##$ASSFACX= 0
##$ASSWID= 0
##$AUNMP= <proc_1d>
##$AZFE= 0.1
##$AZFW= 0.1
##$BCFW= 1
##$BC_mod= 2
##$BYTORDP= 1
##$COROFFS= 0
##$CY= 11.3945322036743
##$DATMOD= 1
##$DC= 2
##$DFILT= <>
##$DTYPP= 0
##$F1P= 15.9154993809931
##$F2P= -4.1035820241983
##$FCOR= 0.5
##$FTSIZE= 0
##$FT_mod= 4
##$GAMMA= 1
##$GB= 0.15
##$INTBC= 1
##$INTSCL= 1
##$ISEN= 128
##$LB= 0.24
##$LEV0= 0
##$LPBIN= 0
##$MAXI= 10000
##$MC2= 0
##$MEAN= 0
##$ME_mod= 0
##$MI= 1.114404
##$NCOEF= 0
##$NC_proc= 0
##$NLEV= 6
##$NOISF1= 3.799351
##$NOISF2= 2.8
##$NSP= 1
##$NTH_PI= 0
##$NZP= 0
##$OFFSET= 15.70392
##$PC= 1
##$PHC0= -11664.33
##$PHC1= 11.40101
##$PH_mod= 1
##$PKNL= yes
##$PPARMOD= 0
##$PSCAL= 0
##$PSIGN= 0
##$REVERSE= no
##$SF= 200.130013532006
##$SI= 16384
##$SIGF1= 3
##$SIGF2= 2
##$SINO= 400
##$SIOLD= 16384
##$SREGLST= <1H.CDCl3>
##$SSB= 0
##$STSI= 0
##$STSR= 0
##$SW_p= 3612.71676300578
##$SYMM= 0
##$S_DEV= 0
##$TDeff= 0
##$TDoff= 0
##$TI= <>
##$TILT= no
##$TM1= 0
##$TM2= 0
##$TOPLEV= 0
##$USERP1= <user>
##$USERP2= <user>
##$USERP3= <user>
##$USERP4= <user>
##$USERP5= <user>
##$WDW= 1
##$XDIM= 8192
##$YMAX_p= 0
##$YMIN_p= 0
$$ End of Bruker specific parameters
$$ ---------------------------------
##NTUPLES= NMR FID
##VAR_NAME=  TIME,          FID/REAL,        FID/IMAG
##SYMBOL=    X,             R,               I
##VAR_TYPE=  INDEPENDENT,   DEPENDENT,       DEPENDENT
##VAR_FORM=  AFFN,          ASDF,            ASDF
##VAR_DIM=   8192,          8192,            8192
##UNITS=     SECONDS,       ARBITRARY UNITS, ARBITRARY UNITS
##FACTOR=    0.0002004,     1,               1
##FIRST=     0,             0,               0
##LAST=      1.6414764,     0,               0
##MIN=       0,             -923868,         0
##MAX=       1.6414764,     877929,          0
$$ Real data points
##PAGE= N=1
##DATA TABLE= (X++(R..R)), XYDATA
$$ [...]
2535c780o486R062J0690l950j2289j857J1885P442r555j1180M566J3336R50j3019
2549d185o665J0375J0657o172j2166J066J2082L631r268p581M481R794P71r960
2563c140o016Q294R729m306j2124L66J1722M402j0342p398N871R936k043r740
2577d789k057P224O469l723q227j052Q442N560o810r837M182J1632j68j1782l767
2592h703J0133P164p290q695K801R185J490p635n453M853P964p05q744l584Q221
2607A002P037o107r425K952J0451J94r604l168P705N133m642n517j68O231L371
2622E445m639n974J747P520J012p243l680O681N452n001o768K891O559q87n244
2637b129l27K514J489K9p67k807m50M679J585n309l251N007N161m256n900K629
$$ plain form
2535 -3780 -10266 -1204 9486 5536 -6753 -8610 3275 10717 1162 -10018 -5452 7884 8834 -4185
2549 -4185 -10850 -475 10182 4010 -8156 -7090 4992 8623 -645 -8226 -3745 6049 6820 -3140
2563 -3140 -9156 -862 8867 4561 -7563 -7197 4525 8927 -1415 -8813 -2942 6994 4951 -4789
2577 -4789 -6846 378 6847 3124 -5103 -6155 2287 7847 1037 -8800 -4618 7014 6846 -4936 -8703
2592 -8703 1430 8594 1304 -7391 -4590 4595 6085 -1550 -7003 -2150 5814 5109 -3635 -7219 1002
2607 1002 8039 1932 -7493 -4541 5910 6104 -3500 -6668 1037 6170 1528 -3989 -4157 2074 5445
2622 5445 806 -5168 -3421 4099 5111 -2132 -5812 869 6321 1320 -5448 -2557 4002 3115 -2129
2637 -2129 -2456 58 1547 1576 809 -1998 -2448 2231 3816 -1493 -4744 263 5424 1168 -4732 -2103
2653b103N945q89m888j297L817J404p87j508j510M46L760R10n564j805N796L720
2669E447n704n500M593O092k719n836O16M635J279k882j874J82K112J863j452
2684H52m256O15N684J246o281k950N998L730m276m076K281L117q56j465k68n27
2700a432Q44L186p69n067M10O168J158o875l447O527M708m822n187K272N158k94
2716B538l290j619R24K869K685l990n931L373Q716j178j0407j729J0682M645r759
2731a471n864O436P462l996o673K72N183L001k557m827j905O466N368n364q739
2746g208L188J1005q30j1278k245J0279M986p991o590M208P568o09o108l388L264
2761a749N790P48o822m610O294Q435n032j0501J992J1559K33r758m178P794O463
$$ plain form
2653 -2103 3842 2953 -1935 -3232 585 1989 1202 -306 -1816 -1370 2390 3300 -2264 -4069 1727 5447
2669 5447 -257 -5757 -1164 4928 2209 -3627 -3011 1624 2903 21 -1853 -1671 441 2304 852
2684 852 -3404 -2789 2895 4141 -2140 -5090 908 4638 362 -3714 -1433 1684 828 -637 -905 -1432
2700 -1432 -588 2598 1829 -3238 -2828 3340 4498 -2377 -5824 703 5411 589 -4598 -2326 2832 2538
2716 2538 -752 -2371 -1447 1422 4107 117 -5814 -2441 6275 5097 -5310 -7039 3643 8288 -1471
2731 -1471 -7335 -899 6563 2567 -4106 -3834 1349 4350 1793 -3034 -4939 1527 6895 1531 -7208
2746 -7208 -4020 6985 6155 -5123 -7368 2911 7897 -94 -6684 -2476 5092 4483 -1625 -5013 -1749
2761 -1749 4041 4789 -2033 -6643 -349 8086 3054 -7447 -5455 6104 6337 -3421 -7599 195 6658
2776F658m101o461q23N719M714k958p893n95Q842M327q395q129O922J0998m314
2791D511j1423R7J0867L236q205n336L721O239J121n885n003L920Q301q90r901
2806d630l310R688P206q050j0009M960J1142j043j0040k577P856M867l936o636
2820d512m72O356M813m463q583J234J1389K289j0879o340R321R093o735r877K530
2835d836R634J480p828m464M584O563o52p012l796N509P841l257r872n69J0600
2850C925M254r398p198P133Q490l452q331q85P191M529m602o931J143P493L332
2865F693o570p158M253R510j148j0328k233R292N654p321p211L202Q015J267o958
2880a041n292M318P581l73r195l169Q176P411o231j0123K656J1622J039j1050
$$ plain form
2776 6658 2557 -3904 -4727 992 5706 2748 -5145 -5740 3102 7429 -966 -9095 -2173 8825 4511
2791 4511 -6912 -6815 4052 7288 -917 -6253 -2532 3707 4828 -1057 -6060 -2140 6161 5271 -4630
2806 -4630 -7940 1748 8954 904 -9105 -4145 6997 5954 -4086 -6663 1193 6060 2124 -4512
2820 -4512 -4984 1372 6185 1722 -6861 -5627 5762 8051 -2828 -9168 153 9246 2511 -7366 -4836
2835 -4836 4798 6278 -1550 -6014 -1430 5133 4481 -2531 -6327 -818 7023 3766 -6106 -6675 3925
2850 3925 8179 -1219 -8417 -1284 7206 3754 -4577 -5462 1729 6258 1656 -5275 -4132 3361 6693
2865 6693 123 -7035 -2782 6728 5580 -4748 -6981 2311 7965 644 -6567 -3365 4650 5917 -1041
2880 -1041 -6333 -2015 5566 5193 -4002 -7171 1005 8416 2185 -7938 -5282 6340 7379 -3671
2894c671m671P934P983m142q898m41Q455M534n560q514J792J0647K329j0819o982
2909a0024R620J0160o084j2271J798J2177L007j0217o537O581Q629k474q886k532
2923g053P915O899m639j0288N76J1741L573j0397q224Q137R813l291j0635j287
2937g160R804N549p297q512K921J0040K130r617o740O813J0570k573j2205j860
2951h137J1378O063q541r700N014J0735l05j0215m369P433R181l502j1086j506
2965g557J0378O838q553j0551M443J2774k04j2653m402J0869Q754p049j1403K134
2979f182J1515K839q986p653N412J0038m93j1365l680J0348P471o725j1287K962
2993e786J2083J641j0607o285P779R058l343r778j240Q765N164o371q168K358
$$ plain form
2894 -3671 -8342 -408 7575 3433 -5465 -5906 2549 7083 1523 -6991 -5199 5448 7777 -3042 -10024
2909 -10024 -404 9756 3672 -8599 -6801 5376 8383 -1834 -8371 -1790 6839 4365 -4521 -7053
2923 -7053 862 7761 3122 -7166 -6590 5151 8724 -1673 -9897 -1760 8053 4762 -5873 -7160
2937 -7160 2644 8193 896 -7616 -4695 5345 7475 -2142 -8882 -2069 8501 5928 -6277 -8137
2951 -8137 3241 9304 763 -8937 -3923 6812 6507 -3708 -8077 -644 8537 5035 -6051 -7557
2965 -7557 2821 9659 1106 -9445 -5002 7772 7568 -5085 -9487 1382 10136 3087 -8316 -6182
2979 -6182 5333 8172 -814 -8467 -3055 6983 6490 -4875 -8555 1793 9264 2539 -8748 -5786
2993 -5786 6297 7938 -2669 -8954 -1175 7883 4540 -5238 -6478 2287 7451 1080 -7088 -4730
3007d730J0156J854r784o421P988R096m121j0271j90R179M488o897p212L496Q373
3022E004N63q314m416O389P941l593r153r76R111N117p934p510M909Q953r85q748
3038c642k607O939O023m128q009M6Q347M002p343o637M568Q394r74q434k823P473
3054A195N473n420p256K392P580J170o378m106L948O437j187o934k202O201N115
3069F028m578o613J755P414J212o668l830M649N692k058o450q22N864L402l710
3084A287n858J561O410J408n810m382M459O109k152o884k65O339K972m963m641
3099d410K062O131N17n813l596M593N277j900o638p36O601L000m909n398L167
3114b052O259o97o290j883N434L572k909n012J4N700K313m591m453K850N362o01
$$ plain form
3007 -4730 5426 7280 -2504 -8925 -937 8159 4038 -6233 -6423 2756 7244 347 -6865 -3369 5004
3022 5004 5567 -2747 -7163 -774 7167 3574 -5579 -6555 2556 7673 -261 -7771 -2862 6091 5106 -3642
3038 -3642 -6249 690 6713 2585 -5424 -5378 2969 6971 -372 -7009 -2441 5953 4979 -3455 -6278 1195
3054 1195 6668 1248 -6008 -3616 3964 5134 -1244 -5350 -1402 5035 3848 -3086 -5288 913 6028
3069 6028 1450 -5163 -3408 4006 5218 -1450 -5280 -631 5061 3003 -3447 -4269 1595 4997 1287
3084 1287 -4571 -3010 3400 4808 -1002 -5384 -925 5184 3032 -3852 -4117 2222 5194 231 -4410
3099 -4410 -2348 3783 4300 -1513 -5109 -516 4761 2861 -3777 -4513 2088 5088 179 -5219 -2052
3114 -2052 4207 3510 -2780 -4663 771 4343 1434 -3578 -3564 2136 4449 -142 -4595 -1745 3617 3016
3130C016n596j979N006M319l031o033J098N880J433m710l780L215M472l65n297
3145b352j584M378L503k867m740R01N428J364n093l282L136M578p63n025q65M341
3161A058K894l194m148J168M988Q37m278l540L276M841j619n039j84M402J902
3176C364l267l262J871L900O1l626k278L033L334r99m172p45L199K594k040l919
3192b952J188L861O95m087j614L177K690j687l255l91L047J881j925l034J064
3207a342L081O19l092j337J514K791j103k883n12L145J261j928k220Q35K253M42
3223A524j575j662J171J741pk215j067K186J254p64j468l41J844P97j027j988
3239a597P37J693l8j277o24P33J179j6r93j213J435J254n39k050l11J744J504
$$ plain form
3130 3016 -2580 -4559 447 4766 1735 -4298 -3200 2680 4113 -597 -4377 -1162 3310 2945 -2352
3145 -2352 -3936 442 3945 1078 -3662 -2761 2667 4031 -1062 -4344 -1208 3370 2607 -2418 -3283 1058
3161 1058 3952 758 -3390 -2222 2766 3603 -675 -4215 -939 3902 2283 -2756 -2940 1462 3364
3176 3364 97 -3165 -1294 2606 2667 -959 -3237 -204 3130 2131 -2041 -2786 413 3007 967 -2952
3192 -2952 -1764 2097 2792 -1295 -2909 268 2958 1271 -1984 -2375 672 2553 628 -2406 -1342
3207 -1342 1739 2358 -734 -2071 -557 2234 1131 -1752 -2264 881 2142 214 -2006 -1171 1082 1524
3223 1524 -51 -1713 -542 1199 1192 -1023 -2090 96 1350 586 -882 -1223 621 1418 391 -1597
3239 -1597 -860 833 795 -482 -1106 -373 806 790 -203 -1416 19 1273 734 -1316 -1627 117 1621
3256A621j177k123N56K302L15j978j650J825K019n12k674k91K449J490j537k343
3272a708L51K774L93k612j389J765K207n92k590l54K211J696j568k239N3K788
3288A186R68k302j988J373L093q24k917n73K686K157k626k434J274K351M57k606
3304g25j197J482K308l70k507q60K001K357j007l623JL775J487l697k827K740
3320f62L675j090m123n77M206J656k825l107J220M029J35l721j878K840L275j325
3336A728m085m69M455J712l821l367K735M298o99m375j130L608K623k436l591
3351b814N07M193J232l654k805K554L876r04m174j106M228J996k705l711J500
3366a787M111K66l773j659K203L130m46m129r37L624L022k955m087R58M695Q53
$$ plain form
3256 1621 444 -1679 -1123 1179 1494 -484 -2134 -309 1710 1198 -1476 -1767 682 2172 635 -1708
3272 -1708 -1357 1417 1810 -802 -2191 -426 1781 1189 -1401 -1755 456 2152 584 -1655 -1602 1186
3288 1186 2154 -148 -2136 -763 2330 1506 -1411 -1984 702 2859 233 -2201 -927 1424 1881 -725
3304 -725 -1922 -440 1868 1498 -1009 -1869 132 2489 1482 -2141 -2140 1635 3122 -575 -3402 -662
3320 -662 3013 1923 -2200 -2777 1429 3085 260 -2847 -1627 2402 2537 -1184 -3062 -222 3053 1728
3336 1728 -2357 -2826 1629 3341 -480 -3847 -1112 3186 2487 -1888 -3018 590 3213 777 -2814
3351 -2814 -2307 1886 3118 -536 -3341 -787 3089 2185 -1989 -3095 1133 3129 424 -3287 -1787
3366 -1787 2324 2590 -1183 -2842 -639 2491 2045 -2084 -3021 603 3625 670 -3417 -2459 2236 3089
3382C089m079k666L442L640k133l943M1L799J893k471l420N20M190J261l702l279
3398c818L069M523j580n412l53N707J967m331l825K520M789n48m593j172L255
3413A98L107j638m216k86M120K445l475m315K270N401l31n358j896M520L398k648
3429A296m670P70M945J458m324l071K338M090L91n124k062L977M303k633n491
3444c807O63N527J580n130l014L559M036j285m496r10M075K971k142m711N6N183
3460B155K084m501m375L187N276p62o459p59N612K763l751m158J173M786Q80l814
3476f63l562K499N373q23n628j664N524L824m279n407J935O520M55o438k400M828
3492I4M216k489m943l83M960K698l668m591J408O215J005o683k966N647M611l244
$$ plain form
3382 3089 -990 -3656 -214 3426 1293 -2650 -2609 1190 3083 612 -2808 -2288 1902 3163 -539 -3818
3398 -3818 -749 3774 2194 -3218 -3571 2136 4103 -228 -4053 -1533 3256 2708 -1885 -3057 198
3413 198 3305 1667 -2549 -2835 1285 3730 255 -4060 -1790 3611 3280 -2078 -3974 546 3944 1296
3429 1296 -3374 -2604 2341 3799 -525 -3596 -1258 2832 3223 -1901 -3963 14 4317 1684 -3807
3444 -3807 -3144 2383 3963 -1167 -4181 -622 3414 2129 -2367 -3277 798 3769 1627 -3084 -3028 2155
3460 2155 4239 -262 -4637 -1450 3826 3064 -3395 -4154 1458 4221 470 -3688 -2515 2271 3151 -663
3476 -663 -4225 -1726 3647 2824 -2804 -4468 1056 4880 601 -4806 -2871 3649 4104 -2334 -4734 94
3492 94 4310 1821 -3122 -3505 1455 4153 485 -4106 -2698 3517 4522 -2161 -5127 520 5131 1887
3508A887o036R84N834J548n360l214L191N052r74n086j647M321M100k903o225
3523d528J107O622J557o209l679N060N010k453o065J07N300K160l887m046K001
3538a943M818O60n023k757L683N103j825o012n91N976K723n180m181K995M992
3553C438j26n378j631M098L591k244n042l0N307K363m697m267L010N600p73o155
3569b936j208N427L472m383m505K046M838O80m681k533K850M659j127n171j585
3584d157N333L260m382m635K535N434j25n471j698M394L405k846l850J40M379
3599A716J363l187l460J900M320M68m939k066M132L422k566m447Q01M773R16l606
3615d60k904K785L056j07l732j586L177L212j930m432L58M565J544l908l125K771
$$ plain form
3508 1887 -4149 -3165 2669 4217 -1143 -4357 -1166 3886 2912 -2174 -3821 500 4600 1697 -4528
3523 -4528 -3421 3201 4758 -1451 -5130 -70 4940 2487 -3578 -3471 1829 3989 102 -3944 -1943
3538 -1943 2875 3535 -1488 -4245 -562 4541 2716 -3296 -3887 2089 4812 -368 -4549 -1554 3438
3553 3438 3312 -2066 -3697 401 3992 1748 -3294 -3324 1983 4346 -351 -4618 -1608 3992 3219 -2936
3569 -2936 -4144 1283 4755 372 -4133 -2087 2751 3431 -1250 -3783 -933 3726 2599 -2572 -4157
3584 -4157 1176 4436 54 -4581 -2046 3388 3263 -2208 -3906 488 3893 1047 -2803 -2663 1716
3599 1716 3079 -108 -3568 -1668 2652 3120 -1819 -3885 247 3669 1103 -3344 -2543 2230 3146 -460
3615 -460 -3364 -579 2477 2370 -1362 -2948 229 3441 1511 -2921 -2563 2002 3546 -362 -3487 -716
3631g16L949j381l995n76L209K110k191k927O65L630J223l075k953K077L841m36
3647B454m387j454M453K260k919l399J763L363Q0l119j808K414K763p99l240r70
3663b545L134K256k342l061J172L487O3l222j554K401K636j431k879Q4K611J279
3679B089j699k314N48K678Q28k802j866K390K189o00l428R8K753J544k487k255
3695b334J468K471k7k449r50J222K314m82k608o86K983J714k665k816J790L020
3711A965m34l055n29K443J435j339j716k13K365J074k302j259O00L054n84k666
3727a161r52K468J997j472k982J035K581j13k178n74J391J137m96j565m72J609
3743B53J475r15k117J96K034N38j804j186J417J857q16j809l56J903P11j505j149
$$ plain form
3631 -716 3233 1852 -2143 -2719 490 2600 409 -2518 -1853 1777 3000 -75 -3028 -951 2890 2454
3647 2454 -1933 -3387 1066 3326 407 -2992 -1229 2134 2214 -905 -2713 -299 2464 1665 -1575 -2545
3663 -2545 589 2845 503 -2558 -1386 2101 2164 -1058 -2612 -211 2425 994 -1885 -1801 810 2089
3679 2089 390 -1924 -1376 1302 2130 -672 -2538 -148 2041 1441 -1987 -1889 864 2408 -79 -2334
3695 -2334 -866 1605 1578 -871 -1821 -599 1715 1233 -1375 -2061 922 2636 -29 -2845 -1055 1965
3711 1965 1531 -1524 -2053 390 1825 486 -1230 -1443 922 1996 -306 -1565 -965 2089 1505 -1161
3727 -1161 -2113 355 2352 880 -2102 -1067 1514 1401 -777 -1351 40 1177 681 -884 -1356 253
3743 253 1728 813 -1304 -1108 926 1464 -340 -1526 -109 1748 932 -877 -1233 670 1381 -124 -1273
3760a273O09J395N59j360j318J209J578q02j796K4J984N82j584j081O68J600l34
3777F60j124n14J262P82n45j470O2J406L85j141r37P83J463m60j570k77J586P94
3795A145r60r28L68O05L33q32k64K90N33J12p02k95L47J190n59j259M03J031R7
3814F55j015l23R58M61p62l11j57Q25n9k97k72k46O40J54k69l14P3N57J06m20
3834a6k28m6Q43m58j23Q3n59N67O29r26j97M04P99m07j015J09J101p6p11m09L26
3855c10P15J38o20n17L94Q07O9r21n10J120O90r72j036O14J340k01j162l13O13
3874f2Q69m65r52j02Q05R67q35j080K44R98M08j226q30J021J457q10j800O29J141
3893C77N87j356l69L22J074J12j292o59J040J563o81j806j47J775R55j192k176
$$ plain form
3760 -1273 -664 731 1290 -70 -1388 -179 1399 597 -1199 -1175 809 1391 -193 -1274 -606 994 660
3777 660 -464 -978 284 1066 521 -949 -887 519 904 -237 -1174 -391 1072 612 -958 -1235 351 1145
3795 1145 185 -743 -375 230 563 -269 -533 -243 290 402 -300 -595 -248 942 383 -876 -473 558 655
3814 655 -360 -683 275 736 -26 -337 -494 331 272 -25 -297 -543 97 251 -18 -332 -259 298 404 -16
3834 -16 -244 -290 553 95 -28 55 -504 63 692 -234 -431 -27 772 365 -650 -541 560 484 -227 -636 -310
3855 -310 405 543 -77 -594 -200 607 676 -245 -755 365 1055 83 -953 -339 1001 800 -362 -675 -62
3874 -62 807 342 -610 -712 93 1060 225 -855 -611 387 795 -431 -1261 -240 1217 407 -1393 -764 377
3893 377 964 -392 -761 -439 635 747 -545 -1204 -164 1399 718 -1088 -1235 540 1495 303 -1873
3910a873J274J713O9j872m56J419J173j136j604J97J614P41j362j564Q28J909
3926A070K53j994r04J832J215r37j989M10J940N13j783j319J312J824m38j982
3942i77p05J983J424j458j763P11J917J3k149j77J069J436p57j652J28J294J068
3959A405j174j606O17J724M38j671j179Q01K548q97k497J1J975J251j841j306
3975a401Q63J747l38j387p65J089J672q89j339o24K235Q14j199j975O06K452j65
3992A396k476r47K064J935j348j932K83J977O54j833j279J052J809l75j876n07
4008a403J858J532j646k022O76J984O45j895j410J264J909n95j802n32J714J160
4024A437r11k271N69K337N26k230j620J818J900p00k180q4J885J004j331j542
$$ plain form
3910 -1873 -599 1114 1183 -689 -1145 274 1447 311 -1293 -1096 518 1259 -103 -1667 -839 1070
3926 1070 1323 -671 -1575 257 1472 535 -1454 -1044 896 1409 -374 -1693 -381 1443 1005 -977
3942 -977 -1682 301 1725 267 -1496 -785 1132 1145 -1004 -1181 -112 1324 567 -1085 -957 337 1405
3959 1405 231 -1375 -758 966 1404 -267 -1446 -645 1903 1006 -1491 -1480 495 1746 -95 -1401
3975 -1401 -538 1209 871 -516 -1281 -192 1480 591 -748 -1372 863 1677 478 -1497 -891 1561 1396
3992 1396 -1080 -2027 37 1972 624 -1308 -1025 952 1606 -227 -1506 -454 1355 980 -896 -1403
4008 -1403 455 1987 341 -1681 -1005 979 1624 -271 -1681 -417 1492 897 -905 -1437 277 1437
4024 1437 526 -1745 -1176 1161 1687 -543 -2163 -345 1555 855 -1325 -1409 476 1480 149 -1393
4040a393M64K094J27j830j401J559K157l59k704o24K580J618k157k409J509K472
4056A703J1k630j328K429J978j280k330o5K577N90k020j689J142K472q4k454j054
4073b032K201J848j433k373M05K676O49k182j828J527K451k56k862n25K225J643
4089B134j663k295P32K379O72k426j572J808K351r48k491l52K370J464j761k594
4105b192R97K659K18k441j169J829K272j252k580R0K362J451k061k478J435K657
4121A797j59k868q12K398J890j839k017J78K515Q05k311j703J627J953k78k044
4137h68q83K154J333j444k096N12K633L11k360r95J644J754j003k108K56J817
4153F57J052j662j607O98J978M91k247j063J529J993r07k458J85K018J259k039
$$ plain form
4040 -1393 -929 1165 1292 -538 -1939 -380 1777 1418 -1286 -1910 670 2288 131 -2278 -769 1703
4056 1703 1714 -916 -2244 185 2163 883 -1447 -1512 1065 1655 -365 -2054 -912 1560 1476 -978 -2032
4073 -2032 169 2017 584 -1789 -1384 1292 1941 -241 -2069 -542 1909 1653 -1209 -1734 491 2134
4089 2134 471 -1824 -1092 1287 1959 -467 -2039 -231 2120 1172 -1319 -1671 699 2163 402 -2192
4105 -2192 -1195 1464 1682 -759 -1928 -99 2173 921 -1659 -1569 793 2244 183 -2295 -860 1797
4121 1797 1638 -1230 -2042 356 2246 407 -1610 -1432 1083 1888 -423 -2126 -499 1454 1176 -868
4137 -868 -1751 403 1736 292 -1804 -1292 1341 1652 -708 -1703 -59 1695 692 -1416 -1160 657
4153 657 1709 47 -1560 -862 1116 1607 -640 -1703 -174 1819 912 -1546 -1361 657 1916 -123
4169a23j464J215J526j60j654q16J643J393r22j533m19K123O02j406j677J305
4185c67J762k10k168k86K045P38j241j584L28J840N65j505j123R21K041p98j986
4202a028j74J894J039j741j459Q67J779j61j626o19J247R91n23j188K7Q72P33
4219I30o43j327K72J634K67j731m66J029J045o01j181J11J133J73o43j056L59
4236f95J539J9j443o82J006J035l75j333J36J202O31j185j205R72J206l36j104
4253f12l21J257N65o49r13J04J176P5q23r94R02J305k60j536l45J258M98m96j116
4272i25M75J140J27r03q53P61J278m44j005n51J251P56r97j173P36Q10n7r89k43
4291h06Q13O82l25j058M74N68N15n20p85K87Q65L9j075p78J289P16p32q09L09
$$ plain form
4169 -123 -1587 -372 1154 994 -660 -1476 167 1560 638 -895 -1314 809 1411 5 -1672 -367
4185 -367 1395 1185 -983 -1269 776 1514 273 -1311 -983 857 1422 -83 -1206 -285 1756 958 -1028
4202 -1028 -1202 692 1731 -10 -1469 -602 1177 1016 -610 -1229 18 1009 486 -702 -675 197 930
4219 930 287 -1040 -768 866 1133 -598 -1064 -35 1010 409 -772 -661 472 645 2 -1054 -695
4236 -695 844 863 -580 -1262 -256 779 404 -929 -793 409 1040 -145 -1350 -378 828 492 -612
4253 -612 -933 324 889 240 -673 -569 607 682 -141 -1135 -233 1072 812 -724 -1069 189 687 191 -925
4272 -925 -450 690 817 -86 -939 -178 1100 656 -349 -900 351 1107 110 -1063 -327 483 426 -563 -806
4291 -806 7 689 364 -694 -220 348 863 343 -442 -155 710 749 -326 -1104 185 901 169 -640 -331
4310c31P18J35l03p34J41R72j57p63k87M96Q80m78q24M6J248j92q51m67Q92M86
4330F27j05p40j28O59M18n71o07o3O13M39o53n59M40N11K29r11p1P18M29q36l24
4351d85L79L39J94n96j52L11N50k95q52M52M40j67j08o20N04K20J18m74p6N45
4371B27n5j86j79n7L63J90l40K91o21L60N8ol46N53j39j33k61K47L11l89k55K28
4393a39P8j08L94k66L05k47j17J96j11k08J4L41O5j81M4j45M2j71J63Rj38K71
4415I1J1L1k39l0N08j28l73N9J9M02j78m75K16P5J60l16Oj20M87O9k36l66M33
4438A06R7k54J61j51L71j95l53J92j37O28J7p84k43P91J78m64n99L27P85j58l9
4459B76p12K27Q76m51o37K15M49J42m81k92M57L24l27m38k35O10N56l27q85L96
$$ plain form
4310 -331 387 522 219 -515 -374 598 441 -322 -609 -113 767 289 -535 -489 759 567 -284 -751 141 627
4330 627 522 -218 -346 313 731 160 -447 -510 103 542 -111 -670 -230 281 510 -401 -472 246 675 -161 -485
4351 -485 -106 233 427 -169 -321 -10 540 245 -607 -155 285 118 10 -610 -106 114 232 -242 -318 227
4371 227 172 -14 -193 -250 113 303 -37 254 -367 -7 51 45 -301 252 113 -20 -281 -34 277 -112 -367 -139
4393 -139 -61 -169 225 -41 264 17 -100 96 -15 -223 -209 132 197 16 60 -85 -43 -214 -51 -42 -180 91
4415 91 102 133 -106 -136 372 244 -129 -70 -51 351 173 -302 -86 -11 149 -167 -161 -281 206 275 39 -327 106
4438 106 203 -51 110 -41 330 135 -218 -26 -163 465 482 -302 -545 246 424 -40 -639 -312 473 315 276
4459 276 -436 -209 667 216 -421 -206 243 385 -96 -388 69 393 66 -372 -607 3 559 232 -653 -257
4479b57O21K27r67p28Q52R54m83q13J92M26J58k72m59K05Q52l51l95l61K36Q03
4499D40p3j204L39R53K07o91o60M02Q16l07p50j5O16O42n09n71q1O90M94q68o75
4520h05K95J028k22o34m84R64P16p02o22o7J132n7p00n90P25M77j2p49j87N94
4540A00M96n96o83K65O93M68r11l59N54O01k86r31j0J128jo08n40M34O09K5n38
4561i0n17O47P62o61n03J3Q53P0o23l82P6P02j6n79j76L60R06m86p85q5P14L78
4583E78o52n65M79N66K71j084l30J142M01r13k58q2O80J79p74l66N99O28J38j002
4603c65j08O09M72l78r63J46R17l5o35j11M18P54j95n53n54R66J27l58q19J04
4623e61Q09L18q27m52O31P36l20r58L78Q05j71j12r89K80Q87Q9o00q67J035R00
$$ plain form
4479 -257 364 591 -376 -1104 -252 702 219 -594 -402 24 182 -90 -549 -344 508 157 -238 -599 -363 440
4499 440 367 -837 -498 455 662 -29 -689 -287 529 222 -528 -543 73 715 206 -365 -446 244 738 -130 -805
4520 -805 -510 518 296 -338 -822 142 858 156 -466 -533 599 542 -158 -748 -23 454 442 -307 -494 100
4540 100 596 0 -683 -418 275 743 -168 -527 27 628 342 -589 -599 529 528 -80 -620 -186 423 448 -90
4561 -90 -607 40 802 141 -362 -349 504 574 -49 -431 -355 347 331 -248 -424 -64 842 356 -429 -514 200 578
4583 578 -74 -639 -160 406 677 -407 -737 405 806 -107 -365 -447 233 412 -362 -728 -129 499 637 -365
4603 -365 -473 136 608 230 -733 -587 330 295 -340 -451 -33 721 526 -27 -581 385 512 154 -665 -561
4623 -561 248 566 -261 -713 -82 654 334 -624 -246 559 388 276 -713 -433 454 543 -57 -924 111 1011
4643A011n72j024k76J142O45j142o30R09Q05j47j296p5P93L21r9p90j34Q74L81
4662F96q91n75L84R64j65r09k48J335J38p16q00L42J053O5r82j22J91J080m96
4681C44r88j56J115P82j001r47Q07O32j36o48k03Q34J44o81m93k1Q79K20n25j062
4701a104N70J430m38q19k23Q34O36q74q75N47Q44j23n67l32P10L52l41o99j7P02
4721B13O03q22r36K77J295P6o51n76P25O75m05r30L6O91M08q10o98P45N59M8q71
4742c48j57N27N14l24p01K92R04k17p27m50P83M81l01o44J99M17L10m24m71m3
4762c80P04M58j046m46Q27O51m23o24k76J160k16n31l55L12O82Ro46k65M29N67
4782E91k12p29k20J033P9m73o74O09K49O7n23k33L26N70k57n24K50K89K5n52l03
$$ plain form
4643 1011 439 -585 -861 281 926 -216 -846 63 868 721 -575 -650 143 464 365 -425 -559 315 696
4662 696 -195 -770 -386 578 413 -496 -744 591 729 13 -787 -445 608 673 -309 -431 -240 840 344
4681 344 -644 -800 315 1097 96 -851 -44 588 452 -196 -399 435 579 -102 -595 -616 263 483 -42 -1104
4701 -1104 -534 896 458 -361 -584 250 886 12 -863 -316 528 405 -162 -494 216 568 227 -472 -489 213
4721 213 816 -6 -942 -665 630 706 55 -521 204 879 474 -456 -420 271 679 -131 -829 -84 475 523 -348
4742 -348 -505 22 536 212 -489 -197 707 490 -237 -687 96 577 276 -368 -169 248 558 134 -337 -380
4762 -380 324 782 -264 -710 117 768 345 -279 -555 605 389 -142 -497 -185 497 506 -140 -405 24 591
4782 591 379 -350 -570 463 542 69 -605 4 253 320 -203 -436 -110 460 203 -321 -71 218 243 -309 -612
4803f12L75N15J97p15n4M19L56o77j01J14O17j40k99m75L06M64k26k88k47M98
4823B7L19l76m11J24K78M73q74R9K28L34O2o39k11P92J56m02j60k89Q11j31k05
4844Ej42J09L50L9p24k8M15M71n55k89J79L53O1r4p26K16R36l78l58n4R2O80n68
4867a0l33L03J98J18l12k68O61l29J27j03j11K51J63l87j16J76O38n88N7o01N56
4888I0J80k73p8j75L25J80j09l55L67j53K01o47J26M75L13l28k35J44K18k32j44
4909a10j65M80K11n01j68J56j52J48rP3Q8L15m59j24l9M25L6K9m15K67L8q4M3
4932H3j27L1Q2k07j47J83k48O38k95q2Q0K09k68qm5L2J4Q4k66J40o6M26l15P6
4956DR1J38k90K4j37L09L4j67L8k51L81k56K1k3J68j14j2p8K33k9L9k35k3J70
$$ plain form
4803 -612 -237 278 475 -240 -294 125 481 -196 -297 -183 434 294 -5 -480 -174 290 64 -224 -471 27
4823 27 346 -30 -441 -317 -39 434 -440 -341 -113 221 283 -356 -567 225 381 -21 -181 -470 341 210 5
4844 5 -137 -28 322 361 -363 -391 24 495 -60 -349 -170 183 244 150 -576 -360 576 198 -160 -214 -122 558 -10
4867 -10 -343 -40 158 276 -36 -304 357 28 155 52 -59 192 355 -32 -148 28 666 78 135 -466 90
4888 90 270 -3 -81 -256 69 249 140 -215 152 -1 200 -447 -321 154 467 139 -96 48 266 34 -110
4909 -110 -275 205 416 -85 -253 -97 -249 -101 -110 -37 51 366 -93 -217 -256 169 205 234 -181 86 124 40 83
4932 83 -44 -13 69 -138 -285 -102 -350 288 -7 -89 -9 200 -68 -76 -121 -89 -75 9 -257 -117 -183 243 -72 4
4956 4 95 233 -57 -33 -170 139 173 6 44 -207 174 -82 -61 -84 84 -30 -42 -120 113 84 123 -112 -135 35
4980C5o0j42J79J5j16j97M08k47K80k05L88m23K32K08k05J4k53N12m88M0K43k09
5002IK98l59J48o0J45n35L01M5N4J30k91j2q7M4j06K51j93J63K17q6m05K37J08
5025A6J99m34n4L21j99J00j49nL34J10k35J91j94Q3K8k62o2J60J68j72J38j50
5047f8K75J12p08K81K6P5K15l53P7l1J53L3k51KK96m3j22m8j98N16j2l86J82J10
5071A33r7j91j62n5K97J51L9k77L37k0R5n74L24OJ82j19n91M35L77j26j92k09
5093b37M26k16J91l05p8L78K1j1m52L61M97l60m34K91m4L83j13p74N14J7n9k05
5115b09J52m0K42L2k69k7Q7l5M66m54j8J67j15J05j42Q5O9J85l58Q7r0K83l21
5138a18l5m9L84J35m90j6L69k11K44k96J02J21L7j54k8m6R7K7k66j33J12M37k06
$$ plain form
4980 35 -25 -167 12 27 -89 -286 122 -125 155 -50 338 -85 147 355 150 164 -89 423 -65 -25 218 9
5002 9 307 -52 96 36 181 -354 -53 -8 46 176 -115 -127 -214 -170 -276 -25 -218 -55 162 76 -329 -92 16
5025 16 215 -219 -273 48 -151 -51 -200 -205 129 239 4 195 1 84 112 -150 -212 -52 116 -56 82 -68
5047 -68 207 319 -389 -108 -82 -7 208 -145 -68 -99 54 87 -164 -162 134 91 -31 -79 -277 239 227 -159 23 133
5071 133 36 -155 -317 -372 -75 76 115 -162 175 155 250 -324 0 6 188 69 -522 -87 290 164 -28 -237
5093 -237 189 -27 164 -141 -219 159 180 169 -283 78 575 215 -219 72 28 411 298 -476 38 55 -4 -209
5115 -209 -57 -97 145 177 -92 -119 -32 -67 399 -55 -73 94 -21 84 -58 27 96 281 -77 10 -80 203 -118
5138 -118 -153 -202 182 317 -173 -189 180 -31 213 -83 19 140 177 23 -5 -51 46 73 -193 -326 -214 223 17
5161A7j21k23N89q2k9n40K16N62n1m31o5M25k37K90l85K12j17J13k35l64N64J99
5183C07k44k35J52k28L17k07m5J24L81J37p25J2K70J57K3m31N1J33L03N7l21J02
5205I0R0r0Q3j34M48n61L5l13L45J84J61k07k03J7J68L6n4k56L01k05K55j86k49
5228b45N11J51n9n87N0M65j63m18J04P3L05j59q5j8M69l47k38P9K46J99k34l31
5250b32J30J21K30k94l83L90K57l7k97j75O6O27m74j81P0L64k4k10N4k60K91q
5272B5r2k3J88K62n88r1J98L17k32n8o6O0K13p0l82J91L43k11rj68J96L1K06k67
5296b7l14N35M8k72j02J59j27N18m45J01l69P81n06j95j00N50m3o3j30p6J85j44
5318c6j03m5L09J47r4j89q4L20O3l49l7m5rL52n44K56K73j5m56L11J00r2j37J08
$$ plain form
5161 17 -104 -327 262 180 151 -389 -173 389 338 -93 -158 267 30 320 -65 147 30 143 -92 -456 108 307
5183 307 63 -172 -20 -248 69 -138 -183 -59 322 459 -266 -254 16 173 196 -235 -184 -51 252 309 -12 90
5205 90 180 90 173 39 487 -74 -39 -352 -7 177 338 131 -72 -55 113 149 95 -161 140 -65 190 4 -245
5228 -245 266 417 358 -229 -179 286 123 -295 -191 -118 187 28 -57 -75 394 47 -191 -112 134 333 99 -232
5250 -232 -102 19 249 -45 -428 -38 219 182 -115 -290 -224 403 -71 -252 -182 182 158 -52 2 -258 33 25
5272 25 -67 -90 98 360 -228 -319 -121 196 -36 -94 -160 -100 113 43 -339 -148 195 -16 -25 -193 3 34 240 -27
5296 -27 -341 194 242 -30 -132 27 -100 418 -27 74 -295 486 -20 -215 -315 235 192 129 -1 -77 108 -36
5318 -36 -139 -184 125 272 178 -11 -95 225 288 -61 -98 -143 -152 200 -344 -88 185 170 -286 25 125 33 -104 4
5342Dl09K31K78Q4J5l65J64k20J11j09L01Q4k75N8L4lL36l44l72L03j78L39l88
5365b21j0L41O1Q9m48K53J82k50j40O1M1Q4j0j37P2K06q5J14j71p4j02K05k23
5388a62J08K43m24N3J76%k07L36k16K81j37J45k72N2k84K49J57j33M7j16M30l50
5410b4r4o4M6M68k02l44J67j49M08q3j2R6m25J54p2J73j3LJ16j27om9J03P3k45
5435a02n2L73j67r2k90M43j50K46K7k3k40K02o05M80J39j21N0j89j11L8M31k13
5457G4l0N8N1l70M05J63n23K02J12j51N4J66j21N3K5p6k56M4J03k34K06M76l47
5480H4m2n9K30k11P8j73q7J04j11J82p7Q5K67j75j18j25M10j11m11K59R8k4j12
5503c9l2o3k2L96k39m6O9J60l02J79n7m91M44K53j75j29J45Jk33M00k17j28J80
$$ plain form
5342 4 -305 -74 204 288 303 -62 102 -118 -7 -116 185 269 -6 52 86 83 419 75 -297 6 -172 167 -221
5365 -221 -231 110 171 260 -188 65 247 -3 -143 -82 -41 43 33 -104 -32 174 89 203 32 -42 -144 61 -162
5388 -162 -54 189 -235 -182 -6 -6 -213 123 -93 188 51 196 -76 -24 -308 -59 98 -35 12 -104 326 -24
5410 -24 -118 -182 -136 332 130 -214 -47 -196 212 129 117 213 -212 -58 -130 43 30 33 149 22 16 -33 70 143 -102
5435 -102 -154 219 52 -40 -330 113 -37 209 236 213 -27 175 -430 50 189 68 118 -71 -182 -144 287 74
5457 74 44 102 153 -217 188 351 -172 30 142 -9 45 211 90 143 168 92 -164 -120 -17 -251 -45 431 84
5480 84 42 -17 213 2 80 -93 -180 -76 -187 -5 -82 3 270 95 -23 -148 262 151 -260 -1 97 73 -39
5503 -39 -71 -134 -156 240 1 -45 24 184 -118 61 4 -487 -43 210 35 -94 51 52 -181 219 2 -126 54
5526E4qK45j23l17K68K9K3K34k21q0L12m30l6J00r7N4L34k15n2j74L59l53J00
5549FL1J5n1Q4M1l06K99j44K63l40K50k65L62k58L1P3J83j51k64J34Q2k23l7N7
5573a28R0l18L90N5k4J23k90K25j30J51j44K65l76k15K29oK78k50l29L35O5Q4
5595H0r9n9o4N61j57j54j41J14O3l03K75k16R9P4j03j64L2M65k13k23K88q4j06
5618c5k26q2K83J62l68R0o8K45J64m13K04M8K17j7j56K39k56j50l6O9J27m1J85
5641A85j93P5k1p9k2L4M3J27L3k98Q9j33K53j12J20k12K75n8l79j16N72j45q9
5664e1o6j05L16r2rj70K25K27k38q8O7j60L04l6n9k39M15l85M02m87j00L12M06
5687C89o60L57n2j20O5L0rL90k52j62K59j1j51l39R1K35J36l86J86K15o60O10
$$ plain form
5526 54 46 291 168 -149 119 148 171 405 184 104 416 -14 -50 50 -47 7 341 126 74 -100 259 -94 6
5549 6 37 52 1 85 126 -180 119 -25 238 -102 148 -117 245 -13 18 91 274 123 -141 -7 75 -148 -185 -128
5573 -128 -38 -356 34 89 65 188 -102 123 -7 144 0 265 -111 -326 -97 -103 175 -75 -404 -69 -4 80
5595 80 -19 -78 -142 419 262 108 -33 81 144 -159 116 -100 -1 73 -30 -194 -162 303 90 -133 155 71 -35
5618 -35 -261 -343 -60 102 -266 -176 -244 1 165 -248 -44 4 221 204 48 287 31 -119 -155 -86 41 0 185
5641 185 -8 67 46 -33 -55 -21 22 149 182 -116 -27 -160 93 -19 101 -111 164 106 -273 -389 183 38 -51
5664 -51 -117 -222 94 2 -7 -177 48 275 37 -51 16 -144 160 124 65 -174 241 -144 258 -229 -329 -17 389
5687 389 -271 86 34 -86 -21 9 0 390 138 -24 235 224 73 -266 -175 60 196 -190 -4 211 -449 161
5709A61l96L64j87J36j60k18M22m08M48j15o3jJ05k92K91j18M64q06K47pL29n49
5731c53M26j65N9j17m0L65m1j40j71j9J55J14N4L9p9k06K14r2J41K04l32J59j06
5754F9J2K1R2k2L0O5k02n8q7J67j89J75P2k92J38J34n9j07k10K86J09k50J57M
5778E5O4L13l80p8K65k23j07j28K66J27j4k20o7l7K36k2o8R0J38k77Ro5R1j07
5802a39O5q2Q0k2JJ04j20K35j25l8j91J86J10o3R5l63M20l06k78M96R4m3J30j05
5826A41j85O4k45J94j06K70j02j25r8R8O8J43k15N5N2M4j68J22j5K04J8k13Nk08
5850b02K7J43p0K92k2o3K3Q2k63L07m68J09j09J51M9P6Np7Q8k0j24J25k96M06
5874A69Kl82O0J87l4J18J09m49L21Nj46K23K2M8l56J95k60L3J79k1J03r0j81m6
$$ plain form
5709 161 -235 129 -58 78 -82 -300 122 -286 162 47 -16 -17 88 -204 87 -31 433 -373 -126 -133 196 -353
5731 -353 73 -92 -33 -150 -190 175 134 -6 -177 -196 -41 73 127 166 87 -119 95 3 144 348 16 175 69
5754 69 81 102 194 172 202 267 65 7 -80 87 -102 73 145 -147 -9 125 66 -41 -251 35 144 -106 51 55
5778 55 119 432 52 -26 239 16 -91 -219 47 174 160 -60 -127 -164 72 50 -18 72 210 -67 -58 -123 -32 -139
5802 -139 -74 -156 -76 -98 -97 7 -113 122 -3 -41 -232 -46 64 1 96 -267 153 -153 -431 65 159 116 246 141
5826 141 -44 20 -225 -31 -137 133 31 -94 -192 -94 -26 117 -98 -43 9 53 -115 7 -8 196 214 1 6 -202
5850 -202 -175 -32 -102 190 168 105 128 210 -53 254 -214 -105 -214 -63 -14 62 67 -10 78 58 -66 59 -237 169
5874 169 171 -211 -151 36 2 120 229 -220 101 106 -40 183 205 253 -103 92 -168 -135 44 23 126 36 -145 -191
5898a91M66k40m08M87R6J34p12N09j48K98j91j72L54j03k82K38j15K16j06l78
5918b48J89J2L8j83J71nJ8l9l3J00j98J33M7j87J16Q6l05N68l72J0J21j18k31
5941c10L33j37K63k5k67O0M3j1K01j78k09K15k56L23k34J44R1j73J21J12j01q8
5963h3K65l12J76p9l3q3r4j46K54nQ2n4N2K74j49k14J25J78j49J47j53J3J16j3
5987A15j37l5k06N8M4K36j30J86Rk0l1Nn9o3j2J08n0q5K40m77L70o0j71K60J0
6012A05l23P06p00K03J4L56j13l63Q3k70K56J25q5o9L67j96j73j96L38k51J18
6033f8o6p2M80k66j03k05K83q7K96k76j1K64k02J01j67M2k38J09M2Q3o6k1j47
6056b95O8L05l73K12O0j21qL25m46L19k37J06K84j58j42J58q8k03K33k22K7K58
$$ plain form
5898 -191 275 35 -373 114 210 344 -368 141 -7 291 100 -72 282 179 -103 135 20 236 130 -248
5918 -248 -59 -47 -9 -192 -21 -26 -8 -47 -80 20 -178 -45 2 -185 -69 17 -288 280 -92 -82 39 -79 -310
5941 -310 23 -114 149 124 -143 -83 -40 -51 150 -28 -237 -22 -278 45 -189 -45 46 -127 -6 106 5 -83
5963 -83 182 -130 46 -33 -66 -149 -243 -389 -135 -140 -58 -112 -60 214 65 -149 -24 154 5 152 -1 12 128 115
5987 115 -22 -57 -263 -205 -161 75 -55 131 140 120 89 94 35 -28 -40 68 18 -67 173 -304 66 6 -165 95 105
6012 105 -218 488 -212 -9 5 361 248 -115 -32 -302 -46 79 -6 -75 292 96 -77 -273 65 -186 -68
6033 -68 -134 -206 274 8 -95 -300 -17 -104 192 -84 -95 169 -33 68 -99 -57 -295 -186 -144 -61 -127 -148 -295
6056 -295 -227 78 -295 -83 -23 -144 -152 173 -273 46 -191 -85 199 41 -101 57 -31 -234 -1 -223 -196 62
6078F2R1k14j21J50p0M3J53j39l5J60j1j81K1N23k95J50l61K39L4J8m52P0L17
6101A52k18K75N4r6n4k16m7JJ16j14J6J15j25M00j62l2o2j93K46j52K64k69j91
6124b92M52j90o0J69m5k17k73P05j88j62k04K18K33j62J63l45K67m24K53J60j74
6145a16K47o0p9p7j79N12k32j88M05L8k07M2q6k09N4M2L64l62J34J65j05k49J34
6168a2O4N0j5k00K45l6k55J63r9k15L63j07L62k95Kn5M9j26J60k30K55k28J52
6191hj47L5K25qk18K03o8n4q0M8R3r6j58J37J18J49l94K45j2L01j77J05k04K96
6215C31l70j95K66J22q8j55j70L70l6j91M61k42k31J19Q4k08J73j54K0M32l69
6236c1Q8N5J21k14J1k00M36j78l61K23J80j30J15P8l58M4o4L12m53K06J86J7j15
$$ plain form
6078 62 153 -61 -182 -32 -102 -59 94 -45 -80 80 69 -112 -91 432 137 287 -74 165 199 217 -235 -165 152
6101 152 -66 209 263 167 113 -103 -150 -149 -33 -147 -131 -16 -141 259 97 65 3 -190 56 -96 168 -101 -292
6124 -292 160 -30 -90 79 34 -183 -456 249 61 -101 -305 -87 146 -16 147 -198 69 -355 -102 58 -116
6145 -116 131 71 -8 -85 -264 248 16 -172 233 271 64 106 20 -189 -135 -93 271 -91 43 208 103 -146 -12
6168 -12 52 102 87 -113 132 96 -159 4 -95 -310 53 -54 308 13 15 -40 9 -117 43 -187 68 -160 -8
6191 -8 -155 -120 105 97 -121 82 14 -40 -120 -72 21 -75 -233 -96 22 171 -223 22 10 311 134 239 35 331
6215 331 -39 -234 32 154 66 -89 -259 111 75 -116 345 103 -128 -9 75 -133 40 -114 -94 338 -31
6236 -31 57 112 233 19 30 -170 266 88 -273 -50 130 0 115 193 -165 -121 -185 127 -326 -120 66 83 -32
6259c2K5o9J92k47L20j64l63N07J24o8j48N6k7J15q7l58K42j51K0J01m3J16j43
6282h2j2l2Q1O8J05rj62M1O4m6m0K23m1k82J67kJ51l02j12j63K85l98M24mJm8
6308a25J69J23K7k97K3pM25o11%M29n8j27L47l80M5M7J06m3k65K45k95K30p2K07
6332A43K0N4j61q1M8J36j06J20r4O7K50m29L26j44k50K23k83J34q7J60K84l19
6354A1p3L1l27K56M64l49K62m73L40j39J14Pn3l78K72L00j83j46K61l26j1nj03
6377b48L75p2j04r6j7N64l19l43L27j08K32k17J93l43L62q7r3R2j12j97J86m06
6399d31K70J37J77q1k10m9M38m5k00j36K01J01k06k8J05p0J59N4j82J04J00L2
6421B40m24P6R1J53k14J93J38k14K86l02j22J93L0k21K3J57q9J08r3j10K48l76
$$ plain form
6259 -32 -7 -76 116 -131 189 25 -338 169 293 225 77 133 106 221 134 -224 18 -133 -113 -12 -55 61 -82
6282 -82 -94 -126 -45 23 128 119 -43 -2 62 16 -24 199 158 -124 43 41 192 -110 -222 -385 -100 -498 -74 -78 -77 -125
6308 -125 44 167 194 -103 -80 -87 338 -273 -273 156 98 -29 318 -62 -17 30 136 93 -172 73 -222 8 -64 143
6332 143 163 217 56 -25 23 159 53 173 79 146 396 -33 293 149 -101 122 -161 -27 -114 46 330 11
6354 11 -62 -31 -358 -102 362 13 275 -198 142 3 117 124 71 -307 -35 265 82 -64 197 -129 -140 -145 -248
6377 -248 127 55 -49 -145 -162 402 83 -260 67 -41 191 -26 167 -176 186 99 6 98 -14 -211 -25 -431
6399 -431 -161 -24 153 72 -138 -187 251 206 6 -130 71 172 -34 -62 43 -27 132 186 4 108 208 240
6421 240 -184 -108 -17 136 -78 115 253 39 325 23 -99 94 124 -97 -74 83 -6 102 9 -101 147 -229
6443b29Q9J14k16M01mj85J35m00N8L64m13N76k60J06oR6k43M24l65j3j50J1K30
6466A20J7j73q6J79M0l58L07l10L35j73R4J30Nl01L66p6k88K74P2k90Q9j86M68
6489B55p1m12jJ97K04k13j73K63n3o7j29k5J23k56O39p52M04L01k57m3r4L32j74
6512bMm4o8J24O8r9m60M51K39o1j34k98J98K93J3j65J32j23j55N9k2K10j1j7Q1
6537B13k59K16nj25J43j28O1r3q0o5J74L16m57n2K08J16l26J26n7K8K9m9j82L92
6561A44j94L9L8j90J70J39p0J74l66K90P2l16O2j58J53J13R9k78J87J10j03l3
6583H2m74J25N7L23O9j50K73k67J71j52J07J52k82N5o4L8K61j43k46J28j12j1
6605f0K06l27O8P6J21q1j41L37k67J74j66j27J62J08j80J02J02l39K81l79j85
$$ plain form
6443 -229 -140 -26 -242 159 155 -30 105 -295 -237 127 -286 290 30 136 130 226 -17 407 42 29 -121 -110 120
6466 120 137 -36 -122 57 97 -261 46 -264 71 -102 -8 122 127 -174 192 116 -172 102 174 -116 -27 -213 255
6489 255 184 -228 -229 -32 172 -41 -214 49 -4 -71 -200 -225 -102 -358 281 -471 -67 234 -23 -66 -160 172 -2
6512 -2 2 -42 -110 14 82 -17 -477 -26 213 152 18 -280 -82 211 224 59 191 68 -87 -28 -50 160 149 132 213
6537 213 -46 170 165 40 183 55 116 23 -57 -122 52 368 -89 -141 67 183 -143 -17 -74 -46 -17 -66 -248 144
6561 144 -50 -11 27 -163 7 146 76 250 -116 174 246 -70 -8 -166 -13 100 199 -79 108 218 115 82
6583 82 -392 -267 -210 113 182 32 305 38 209 57 164 316 34 89 25 63 324 181 -65 63 -49 -60
6605 -60 146 -181 -113 -37 84 3 -138 199 -68 106 -60 -187 -25 83 -97 5 107 -232 49 -330 -515
6626e15P78m78K15j27o0L07J11j89k32L7K22m9j56n1L90mm70M29n07O94n21J93
6648A7J3j15K0R1PJ66K59m32r2o1n6L63k68l58L15J19L24n55M09l16J04Q5n0m50
6672d61N22o6N0j8r4K46O7k68j33K74L2J18k69k73J64K85j63k96K49K02k10j29
6694a71J64o9K66l28j18K71k37L41k61R5J80m5j87K6j24N3M10k40k97J21K01J59
6716B10q6jl25J85J58j78K02j53K29j93J46k84O0n8pq5M72j03j58j12M8L5O7l81
6740c12J07j80O46r0n1q3k04J83j32J79q9nK00k60k5K95j21Q9m90K7L75O4k30
6763a07J19R3K32k97OJ00l19M62j16k83J10J19k68N12o31L57K04l05j47J51Q5
6784G7j10J62l08p3K79J10j29k18R1J51J00k24J68Q0J58l94j4M46j50J33l73k9
$$ plain form
6626 -515 263 -215 0 -127 -187 120 231 42 -190 -153 69 20 -136 -187 203 199 -271 158 -349 345 -176 17
6648 17 30 -85 -65 26 33 199 458 26 -66 -127 -183 180 -88 -446 -131 -12 312 -243 166 -150 -46 39 -11 -461
6672 -461 61 -5 45 27 -67 179 246 -22 -155 119 151 269 0 -273 -109 176 13 -283 -34 168 -42 -171
6694 -171 -7 -76 190 -138 -256 15 -222 119 -142 -47 133 88 -99 -73 -197 -144 266 26 -271 -150 51 210
6716 210 124 123 -202 -17 141 -37 165 12 241 48 194 -90 -30 -88 -95 -180 292 189 31 -81 -33 2 69 -312
6740 -312 -205 -385 261 171 120 37 -167 16 -116 63 -26 -31 169 -91 -116 179 58 147 -343 -316 59 123 -107
6763 -107 12 105 337 40 46 146 -173 289 173 -110 0 119 -149 363 -268 89 293 -12 -159 -8 77
6784 77 -33 129 -179 -252 27 137 8 -210 -119 32 132 -92 76 156 314 -80 -94 352 202 335 -38 -67
6806f7pR3Q9m53K35m5J23J54l16J58K4L8R7l78O5K29Q5k85J35K01R6m37K38J20
6830A92k10n8p0J45J85J48m30r3K31j75L28k69O0J29j64N75p86P5R3P0n4m7K21
6853I6k41K18k34L9J67j81J90K07k45j18Q3p3P8J95l45J85l25K37J96j5k26J37
6875B5J28l8J28l37J92o79P04Q2j06k56K01Q0j43k81M16j05q4P6K2J09j7M0k41
6898h4K29K4k50n2K3k4L8L85l57m21M98J59j19R1k46M1K79j2l64n7R9o0J19j29
6922a90j06L93l9o8J8k28L7L84o5o3J3k40J23k43K80r5l99L11O4j53L57j20ML3
6946HJ11J49n97L20j15k6k0j08M34j16M2p4k04K66O4l04J66k41L00J59k84p5L
6969a42K38o9%k8J23k60J31J14M9j03L11l18r0j42K13K8o2K2j7O7m6l46M00j09
$$ plain form
6806 -67 -74 19 108 -345 -110 -155 -32 122 -194 -36 -12 26 123 -255 -190 39 124 -161 -26 175 271 -166 72 192
6830 192 -18 -76 -146 -1 184 332 -98 -191 40 -135 193 -76 -16 113 -51 524 -262 -187 -94 -24 -78 -125 96
6853 96 -145 73 -161 -122 45 -136 54 261 16 -102 -19 -92 -14 181 -164 21 -304 -67 129 114 -112 25
6875 25 153 115 243 -94 98 -581 123 205 99 -157 44 124 -19 -300 116 11 -73 3 25 134 117 157 -84
6898 -84 145 169 -81 -133 -110 -134 -96 289 -68 -489 9 168 49 140 -106 -65 214 202 -162 -219 -120 -180 -61 -190
6922 -190 -296 97 58 -10 8 -220 -183 201 136 73 86 -154 -31 -274 6 -89 -488 -177 -113 -266 91 -29 -25 8
6946 8 119 268 -329 -9 -124 -150 -170 -278 156 40 82 8 -196 70 134 -170 -4 -245 55 214 -70 -145 -142
6969 -142 96 27 27 -1 122 -138 -7 107 156 53 364 46 -44 -186 27 55 -7 15 -2 65 19 -327 73 -36
6993c6L16k34l61N21l22J20q6K84k06o7O1J5J87j83J03k48K33j97K03r5j52L30
7015A86K41n14L34n18M63j89K77n20K22j58N9O7J67Q8j08j65J6J85n8k23J47O7
7037F6r5n5N8J26J8l36J03O6l06L16l13M62k36K31j5J3m1J90m10L15J2m43L83
7060A09k11J73Ml92K51M0k08L08j5k11K69j56J99k12J61q3R9l9l1J31k54O4P0
7083F6q6N5M9r1O7k68q2J33N04k58M8j51j87L39l9J96k72k92K1J76J14k46N82
7106C78k30k36j45K64J2J39q4o7p1N5k53N19j13j62J24j6k5j68K43j00k05O7N2
7129b2J19J04q8j04n2J21P6J46m91Q6K56p2k82J57L8J06k31O2j17M31o0j58n6
7152c1J34k54J13l44N05R4j49J13k59j3J65L1k22kJ7K76Q4q2k30M0N1k9j10Q7
$$ plain form
6993 -36 280 46 -315 206 -116 4 -82 202 -4 -71 -10 5 192 9 112 -136 97 -100 103 8 -144 186
7015 186 427 -87 247 -271 192 3 280 -240 -18 -176 -117 -50 117 205 97 -68 -52 133 75 -148 -1 66
7037 66 -29 -84 -26 100 118 -218 -115 -49 -355 -39 -352 110 -126 105 90 103 62 252 -158 157 169 -274 109
7060 109 -102 71 75 -317 -66 -26 -234 74 59 -152 117 -39 160 -52 109 26 125 86 55 186 -68 -4 66
7083 66 -20 35 84 -7 60 -208 -290 -157 347 89 137 -14 -201 138 99 295 23 -269 -248 -72 42 -204 378
7106 378 148 -88 -233 31 43 182 98 31 -40 15 -238 281 168 6 130 114 89 -79 164 64 -141 -74 -22
7129 -22 97 201 113 9 -43 78 154 300 -191 -105 151 79 -203 -46 -8 98 -133 -71 -188 243 183 25 -31
7152 -31 103 -151 -38 -382 123 217 68 181 -78 -91 74 105 -117 -119 -102 174 258 176 -54 -14 37 8 -102 -15
7176a5p0J87L9k63R2K01l38K07q3K17j78N0l57L37L56m44J6p0K33j93J6Q3k20
7199a97K57j36J90k17Q9oJ70r0l04J56K38j05n4k4j60K24L8k20l7N9J47j20j48
7222b50L5K06n4M7J22J4O2l36Q2k2J67l91jM60p5pk1j46m6o9K90j00q6L48qm07
7248a86N9KJ45m2j38j56K45K77r8n9k47K6K56j86J1r2OK99m00J0J31K45j00j96
7272a88k55O43J15m68r8LM23l19J28R1n6J30j60K2k21K37K25m62O3K09N3J64n55
7295b76J40J85J12N1o6k47K78J4j88J90J31m34q7j91J88L12p3J16j84P1J71j70
7317D3j72R2j44j36N07l89lK68J89l08J95O0N7j61o4Q0l19M45j72j20O0L21k36
7340I3j0j94J76q2M4O8k48L85k20j00M5M19l02k24J3K19o12P91k06n3j56K77O3
$$ plain form
7176 -15 -85 102 141 -122 -30 171 -167 40 -43 174 -4 46 -311 26 382 -62 -46 -116 117 -76 -60 23 -197
7199 -197 60 -76 114 -103 -14 -20 150 60 -244 -88 150 45 -9 -33 -193 31 69 -151 -188 -129 18 -102 -250
7222 -250 -215 -9 -63 -16 106 120 182 -154 -72 -94 73 -318 -319 141 66 59 38 -108 -154 -223 67 -33 -119 229 221 -186
7248 -186 -127 -125 20 -22 -160 -316 -71 206 108 49 -198 -172 84 -102 -91 -183 -177 122 -278 -268 -137 108 8 -188
7272 -188 -443 200 315 -153 -251 -248 175 -144 -16 75 19 149 -11 11 -210 27 252 -210 -147 62 115 279 -276
7295 -276 -136 49 161 212 146 -101 177 191 3 193 324 -110 -197 -388 -200 112 39 155 -29 42 213 43
7317 43 -129 -37 -181 -317 190 -199 -202 66 255 -53 142 202 259 98 34 114 -205 240 68 -52 8 329 93
7340 93 83 -111 65 -17 27 95 -153 232 12 -88 -43 376 74 -150 -137 82 -530 261 55 2 -154 123 186
7363A86l73Q0J9L42n2j56j87J01k42L80k66j29K47J96k45n1P0J5Q5J64j88J96
7385A92M9k06J39k84K57m0l26J38J42JK9o5k00R4nJ78j86j41J25K86l22kK73j20
7409FK35l45L4k81M24j31P7j44K30l22J3Q4J41J31j54J87k74Q2J0o1N6j33J67
7432C2J26n10J60L23m8K8L9j36J66j59J93k92J58J39l31Oo4K14j63j58K00j47
7454b24K82J77l68J20J17K23j74k51N8j60O5J76N9j99J45J78k95k42J08J05K65
7475A65j94j19J11J05J9O5m1Jj52k7j04RJ68K2J39m64L47J95k19j04K37l27J75
7498Go3m5K4L53m15K52L5J1k60M67j78j11l78M51j11M5j06J12j28l6k03J16J32
7521b9J33l08L46O8m20J15J81M0j04J91k82j70J73J69rk05K49kK09l71j21K9L34
$$ plain form
7363 186 -187 -107 -88 254 202 46 -141 -40 -282 98 -168 -297 -50 146 -99 -150 -80 -65 20 184 -4 192
7385 192 241 35 174 -110 147 107 -219 -81 61 62 91 26 -174 -80 -85 93 -93 -234 -109 177 -145 -147 126 6
7409 6 241 -104 -70 -351 73 -58 19 -125 105 -217 -204 -120 21 152 -2 185 -89 -7 3 -58 -2 -135 32
7432 32 158 -352 -192 131 83 111 150 14 180 21 214 -78 80 219 -112 -106 -170 44 -119 -277 -77 -224
7454 -224 58 235 -133 -13 104 327 153 -98 -40 -200 -135 41 100 -99 46 224 -71 -313 -205 -100 165
7475 165 -29 -148 -37 68 87 152 111 112 -40 -67 -171 -162 6 28 167 -297 50 245 26 -78 159 -168 7
7498 7 -56 -101 -77 276 -139 113 148 159 -101 366 188 77 -301 150 39 84 -22 90 -38 -74 -277 -161 -29
7521 -29 104 -204 142 210 -210 -95 86 126 22 213 -69 -239 -66 103 94 -111 138 136 345 -26 -147 -118 216
7544B16J1K2m74P4L77k71M9q5R0j48k59N21q9L94j1n42K97J95l38K0j71J1K44
7567A33k53K02l40J81K98m16J52M01m78Q2j91QlN70j68o2J33m52J83J80l43N53
7589C70l01r6J81j84J8M7O0r1j08n8J97P1k57J98j30J3K99l90L04l74P5j8K47
7612G3l0J14q3Q9j48%p1J60k3q7k7J23k45J73R3k14Q7Q8j97K24l7J29m2k64l24
7637d39P10k48l52K72Q0K32km76K49J53j92J31P4m55M02m2P1k28k76M07J9K9K0
7660A39j17J79j00j79m9K94j33J34m72J85P3j63L72k46J30J04k84J41q7L63j32
7681A52k46J5K80L0k90J03N1J10j10M3N2J7j79J40j00n47N40Q0m45L14k25N0J67
7704BJ08j36k84R5K60j29j38L38Kl51J43J66Nj8l08L76k59R6k37M6K69J23O6k58
$$ plain form
7544 216 227 249 -225 -151 226 -45 4 -81 9 -139 -398 123 34 428 417 -125 172 367 29 49 -122 -111 133
7567 133 -120 82 -258 -77 221 -195 -43 358 -120 -38 -229 -221 -224 346 178 116 249 -203 -20 160 -183 370
7589 370 69 -27 154 -30 -12 35 95 4 -104 -162 35 106 -151 47 -83 -70 229 -161 143 -231 -156 -174 73
7612 73 43 157 74 163 15 15 -56 104 81 -6 -33 90 -155 18 111 -103 -16 72 -125 99 62 191 149 -115 -439
7637 -439 271 23 -329 -57 23 255 253 -223 26 179 -13 118 192 -263 139 97 168 -60 -336 71 90 119 139
7660 139 22 201 101 -78 -127 167 34 168 -304 -119 -46 -209 163 -83 47 151 -133 8 -79 284 152
7681 152 -94 -79 201 231 -59 44 95 205 95 138 190 207 28 168 68 -479 61 141 -304 10 -215 -165 2
7704 2 110 -26 -310 -215 45 -84 -222 116 118 -233 -90 76 81 63 -245 131 -128 -32 -269 -223 46 169 235 -23
7728b3j49J24K97k14J32l18J07P2J12jl60M09K7l04N0K8j31L1K11m18j22O37l22
7751a25l6K26r5j15K59k37OL13j63l44K91k48J15j5N7RK8P6q9r4K25R6K61l31
7775G0j79K49J15j39k19J28p0L31n10J02J05j4l62M82l26K76k3M0j68n0J91K01
7797B30k04k99J25K97k83J83k30J96J9lj66j12J81K44k68j56K42j05L78m03K22
7818H8o9R2R8k34l9R3K45jo09J36J14M46m00K4K44pL7j17j8j11r9M9k19K94k4
7843A3J00r3m79M25K97k86k77L4N56j13k02k26L27k0o4k71q5J93L26k37r7J09
7865g0K36p1k44k67P12k5o2m34n0L60j9J43k95L24J08om34j36K50J98j9l32L4
7888i9L71%j79j36J21L09l00l73M52OJ24m46N7m8J84k3l02r3J88K53J34m22O2
$$ plain form
7728 -23 -172 -48 249 35 167 -151 -44 28 140 139 -221 188 215 -89 -39 -11 -142 -111 100 -318 -440 197 -125
7751 -125 -161 65 -30 -145 114 -123 -117 196 33 -311 -20 -268 -153 -168 -111 -102 -74 2 -87 -181 44 140 401 70
7775 70 -109 140 255 116 -103 25 -45 286 -224 -122 -17 -31 -393 89 -237 39 16 56 -112 -162 29 230
7797 230 26 -273 -148 149 -134 49 -181 15 34 31 -135 -247 -66 178 -90 -246 -4 -109 269 -134 88
7818 88 19 111 209 -25 -64 29 274 273 -336 -200 -86 360 -40 -16 228 221 258 141 123 12 -87 -38 -257 37 13
7843 13 113 20 -459 -34 263 -23 -300 -266 290 177 -25 -251 76 56 -8 -279 -364 -171 155 -82 -179 -70
7865 -70 166 95 -149 -416 296 271 209 -225 -275 85 66 209 -86 238 346 340 -94 -230 20 218 199 -133 -99
7888 -99 272 272 93 -43 78 387 87 -286 166 172 296 -150 -93 -141 43 20 -282 -375 -187 66 200 -222 -160
7911a60K77k8L4l36L81j29M37n02j61l7M93q5k74j81M07k22M6l93N03l6J84j08
7933A10m80K02J76K22m47Q1J99K95n27J27P1M08l10m05p9L08k5K28l55P6K89q8
7955G6J57l48k0L91k63p2J5J70L6j85j19k09N12o9m05P0P8M44L5o09n1N59r4q8
7979A1l03K32N0J74j08j12M4K02p0l81p9N22n4j24j30p2K75K45k58L2k9K08N4
8002C29n74J36L79j67K67o44K02J87p7k61K38J05P6q7r8j41p9M35l38%J04J10
8024A02k11j52j90N64N6l95J26K00J7R1j35k74K27L03l50j27j75P3M34r5k59J45
8046b5j14L07j01m60J11J72LMN6n06P20M90p51j35L18j06J43j98P1p0O5j71M7
8069a30m2M63k38k09q1J63R2j0nM1M58l44j27L9J23K22k38m80J54J58J47m68L03
$$ plain form
7911 -160 117 89 123 -213 168 39 476 -26 -187 -224 269 184 -90 -271 136 -86 -40 -433 70 34 218 110
7933 110 -370 -168 8 230 -217 -136 63 358 -169 -42 29 437 127 -278 -357 -49 -74 154 -201 -125 164 76
7955 76 233 -115 -135 256 -7 -79 -64 106 142 -43 -162 -371 141 72 -333 -263 -185 259 294 -315 -366 193 99 11
7979 11 -292 -60 -10 164 56 -56 -12 190 120 -261 -340 182 128 4 -126 -198 77 322 64 96 67 275 329
8002 329 -245 -109 270 103 370 -274 -72 115 38 -223 15 120 196 109 11 -130 -209 226 -112 -112 -8 102
8024 102 -109 -261 -451 113 169 -226 -100 100 117 208 73 -201 26 329 -21 -148 -323 -250 184 89 -170 -25
8046 -25 -139 168 67 -393 -282 -110 -107 -103 -47 -553 167 657 -94 -229 89 -17 126 -72 -1 -71 -6 -177 -130
8069 -130 -172 291 53 -156 -237 -74 18 8 3 44 502 158 31 70 193 415 177 -303 -149 9 156 -312 -9
8092iK6L30l11L8k46J81K07q8j54l68M38J58l77L50j31K44j14j62j00J46j15P9
8114B2k22J4L51m3k2k98k1R3J88r0j4J74j47q0k32K64j88L35j06n54M56Q4k2k05
8138b63K94k62K5L91k53k30L99K36j4m02j15K07J15m47L52J0P3j74J29k00o1J79
8160a1l3K9j81M63k38J03l78L39o3j65L45j43q2Q1J13m44L57N1l89L19p4L9J0
8183D8q3K43l00M4K0L3j80k4
$$ plain form
8092 -9 17 347 36 74 -172 9 216 128 -26 -394 44 202 -175 175 44 288 174 12 -88 58 -57 22
8114 22 -200 -186 165 122 100 -198 -219 -126 62 -28 -42 132 -15 -95 -327 -63 -251 84 -22 -576 -120 -36 -58 -263
8138 -263 31 -231 -206 185 -68 -298 101 337 323 -79 -194 13 128 -319 33 43 116 -58 71 -129 -190 -11
8160 -11 -44 -15 -196 267 29 132 -246 93 30 -135 210 67 -15 66 179 -265 92 143 -246 73 -1 38 48
8183 48 -35 208 -92 -48 -28 5 -175 -199
8191a99
$$ Imaginary data points
##PAGE= N=2
##DATA TABLE= (X++(I..I)), XYDATA
0@%%%%Qk4K4k4M0n6O5q1J10j34J61j97K37k80L34l98M64n45O41p39Q47r76J120
27E97j274J444j637J851k080K335k620K928l267L641m047M491m984N525o113O769
43C559p500Q305r201J0210j1354J2652j4146J5895j7961K0449k3527K7435l2586
56a7770L9743n0418O8224j04952K97628o70742m85581J244390M14968p97921n49639
67f12070N55744M81692k66438m26066Q9954K00766K08748J5407l97920l20875
77d71058M04849N77419k06036p80329M4965P93814Q3174o69165j76442M95917
87I7108K82464l70275l28599J59941K75239J38722j24320l84783n6009M45342
97A34830K72108l69484m58556K71001N18563k06168m72694R8429M13035O5268
$$ plain form
0 0 0 0 0 0 8 -16 8 -16 24 -32 33 -48 62 -72 89 -108 129 -151 183 -215 249 -296 345 -394 453 -523 597
27 597 -677 767 -870 981 -1099 1236 -1384 1544 -1723 1918 -2129 2362 -2622 2903 -3210 3559
43 3559 -3941 4364 -4837 5373 -5981 6671 -7475 8420 -9541 10908 -12619 14816 -17770
56 -17770 21973 -28445 39779 -65173 232455 -438287 -923868 320522 735490 -62431 -612070
67 -612070 -56326 425366 158928 -267138 -177184 23582 232330 247737 -150183 -471058
77 -471058 -66209 511210 305174 -475155 -430190 363624 446798 -222367 -398809 97108
87 97108 379572 9297 -319302 -159361 115878 254600 130280 -254503 -310512 134830
97 134830 406938 37454 -421102 -150101 368462 162294 -310400 -211971 201064 266332
107B66332l23468j75549J37018J79822J52788j13755m26604j7912N46181K03669
117D28522n47584l83710N49102N08674n24117n66298L93656N93170j88316n90305
127c27206n057M65912J29006k00682j80399o2670J79417K37197j08772l68231
137b41485k4501M98595J47574n92577k46363N74048L66855m37203m63231K80934
147a37354M49184j55780l24852L1062J67456P2761m6664j00635o4415P4803K21196
158A86762l0489l66946l2970M03687J29096l53617k38950K82304K84004j95152
168F7729k25540Q3036J41853L2751q7122j08462K125J27295J38516j25566k73222
179b26607J06130L39318j9492l33231j07251K96577J79187k42323j81230J35359
$$ plain form
107 266332 -57136 -232685 -95667 84155 236943 123188 -303416 -321328 224853 428522
117 428522 -119062 -502772 46330 555004 30887 -535411 -141755 451415 263099 -327206
127 -327206 -332263 133649 262655 61973 -118426 -181096 -1679 235518 126746 -241485
137 -241485 -265986 232609 380183 -212394 -458757 115291 482146 44943 -418288 -137354
147 -137354 311830 156050 -168802 -137740 29716 102477 55813 -44822 -109237 -34434 186762
158 186762 156273 -210673 -243643 160044 289140 -64477 -303427 -21123 262881 67729
168 67729 -157811 -74775 67078 99829 12707 -95755 -93630 33665 172181 46615 -226607
179 -226607 -120477 218841 199349 -133882 -241133 55444 234631 -7692 -188922 -53563
189e3563J63799K350j47006j06683R4086J79102L1949k46540j86261K73444K85451
200B90128k20592l32912J11555L67346j2770l65398m0211K97617Q9283j92564
210h518j58021Q4008J76613K2635j01621j33716r252K24235R9793k37251j73671
221b14766J79566K44601j25192k95278Q5684K90482j0372k32049r3150J60658
231i816J58765p5964j45661m1646Q5430J46557k9669j85903k3580J77724J06292
242A62529j65692j86060J47794K15242q4743k03623k5012J71663J13638j07504
252C8232j30624P697J16270R4563j07356j56358P6000J78423K54k00226q8891
263a72016K13102J51231j63320j78801N9057J86839K7920j67104p0056R7674R9132
$$ plain form
189 -53563 110236 112586 -34420 -141103 -47017 132085 164034 -82506 -268767 4677 290128
200 290128 69536 -263376 -151821 215525 202755 -162643 -202854 94763 184046 -8518
210 -8518 -166539 -82531 94082 116717 15096 -118620 -127872 96363 196156 -41095 -214766
221 -214766 -35200 209401 84209 -211069 -125385 165097 154725 -77324 -170474 -9816
231 -9816 148949 72985 -72676 -114322 -28892 117665 87996 -97907 -121487 56237 162529
242 162529 -3163 -189223 -41429 173813 89070 -114553 -139565 32098 145736 38232
252 38232 -92392 -84695 31575 126138 18782 -137576 -61576 116847 117101 -83125 -172016
263 -172016 41086 192317 28997 -149804 -90747 96092 124012 -43092 -113148 -15474 83658
274H3658n830j33063o0203J42267J09077r5811j67149J7437K08537M2776j89087
285d7391q7553J19078J32430m9905j53799R059J26527L3129p3133r5471K3044
296f3985J32548K6141j11250r0608O5410J49887k8922j58859r546J18289O0139
307H9244q0171j02034N6221J06480j1200q1460n5524N8145R8001l0056r5870k6927
319g5151P2302Q8131n5489j09495L5585R6524J1359q5225n8889P5465P0720m2014
331B3823o2644j8186O1788O3464n0536o7249J1158N9419L7528o2930o3497N0650
343a7212O3684p809o6085l2598P3582M7064n1237m6591l27N1465L6895n2537m4927
356d6633K3990N2245K1270o3990m2493N7590M4527k0745n6953k2354O9990L9031
$$ plain form
274 83658 77828 -55235 -115438 26829 135906 40095 -127054 -109617 98920 141696 -47391
285 -47391 -134944 -15866 116564 66659 -87140 -78081 48446 81575 8442 -87029 -63985
296 -63985 68563 94704 -16546 -107154 -41744 108143 79221 -79638 -89184 29105 89244
307 89244 9073 -92961 -36740 69740 58540 -22920 -78444 -20299 77702 47646 -48224 -75151
319 -75151 -2849 85282 29793 -79702 -44117 52407 63766 -21459 -80348 -4883 65837 23823
331 23823 -38821 -57007 4781 68245 17709 -49540 -38382 21037 58565 -4365 -67862 -17212
343 -17212 46472 38663 -27422 -60020 13562 60626 9389 -37202 -37529 13936 50831 -1706 -46633
356 -46633 -22643 29602 50872 -13118 -55611 1979 46506 25761 -31192 -53546 16444 55475
368E5475n3461m2790J3894N9835J9546o6885l3509L8601M6311K106o9848k6745
380e7470P3798L8518l9110n5559J520P5232J6048o7966l5433L1566O3937j968
392D3113q0581j2531O6270L7332k8335p1459L97Q2041J5970o2041m9653L4041
404b5436Q4221j3832q5460r216O1435N1723l8996q8607J7990Q6551J3964o4827
416a0490n8981M9660Q8324k6593q1561j8206O5520O6280n8033r1757L1454Q7314
428D2931K0969p6985o6479O7775Q6765l1149r0967k7685R0447O8602q0306q4251
440h0333L8090R3656K3516r7421o2127P9174Q1704l1619j02605k5885J10250O1548
452H7948q3887q4287L1433J13053K2843j21267n8934Q8756Q7875l8976j18843
$$ plain form
368 55475 2014 -40776 -26882 32953 52499 -14386 -47895 -9294 37017 39123 -30725 -57470
380 -57470 16328 54846 15736 -39823 -38303 36929 52977 -14989 -50422 -18856 45081 43113
392 43113 -37468 -49999 16271 53603 25268 -46191 -45794 36247 52217 -9824 -59477 -25436
404 -25436 58785 44953 -40507 -49723 11712 63435 24439 -64168 -46178 40373 54337 -10490
416 -10490 -69471 -19811 68513 41920 -39641 -57847 7673 73953 15920 -75837 -44383 42931
428 42931 63900 -13085 -79564 -11789 74976 43827 -47140 -74825 15622 84224 3918 -80333
440 -80333 -42243 51413 74929 -22492 -84619 -5445 76259 44640 -57965 -83850 26400 87948
452 87948 4061 -80226 -48793 64260 87103 -34164 -93098 -4342 83533 44557 -74286
463g4286n778J21866M5383q1882q6358L3165J22461Q379j23769n3931Q4430J00608
475I0288m0459j29783L014J23729M8278q8522j00185N2366J25912j5568j16850
486d7780m3735Q4741J02007m6660j23000L00J13722O3264r0897j16619N9557J28427
498H3327j1794j19491n3193J04630J06356o8495j20996O075J16407O2138j01138
509C826j09230N6273J22157J1166j22499p3369J17266J13869p7498j34988R992
520h3035J42419N0542j29186r3149P3408J20120K726j27564n7388J09300R3451
531A01644n9744j26917m177J44477N4034j28840r8755P9306J42165j5971j52981
542f5759l4047J17254P6122o2254j14152Q988J23275L7830r7872q6841O0528J34336
$$ plain form
463 -74286 -80064 41802 87185 5303 -81055 -47890 74571 82950 -40819 -94750 -10320 90288
475 90288 49829 -79954 -76940 46789 95067 6545 -93640 -41274 84638 69070 -47780
486 -47780 -91515 -6774 95233 48573 -74427 -74127 39595 102859 11962 -104657 -45100 83327
498 83327 71533 -47958 -101151 3479 109835 41340 -79656 -73581 42826 104964 3826
509 3826 -105404 -49131 73026 84192 -38307 -111676 5590 119459 41961 -93027 -83035
520 -83035 59384 109926 -19260 -112409 -39001 81119 83845 -43719 -101107 8193 101644
531 101644 41900 -85017 -89194 55283 109317 -19523 -118278 -38972 103193 87222 -65759
542 -65759 -99806 17448 93570 31316 -82836 -73848 49427 87257 -10615 -97456 -36928 97408
554I7408j5240j45902m1132J11379R7185o5072j31360J8504J25600L5967r0462
565c125q6867N5436J21515j4746j29453n3439J12643J22686q0643j58078L0657
576h3414J57141L8220j32247r2526R7568J12042m9868j17370j6862J15832Q0839
587A09355r0069j19464L0671J41341M8282j42943j10298J09723J38223n5126j53598
598i3903K374J60584M1678j36523p8717Q2054J15284j8472j31932m3350J01254
609C31R4034m4058j25769l804J33967M1945j12192q2721P8225J17764m5842j30773
621g8893o07J07970N9243o0834r5594J0222R4582M3191p0512r5987M2759J25030
633H0570j6096j29574k4620J22062P8660r9684j11607N1768J11420J3140r1843
$$ plain form
554 97408 82168 -63734 -104866 6513 103698 38626 -92734 -74230 51370 87337 -3125
565 -3125 -89992 -34556 86959 72213 -57240 -110679 1964 124650 44007 -114071 -83414
576 -83414 73727 111947 -20300 -112826 -15258 96784 46916 -70454 -87316 28516 109355
587 109355 19286 -100178 -69507 71834 120116 -22827 -133125 -23402 114821 59695 -93903
598 -93903 -91529 69055 110733 -25790 -104507 -22453 92831 74359 -57573 -100923 331
609 331 94365 50307 -75462 -79266 54701 96646 -15546 -98267 -20042 97722 51880 -78893
621 -78893 -79500 28470 87713 26879 -68715 -58493 36089 79280 8768 -87219 -44460 80570
633 80570 64474 -65100 -89720 32342 111002 11318 -100289 -48521 62899 76039 -15804
644a5804p2427N5616J00165k289j04419n6845J08086J11417j00944j52389O2444
655f7389J77029l996j86339m9040J61939Q4013j00520r9048L4925R8949J3606
666F4129p8009n6885L2612J00872K0814j31014p4338J28535J32615r0440j80230
677a31339M2960J92564m136j69084l3862J29948O7627r1516q0832M7986P5385
688D5701J2993n6326p2252K1446R7248K7819q9221p7103O9395J03411m3361r8124
700e8374J2662Q0578K0108o3435m7158K8406N9403L3664n5325r8909L4863J38942
712H5425R059j48155n8973J38690Q9307j24467r8169R6934J03124n3125j04431
723f4781Q240Q1496K9232k3019n3588n1477N2826J06549k5093j36607j2253J58965
$$ plain form
644 -15804 -88231 -32615 67550 65261 -39158 -96003 12083 123500 22556 -129833 -67389
655 -67389 109640 105644 -80695 -129735 32204 116217 15697 -83351 -48426 50523 64129
666 64129 -13880 -70765 -38153 62719 83533 -47481 -121819 6716 139331 48891 -131339
677 -131339 -88379 104185 100049 -69035 -102897 27051 94678 3162 -77670 -29684 45701
688 45701 58694 2368 -69884 -48438 48810 76629 -12592 -89695 -20300 83111 39750 -58374
700 -58374 -45712 34866 54974 -8461 -55619 -27213 32190 65854 10529 -88380 -53517 85425
712 85425 94484 -53671 -112644 26046 115353 -9114 -107283 -10349 92775 39650 -64781
723 -64781 -56541 24955 54187 31168 -22420 -73897 -21071 85478 60385 -76222 -88475 70490
735G0490M1485j74248o3207J68654R0712j38601j22030R0407J26594l7348q9165
746c6257n782L4531K9707Q575l3400m0241K4860P5299j8873j13777Q955J35799
758F9396K1645j26900n9195R4123P1920n4502m9973J6360J4985J1555R009k5492
770g069k7595L5558O1074m5033j04780L9388J31114r148j28158k9199J04108M7510
782F7770p2127l4490L8285J5590o818q446k3140l529N2923L9042p6589q6832Q1622
795a6739J20566n8232j28211K2999J18189k410j04273L38Q4213O251n4715k1764
807c3788J8043K5926K3756j354o3758m0325Q5317P1368q0634q3251O5399Q9599
819G6298n6602r5400N1050R3323l3696p7008K655M7792J7251r043p345k9610j7527
$$ plain form
735 70490 111975 -62273 -125480 43174 133886 -4715 -126745 -36338 90256 52908 -36257
746 -36257 -42039 -7508 22199 30774 -2626 -42867 -18007 57292 38419 -75358 -66403 69396
758 69396 91041 -35859 -95054 -931 70989 16487 -33486 -17126 -2141 9414 18423 -7069
770 -7069 -34664 894 61968 16935 -87845 -48457 82657 73509 -54649 -83848 20260 67770
782 67770 -4357 -38847 -562 15028 8210 -236 -23376 -26905 26018 65060 -11529 -98361 -16739
795 -16739 103827 45595 -82616 -59617 58572 56162 -48111 -47773 36440 42691 -12024 -33788
807 -33788 -15745 10181 33937 32583 -31175 -71500 13817 85185 4551 -78700 -13301 76298
819 76298 19696 -75704 -24654 68669 34973 -42035 -39380 8412 25663 16620 9275 -20335 -37862
832c7862N7199L3587o7778m2935O9471N5668p3553p2126P4897Q1518n6023p5440
844e3377K1443N4750L028k5923p207o226J289L5647R20n4471j891O7581J4110
857D9673q2252l6808Q9356N2265p6545n4765M9282M8515k4230l5159J3611J2127
869E070o687J1242o334l0893J5311M8422q560o5857p094P7998K1217p3223k9917
882d9305N1878L3439l2211l0953K0917J8726p081O40j1100j8663K4569L4751k5176
895A0431n5545J4799P2946l897p3176m387N9369J5482m3078k2321K9298J7231
907A7152j4913o646m903l898K3691J8158k7979l8335K3788N8011j8993o5609J0134
920c0342N6649K247m3833r741L4845J0014k0207n138r47r47J8066Q706k5330k6115
$$ plain form
832 -37862 19337 52924 -14854 -57789 11682 67350 -6203 -78329 -3432 78086 22063 -53377
844 -53377 -31934 22816 25844 -79 -7286 -13512 -12223 23424 24344 -30127 -32018 35563 49673
857 49673 -32579 -69387 19969 72234 -4311 -59076 -9794 38721 14491 -20668 -7057 5070
869 5070 -1617 9625 3291 -27602 -12291 36131 27571 -38286 -45380 32618 53835 -19388 -49305
882 -49305 2573 36012 3801 -27152 -6235 12491 5410 6050 -5050 -23713 856 35607 10431
895 10431 -45114 -30315 42631 38734 -34442 -38829 20540 36022 -7056 -29377 -79 17152
907 17152 2239 -4407 -9310 -13208 10483 28641 662 -37673 -13885 44126 25133 -40476 -30342
920 -30342 26307 28554 -15279 -25020 9825 19839 -368 -5506 -6453 -7400 10666 19372 -5958 -32073
934c2073K3655M7349j6544n3989P546M6885M470l7924j4655K7894J5242j3499
946D357j1136q337R045L0366R80m0029k2638L8233M3905l1739n5310J8439N3266
959B9402J661m7047j7769M1216K8130k6466l4882j639L5182K9314k6694m6929
971c6521N345N5571K2618n5197m0519M5928M7471k9155n3987N255N7305J5698
983C9812m6273l2137K1597M6132P720m7099l1108K9443M6036o512n7566j2787
995d2742O0608K9749m8217m6109K8570N8859o456n7945j8853L7696M0806j1956
1007B4010n1222r576M7606L2008l1913n3182J3490O4664N408o3170l1809M9835
1019c851N7096k9024o4631M608N7103K3947m2530m7159K1757N6489K092n4931
$$ plain form
934 -32073 -8418 38931 22387 -31602 -24056 22829 27299 -10625 -25280 2614 17856 4357
946 4357 -6779 -15116 -6071 24295 25275 -14754 -37392 841 44746 13007 -42303 -23864 29402
959 29402 31063 -15984 -33753 7463 35593 9127 -25755 -27394 7788 37102 10408 -36521
971 -36521 -31176 24395 47013 -8184 -48703 -2775 44696 15541 -38446 -33191 24114 39812
983 39812 -6461 -38598 -17001 29131 36851 -10248 -41356 -11913 34123 27611 -29955 -42742
995 -42742 17866 47615 -602 -46711 -18141 40718 34262 -23683 -42536 -4840 35966 24010
1007 24010 -27212 -36788 10818 42826 10913 -42269 -28779 35885 41293 -21877 -53686 -3851
1019 -3851 53245 24221 -40410 -35802 21301 45248 2718 -44441 -22684 33805 35897 -19034
1031a9034l0505M8610N5705l1349o5653K922O4598K6793n7059m9005L8097N8224
1043D2344j0430n7958j7124N3960L8759l6088n2973N727N9629K2118n7005m3016
1055e2057L9401N7760j1475o3522j3342N8984L3077m1343n1779J4759O1632R374
1067D1469n6512l1075L9171N1190j3515o1896j0939N7216L2451m1841n4442K1121
1079b7602O5156K409n8558k7312M3185N0515k3156o1575k613N6856K8736m4717
1091A324n1011K7245O2030q86n8910k8323M8823N0369l2069o1409N600N9233K3716
1104D5732m9159m4976L1528N7134l603n9570k6962N2888M8012l5678o0168P403
1116c7419O4536K2423n6859m3744L7688N7882r324o5430j9304N8360M1602l7107
$$ plain form
1031 -19034 -49539 -929 54776 23427 -42226 -39304 25294 52087 -4972 -53977 -15880 42344
1043 42344 31914 -26044 -43168 10792 49551 13463 -39510 -33783 25846 47964 -9041 -52057
1055 -52057 -12656 45104 33629 -29893 -43235 15749 48826 7483 -44296 -29537 32095 41469
1067 41469 -15043 -46118 -6947 44243 30728 -31168 -42107 15109 47560 5719 -48723 -27602
1079 -27602 37554 39963 -18595 -45907 -2722 47793 24637 -36938 -39551 17305 46041 1324
1091 1324 -49687 -22442 39588 38702 -20208 -48531 292 50661 18592 -42817 -37217 22016 45732
1104 45732 -3427 -48403 -16875 40259 36656 -22914 -49876 3012 51024 15346 -44822 -37419
1116 -37419 27117 49540 -7319 -51063 -13375 44507 35183 -30247 -49551 8809 50411 13304
1128A3304n8458Q396O8363K1328o2892m5777M2290O5386j6889p5115j1245O8093
1140A6784L8588m5937o0650J9279P2020J0217o6416m0046M5799O4453k0697p5956
1152d2562r034P1517M2243n4243o7490L0500P7819j154p2655l2207N5141N8006
1164E5881l0201o8270k806O7653L8355n4864o5228L0294P6243L382p6105l7957
1176f3623O4045O3207l9251p4472O102P5427K6628o3745n2732L6606O7802k36
1188D5758p2390l5447O2808O3169l7082p9794L914Q4996K6856p6089n2720N0748
1200a5273P2604j7967q0288j4247P0345M4584m4618o7969J0902P6643K2136o8657
1212a1805n3113M8462P7635k1640q8587o915Q1931L8439o2673o4437L4150P4026
$$ plain form
1128 13304 -45154 -36758 31605 52933 -9959 -55736 -13446 51940 35051 -40064 -51309 16784
1140 16784 55372 9435 -51215 -31936 40084 50301 -16115 -56161 -10362 54091 33394 -42562
1152 -42562 -51596 19921 62164 7921 -59569 -29069 48750 47596 -25059 -57266 -2125 55881
1164 55881 25680 -42590 -45396 22257 60612 5748 -59480 -29186 47057 50439 -25666 -63623
1176 -63623 422 63629 24378 -50094 -43992 31435 58063 -5682 -58414 -21808 45994 45758
1188 45758 -26632 -62079 729 63898 26816 -52978 -49064 35932 62788 -13301 -66021 -15273
1200 -15273 57331 39364 -40924 -55171 15174 59758 15140 -52829 -41927 34716 56852 -11805
1212 -11805 -64918 -16456 61179 39539 -49048 -55963 25968 64407 1734 -62703 -28553 45473
1224D5473l31o6248l3738M8330N9093k3124o9002q852O7076M1296n5116o8701
1236f3844L4346Q0770k217p8829k9800O4714N2006l8533o1185M458O0435K7288
1248D9609n0134n1181K8487O7555K567p3755l4842O5908N9930m2955p5226J1890
1260d2147P9210J5967o8642l6773M6138N3593j8371o2293j1409N7032M0617l8416
1272A4506o4827J2645P5358J4876o8789l9411N1166N7740l1033o5628Q231O2886
1284B7720J6735m9713m0067K9117N2110n39n0009l0118L7400N2283j9741o1288
1296c6110j749O0743K3827n4055m2023L9952N2141j5970n3989j2288M5210L3565
1308C9254k5088m2422j240M1725K5583l4588m2387J9115N3924J426n9675k3962
$$ plain form
1224 45473 45142 -21106 -54844 -6514 52579 29455 -39547 -48399 18677 59973 4857 -63844
1236 -63844 -29498 51272 49055 -29774 -59574 5140 57146 18613 -42572 -38114 22321 49609
1248 49609 -525 -51706 -23219 44336 46903 -26852 -61694 4214 64144 21189 -54037 -42147
1260 -42147 37063 53030 -15612 -52385 -6247 47346 28975 -33318 -44727 12305 52922 14506
1272 14506 -50321 -37676 37682 52558 -16231 -55642 -4476 53264 22231 -43397 -35166 27720
1284 27720 44455 -5258 -45325 -16208 35902 35363 -14646 -44764 -7364 44919 25178 -36110
1296 -36110 -37859 22884 46711 -7344 -49367 -9415 42726 26756 -27233 -39521 5689 39254
1308 39254 14166 -28256 -29496 12229 37812 3224 -39163 -20048 33876 35302 -24373 -48335
1320d8335N5085M3382l5088n6500O777N9014J9707m9066l9247K9242N2671p190
1332C0452n9238j3785N6423L5099m2428n4646J9788O4587M212n7865k6707L9510
1344d598M2642j7432m7375l678M1867K5743l1599m6101J6191N8156M953n6985
1356a8216k9481M6067M8291k7246n3719M771M8587J4543l8352k9261K5674L5439
1368B7097n226l5857j7356K9910L5173j3841m3957r091M1414K9009l0169l9178
1380c2072J3244M1271P680l9525k6025L1676M0149j5552n0078p876N1760L0315
1392D4967m0506m5141J9918N1895J736m9948j8623L9210K9543k2441l8306K566
1404b5130M1924J8784l3602l8667J5407N2420M760n3882k3639M2979L6877k7352
$$ plain form
1320 -48335 6750 50132 15044 -41456 -34679 24335 44042 -5024 -44271 -15029 37642 30452
1332 30452 -28786 -42571 13852 48951 6523 -48123 -28335 36252 40464 -17401 -44108 -4598
1344 -4598 38044 20612 -26763 -30441 11426 37169 5570 -40531 -24340 33816 38769 -18216
1356 -18216 -47697 -1630 46661 19415 -34304 -29533 19054 33597 -4755 -34016 -8342 27097
1368 27097 21871 -13986 -31342 -1432 33741 19900 -24057 -33148 8266 37275 7106 -32072
1380 -32072 -18828 22443 30123 -9402 -35427 -3751 36398 20846 -29232 -37108 14652 44967
1392 44967 4461 -40680 -20762 31133 32869 -17079 -35702 3508 33051 10610 -27696 -25130
1404 -25130 16794 35578 1976 -36691 -21284 31136 35896 -17986 -41625 1354 38231 10879
1416A0879m3912J3633M4937P03l8194j7852K6724K9852r519l3107j1842K5273
1428b425L0860j1584l9761r63L8556J3038l4923k2619K8422K8466j8436k9816
1440b1185K283K6793J4453j4981k3147k078K1362J8092j5511k8309P927L1634
1452A7333J150l2626j0013L3511J9397k8471k5436J3055K5245M164j8482j4907
1464a6080N487J9166Q746j8966j7422J8075K2874j6051k9416P877L5698K633l4258
1477a1637j1334K3655J6284q618j3939j154N014N373K834j0878p743J6750J3936
1490A8543j9209k1565J6471K9301q345l0565q78K1270N377j0367m545M179J481
1503A148N38J833o500m695J5076Q394k0927j8515J9869K7514j3301k8049P735
$$ plain form
1416 10879 -33033 -19400 25537 26240 -11954 -29806 -3082 26770 17251 -15856 -27698 -2425
1428 -2425 28435 16851 -22910 -23873 14683 27721 -7202 -29821 -1399 27067 8631 -21185
1440 -21185 -18902 7891 22344 7363 -15784 -17862 3500 21592 6081 -22228 -14301 17333
1452 17333 18483 -14143 -24156 9355 28752 281 -25155 -12100 13145 17309 -1173 -16080
1464 -16080 -10593 8573 17319 -1647 -19069 -994 21880 5829 -23587 -15710 19988 22621 -11637
1477 -11637 -22971 684 16968 8350 -5589 -6743 -1729 3644 6478 -4400 -12143 4607 18543
1490 18543 -666 -22231 -5760 23541 15196 -15369 -16247 5023 10400 33 -4512 -333 1148
1503 1148 1686 3519 -2981 -7676 7400 15794 -5133 -23648 -3779 23735 10434 -17615 -9880
1516i880K1057l862j3408K929Q069l052m918K124k535k334J3667O746j8524j6461
1530b0382J7291K4640j2381k7185P223K1949l458j6374J551J3414J609p918m493
1543d514l979N251J6137j325k3786q153K4236J8074j9782k2194J6202K1532j1221
1556F478k1928M112K0569L808j4814j0639K668J4349J3379j2734k3664M885K8646
1569A5115K893l0963r129L0863J4147k6530j9137J8165K4007o501k2678m926J2806
1582a868J2345L40j6317j1104J4588K1209q956k9444L315L4856L578l5656j2734
1595b5848K8965K0756j7919k3155N848J9482O340j0472j6308R34K0015R337j9276
1608a301k1972J4926L3123p332l7474l446L6394J5180k9506k3893J7666K5202
$$ plain form
1516 -9880 11177 7315 -6093 -3164 4905 1853 -3065 -941 -3476 -5810 7857 14603 -3921 -20382
1530 -20382 -3091 21549 9168 -18017 -10794 11155 7697 -8677 -7126 6288 7897 -21 -4514
1543 -4514 -8493 -3242 12895 11570 -12216 -20369 3867 21941 2159 -20035 -3833 17699 6478
1556 6478 -15450 -11338 9231 13039 -1775 -12414 -9746 4603 17982 5248 -18416 -13531 15115
1569 15115 18008 -12955 -22084 8779 22926 -3604 -22741 -4576 19431 12930 -9748 -14674 -1868
1582 -1868 10477 10817 -5500 -16604 -2016 19193 10237 -19207 -15892 18964 22542 -13114 -25848
1595 -25848 3117 23873 5954 -17201 -11353 8129 14469 3997 -12311 -11377 8638 17975 -1301
1608 -1301 -23273 -8347 24776 17444 -20030 -23476 12918 28098 -1408 -25301 -7635 17567
1620A7567l354k1793j0817J5364K1753m464k7169r350K8264K2322k4250l2722
1632b8649J3438L8224L89l7420j3323L1123K2643j8829k6928L167K5595J1026
1644B0456j9976k2086Q872L0618M774l3845j7458K9755K7862j8865l4593M579
1656a9907L4777P277k6974j6961J5776K3781l544k4466r468J9358K1808r308l1988
1669a9839l407L4278J6825k8679k6913J8376L2493o345l1631n783K5112J7083
1681B1570j6083k5187L432K7959J1720k2298k6027J2144L3237J598l4168j5344
1693b7447K9148K6462k1641l0904R684L2642M409k8465j9092J9002K8363m406
1705A7755l0864j2075K7282K4966j8176l1986N735L4934Q119l4103k0062K6071
$$ plain form
1620 17567 14213 -7580 -18397 -3033 18720 14256 -12913 -22263 6001 28323 4073 -28649
1632 -28649 -15211 23013 23402 -14018 -27341 3782 26425 7596 -19332 -16165 9430 20456
1644 20456 480 -21606 -12734 17884 22658 -11187 -28645 1110 28972 10107 -24486 -19907
1656 -19907 14870 22147 -4827 -21788 -6012 17769 14225 -10241 -19709 -351 21457 12149 -19839
1669 -19839 -23246 11032 27857 -822 -27735 -9359 23134 16789 -14842 -20625 4487 21570
1681 21570 5487 -19700 -16268 11691 23411 1113 -24914 -12770 20467 22065 -12103 -27447
1693 -27447 1701 28163 6522 -24382 -14698 17944 22353 -6112 -25204 -6202 22161 17755
1705 17755 -13109 -25184 2098 27064 8888 -23098 -17363 17571 25690 -8413 -28475 -2404
1717b404K9318j2854l3277k841L0823J6136j9924k6110N854L0592Q136l0001k0384
1730b6936K3310L0429j1917l6463k145L5941J6081k7116k7901J4114L3353o66
1742B0084l1052j3161K3245K5681j2325l3211j691L4547J7041k9275l0814J8552
1754a2379L8542m564l7971j1088L1511K4756k1393l2771P042L4660R731l1255
1766e179k4874K1710L4783o568l8134j0976L5690K5533k6974l4869J2432L9465
1778B2039L872l7382j8965K7860L0619j1972l7340n685L6999K0977k8059l2995
1790c0032J3897L9919K518m0306j7714L2368L0876j8623l8958K555L8913J3479
1802B8892l0151k7852J6507L6767l93l7976j6559L2401L0892k0556m0761O466
$$ plain form
1717 -2404 26914 14060 -19217 -22058 8765 24901 4977 -21133 -15279 15313 23449 -6552 -26936
1730 -26936 -3626 26803 14886 -21577 -23722 12219 28300 1184 -26717 -12603 20750 20084
1742 20084 -10968 -24129 -884 24797 12472 -20739 -22430 12117 29158 -117 -30931 -12379
1754 -12379 26163 21599 -16372 -27460 4051 28807 7414 -25357 -18315 16345 26076 -5179
1766 -5179 -30053 -8343 26440 19872 -18262 -29238 6452 31985 5011 -29858 -17426 22039
1778 22039 25911 -11471 -30436 -2576 28043 16071 -21269 -26954 10045 31022 2963 -30032
1790 -30032 -16135 23784 26302 -14004 -31718 650 31526 12903 -26055 -23500 15413 28892
1802 28892 -1259 -29111 -12604 24163 23770 -14206 -30765 1636 32528 11972 -28789 -22323
1814b2323M1297J1030l5472k5816K3369L5329q147l7199q755L2121K4274k1300
1826H408l4180N881L7748J1670l5301k7294K6306L7264j2267m0261m195L7174
1838A0953J8971k7203k9510J1992L4140N281l3077k0161K3954L1747r833l7082
1850a9828o654L6847K0769k9306l1509J5755L7429j059l6160j2838K7413K4335
1862B5194j3538l1080j701L1150J6341k4634k9020J3273L6565o78l6227j2562
1874b6917K9990K4266j9899l0651P345K9588N696k3270j7063J3242K3931k15k4530
1887h487j3692K0855K5174j3408l1293K670L1017Q533k6803j7160J8992K2139
1899A8537q164k1448l999J7370J3630r465j8864l284K0598J5552j7822k3829J1094
$$ plain form
1814 -22323 18974 30004 -5468 -31284 -7915 27414 19267 -17932 -26687 5434 29708 8408
1826 8408 -25772 -19891 17857 29527 -5774 -33068 -6762 30502 18235 -22026 -26221 10953
1838 10953 29924 2721 -26789 -14797 19343 24624 -8453 -28614 -4660 27087 17254 -19828
1850 -19828 -26482 10365 31134 1828 -29681 -13926 23503 22444 -13716 -26554 859 25194
1862 25194 11656 -19424 -21125 10025 26366 1732 -27288 -14015 22550 21872 -14355 -26917
1874 -26917 3073 27339 7440 -23211 -15866 13722 19418 -3852 -20915 -7673 16258 16043 -8487
1887 -8487 -22179 -1324 23850 10442 -20851 -18181 12836 21369 -5434 -22594 -3602 18537
1899 18537 10373 -11075 -15074 2296 15926 6461 -12403 -15687 4911 20463 2641 -21188 -10094
1912a0094K9139j786l0591p282K7008J4444j9424j8514P331K0352M879j6748j4480
1925a5766Q490K0554K204k3690j1783K1212K0477j5443k7366Q418L0759J84k8420
1938a0170q446K0820J4608j1170j6646L10J4429R458r241j6774L079K1454M500
1951A6211k2663j2719J9408J9259j3952k2189P306K0297N2j5577m007Q830M782
1964E038p37m375q076K469J4553K474j8933q793J9985J5563j7149j9500J1314
1977f167J9444m846j7673n67J3472N101p263p512q19Q147R640n853j7090p44K1602
1992H872Q095k2829j3434K0236J7518j4617j9639P790K0131j144j7371o841J1163
2005b070J2735k071j5456o370J4122J4677j0159k0665N254K3356p58k3801m350
$$ plain form
1912 -10094 19045 17259 -13332 -20614 6394 20838 1414 -17100 -9769 10583 15462 -1286 -15766
1925 -15766 -7276 13278 15482 -8208 -19991 1221 21698 6255 -21111 -12693 18066 18250 -10170
1938 -10170 -18616 2204 16812 5642 -11004 -10694 3735 13193 3952 -12822 -9743 11711 16211
1951 16211 -6452 -19171 237 19496 5544 -16645 -9339 10958 11010 -4567 -8574 256 5038
1964 5038 4301 -74 -8150 -5681 8872 11346 -7587 -16380 3605 19168 2019 -17481 -6167
1977 -6167 13277 8431 -9242 -9809 3663 8764 1501 -6011 -6830 1317 10957 5104 -11986 -12730 8872
1992 8872 16967 -5862 -19296 940 18458 3841 -15798 -8008 12123 10979 -6392 -13233 -2070
2005 -2070 10665 8594 -6862 -13232 890 15567 5408 -15257 -10003 13353 12595 -11206 -15556
2018a5556K1877Q854j6402j0694R305R091j509n126m006q56O533O411o700j1076
2032i854O198J5646m911j7529P68J8191K750j6242n067J1229M537m730j733P20
2046b7k711K649O343m147j0819M672J4412l657j7285O53J7973M509j6047p785
2060a1267J1000R100n508q060j2N610M000j643p672k655J0849P886j1962j2232
2074a2566R000J5170n078j5746J294J2824J924q617l062M249M253q07l634l577
2088d373R98P256K893r283o302Q424R037n742r344L018P444j886m540J017L84
2103i99M83K906L39o819k687J0339O364j1191j0362Q945J2952m869j3980J360
2117g219J2441J920q853m459M334O432N17p106o265M817J2490r93j5811l372J5122
$$ plain form
2018 -15556 6321 15175 -1227 -11921 -2616 6475 4966 -160 -4166 -5022 1511 7922 1222 -9854
2032 -9854 -3656 11990 7079 -10450 -9682 8509 11259 -4983 -10050 1179 5716 986 -747 -27
2046 -27 -2738 -89 6254 2107 -8712 -4040 10372 6715 -10570 -9917 8056 12565 -3482 -11267
2060 -11267 -267 8833 3325 -4735 -4747 863 4863 3220 -4452 -7107 3742 11628 -334 -12566
2074 -12566 -3566 11604 6526 -9220 -7926 4898 6822 -1795 -4857 -608 3645 2838 -796 -4373
2088 -4373 -3375 3881 6774 -2509 -8811 -387 8650 2908 -6436 -3418 4026 2140 -2400 -1383 -999
2103 -999 -516 2390 2729 -4090 -6777 3562 9926 -1265 -11627 -2682 10270 5401 -8579 -7219
2117 -7219 5222 7142 -1711 -6170 -1836 4596 5113 -1993 -8258 -3441 9049 8056 -7755 -11127 3995
2132C995Q553j2268j2192Q244J3476l763j2868j244J0468O542o443r758M91R827
2146C060P244p829j2811L742J5077J201j4780n816J3216R099r722j1284M027J2034
2160F458K640j0468q524N478J2362J094j2186p673J0108J2023n893j4699J045
2173h235J5517M159j4801r302J0521J3049k891j4005m811J1450J1062o163j5186
2186i636j06J6474N325j5381j0232J1658J5692o359j7931q92J6667P806j1678
2199A407j2645M398J3590K817j1444r300Q317J4117l582j7898k247J8322R190
2212A5042j5045j5362Q945J7516p37j5876o576J1925J1365o707j3892Q7J4574
2225E259P280j2849j4373P912J9206Lj9804p876J6110J3428r737j5853K602J5396
$$ plain form
2132 3995 12548 280 -11912 -3668 9808 6045 -6823 -8067 2401 8943 2500 -7258 -6767 3060
2146 3060 10304 2475 -10336 -6594 8483 9684 -5096 -10912 2304 11403 1681 -9603 -5576 6458
2160 6458 9098 -1370 -9894 -4416 7946 9040 -3146 -10819 -711 11312 5419 -9280 -8235
2173 -8235 7282 11441 -3360 -12662 -2141 10908 8017 -5988 -10799 651 11713 5550 -9636
2186 -9636 -9742 6732 12057 -3324 -13556 -1898 13794 7435 -10496 -11388 5279 13085 1407
2199 1407 -11238 -6840 6750 9567 -1877 -11177 -2860 11257 7675 -10223 -12470 5852 15042
2212 15042 -3 -15365 -6420 11096 10359 -5517 -12093 -168 11197 4490 -9402 -9315 5259
2225 5259 12539 -310 -14683 -6771 12435 12438 -7366 -15242 868 14296 4559 -11294 -8692 6704
2239F704N266j4383j0986R018J7173j635j9427p530J7371J4930j0706j9725K903
2252a1027K0484M335j7918j0079J2993J5038o423j7576k577J6180J1781j0247
2264D964j8827K322K0869O325j8496j3357J3456J7924o855k0062j000J9069R338
2277A5670j4417j5802O170J8442L603j6067j2412J0107J8500k722k1129n245K0292
2290D990J3211j6759j9211R391K2491J29k1087j0046J5323J7241o793k0084k652
2303a3856J9154J1849j5243j8680P478K3048K154k4063j1799J9730J9254j1399
2315G627k2635J078K2190Q378j6851j6732R459K1337L10k2846j0168J9518J8515
2328A9180j1611k4304K034K5221P832k1507j5857J4270K0866m910k1752n232J8117
$$ plain form
2239 6704 11970 -2413 -13399 -4381 12792 11157 -8270 -15800 1571 16501 5795 -13930 -11027
2252 -11027 9457 13792 -4126 -14205 -1212 13826 7403 -10173 -12750 3430 15211 4964
2264 4964 -13863 -11541 9328 15653 -2843 -16200 -2744 15180 8325 -11737 -12737 6332 15670
2277 15670 1253 -14549 -8379 10063 13666 -2401 -14813 -4706 13794 11072 -10057 -15302 4990
2290 4990 18201 1442 -17769 -8378 14113 14242 -6845 -16891 -1568 15673 8880 -11204 -13856
2303 -13856 5298 17147 1904 -16776 -9298 13750 15904 -8159 -19958 -228 19026 7627
2315 7627 -15008 -13930 8260 16638 -213 -16945 -7486 13851 14161 -8685 -18853 665 19180
2328 19180 7569 -16735 -14701 10520 18352 -3155 -19012 -4742 16124 11214 -10538 -15770 2347
2341B347J4283j0793k0591J541K2604Q165j9936j7173J3896K2748n069k4390m661
2354a7029K1784J3796j5779j9238O682K1275L495j9433j2835J3761J9373n183
2366A0669k2297m543K1683J3579j6854k0247Q773K2691P51k1263r769J6941J6243
2379A6357r241k0122M75K0185R065j6850j6906R354K1689l53k1986q478J8898
2392B087J5268j2227j9596M539K0104L631j7468j1779J1743J7505l316j9423n567
2405a4499J7337J3604j2032j9000M719K0214L721j9180j0990J4974J6857q869
2417F856j8645J8J7501Q247j2916j4753N738J7536K332j6637j0035J3779J5749
2430A4770q387j8802O79J9408P031j6357j3539J0276J6576k109j6601m955J3494
$$ plain form
2341 2347 16630 5837 -14754 -13213 9391 17556 -2380 -19553 -5657 17091 12022 -12368 -17029
2354 -17029 4755 18551 2772 -16466 -9784 11491 14986 -4447 -17282 -3521 15852 10669
2366 10669 -11628 -16171 5512 19091 2237 -18010 -9237 13454 14205 -7058 -16827 114 16357
2379 16357 7116 -13006 -12531 7654 16719 -131 -17037 -7683 14006 13653 -8333 -16811 2087
2392 2087 17355 5128 -14468 -9929 10175 13806 -3662 -15441 -3698 13807 10491 -8932 -14499
2405 -14499 2838 16442 4410 -14590 -9871 10343 14064 -5116 -16106 -1132 15725 6856
2417 6856 -11789 -11771 5730 13977 1061 -13692 -7954 9582 11914 -4723 -14758 -979 14770
2430 14770 6383 -12419 -11740 7668 14699 -1658 -15197 -4921 11655 9546 -7055 -12010 1484
2443A484J1072q401j5211J574J6634N798j5454j1787J0285J6685l578j7566l613
2456a2078J5171R464j0118j3661L568J5548K711j4050r048J0470J3981m003j6576
2469h621l297J5459R620j1468j3770N520J5566P44j3984o831J0637J1399m585
2482F389j4709k113J3834Q893j0379j3664N158J5507J612j4704p654J2377J1420
2495A1967p474j3951R11J3843N321j0452j0158M955J3009J712j3087p720J0201
2508i23J1792n637j4195k96J4932N802j2076j0337O710J3251o70j3468n348J0813
2522C50R859n943j2566K55J3149O175j1300j0958O798J3548j559j4287l616J1320
2536A225Q545o378j1885J241J2788M108j0852r246O694J2826j785j3529l966J2117
$$ plain form
2443 1484 12556 4155 -11056 -9482 7152 12950 -2504 -14291 -4006 12679 9101 -8465 -12078
2456 -12078 3093 12557 2439 -11222 -7654 7894 10605 -3445 -12493 -2023 11958 7955 -8621
2469 -8621 -11918 3541 13161 1693 -12077 -6557 9009 9753 -4231 -11062 -425 10974 6389
2482 6389 -8320 -10433 3401 12294 1915 -11749 -6591 8916 10528 -4176 -11830 547 11967
2495 11967 4493 -9458 -8547 5296 10617 165 -9993 -5038 7971 9683 -3404 -11124 -923
2508 -923 10869 5232 -8963 -9259 5673 11475 -601 -10938 -4228 9023 8353 -5115 -10463 350
2522 350 10209 4266 -8300 -8045 5104 11279 -21 -10979 -4181 9367 7808 -6479 -10095 1225
2536 1225 9770 3392 -8493 -7252 5536 9644 -1208 -10454 -3760 9066 7281 -6248 -10214 1903
2550A903R029q587j1993L909J2611J110j0930o167P549Q426j746j0190l064R326
2564A186Q071o383j1636K712J2030K099j0895o610Q635Q785m305r697o28R121
2578B485M813o080p352J509Q061L564p628p954N975J0615j905j2273j744J1445
2592C531N071q682p952M755R259k21r029l223O340O621k956q181j695Q748N329
2607G715o894q635M457J0578j915j0371j322Q602M621o084o130K209O925Q98n358
2622g04m701L709O563n66p542k326P266M465n798o231L951O519j766o171M50M037
2638A155Q76j448j026j590O86L393R13m918k593N628M202m819n771L752N989j769
2654B660n879l90M757J323k187j808K6O74L227l02m433j585N726L055n976m824
$$ plain form
2550 1903 10932 2345 -9648 -5739 6872 7982 -2948 -9115 -1566 6860 5114 -5076 -8140 1186
2564 1186 9257 2874 -8762 -6050 5980 8079 -2816 -9426 -791 7994 3689 -6008 -6636 2485
2578 2485 7298 1218 -6134 -4625 3436 7000 -628 -8582 -2607 8008 6103 -6170 -7914 3531
2592 3531 8602 -80 -8032 -3277 5982 5761 -3268 -6491 -151 6470 3514 -4667 -6362 2386 7715
2607 7715 821 -7814 -3357 7221 5306 -5065 -6387 2215 6836 752 -5378 -3169 3756 4654 -704
2622 -704 -5405 -1696 4867 4301 -3241 -5567 1699 6164 366 -5865 -1914 4605 2839 -3332 -2882 1155
2638 1155 2031 583 -443 -2033 -1347 2046 2959 -1959 -4552 1076 5278 459 -5312 -1560 4429 2660
2654 2660 -3219 -3609 1148 2471 284 -1524 -1498 -824 2403 2101 -2332 -3917 1809 4864 -1112 -5936
2670e936N341O074l527o292J344N570J44l216j864J156K555Q80k070l204J073
2685a972N255K29o196k110O154L625n477l912L575L307j334k307M14J85J073J530
2701B039j065l809Q41N440O20o861k596O742M413n485n647M141N356j577m130
2716a578o69J532K723J030l584m155L707P229k275r704JJ0467K839r944n345P811
2732H5O987n240p396K084O913Q15m079m240Q76N680L388n811p689M890J0244k027
2748E480j1793m54J1080L599r252o335O211P352k420o917j550M953M812j373o615
2763c222k911O986O573n988r419L585J1166n40j1063k586R277N199o196o035J338
2778c836O234K840m267o183J026Q082K731q793o184P602R764n720j1380K099J1476
$$ plain form
2670 -5936 -595 5479 1952 -4340 -2996 2574 2718 -498 -2362 -1206 1349 2229 159 -3045 -1972
2685 -1972 3283 3512 -2684 -4794 1360 4985 -492 -4404 -829 2478 1144 -1163 -749 -564 509 2039
2701 2039 974 -2835 -1994 3446 4066 -2795 -5391 1351 5764 279 -5368 -1227 4129 2552 -1578
2716 -1578 -2247 -715 2008 3038 -546 -4701 -994 6235 3960 -5744 -5743 4724 7563 -2381 -7726 85
2732 85 7072 1832 -5564 -3480 3433 4248 169 -4071 -3195 2485 5873 62 -7627 -2737 7507 5480
2748 5480 -6313 -6767 4313 7912 -1340 -7675 -1464 5888 3468 -3449 -4999 -46 4766 3393 -3222
2763 -3222 -6133 853 7426 1438 -7981 -4396 6770 6230 -4833 -7419 1858 7057 861 -5174 -3836
2778 -3836 2398 5238 971 -5212 -4186 3896 6627 -2166 -8350 -748 9016 3296 -8084 -5985 5491
2793E491J643r777m345O080O261j591o205l015M767O766k288r104j608J0582N069
2808H726r175q626O609J0760k927j0784r10R181L854o259n652J623O163K947n106
2823D24o900K741J0011L44j0896m696J0817P330p597r844M509J0048m75r084l020
2838f288O441N456k257p119j748O266O173m413q935J111J0612K439j0277n817
2852h356Q369P656m942q898J570Q022K487o125n575K899P133J434p444n440N595
2867a615Q159k467j0003k86R878L935q610o426N252P785q39p611l318N384P056
2882F274k454q337k161R003N605p404q993M562J1114q84j1614k909R851O463o310
2897A806q752K161Q476K784o925o930M286R360L17j1179m419J0774Q215p790j1288
$$ plain form
2793 5491 7134 -2643 -6988 -908 5353 3762 -2443 -5458 -691 6075 3787 -5317 -6925 3657 8726
2808 8726 -449 -9075 -2466 8294 5367 -5417 -6327 2854 6708 449 -5203 -3580 2583 5530 424
2823 424 -6476 -3735 6276 6620 -4276 -8972 1845 9175 1578 -8266 -3757 6291 5816 -3268 -6288
2838 -6288 153 5609 3352 -3767 -5515 751 6924 2511 -6424 -5313 5299 7738 -2539 -8356
2852 -8356 13 7669 2727 -6171 -4601 3421 5908 -217 -5792 -2893 4240 5674 -1770 -7210 -1615
2867 -1615 6544 4077 -5926 -6212 3666 7601 -1009 -7435 -2183 5602 4763 -2848 -6166 -782 6274
2882 6274 3820 -4517 -6678 2325 7930 526 -8467 -3905 7209 6325 -5289 -8198 1653 8116 1806
2897 1806 -6946 -4785 3691 6475 -450 -7380 -3094 6266 6583 -4596 -9015 1759 9974 2184 -9104
2912i104L481J2458R44j1405n106Q576Q041m667r323J57Q843N023o808q716K745
2927d861J1169J295j1269n662R216R587n918j0622Q75J0763L325q904o993N062
2941b937R827q23j0197m190Q605Q682m785j1358k7J1897M480j0651p896P216J0445
2956H288l104j0090k523R162O905n781j0330J071J1217M217j0182q385O714J1390
2970H569k532j2518k054J1786O744r417r606M274J1602N96j0557n499P140R466
2984G994k789j1153j695J0835N980q920r616N287J1602n04j1793l748R295P568
2998H343n192r701P85R277L473p432p304M643R165Mj0393m048R397P405n957r846
3014g381J967R619K401q031n956N314Q123j419q640k794Q130N942n173q517J112
$$ plain form
2912 -9104 -5623 6835 7779 -3626 -8732 -156 7885 3218 -6105 -5948 2895 7918 1110 -7606 -4861
2927 -4861 6308 7603 -3666 -9328 -112 9475 3557 -7065 -6190 4573 7898 -1006 -7999 -2937
2941 -2937 6890 6067 -4130 -8320 285 8967 4182 -7176 -7203 4694 9174 -1477 -9373 -2157 8288
2956 8288 5184 -4906 -7429 1733 8638 2857 -7473 -6402 4815 9032 -1150 -9535 -2821 8569
2970 8569 6037 -6481 -8535 3251 9995 578 -9028 -4754 6848 7444 -3113 -8612 -1472 7994
2984 7994 5205 -5948 -7643 3192 9172 252 -9364 -4077 7525 7021 -4772 -8520 775 8343
2998 8343 3151 -6550 -5765 3512 6985 -447 -7751 -3108 6057 6061 -4332 -8380 1017 8422 2465 -7381
3014 -7381 -5414 4205 6606 -1425 -7381 -2067 6056 4637 -4003 -6797 1333 7275 2102 -6415 -5303
3029e303R431L218q544o532O375Q541l257q845j004Q227M361n735p200K289Q516
3044D538J863q413m747N588P726k834q572j125Q781L632o351o407L920P766o27
3059D738p618k713N545N529k784o493q69O717L667n325o179L385P233m82o810
3074b459k826N758M755l491o023N24O277K384n105m753K806O172l9o412k903N703
3090C68N004l571o566J168O777J658n664m086L816N394q18o496j713N127M698
3105E096l454o057R78O239J864n828m501M552O034k404o129p06O167K884m180
3120E55m825J756N561J199n308l340L263N334j773n469o97N456L148m283n032
3135d455K019O108M22n531k979M007M193j717m575o82M727K634l813m573K010
$$ plain form
3029 -5303 4128 7346 -1198 -7730 -1355 7186 3929 -4916 -5920 2307 6668 933 -6267 -3978 4538
3044 4538 6401 -2012 -6759 -1171 6555 3721 -4851 -5976 2805 6437 86 -6321 -2401 5365 4738
3059 4738 -2880 -5593 -48 5481 2697 -3796 -4665 2052 5719 394 -5785 -2400 4833 4351 -2459
3074 -2459 -5285 473 5228 1737 -4286 -3762 2515 4899 -206 -4959 -2153 4019 3980 -2432 -5335 368
3090 368 5372 1801 -4765 -3597 3180 4838 -826 -4912 -1096 4298 3480 -3016 -4729 398 5096
3105 5096 1642 -4415 -3437 2802 4666 -1162 -5663 -1111 4923 2519 -3610 -4316 1851 4735 555
3120 555 -4270 -2514 3047 4246 -1062 -4402 -1139 4195 2422 -3047 -3744 1712 4860 577 -4455
3135 -4455 -2436 3672 4094 -1437 -4416 -409 3784 2067 -2508 -3190 1537 4171 358 -4215 -2205
3150b205N522J68n248k331M132L907j885n007p7M667K185l915l497K360M440j24
3166C092m957k022L989M137k230n163K81M775J624m041l030K821L708o10m034
3181a660j049L601K712k369m081M64L783J561k831l207J858L577M3m103o32L036
3197G03K154k147l288P83L149J230k921k042J215L379l92k846j242K200K231j288
3213H78k967Q5K843J441k400k003J255K357q1k177r03J325J579l75k279P0K054
3230G02J008j609j451M02K008L90j784j247J151J300j23j651k3Q26J014j84j575
3247h46k81R57J549q17k049K89J814J353j789j689O55K296J70k489j327K301J920
3264B017j583j950P9K297J397k102k171J171K884m65k431j039K013J932j041k228
$$ plain form
3150 -2205 3317 3485 -1763 -4094 38 3945 2060 -2947 -3024 1643 3828 -87 -3584 -1224 3216 3092
3166 3092 -1865 -3887 102 4239 2009 -3154 -2873 1902 3526 -515 -3545 -724 2984 2374 -1660
3181 -1660 -2709 892 3604 1235 -2846 -2382 1401 2962 131 -3076 -1218 2359 2402 -1701 -2333 703
3197 703 2857 710 -2578 -1795 1354 2584 -337 -2379 -1164 2215 1823 -1023 -2265 -65 2166 878
3213 878 -2089 -2004 839 2280 -120 -2123 -868 1489 1408 -769 -1672 -347 1232 857 -1422 -1352 702
3230 702 1710 101 -1350 -948 1060 1450 -334 -1581 -430 870 747 -904 -927 -101 913 729 -846
3247 -846 -1127 -170 1379 562 -1487 -1198 616 1969 180 -1509 -854 1442 1612 -877 -2204 97 2017
3264 2017 434 -1516 -1437 860 2257 155 -2016 -845 2039 1574 -857 -1896 117 2049 1008 -1220
3280a220l17K540R67j524k256Q44K585K21k382j638J890K371q85l240J51L476
3296A583J045k971k182J683K593k17k720r23K200J862p89k832j68K595J530j825
3312D64l074O68L875P73l890k112L446L060k071l928N39L866J562l705k699J913
3328a313M280q30l990j038L502K532k110m121O20M606N40l729k552L175L827j905
3344A494m137q2L740K231l635k892J458M260K10l967k100L200L423j646m210m10
3360c063M842J705l778l186K287M008p06l676j362L226K596j570l950K41L677
3375A291J962l056l558K083M156L6m650j516L476L501k775m294J115M023J258
3390C052l197k980J831L730L78m160k248L360M067k141n257O62N423J314m596
$$ plain form
3280 -1220 -1537 1003 1970 446 -1810 -966 1619 1840 -542 -2180 -290 2081 1196 -2044 -1893 1583
3296 1583 2628 -343 -2525 -842 1751 1534 -1186 -2109 91 1953 1164 -1668 -1836 759 2289 464
3312 464 -2610 -1942 1933 2706 -1184 -3296 150 3210 1139 -2789 -2250 1616 3178 -527 -3226 -1313
3328 -1313 2967 2137 -1853 -2891 611 3143 1033 -3088 -2468 2138 2678 -1051 -3603 -428 3399 1494
3344 1494 -2643 -2725 1015 3246 -389 -3281 -1823 2437 2647 -1320 -3420 -220 3203 1557 -2653 -3063
3360 -3063 1779 3484 -294 -3480 -1193 2815 2109 -1567 -2929 297 2893 1323 -2627 -2386 1291
3375 1291 3253 197 -3361 -1278 2878 2914 -1736 -3252 224 3725 950 -3344 -2229 1794 3052
3390 3052 -145 -3125 -1294 2436 2814 -1346 -3594 -234 3833 1692 -3565 -2903 2520 3834 -762
3405g62l204L255M728j834m957j53M087K287k752l770J069L958J495l815l620
3420c988L103M637j018n715p24N229K779l965m240K120M787J07m519k020K737
3435f90L974j305m641j038M673L435l396n293J774N893p7n157k174M097L581k269
3451A387m370qM166K553l378m093J314N090R46m878l509M042N177k183n852l5
3467c631N762K324m966l583K778M651l21m655k386L761M225j737n583n15O033
3482B157K430m835m678L300O128j044o282j275N086L626l772m612J238M987J436
3497C890m263m046K642N914o70o422j914O316L724m369n673K027O668L20o091
3512a947k479M449M336k383m984p60N138K941l659n297J980O610N23o724l040
$$ plain form
3405 -762 -3966 -711 4017 2183 -2774 -2927 1160 3447 695 -3075 -2006 1952 3447 -368 -3988
3420 -3988 -885 3752 2734 -2981 -3705 1524 4303 338 -3902 -1782 3005 3112 -1407 -3427 -690
3435 -690 3284 1979 -2662 -3700 973 4408 1012 -4281 -2507 3386 3309 -1848 -4022 75 3656 1387
3451 1387 -2983 -2991 1175 3728 350 -3743 -2429 2661 3607 -1271 -4780 -738 4439 2256 -3596 -3631
3467 -3631 2131 4455 -511 -4094 -1316 3335 3014 -1641 -4027 -266 3959 2222 -3361 -3876 2157
3482 2157 4587 -248 -4926 -1626 4502 3458 -2824 -4099 987 4613 841 -3771 -2533 2454 3890
3497 3890 -373 -4419 -1777 4137 3467 -2955 -4869 1447 5171 802 -4871 -2844 3824 4144 -1947
3512 -1947 -4426 23 4359 1976 -3008 -3768 1370 4311 652 -4645 -2665 3945 4468 -2256 -5296
3527e296N721M715l430n878J018N948J110m892l126K945M451l91m636k250M426
3542D35M032k609n988O36O213J695n762l366M266M509j965n220m80M789K746l221
3558G10m377O61N452J561n249l432L843N159j772o089n5N817K133m671m138L066
3574a381M851n61m675j753L648L750j933n334m7N573J818m666l814L423N370j441
3590B828n545p79M917K661l688m276J939M561L53l673k863K646M108n47m969j370
3606c697M347L346l282m475J970M462k0l930j862L185L203j474l706m21L241K191
3622C078k657l518Q32M571J046m403k322L605L281k147l980L02L861J040k313
3637B76k614J030L344M68l398k095K708L438j504m462L75L940K016l891k652K380
$$ plain form
3527 -5296 425 5140 1710 -4168 -3150 2798 3908 -984 -4110 -1165 3286 2895 -1741 -3991 435
3542 435 4467 1858 -4130 -3494 2719 4414 -1348 -4714 -448 4061 2096 -3124 -3604 1185 3931 710
3558 710 -3667 -3006 2446 4007 -1242 -4674 -831 4328 2556 -3533 -3588 2229 4362 -309 -4447 -1381
3574 -1381 3470 2909 -1766 -3519 129 3879 1946 -3388 -3435 2138 3956 -710 -4524 -1101 4269 2828
3590 2828 -2717 -3496 1421 4082 394 -3882 -1943 2618 2971 -702 -3565 -919 3189 2642 -2327 -3697
3606 -3697 650 3996 714 -3761 -1791 2671 2651 -1279 -3141 44 3247 1773 -1933 -2354 887 3078
3622 3078 421 -3097 -2265 2306 3352 -1051 -3373 232 3513 1366 -2614 -2312 1549 2589 276
3637 276 -2338 -1308 2036 2504 -894 -2989 -281 3157 1653 -2809 -2434 1506 3522 -369 -3021 -641
3653f41L196m43l874m67K281K176j093l400J23L250J514k775k822J956L560q71
3669A670l188j149L078K128k123k644R83K569N88k053j945J104K641P2k625j327
3685b221K315K520j619l129N84L131O03k796j675J625K532l37k588p99J950J978
3701B074j191k632j43L135R53k553k133J598L538r49l571n1L046J005j846k302
3717b022J031K244M33k174j196J582K067n06k694o59K665J630k298k244J410K553
3733A822m53k399k38J635J101q69j784K64J636R75j385k048J238J974o2k175o57
3750a425J660J233r81j804L73J629N74j656r19R78J604m42j646k75J145J549j444
3767A53j827R18J694L57j667r98J337J267p71j355l6J268O30j058j142K35J463
$$ plain form
3653 -641 2555 2112 -1762 -2229 52 2228 1135 -2265 -2142 1108 2622 -153 -2975 -1019 2541 1670
3669 1670 -1518 -2667 411 2539 416 -2228 -1245 1324 1912 -141 -2086 -982 1659 1731 -894 -2221
3685 -2221 94 2614 995 -2134 -1550 1581 2184 -612 -2287 -662 1870 1533 -1055 -1854 96 2074
3701 2074 883 -1749 -1892 1243 2196 -357 -2490 -892 2646 1697 -1874 -1925 1121 2126 280 -2022
3717 -2022 -991 1253 1686 -488 -1684 -102 1965 1459 -1235 -1894 771 2401 103 -2141 -731 1822
3733 1822 1369 -1030 -1268 367 1468 599 -1185 -921 715 1690 305 -1743 -505 1469 1407 -768 -1425
3750 -1425 235 1468 487 -1317 -944 685 1259 -397 -1316 -338 1266 824 -822 -1097 48 1597 153
3767 153 -1674 -756 938 1295 -372 -1370 -33 1234 463 -892 -928 340 970 -88 -1230 -995 468
3784D68N94j273j018J181J109n00j888M86J428K85j010p76Q39P97k60q43o59R23
3802a17R00m77q60q4N79M94j54r54R4J148j57r75o3P76O35o52o16J89J43L12j04
3823E7k13k25O28L14k33p20j09J018j64n45l48O12M46j93n18k89L67L09M5n99
3843c60j44N60O30n13p06M24O68J05j151J26M86K34J99r17l17P59N36j22q66l39
3863g08J015O05j076o60N78R24j81j222j10R52O89n92p12k95Q11Q51r64q87P41
3882b41R91J09j577n82J777R13q35j918M19J339O33j419q77J023J130n31q96o58
3900a200J304J155r21j849N68J688O82j263j779J115K020n34k044k86J882Q01
3916A339j417j155O60J209P52j863r34J143J825n69k035m37J986R50j505j239
$$ plain form
3784 468 1062 -211 -1229 -48 1061 561 -1327 -841 587 872 -138 -914 -75 722 462 -381 -1040 -117
3802 -117 783 306 -554 -638 -59 435 281 -673 -579 569 412 -563 -626 150 785 133 -483 -294 -151 161 57
3823 57 -156 -381 247 561 328 -392 -501 517 353 -192 -540 72 518 325 -193 -482 -115 194 239 -360
3843 -360 -504 56 686 173 -533 -109 559 664 -487 -361 125 359 558 -359 -676 83 619 497 -369 -708
3863 -708 307 912 -164 -824 -246 678 497 -725 -835 117 806 214 -498 -793 18 869 -95 -982 -241
3882 -241 750 859 -718 -1300 477 1390 555 -1363 -944 395 1028 -391 -1268 -245 885 354 -542 -1200
3900 -1200 104 1259 338 -1511 -943 745 1427 164 -1615 -500 1520 986 -1058 -1344 538 1339
3916 1339 -78 -1233 -573 636 1388 -475 -1409 -266 1559 990 -1045 -1482 504 1454 -51 -1290
3932a290N06J959P2j890q82J626J545r60j843PJ469J309j314j748Q20J955j73
3949A168k258l4J556J051j405j281M51J322P76j402j098O49J479N71j898j452
$$ plain form
3932 -1290 -784 1175 1247 -643 -1525 101 1646 686 -1157 -1150 319 1628 314 -1434 -614 1341 1168
3949 1168 -1090 -1124 432 1483 78 -1203 -752 570 1346 -56 -1154 -505 974 1545 -353 -1805
$$ [...]
8191A99
##END NTUPLES=NMR FID
##END=
