##TITLE=1H_IAMT-145
 CDCl3, 108 sc, 
 31.05.2021
##JCAMPDX= 6.0         $$ Bruker NMR JCAMP-DX V2.0
##DATA TYPE= NMR FID
##DATA CLASS= NTUPLES
##ORIGIN= UXNMR, Bruker Analytische Messtechnik GmbH
##OWNER= root
$$ XWIN-NMR		Version 3.5
$$ Mon May 31 13:16:39 2021 Russian Standard Time (UT+4h)  she@DPX200
##.OBSERVE FREQUENCY= 200.131506
##.OBSERVE NUCLEUS= ^1H
##.DELAY= (6, 6)
##.ACQUISITION MODE= SIMULTANEOUS
##.ACQUISITION SCHEME= undefined
##.AVERAGES= 108
##.DIGITISER RES= 18
##SPECTROMETER/DATA SYSTEM= spect
##.PULSE SEQUENCE= zg30
##.SOLVENT NAME= CDCl3
##.SHIFT REFERENCE= (INTERNAL, CDCl3, 0, 15.7039)
##AUDIT TRAIL= $$ (NUMBER, WHEN, WHO, WHERE, WHAT)
$$ ##TITLE= Audit trail, XWIN-NMR		Version 3.5
$$ ##JCAMPDX= 5.01
$$ ##ORIGIN= Bruker BioSpin GmbH
$$ ##OWNER= she
$$ F:/spectra/data/she/nmr/H-F/1/audita.txt
$$ ##AUDIT TRAIL=  $$ (NUMBER, WHEN, WHO, WHERE, WHAT)
(   1,<2021-05-31 13:14:47.75 +0400>,<she>,<DPX200>,
      <continue with go, POWCHK disabled, PULCHK disabled
       configuration hash MD5:
       00 E9 B6 7A A2 85 ED C7 34 08 36 98 17 FE 4E 26
       data hash MD5: 16K
       A8 30 C1 0E C2 5F B6 E5 6D E4 A2 25 22 89 23 5E>)
$$ ##END=
$$ 
$$ hash MD5
$$ 1A 99 E7 FF 18 F4 AF E9 B9 9F 37 53 08 A2 E0 F1
##$RELAX= 
##$RELAX= 
##$RELAX= 
##$RELAX= 
##$RELAX= 
##$RELAX= 
$$ Bruker specific parameters
$$ --------------------------
##$DU= <F:/spectra>
##$EXPNO= 1
##$NAME= <H-F>
##$PROCNO= 1
##$TYPE= <nmr>
##$USER= <she>
##$AMP= (0..31)
100 100 100 100 100 100 100 100 100 100 100 100 100 100 100 100 100 100 
100 100 100 100 100 100 100 100 100 100 100 100 100 100 
##$AQSEQ= 0
##$AQ_mod= 1
##$AUNM= <au_zg>
##$AUTOPOS= <>
##$BF1= 200.13
##$BF2= 200.13
##$BF3= 200.13
##$BF4= 200.13
##$BF5= 200.13
##$BF6= 200.13
##$BF7= 200.13
##$BF8= 200.13
##$BYTORDA= 1
##$CFDGTYP= 0
##$CFRGTYP= 5
##$CHEMSTR= <none>
##$CNST= (0..31)
1 1 145 1 1 1 1 1 1 1 1 1 1 1 1 1 1 1 1 1 1 1 1 1 1 1 1 1 1 1 1 1 
##$CPDPRG= <>
##$CPDPRG1= <>
##$CPDPRG2= <>
##$CPDPRG3= <>
##$CPDPRG4= <mlev>
##$CPDPRG5= <mlev>
##$CPDPRG6= <mlev>
##$CPDPRG7= <mlev>
##$CPDPRG8= <mlev>
##$CPDPRGB= <>
##$CPDPRGT= <>
##$D= (0..31)
0 1.2 0 0 0 0 0 0 0 0.06 0 0.03 0 0 0 0 0.0002 0 0 0 0 0 0 0 0 0 0 0 0 
0 0 0 
##$DATE= 1622452063
##$DBL= (0..7)
120 120 120 120 120 120 120 120 
##$DBP= (0..7)
150 150 150 150 150 150 150 150 
##$DBP07= 0
##$DBPNAM0= <>
##$DBPNAM1= <>
##$DBPNAM2= <>
##$DBPNAM3= <>
##$DBPNAM4= <>
##$DBPNAM5= <>
##$DBPNAM6= <>
##$DBPNAM7= <>
##$DBPOAL= (0..7)
0.5 0.5 0.5 0.5 0.5 0.5 0.5 0.5 
##$DBPOFFS= (0..7)
0 0 0 0 0 0 0 0 
##$DE= 6
##$DECBNUC= <off>
##$DECIM= 32
##$DECNUC= <off>
##$DECSTAT= 4
##$DIGMOD= 1
##$DIGTYP= 9
##$DL= (0..7)
0 120 120 120 120 120 120 120 
##$DP= (0..7)
150 150 150 150 150 150 150 150 
##$DP07= 0
##$DPNAME0= <>
##$DPNAME1= <>
##$DPNAME2= <>
##$DPNAME3= <>
##$DPNAME4= <>
##$DPNAME5= <>
##$DPNAME6= <>
##$DPNAME7= <>
##$DPOAL= (0..7)
0.5 0.5 0.5 0.5 0.5 0.5 0.5 0.5 
##$DPOFFS= (0..7)
0 0 0 0 0 0 0 0 
##$DQDMODE= 0
##$DR= 18
##$DS= 0
##$DSLIST= <SSSSSSSSSSSSSSS>
$$ [...]
##$SUBNAM2= <"">
##$SUBNAM3= <"">
##$SUBNAM4= <"">
##$SUBNAM5= <"">
##$SUBNAM6= <"">
##$SUBNAM7= <"">
##$SUBNAM8= <"">
##$SUBNAM9= <"">
##$SW= 16.9725357007746
##$SWIBOX= (0..15)
0 0 2 0 0 0 0 0 0 0 0 0 0 0 0 0 
##$SW_h= 3396.73913043478
##$TD= 16384
##$TD0= 1
##$TE= 0
##$TE2= 300
##$TE3= 300
##$TEG= 300
##$TL= (0..7)
0 120 120 120 120 120 120 120 
##$TP= (0..7)
150 150 150 150 150 150 150 150 
##$TP07= 0
##$TPNAME0= <>
##$TPNAME1= <>
##$TPNAME2= <>
##$TPNAME3= <>
##$TPNAME4= <>
##$TPNAME5= <>
##$TPNAME6= <>
##$TPNAME7= <>
##$TPOAL= (0..7)
0.5 0.5 0.5 0.5 0.5 0.5 0.5 0.5 
##$TPOFFS= (0..7)
0 0 0 0 0 0 0 0 
##$TUNHIN= 0
##$TUNHOUT= 0
##$TUNXOUT= 0
##$USERA1= <user>
##$USERA2= <user>
##$USERA3= <user>
##$USERA4= <user>
##$USERA5= <user>
##$V9= 5
##$VALIST= <valist>
##$VCLIST= <CCCCCCCCCCCCCCC>
##$VD= 0
##$VDLIST= <DDDDDDDDDDDDDDD>
##$VPLIST= <PPPPPPPPPPPPPPP>
##$VTLIST= <TTTTTTTTTTTTTTT>
##$WBST= 1024
##$WBSW= 4
##$XGAIN= (0..3)
0 0 0 0 
##$XL= 0
##$YL= 0
##$YMAX_a= 3915640
##$YMIN_a= -3286997
##$ZGOPTNS= <>
##$ZL1= 120
##$ZL2= 120
##$ZL3= 120
##$ZL4= 120
##$ABSF1= 10
##$ABSF2= 0
##$ABSG= 5
##$ABSL= 3
##$ALPHA= 0
##$AQORDER= 0
##$ASSFAC= 0
##$ASSFACI= 0
##$ASSFACX= 0
##$ASSWID= 0
##$AUNMP= <proc_1d>
##$AZFE= 0.1
##$AZFW= 0.1
##$BCFW= 1
##$BC_mod= 2
##$BYTORDP= 1
##$COROFFS= 0
##$CY= 11.3945322036743
##$DATMOD= 1
##$DC= 2
##$DFILT= <>
##$DTYPP= 0
##$F1P= 15.9154993809931
##$F2P= -4.1035820241983
##$FCOR= 0.5
##$FTSIZE= 0
##$FT_mod= 4
##$GAMMA= 1
##$GB= 0.15
##$INTBC= 1
##$INTSCL= 1
##$ISEN= 128
##$LB= 0.24
##$LEV0= 0
##$LPBIN= 0
##$MAXI= 10000
##$MC2= 0
##$MEAN= 0
##$ME_mod= 0
##$MI= 1.114404
##$NCOEF= 0
##$NC_proc= 0
##$NLEV= 6
##$NOISF1= 3.799351
##$NOISF2= 2.8
##$NSP= 1
##$NTH_PI= 0
##$NZP= 0
##$OFFSET= 15.70392
##$PC= 1
##$PHC0= -11123.89
##$PHC1= 16.80099
##$PH_mod= 1
##$PKNL= yes
##$PPARMOD= 0
##$PSCAL= 0
##$PSIGN= 0
##$REVERSE= no
##$SF= 200.130013532006
##$SI= 16384
##$SIGF1= 3
##$SIGF2= 2
##$SINO= 400
##$SIOLD= 16384
##$SREGLST= <1H.CDCl3>
##$SSB= 0
##$STSI= 0
##$STSR= 0
##$SW_p= 3612.71676300578
##$SYMM= 0
##$S_DEV= 0
##$TDeff= 0
##$TDoff= 0
##$TI= <>
##$TILT= no
##$TM1= 0
##$TM2= 0
##$TOPLEV= 0
##$USERP1= <user>
##$USERP2= <user>
##$USERP3= <user>
##$USERP4= <user>
##$USERP5= <user>
##$WDW= 1
##$XDIM= 8192
##$YMAX_p= 0
##$YMIN_p= 0
$$ End of Bruker specific parameters
$$ ---------------------------------
##NTUPLES= NMR FID
##VAR_NAME=  TIME,          FID/REAL,        FID/IMAG
##SYMBOL=    X,             R,               I
##VAR_TYPE=  INDEPENDENT,   DEPENDENT,       DEPENDENT
##VAR_FORM=  AFFN,          ASDF,            ASDF
##VAR_DIM=   8192,          8192,            8192
##UNITS=     SECONDS,       ARBITRARY UNITS, ARBITRARY UNITS
##FACTOR=    0.0002944,     1,               1
##FIRST=     0,             0,               0
##LAST=      2.4114304,     0,               0
##MIN=       0,             -3286997,        0
##MAX=       2.4114304,     3915640,         0
$$ Real data points
##PAGE= N=1
##DATA TABLE= (X++(R..R)), XYDATA
$$ plain form
0 0 0 0 0 0 0 0 0 0 0 0 0 0 -108 108 -108 108 -215 216 -216 324 -329 432 -540 624 -752 862 -973 1085
28 1085 -1297 1461 -1644 1896 -2164 2422 -2729 3084 -3455 3860 -4311 4815 -5348 5925 -6580
43 -6580 7275 -8035 8878 -9792 10790 -11878 13089 -14430 15887 -17514 19342 -21393
55 -21393 23696 -26344 29398 -32969 37197 -42327 48682 -56770 67476 -82374 104511
66 104511 -140880 210861 -393957 1872589 3915640 -1514415 -2803697 464766 3630430
75 3630430 1015461 -2725649 -1257511 2546085 2098289 -1216284 -2556473 647339 2945623
84 2945623 -3600 -2805192 -787095 2499998 1354062 -2231600 -1816627 1608601 2227240
93 2227240 -998569 -2170443 222925 2285801 825270 -1927810 -1246779 1741975 1951863
$$ packed form
0@%%%%%%%%%%%%j08K16k16K16l23M31m32N40o53P61r72J164j376J614j835K058
28A085k382K758l105L540m060M586n151N813o539P315q171R126j0163J1273j2505
43f580J3855j5310J6913j8670K0582k2668K4967k7519L0317l3401L6856m0735
55b1393M5089n0040N5742o2367P0166p9524R1009j05452J24246j49850J86885
66A04511k45391L51741o04818K266546K043051n430055j289282L268463L165664
75C630430k614969l741110J468138L803596m47796l314573j340189L203812K298284
84B945623k949223k801592K018097L287093j145936l585662M14973L425228O18639
93B227240l225809j171874K393368K062876j460531k753080O81031K988754K09888
$$ plain form
102 1951863 -867050 -2051140 321368 2539435 326783 -2228620 -643976 1721617
110 1721617 1420145 -1316379 -1759686 909649 1765539 -318921 -1824744 -415618 1773713
119 1773713 876589 -1788925 -1241589 1283619 1576131 -880338 -1983791 482004 1989313
128 1989313 124650 -1930088 -634285 1777493 1212330 -1257493 -1511644 938789 1817700
137 1817700 -228285 -1741949 -148868 1719948 758973 -1379962 -1077108 1149522 1257257
146 1257257 -617110 -1459093 212280 1508031 66349 -1348171 -501637 1157894 848661
155 848661 -877274 -1055981 647762 1215185 -110432 -1096180 -227134 1285712 646626
164 646626 -877057 -782147 719429 1192386 -322094 -1121320 61917 1176024 295908
$$ packed form
102A951863k818913j184090K372508K218067k212652k555403J584644K365593
110A721617l01472k736524m43307K669335Q55890k084460j505823J409126K189331
119A773713q97124k665514N47336K525208K92512k456469j103453K465795J507309
128A989313j864663k054738J295803K411778n65163k469823k54151K450433Q78911
137A817700k045985j513664J593081J868816r60975k138935L02854K226630J07735
146A257257j874367q41983J671373J295751j441682j414520Q46534J659531l09233
155H48661j725935j78707J703743N67423j325617r85748Q69046J512846o39086
164F46626j523683R4910J501576M72957j514480p99226J183237J114107q80116
$$ plain form
173 295908 -983693 -589545 789768 796749 -583489 -951068 185727 1052048 -3226
182 -3226 -1095425 -329415 988108 593734 -959517 -768401 731833 973919 -484828
191 -484828 -1060740 234484 1129675 136346 -1075090 -384647 948900 777630 -778129
200 -778129 -982441 552729 1107820 -222670 -1248402 -45636 1148886 312626 -1066430
209 -1066430 -616497 839173 771347 -566979 -956508 289424 1002494 86550 -991397
218 -991397 -323330 990245 621470 -684711 -802840 594394 1007969 -228624 -939488
227 -939488 -4179 976785 355404 -768958 -615451 652007 812010 -346612 -938183
236 -938183 42241 1040454 206003 -947789 -483900 853787 708594 -610570 -855963
$$ packed form
173B95908j279601L94148J379313O981j380238l67579J136795Q66321j055274
182c226j092199P66010J317523l94374j553251J91116J500234K42086j458747
191d84828n75912J295224Q95191r93329j211436O90443J333547j71270j555759
200g78129k04312J535170N55091j330490j025732J202766J194522q36260j379056
209a066430M49933J455670o7826j338326l89529J245932P13070r15944j077947
218i91397O68067J313575l68775j306181j18129J397234M13575j236593p10864
227i39488R35309R80964o21381j124362J53507J267458J60003j158622n91571
236i38183R80424R98213q34451j153792M63889J337687j45193j319164k45393
$$ plain form
245 -855963 359465 1024597 -85229 -965453 -232246 948650 530980 -836632 -763749
254 -763749 643537 950229 -460022 -1043773 106175 1090929 133461 -1084099 -403081
263 -403081 865543 670259 -714129 -895334 424911 1016179 -185678 -1075800 -141082
272 -141082 956258 423400 -934696 -651119 659795 745475 -443980 -922229 117118
281 117118 864903 131914 -883871 -389161 682980 593535 -506769 -794619 329536
290 329536 834885 -49939 -836692 -184163 750885 441464 -596004 -639706 422204 715648
300 715648 -124244 -828228 -132079 823481 340464 -714510 -564691 564237 703341 -321817
310 -321817 -815544 140596 830678 113578 -726064 -385859 681049 572767 -506434 -717338
$$ packed form
245h55963J215428O65132j109826q80224P33207J180896m17670j367612P2883
254g63749J407286L06692j410251n83751J149948R84754r57468j217560O81018
263d03081J268624j95284j384388j81205J320245N91268j201857q90122R34718
272a41082J097340n32858j358096K83577J310914Q5680j189455m78249J039347
281A17118P47785p32989j015785M94710J072141q9445j100304k87850J124155
290C29536N05349q84824p86753O52529R35048l09421j037468m3702J061910K93444
300G15648q39892p03984O96149R55560m83017j054974J49819J128928J39104j025158
310c21817m93727R56140O90082p17100q39642L40205J066908j08282j079201k10904
$$ plain form
320 -717338 318167 800096 -116162 -831085 -130826 821004 263873 -693045 -468953 507726
330 507726 612450 -354822 -685373 114691 718029 60469 -678053 -299098 586905 440626
340 440626 -523116 -538153 278890 571846 -160823 -625507 -72361 522459 184989 -494893
350 -494893 -355549 279041 466618 -205269 -548464 37295 507403 126782 -508711 -259652
360 -259652 403048 377837 -309358 -441828 129622 454886 45243 -515948 -181762 417966
370 417966 305064 -371171 -454761 246539 497388 -133413 -563617 10569 504721 153300
380 153300 -465324 -281499 415811 383352 -251019 -464616 168100 529055 12141 -515843
390 -515843 -103269 526829 217279 -407675 -326276 352323 392214 -231899 -434425 81793
$$ packed form
320g17338J035505M81929r16258p14923P00259R51830n57131r56918K24092R76679
330E07726J04724r67272l30551Q00064O03338o57560p38522L78955Q86003j46279
340D40626r63742j5037Q17043K92956p32669m64684N53146N94820l37470o79882
350d94893J39344O34590J87577o71887l43195N85759M70108l80621o35493K49059
360b59652O62700k5211o87195j32470N71450L25264m09643n61191L34186N99728
370D17966j12902o76235q3590P01300K50849o30801m30204N74186M94152l51421
380A53300o18624J83825O97310l2459o34371k13597O32716L60955n16914n27984
390e15843M12574O30098l09550o24954Q1399O78599L9891o24113k02526N16218
$$ plain form
400 81793 438416 10912 -423695 -195776 374526 240764 -335371 -350523 179013 387117
410 387117 -132171 -405891 -21877 366930 95845 -317943 -210161 218377 299248 -161758
420 -161758 -325811 9994 346957 73681 -369620 -179235 268482 240673 -257285 -331647
430 -331647 91574 328351 -42279 -387995 -124411 293535 216900 -322636 -325778 197604
440 197604 380336 -120686 -451769 23752 432995 109034 -412198 -191570 343048 308348
450 308348 -240992 -379986 163371 416303 -9823 -451996 -82902 427432 190664 -379482
460 -379482 -301073 320604 326651 -208459 -400673 82760 394681 15324 -381435 -159718
470 -159718 321815 228962 -239365 -350777 162378 369582 -73853 -354754 -71880 357013
$$ packed form
400H1793L56623m27504m34607K27919N70302j33762n76135j5152N29536K08104
410C87117n19288k73720L84014L88807k71085m13788J07782M28538Q0871m61006
420a61758j64053L35805L36963k73276m43301J90385M47717k7809m97958p4362
430c31647M23221K36777l70630l45716K63584M17946p6635n39536l142N23382
440A97604J82732n01022l31083M75521M09243l23961n21232K20628N34618l4700
450C08348n49340j38994N43357K52932m26126m42173L69094N10334k36768n70146
460c79482P8409O21677O047n35110j92214M83433L11921l79357l96759K21717
470a59718M81533r2853m68327j11412N13155K07204m43435k80901K82874M28893
$$ plain form
480 357013 143738 -285009 -218383 194987 275953 -87654 -318511 -41886 337210 98359
490 98359 -298680 -243211 214204 291291 -197304 -356533 32527 340737 14912 -356004
500 -356004 -180843 266081 248154 -240633 -336208 106534 382965 -37053 -401833 -84905
510 -84905 388610 176684 -360868 -235766 242726 320514 -174355 -369235 65444 349970
520 349970 40685 -366120 -154801 304404 242993 -277041 -292269 176737 320750 -67134
530 -67134 -351765 18685 312506 100540 -246307 -168375 211737 238443 -99608 -256333
540 -256333 50306 268221 64779 -256551 -105051 231938 155072 -139594 -215333 92539
550 92539 214835 -5262 -214293 -87963 196865 138369 -153354 -224309 106565 241473
$$ packed form
480C57013k13275m28747O6626M13370Q0966l63607k30857K76625L79096k38851
490I8359l97039N5469M57415P7087m88595j59229L89060L08210l25825l70916
500c56004J75161M46924j7927m88787r5575M42742K76431m20018l64780L16928
510h4905M73515k11926n37552J25102M78492P7788m94869j94880M34679K84526
520C49970l09285m06805K11319M59205o1411n20034j5228M69006J44013l87884
530f7134k84631L70450K93821k11966l46847P7932L80112K6706l38051j56725
540b56333L06639K17915k03442l21330J51500L36989p6866k94666p5739L07872
550I2539J22296k20097k09031J26330K84828n8496k91723p0955L30874J34908
$$ plain form
560 241473 -45072 -268058 -37201 246116 81546 -206378 -175170 167403 183921 -106978
570 -106978 -229161 4021 258048 18591 -260419 -102296 221241 129457 -206557 -206147 145690
581 145690 213662 -133346 -221976 7688 218200 31626 -234233 -91344 171496 144382
591 144382 -152194 -180446 95296 211896 -55832 -203835 21264 183102 48506 -164707
601 -164707 -58459 126211 111577 -74242 -124898 50787 131659 29374 -145911 -42160
611 -42160 139912 81278 -100055 -107164 81154 125743 -19926 -133517 1296 112151 70338
622 70338 -84452 -121221 90796 136635 -27763 -159631 -662 174783 43016 -154905
632 -154905 -76226 145121 98748 -91577 -147308 67828 159867 -29399 -171380 -46747 184786
$$ packed form
560B41473k86545k22986K30857K83317j64570k87924L1208L42573J6518k90899
570a06978j22183K33182K54027k39457k79010J58123L23537r1784l36014M10L51837
581A45690O7972l47008q8630K29664K10512j86574k65859J42889K62840k7114
591A44382k96576k8252K75742J16600k67728j48003K25099J61838j34596k13213
601a64707J06248J84670j4634j85819n0656J75685Q0872j02285j75285J03751
611d2160J82072n8634j81333p109J88318M4589j45669j13591J34813J10855m1813
622G0338j54790l6769K12017M5839j64398j31868J58969J75445j31767j97921
632a54905P8679K21347m6373j90325n5731K15136R2039j89266j41981J24633K31533
$$ plain form
643 184786 56849 -179238 -125989 145653 141729 -138971 -181669 62441 187750 -44660 -186289
654 -186289 -37631 161960 71197 -158230 -115232 99323 157793 -88730 -171564 30619 166209
665 166209 9822 -174416 -41537 130930 82099 -114053 -105750 57451 126718 -6801 -142808
676 -142808 -22811 120419 91235 -108426 -104845 89836 134962 -23831 -139217 3427 138504
687 138504 75867 -109594 -96476 85626 147930 -22980 -174080 9214 176694 63924
697 63924 -164286 -95679 154910 135907 -95782 -160083 70354 172687 6818 -179542 -46259
708 -46259 182490 94843 -143154 -151128 128867 165665 -82178 -194080 31012 188857 -2406
719 -2406 -171449 -75149 148243 92792 -117519 -138588 57053 152365 -32700 -161133 -31887
$$ packed form
643A84786j27937k36087N3249K71642l924k80700m2698K44110J25309k32410j41629
654a86289J48658J99591r0763k29427M2998K14555N8470k46523q2834K02183J35590
665A66209j56387j84238J32879J72467m8831j96152Q303J63201O9267j33519j36007
676a42808J19997J43230k9184j99661L581J94681M5126j58793j15386J42644J35077
687A38504o2637j85461J3118J82102O2304j70910j51100J83294J67480j12770
697F3924k28210O8607K50589j9003k31689o4301K30437J02333j65869j86360J33283
708d6259K28749q7647k37997p974K79995L6798k47843j11902K25092J57845j91263
719b406j69043R6300K23392n5451k10311k1069J95641R5312j85065j28433J29246
$$ plain form
730 -31887 158733 44009 -136717 -87055 85150 110067 -73689 -113149 7478 107669 22256
741 22256 -105694 -75907 77980 107156 -70973 -114584 15046 137080 12321 -131499 -36500
752 -36500 106826 89549 -80032 -98998 39261 142007 6923 -135810 -29558 135968
762 135968 97575 -122990 -99119 104341 139861 -60441 -133489 40242 141150 27928 -136312
773 -136312 -32036 125380 84442 -87461 -113569 83505 132288 -40847 -143376 28213
783 28213 135610 12840 -125732 -43482 120962 49654 -75688 -82921 49235 89406 -22232
794 -22232 -94038 -13840 93596 17975 -77479 -59319 67270 54307 -60727 -61109 16568 57815
806 57815 -17782 -54804 -30263 43494 32880 -44729 -57520 4392 76354 -13369 -79095 -17483
$$ packed form
730c1887J90620j14724j80726M9662J72205K4917j83756l9460J20627J00191q5413
741B2256j27950K9787J53887K9176j78129m3611J29630J22034j24759j43820R4999
752c6500J43326j7277j69581j8966J38259J02746j35084j42733J06252J65526
762A35968l8393k20565K3871K03460L5520k00302p3048J73731J00908j13222j64240
773a36312J04276J57416m0938j71903k6108J97074M8783j73135j02529J71589
783B8213J07397j22770j38572Q2250J64444p1308j25342p233J32156M0171j11638
794b2232p1806Q0198J07436p5621r5454J8160J26589j2963j15034l82P7677M1247
806E7815p5597l7022K4541P3757j0614p7609j2791O1912P1962q9723o5726O1612
$$ plain form
818 -17483 69263 30302 -63798 -47666 41459 76133 -29360 -67077 -4187 85286 41496 -87730
830 -87730 -39275 79005 79270 -66472 -80708 55509 104164 -24840 -100788 18366 94961
841 94961 32973 -94251 -41240 88679 75846 -54713 -94197 59172 108228 -10630 -108903
852 -108903 6697 116757 25342 -84515 -41904 86705 60222 -41070 -74692 30266 81502
863 81502 -1147 -71593 -34790 84767 38099 -62650 -58341 40465 66907 -27782 -64089 -9296
875 -9296 63369 18085 -45534 -57929 30343 71469 -23617 -75655 -23414 86617 25394 -81502
887 -81502 -54244 54804 71242 -45544 -85062 3373 96133 13977 -91418 -54122 84003
898 84003 83060 -82661 -89580 47256 117494 -28991 -117503 5490 111084 37015 -103028
$$ packed form
818a7483Q6746l8961r4100J6132Q9125L4674j05493l7717O2890Q9473m3790j29226
830h7730M8455J18280K65j45742j4236J36217M8655j29004p5948J19154P6595
841I4961o1988j27224N3011J29919j2833j30559l9484J53369M9056j18858r8273
852a08903J15600J10060r1415j09857M2611J28609k6483j01292l3622J04958N1236
863H1502q2649p0446L6803J19557m6668j00749M309R8806K6442r4689l6307N4793
875i296P2665m5284o3619j2395Q8272M1126r5086n2038N2241J10031o1223j06896
887h1502K7258J09048J6438j16786l9518Q8435R2760q2156j05395L7296J38125
898H4003r43j65721o919J36836P0238j46485q8512J22993J05594p4069j40043
$$ plain form
909 -103028 -48925 82067 89240 -57655 -93320 38321 115277 7088 -115339 -8199 103975
920 103975 55592 -83514 -60340 77989 72734 -25963 -77975 12639 80108 26279 -70479 -39354
932 -39354 58182 59272 -30222 -81256 30532 68380 3224 -62236 -31052 58123 38631 -28569
944 -28569 -63691 12272 65518 13933 -76825 -40460 69869 44608 -54928 -80566 41098 69407
956 69407 -23709 -81139 -18801 79389 21036 -69864 -63009 53769 73505 -44047 -88793 16541
968 16541 96924 -8722 -87839 -20678 91619 31156 -72101 -40678 44290 70264 -36524
979 -36524 -62846 13354 70884 12191 -70019 -21720 67497 41901 -57698 -31569 36512 52079
991 52079 -18018 -46404 19059 33601 18118 -30391 -20481 25914 37214 -8778 -39107 11109
$$ packed form
909a03028N4103J30992P173j46895l5665J31641P6956j08189j22427J07140J12174
920A03975m8383j39106K3174J38329n255r8697n2012R0614O7469n3829r6758L1125
932c9354R7536J090q9494n1034J11788L7848o5156o5460L1184Q9175j9492o7200
944b8569l5122P5963N3246n1585r0758L6365J10329k5261r9536k5638J21664K8309
956F9407r3116n7430O2338R8190n8353r0900O855J16778J9736j17552m4746J05334
968A6541Q0383j05646p9117O7161J12297o0463j03257L1423Q4968K5974j06788
979c6524k6322P6200N7530n8693q2210M8299Q9217k5596r9599K6129O8081J5567
991E2079p0097k8386O5463J4542j5483m8509R910M6395J1300m5992l0329N0216
$$ plain form
1003 11109 38348 13350 -39282 -10199 29402 23806 -12678 -33124 7831 26355 18767 -40743
1015 -40743 -24102 35063 30979 -28542 -53156 25774 46786 -18469 -60104 4364 45269 6498
1027 6498 -50477 -37855 46583 27960 -33447 -57493 15635 62532 -20705 -68807 -5821 68218
1039 68218 2354 -64432 -27439 56241 31241 -51363 -35975 22923 52030 -20923 -51852 296
1051 296 55032 17124 -59768 -19012 45568 40974 -40618 -36397 30741 43155 -8007 -39684 7196
1064 7196 33201 27014 -26911 -22681 22857 39084 2910 -44018 6176 41787 18950 -33330
1076 -33330 -19226 29580 34310 -5422 -41175 3509 38535 25767 -43558 -35742 43101 44825
1088 44825 -26798 -63536 22128 59730 -1383 -65359 -15251 59699 25531 -47073 -54571 38985
$$ packed form
1003A1109K7239k4998n2632K9083L9601n596l6484k0446M0955J8524p588n9510
1015d0743J6641N9165m084n9521k4614P8930K1012o5255m1635O4468M0905l8771
1027F498n6975J2622Q4438j8623o1407k4046P3128M6897q3237m8102O2986P4039
1039F8218o5864o6786L6993Q3680k5000q2604J5388N8898K9107p2953l0929N2148
1051B96N4736l7908p6892M0756O4580m594q1592M221O7138J2414n1162l1677M6880
1064G196K6005o187n3925M230M5538J6227l6174m6928N0194L5611k2837n2280
1076c3330J4104M8806M730l9732l5753M4684L5026j2768o9325P816P8843J724
1088D4825p1623l6738Q5664L7602o1113o3976N0108P4950l4168p2604p498R3556
$$ plain form
1100 38985 55389 -23294 -73364 -989 73480 847 -71267 -33000 65334 28551 -55940 -49562
1112 -49562 30910 53768 -25790 -53427 -8669 55440 14144 -52047 -32721 37609 42956 -36333
1124 -36333 -41768 12517 46828 -2881 -37146 -5376 26557 26482 -17484 -23365 3092 41454 11629
1137 11629 -32022 -11388 31965 37710 -23493 -23449 14461 42395 6639 -32071 -10344 32869 39646
1150 39646 -25976 -33846 17776 55530 -2213 -53212 2439 52240 21884 -48160 -21703 38201
1162 38201 38459 -24872 -43373 16051 43333 6201 -54259 -12927 44845 21863 -42727 -36534
1174 -36534 34417 27820 -23264 -41627 12498 29001 -5416 -29379 -16783 20550 10081 -14583
1186 -14583 -30248 6525 21546 -5122 -25136 -10723 22392 850 -9796 -14034 2206 11228
$$ packed form
1100C8985J6404p8683n0070P2375P4469p2633p2114L8267R8334l6783q4491O378
1112d9562Q0472K2858p9558k7637M4758O4109m1296o6191J9326P0330N347p9289
1124c6333n435N4285L4311m9709l4265L1770L1933p5m3966n881K6457L8362k9825
1137A1629m3651K0634M3353N745o1203M4L7910K7934l5756l8710K1727M3213O777
1150C9646o5622p870N1622L7754n7743n0999N5651M9801l0356p0044K6457N9904
1162C8201K58o3331j8501N9424K7282l7132o0460M1332N7772k2982o4590O193
1174c6534P0951o597n1084j8363N4125J6503l4417k3963J2596L7333j0469k4664
1186a4583j5665L6773J5021k6668k0014J4413L3115k1542j0646m238J6240R022
$$ plain form
1198 11228 3892 -10571 -17661 15270 20143 -3698 -28984 7702 31503 1601 -18574 -8928 29781
1211 29781 14505 -11636 -16446 14014 31363 -48 -23934 -5056 42438 10083 -27288 -10197
1223 -10197 35139 24660 -29733 -13750 25333 30547 -17390 -20044 10083 27421 4882 -28557
1235 -28557 -1036 23406 17759 -25606 -16785 22896 20224 -16537 -23961 19974 12491 -7260 -19877
1248 -19877 4060 14782 -5793 -9996 -10904 8104 2435 -7305 -17000 1006 9513 -9264 -12593
1261 -12593 -8653 8206 -5349 -7188 -6202 -5330 1306 28 -2427 -16862 4963 10264 -2125 -18857
1275 -18857 -3009 19800 -922 -13563 -9144 16795 6496 -7375 -13500 7057 23360 -5349
1287 -5349 -16536 -3960 31718 6827 -27215 -5940 29031 18495 -25024 -11461 20871 26494
$$ packed form
1198A1228p336j4463p090L2931M873k3841k5286L6686K3801k9902k0175R646L8709
1211B9781j5276k6141m810L0460J7349l1411k3886J8878M7494l2355l7371J7091
1223a0197M5336j0479n4393J5983L9083N214m7937k654L0127J7338k2539l3439
1235b8557K7521K4442n647m3365Q821L9681k672l6761p424M3935p483j9751j2617
1248a9877K3937J0722k0575m203r08J9008n669r740r695J8006Q507j8777l329
1261a2593L940J6859j3555j839R86Q72O636j278k455j4435K1825N301j2389j6732
1275a8857J5848K2809k0722j2641M419K5939j0299j3871o125K0557J6303k8709
1287e349j1187J2576L5678k4891l4042K1275L4971j0536m3519J3563L2332N623
$$ plain form
1299 26494 -11563 -18021 10738 23273 9279 -24322 -326 23447 16605 -19009 -15533 23004
1311 23004 17426 -12495 -20131 17124 14733 -5557 -14838 1129 13155 -175 -4070 -13928 5182
1324 5182 3426 -1974 -11964 -7456 8814 -4468 -4727 -8591 -2026 -3222 1988 -4070 -12571 -3466 5357
1339 5357 3493 -22866 -5577 11017 2834 -14636 -15060 12975 5746 -7902 -16622 3677 12944
1352 12944 190 -17374 -10449 22003 8099 -13820 -18382 18564 17769 -15511 -12859 8314 22443
1365 22443 -5293 -10328 2639 13845 6427 -7335 -2224 8000 12892 -7949 -2264 5120 12179
1378 12179 -2152 -7691 10941 3362 1684 -1891 7538 741 -3434 7655 5909 -4911 -6151 8105
1392 8105 2833 -710 -9615 1866 7577 -2767 -5083 -12133 11215 5470 -11341 -14905 5114 13223
$$ packed form
1299B6494l8057o458K8759J2535j3994l3601K3996K3773o842l5614L476L8537
1311B3004n578k9921p636L7255k391k0290r281J5967J2026j3330l895r858J9110
1324E182j756n400r990M508J6270j3282k59l864O565j196N210o058q501R105Q823
1339E357j864k6359J7289J6594q183j7470m24K8035p229j3648q720K0299R267
1352A2944j2754j7564O925L2452j3904k1919m562L6946p95l3280K652K1173J4129
1365B2443k7736n035J2967J1206p418j3762N111J0224M892k0841N685P384P059
1378A2179j4331n539J8632p579j678l575R429o797m175J1089j746j0820j240J4256
1392H105n272l543q905J1481N711j0344k316p050K3348n745j6811l564K0019Q109
$$ plain form
1406 13223 -12572 -16586 2794 16754 -12972 -15565 -195 9421 82 -18854 -1504 1169 6816
1419 6816 -11377 -13149 5992 6524 -3665 -14196 5500 8431 -4934 -11606 5554 7655 -6112
1432 -6112 -3218 1372 8784 -6903 1613 2555 1295 3050 -3671 6366 4465 3370 -5166 3634 8987
1447 8987 3345 -6238 -1996 17856 -861 -6889 -657 14941 4968 -11510 2923 9164 6416 -7504
1461 -7504 -1222 4169 7407 -736 -7004 903 5470 5542 -11852 1398 8098 -844 -7878 -3313 10424
1476 10424 -6839 -6472 1227 3640 -6552 -6484 2588 1492 -3924 -7422 3813 -3616 -1726 -5768 -4405
1491 -4405 5891 -3730 -7506 -8956 9273 1961 -13341 -8306 11143 7976 -14196 -7572 6412
1504 6412 10432 -9569 -7133 6065 6543 1029 -12563 1710 9258 4542 -8382 -4919 11868 6641
$$ packed form
1406A3223k5795m014J9380J3960k9726k593J5370R616r339j8936J7350K673N647
1419F816j8193j772J9141N32j0189j0531J9696K931j3365o672J7160K101j3767
1432f112K894M590P412j5687Q516R42j260J755o721J0037j901j095q536Q800N353
1447H987n642r583M242J9852j8717o028O232J5598r973j6478J4433O241k748j3920
1461g504O282N391L238q143o268P907M567P2j7394J3250O700q942p034M565J3737
1476A0424j7263L67P699K413j0192O8R072j096n416l498J1235p429J890m042J363
1491d405J0296r621l776j450J8229p312j5302N035J9449l167k2172O624J3984
1504F412M020k0001K436J3198M78n514j3592J4273P548m716j2924L463J6787n227
$$ plain form
1518 6641 -6700 -9189 13654 7142 -4244 -4219 8788 8359 -4154 1156 1434 8226 -988 1459 1910
1533 1910 2167 5791 -2017 1186 3890 3508 -3791 2204 4661 -2321 -2657 1132 10388 -8759 -4596
1548 -4596 5221 4837 -4386 -7084 4999 1732 -2443 -8341 2014 1649 -904 -6614 -6895 7644 293
1563 293 -7294 -12110 6288 3761 -10874 -7552 2720 7363 -12981 -5328 3328 5216 -5836 -7476
1577 -7476 3784 3891 -349 -10405 1986 5550 3421 -8129 -6089 13100 3115 -6666 -5803 12178
1591 12178 5841 -7438 -3681 7777 7657 -5751 -831 1571 8161 575 -3896 766 4228 7635
1605 7635 -5384 -158 4421 5211 -3072 -1158 7174 1013 397 -818 6175 -3508 132 5833 -74
1620 -74 -3666 -1672 8060 -1125 -4007 -5255 4533 3885 -5286 -5793 -3410 10182 -2013 -10496 -6022
$$ packed form
1518F641j3341k489K2843o512j1386K5J3007m29j2513N310K78O792r214K447M51
1533A910K57L624p808L203K704l82p299N995K457o982l36L789R256j9147M163
1548d596R817l84r223k698J2083l267m175n898J0355l65k553n710k81J4539p351
1563B93p587m816J8398k527j4635L322J0272M643k0344P653Q656J888j1052j640
1577g476J1260J07m240j0056J2391L564k129j1550K040J9189r985r781Q63J7981
1591A2178o337j3279L757J1458j20j3408M920K402O590p586m471M662L462L407
1605G635j3019N226M579P90q283J914Q332o161o16j215O993r683L640N701n907
1620g4l592J994R732r185k882j248R788o48r171n07K383J3592j2195q483M474
$$ plain form
1635 -6022 11068 2720 -15970 -6856 7848 9683 -15277 -10193 7991 8523 -6164 -14324 3101
1648 3101 9518 4057 -14685 -7780 10132 9482 -10133 -14936 10163 9895 -4571 -12667 4310 9547
1662 9547 -656 -5731 -3776 7697 3381 1017 -4456 1385 7944 2638 -2401 -3272 8939 3450
1676 3450 691 -3146 1945 5829 4226 1978 -8035 3372 9587 4058 -11534 -2599 14052 5736
1690 5736 -7252 -9731 10639 9779 -1980 -10947 209 14634 1871 -11255 -11607 14117 8766
1703 8766 -11837 -14127 8662 15063 -10392 -15649 -1282 15165 -2303 -14299 -5913 6808 6685
1716 6685 -10201 -8222 -587 12486 -3495 -13722 -1533 7476 2520 -12119 -1876 3327 3813
1729 3813 -3603 -2538 -1307 1475 5924 -5115 -4899 -780 7777 240 -7870 -397 6764 6168 -6606
$$ packed form
1635f022J7090q348j8690R114J4704J835k4960N084J8184N32j4687q160J7425
1648C101O417n461j8742O905J7912o50j9615m803K5099k68j4466q096J6977N237
1662I547j0203n075J955J1473m316k364n473N841O559n306n039q71J2211n489
1676C450k759l837N091L884j603k248j0013J1407O215n529j5592Q935J6651q316
1690E736j2988k479K0370q60j1759q967J1156J4425j2763j3126l52K5724n351
1703H766k0603k290K2789O401k5455n257J4367J6447j7468j1996Q386J2721j23
1716F685j6886J979P635J3073j5981j0227J2189R009m956j4639J0243N203M86
1729C813p416J065J231K782M449j1039K16M119Q557p537q110P473P161n96j2774
$$ plain form
1744 -6606 -3006 1081 11660 3562 -8747 -2168 9697 12293 -9534 -7308 9686 14477 -5338
1757 -5338 -12412 6807 12789 3237 -12642 2255 11806 6712 -7572 -7449 11136 10058 -3130 -15382
1771 -15382 6665 13864 -2076 -12485 -1711 13792 -539 -8957 -5281 6740 3475 -5246 -5809
1784 -5809 -1769 7046 -2399 -5893 -4404 4784 597 -8348 -2810 494 1143 -5807 -1615 -2128 509
1799 509 206 -2783 -2945 -3713 7026 -1365 -5016 -4855 3577 5358 -5937 -3643 424 6947 -2029 -5581
1815 -5581 -3095 6317 6376 -7390 -4074 4258 10063 -6403 -7097 6188 11846 -1718 -13120 5791
1829 5791 10354 4031 -10160 -2177 9569 8031 -4284 -8768 6899 10060 -473 -11779 3525
1842 3525 11358 523 -8162 -2734 9689 1194 -6722 -5308 4479 4686 -1613 -4491 -2747 6883 800
$$ packed form
1744f606L600M087J0579q098j2309O579J1865K596k1827K226J6994M791j9815
1757e338p074J9219N982r552j5879J4897R551n094j4284J23J8585j078j3188j2252
1771a5382K2047P199j5940j0409J0774J5503j4331q418L676J2021l265q721n63
1784e809M040Q815r445l494J489R188m187q945N538L304O49o950M192n13K637
1799E09l03k989j62p68J0739q391l651J61Q432J781j1295K294M067O523q976l552
1815e581K486R412N9j3766L316Q332N805j6466o94J3285N658j3564j1402J8911
1829E791M563o323j4191P983J1746j538j2315m484J5667L161j0533j1306J5304
1842C525P833j0835q685N428J2423q495p916J414R787K07o299k878J744R630o083
$$ plain form
1857 800 -5073 -5125 3577 3460 -5245 -3638 -1190 2931 -1776 -1457 -5207 -1724 5333 -533 -6236 -7210
1873 -7210 6617 1873 -6545 -6893 1984 6320 -5387 -5589 -2805 8585 1350 -8358 -6425 6776
1887 6776 10173 -8225 -10534 4094 14450 -4024 -13368 452 12139 5136 -12239 -2517 7681
1900 7681 9994 -5504 -9609 3890 11126 2874 -11705 884 10960 7472 -9466 -5098 9934
1913 9934 5929 -2298 -8384 4362 5892 1790 -4954 -4755 5321 5995 -465 -8402 2266 6926 1985
1928 1985 -5272 -4281 4084 3213 360 -8029 -2028 4743 2427 -7325 -10237 5995 6094 -5169 -12226
1943 -12226 1798 8170 -1070 -10990 -4325 9339 1979 -6519 -11609 5417 8223 -4269 -12203 -1555
1957 -1555 13407 -659 -11831 -4349 11605 4379 -10236 -4940 5201 9562 -5571 -4981 -79
$$ packed form
1857H00n873n2Q702j17q705J607K448M121m707L19l750L483P057n866n703r74
1873g210J3827m744q418l48Q877M336j1707k02K784J1390p235r708J933J3201
1887F776L397j8398k309J4628J0356j8474r344J3820J1687p003j7375R722J0198
1900G681K313j5498m105J3499P236q252j4579J2589J0076l488j6938M368J5032
1913I934m005q227o086J2746J530m102o744J99J0076O74o460p937J0668M660m941
1928A985p257R91Q365q71k853q389O001O771k316r752k912J6232R9j1263p057
1943a2226J4024O372r240r920O665J3664p360q498n090J7026K806j2492p934J0648
1957a555J4962j4066j1172P482J5954p226j4615N296J0141M361j5133N90M902
$$ plain form
1970 -79 8797 2810 -7219 -1337 5986 6831 -6540 -3222 4202 6097 -1251 -3906 3496 2508 3429 -1061
1986 -1061 -781 1276 4870 3390 -3683 -234 1558 5347 -3257 -806 816 3092 1498 -3009 -915
2001 -915 538 7411 -4320 -4986 1744 5676 944 -11106 -4 6202 2358 -8605 -3143 5993
2015 5993 2397 -4350 -7351 2296 3572 -449 -8510 -1406 6379 -538 -7017 -5517 7264 561 -7040
2030 -7040 -4113 4309 3377 -5795 -3543 53 5058 -1667 -2816 -1933 2968 3686 -4345 -1201 1309 5622
2046 5622 -2513 -819 3354 1119 668 -1047 2982 -699 2561 988 1080 -516 1758 5082 -2760 551
2062 551 1373 4586 -582 -1708 1526 2956 4500 -3147 -1613 634 6896 -230 -5394 945 6505
2077 6505 2744 -8895 -21 5282 2679 -6282 -4583 3803 2870 -2185 -7922 1715 4592 596 -9048
$$ packed form
1970g9Q876n987j0029N882P323Q45j3371L318P424J895p348k655P402r88R21m490
1986a061K80K057L594j480p073L449J792L789q604K451J622K276j594m507K094
2001i15J453O873j1731o66O730L932m732j2050J1102O206l844j0963N462R136
2015E993l596o747l001R647J276m021q061P104P785o917o479J500J2781o703p601
2030g040K927Q422r32r172K252L596N005o725j149Q83M901P18q031L144K510M313
2046E622q135J694M173k235m51j715M029l681L260j573R2j596K274L324p842L311
2062E51Q22L213n168j126L234J430J544p647J534K247O262p126n164O339N560
2077F505l761j1639Q874N303k603q961J699Q386r33n055n737R637K877l996r644
$$ plain form
2092 -9048 -3087 6419 1552 -5620 -6009 5516 2161 -5693 -4963 225 4994 -2870 -3441 -2328 3989
2107 3989 2762 -3362 -3300 1388 4639 -3276 -438 246 4374 228 -3775 -49 422 3272 -449 4
2123 4 -2949 4144 4371 -969 -2945 -955 5768 -464 -2293 -707 6032 2099 -4453 -2034 1444 8889
2139 8889 -1340 -4962 -684 7593 2248 -8432 -1840 6806 5498 -7415 -1976 3421 4433 -1841
2153 -1841 -5599 1488 3186 2699 -7061 -3354 4122 3344 -4348 -6179 3502 3517 -2686 -5995 1658 2457
2169 2457 -1108 -2365 -2571 631 -1257 620 -3127 -816 1725 358 -615 -3789 1795 -1440 434
2184 434 -3282 -1148 -1273 2374 1223 -4534 -445 3161 2612 -5048 -1738 4616 1898 -1998 -2921 4567
2200 4567 3168 305 -2885 411 3756 1694 -1662 -2871 6825 2923 -1102 -3337 3370 5910 -1993
$$ packed form
2092i048N961R506m867p172l89J1525l355p854P30N188M769p864n71J113O317
2107C989j227o124O2M688L251p915K838O84M128m146m003L726M71K850l721M53
2123Dk953P093K27n340j976J990O723o232j829J586O739l933o552K419L478P445
2139H889j0229l622M278Q277n345j0680O592Q646j308j2913N439N397J012o274
2153a841l758P087J698m87r760L707P476p78p692j831R681J5o203l309P653P99
2169B457l565j257k06L202j888J877l747K311K541j367r73l174N584l235J874
2184D34l716K134j25L647j151n757M089L606n49p660L310O354k718l896r23P488
2200D567j399k863l190L296L345k062l356j209R696l902m025k235O707K540p903
$$ plain form
2215 -1993 -1479 2313 5128 -997 -1436 -159 1964 1673 -2366 785 -5 4039 -1580 -1248 1163 781
2231 781 1 -3003 1675 -979 -949 374 1451 -742 -2237 1348 -550 -1002 -3217 1674 742 -673
2247 -673 -2638 -1909 954 -1317 -1245 -4298 1181 1715 -2276 -3484 -742 3262 -3785 -2728 -385 2087
2263 2087 -2125 -2933 1543 1355 632 -2710 369 788 550 -953 -1001 3140 2328 1235 -3016 2612 2417
2280 2417 -380 78 1832 3552 -2143 850 1007 2763 -879 52 1689 1484 2035 -969 2121 1205
2296 1205 2666 -869 254 2158 946 130 -1813 3673 909 -1519 -218 646 1143 -2698 433 438
2312 438 851 -1560 267 -164 -209 480 -1205 1128 -982 -683 -2748 258 1758 -3125 -1756 82 2549
2329 2549 -2606 -2560 700 1417 -2252 -2503 1342 265 -829 -2594 615 1157 927 -1697 -2335 2718 603
$$ packed form
2215a993N14L792K815o125m39J277K123k91m039L151p90M044n619L32K411l82
2231G81p80l004M678k654L0J323J077k193j495L585j898m52k215M891r32j415
2247f73j965P29K863k271P2l053N479N34l991j208K742M004p047J057K343K472
2263B087m212q08M476j88p23l342L079M19k38j503m8M141q12j093m251N628j95
2280B417k797M58J754J720n695K993J57J756l642R31J637k05N51l004L090r16
2296A205J461l535J123J904j212q16j943N486k764k428J301Q64M97l841L131N
2312D38M13k411J827m31m5O89j685K333k110K99k065L006J500m883J369J838K467
2329B549n155M6L260P17l669k51L845j077j094j765L209N42k30k624o38N053k115
$$ plain form
2346 603 -209 -2588 2597 3356 -2055 -996 996 3671 -1873 592 -270 1761 1046 -1103 1235 538
2362 538 2659 -381 368 1533 2146 -405 170 1904 1649 -18 -1368 3054 1551 -2916 346 1975
2378 1975 395 -2533 2021 1604 128 -954 -557 1301 93 -41 -2175 2289 832 -365 -2418 -1366
2394 -1366 2444 -472 -1894 -2503 1991 -945 -2571 76 167 23 -1824 693 -1272 324 -1795 -1491
2410 -1491 -463 -447 1315 -2572 1061 596 -661 -1297 450 -167 -2048 923 782 1125 -2019 706 2423
2427 2423 498 -1281 -812 4135 1308 164 -1957 1824 3350 -98 -635 -294 3933 425 -2077 -609
2443 -609 5315 803 -2752 633 2307 1881 -3128 -761 1812 2710 -805 -2147 797 661 1934 -2415
2459 -2415 -1183 400 638 -1763 -1276 1425 -921 -1763 -1617 771 -476 -1763 -240 -668 -207 -945 1374
$$ packed form
2346F03q12k379N185P59n411J059J992K675n544K465q62K031p15k149K338o97
2362E38K121l040P49J165O13k551N75J734k55j667j350M422j503m467L262J629
2378A975j580k928M554m17j476j082L97J858j208j34k134M464j457j197k053J052
2394a366L810k916j422o09M494k936j626K647R1j44j847K517j965J596k119L04
2410a491J028J6J762l887L633m65j257o36J747o17j881K971j41L43l144K725J717
2427B423j925j779M69M947k827j144k121L781J526l448n37L41M227l508k502J468
2443f09N924m512l555L385J674m26n009K367K573Q98l515j342K944j36J273m349
2459b415J232J583K38k401M87K701k346q42J46K388j247j287J523m28M61p38K319
$$ plain form
2476 1374 -1530 -1495 -1201 -626 913 -2660 -1472 -2424 2349 -1047 -2683 -563 1278 2442 -3819 -1439
2492 -1439 1465 2971 -2412 -1772 1977 2198 87 -1694 588 1491 1521 -1931 -1449 1301 729 -568 -2659
2509 -2659 3093 2415 -484 -1557 2159 2197 -1153 360 -976 1497 412 190 66 306 1900 307
2525 307 294 -414 1698 848 287 1557 -216 -432 -434 1789 -2038 -385 601 351 -1310 -1600 2011 833
2543 833 -598 -2282 947 164 -1610 -1690 -1289 2625 -1181 -2163 -2123 1196 1896 -3044 -2176 72 2186
2560 2186 -2401 -2014 -295 2504 -533 -2539 -170 44 1678 -2051 -213 419 1729 -939 -1425 825
2576 825 1135 444 -1680 2046 1650 -1264 -538 723 1417 -1266 1127 -385 861 -518 737 742 69
2593 69 1755 -386 1402 289 1775 -450 1315 1845 -480 -287 -1062 614 -876 -306 2024 748
$$ packed form
2476A374k904L5K94N75J539l573J188r52M773l396j636K120J841J164o261K380
2492a439K904J506n383O40L749K21k111j781K282R03L0l452M82K750n72j297k091
2509b659N752o78k899j073L716L8l350J513j336K473j085k22j24K40J594j593
2525C07j3p08K112q50n61J270j773k16kK223l827J653R86k50j661k90L611j178
2543H33j431j684L229p83j774q0M01L914l806r82M0L319P00m940Q68K248K114
2560B186m587L87J719K799l037k006K369K14J634l729J838O32J310k668m86K250
2576H25L10o91k124L726l96k914P26J261O94k683K393j512J246j379J255No73
2593F9J686k141J788j113J486k225J765N30k325J93p75J676j490N70K330j276
$$ plain form
2609 748 -120 -2495 1651 -173 -468 -1166 -52 884 -365 758 -1156 450 -1175 -1555 -3248 137
2625 137 2045 -2486 -2342 -165 1441 -2942 -1634 -162 1243 431 -2407 -123 -653 256 -1921 -1475
2641 -1475 141 793 319 -1574 1980 494 521 -1498 596 891 -488 -112 -321 1584 -1251 1213 -229
2658 -229 105 890 859 1293 -67 -485 854 2626 390 -438 903 287 1877 -527 607 1764 3789
2675 3789 -965 497 1744 2217 292 -3610 2177 3312 -1369 -1152 -520 2308 -389 -1050 -3482 1368
2691 1368 949 -201 -1632 467 2849 -532 -863 -1159 2392 -237 -1652 -494 -381 126 -1125 -481
2707 -481 -926 1430 -517 -2059 -913 -53 -201 -2015 -409 -498 1325 -1206 -113 -368 -347 1577 872
2724 872 -71 -655 1450 1139 -1532 155 687 3208 -1564 -662 -317 1587 1011 -912 -467 1075 2710
$$ packed form
2609G48q68k375M146j824k95o98J114R36j249J123j914J606j625l80j693L385
2625A37J908m531J44K177J606m383J308J472J405q12k838K284n30R09k177M46
2641a475J616O52m74j893L554j486K7k019K094K95j379L76k09J905k835K464j442
2658b29L34P85l1M34j360m18J339J772k236q28J341o16J590k404J134J157K025
2675C789m754J462J247M73j925l902N787J135m681K17O32K828k697o61k432M850
2691A368m19j150j431K099K382l381l31k96L551k629j415J158J13N07j251O44
2707d81m45K356j947j542J146Q60j48j814J606q9J823k531J093k55K1J924p05
2724H72r43n84K105l11k671J687N32K521m772R02L45J904n76j923M45J542J635
$$ plain form
2741 2710 -2232 -230 693 3558 -1906 -2540 1606 2367 454 -2727 -390 1092 1938 -557 -2180 1407
2757 1407 1037 1772 -2150 830 1103 318 -884 -1282 878 -401 114 -1655 254 -526 -1386 -232 -2167
2774 -2167 329 -1083 140 -1085 -354 -488 -892 -185 -362 999 -830 401 -693 -1351 -153 326 -533
2791 -533 -1918 527 729 109 -851 188 1119 221 -531 -871 1261 -400 513 -668 340 1329 -1776
2808 -1776 -411 948 2820 -412 -489 -1227 1527 937 -497 1526 407 2337 -748 -6 580 718 437
2825 437 -930 -53 1326 1545 -1050 220 2089 393 -1759 -448 1755 -97 -423 320 -18 -656 -173
2842 -173 100 -579 825 57 -615 -684 166 -127 -746 474 -224 315 -1890 660 383 -524 977 406 -1024
2861 -1024 -2256 554 336 117 -1632 -811 573 -1454 -443 -694 773 -115 -1153 -1253 -907 2994 -1530
$$ packed form
2741B710m942K002R23K865n464o34M146P61j913l181K337J482Q46k495j623L587
2757A407l70P35l922K980K73p85j202l98K160j279N15j769J909p80q60J154j935
2774b167K496j412J223j225P31j34m04P07j77J361j829J231j094o58J198M79q59
2791e33j385K445K02o20r60J039R31q98p52l40K132j661R13j181J008R89l105
2808a776J365J359J872l232p7p38K754n90j434K023j119J930l085P42N86J38k81
2825D37j367Q77J379K19k595J270J869j696k152J311K203j852l26P43l38o38M83
2842a73K73o79J404p68o72o9Q50k93o19J220o98N39k205K550k77r07J501n71j430
2861a024j232K810k18k19j749Q21J384k027J011k51J467q88j038j00L46L901m524
$$ plain form
2878 -1530 -1298 -137 2846 895 -1612 182 1575 1476 -2007 864 438 1693 -428 -1045 1414 1356 1267
2895 1267 -955 -153 1865 1261 -909 -829 2014 738 1174 -1436 734 -592 1275 259 -265 462 -433
2912 -433 927 -1897 -966 1426 380 -670 -60 67 -25 1271 -1403 -1229 -876 191 -408 -2429 1270
2929 1270 397 -31 -2967 251 690 420 -1564 -1143 1173 295 -526 -1389 236 867 -1232 -921 -1504 1638
2947 1638 -134 -1349 -1862 2041 607 -1586 -703 244 1570 -1620 207 248 695 -443 -739 -210 -7
2964 -7 1513 -579 89 1644 1207 1950 593 1720 -155 577 141 573 94 -324 377 -759 658 520
2982 520 1187 364 883 681 27 5 -1439 1414 -375 950 -1938 -1634 305 1116 242 -1425 542 518
3000 518 180 -1476 -846 516 792 -442 -1455 611 -279 188 -1596 -1348 1916 -748 -1489 -1639 1690
$$ packed form
2878a530K32J161K983j951k507J794J393r9l483K871m26J255k121o17K459n8q9
2895A267k222Q02K018o04k170Q0K843j276M36k610K170j326J867j016n24P27q95
2912d33J360k824R31K392j046j050O10J27r2J296k674J74L53J067n99k021L699
2929A270q73m28k936L218M39k70j984M21K316q78q21q63J625O31k099L11n83L142
2947A638j772j215n13L903j434k193Q83R47J326l190J827M1M47j138k96N29K03
2964gJ520k092O68J555m37P43j357J127j875P32m36M32m79m18P01j136J417j38
2982E20O67q23N19k02o54k2j444K853j789J325k888L04J939Q11q74j667J967k4
3000E18l38j656O30J362K76j234j013K066q90M67j784K48L264k664p41j50L329
$$ plain form
3017 1690 226 -1056 -635 543 1156 -1794 75 -672 1803 -180 -410 -960 588 666 -654 646 -365
3034 -365 1157 -1801 132 909 1014 424 -170 1186 112 -523 -122 -717 -146 -421 1038 -256 937
3051 937 -849 1399 -397 -857 115 409 226 -1150 540 154 1773 -659 -765 555 398 843 -1772
3068 -1772 -1368 812 -213 -1497 -155 555 187 -52 -1906 45 680 -1226 -1531 594 1992 -551
3084 -551 -1534 -1173 512 -16 -1726 -1157 668 1542 -1315 -307 -486 -289 -461 -581 -1290 32 1126 362
3102 362 427 -508 1597 219 -716 846 484 -488 -1473 -201 -799 -45 428 2 -354 -1055 1758 -919
3120 -919 435 418 1059 -304 -544 -2 787 2165 -576 -553 -969 1839 1279 -2116 807 1001 1083 -1354
3138 -1354 -1072 584 1113 -770 -1384 44 824 228 -1759 62 -1051 1092 -398 -679 534 76 -125
$$ packed form
3017A690j464j282M21J178O13k950J869p47K475j983k30n50J548P8j320J300j011
3034c65J522k958J933P77J05n90n94J356j074o35M01n95N71k75J459j294J193
3051I37j786K248j796m60R72K94j83j376J690l86J619k432j06J320j57M45k615
3068a772M04K180j025j284J342P10l68k39j854J951O35j906l05K125J398k543
3084e51r83L61J685n28j710N69J825Q74k857J008j79J97j72j20p09J322J094p64
3102C62O5r35K105j378r35J562l62r72r85J272n98P54M73m26l56p01K813k677
3120i19J354j7O41j363k40N42P89J378k741K3m16K808n60l395K923J94Q2k437
3138a354K82J656N29j883o14J428P80n96j987J821j113K143j490k81J213m58k01
$$ plain form
3155 -125 -1666 -268 962 -598 -1682 -953 322 -695 375 -2024 -103 302 -993 -727 -2103 1811
3171 1811 889 -883 -1030 721 508 -604 28 -1206 760 206 18 -833 -1011 1156 361 552 -1080
3188 -1080 1458 -225 842 -101 816 1230 3 -951 -704 1468 -115 -870 -339 1298 663 -595 6
3205 6 -495 1351 -1776 -131 403 700 783 -1337 -375 870 1300 -1067 -623 626 468 235 -2181 585
3223 585 418 337 -826 166 1182 -389 -533 -1160 745 -747 -967 -999 -109 502 -244 -1414 -1446 530 -201
3242 -201 45 -845 162 140 -677 293 -933 -335 189 197 -524 -1110 1090 555 -762 -256 839 723 372
3261 372 -753 -16 335 -1012 -754 421 1571 827 -546 -975 972 965 -879 -563 454 1278 1003 -1356
3279 -1356 430 388 426 -887 1254 776 1514 -312 -284 307 68 -362 -1298 471 538 107 -721 -799 839
$$ packed form
3155a25j541J398J230j560j084P29J275j017J070k399J921M05j295K66j376L914
3171A811r22j772j47J751k13j112O32j234J966n54j88q51j78K167p95J91j632
3188a080K538j683J067r43R17M14j227r54K47K172j583p55N31J637o35j258O01
3205Fn01J846l127J645N34K97Q3k120R62J245M30k367M44J249j58k33k416K766
3223E85j67q1j163R92J016j571j44o27J905j492k20l2Q90O11p46j170l2J976p31
3242b01K46q90J007k2q17R70j226N98N24Qp21n86K200n35j317N06J095j16l51
3261C72j125P37L51j347K58J175J150p44j373m29J947pj844L16J017Q24k75k359
3279a356J786m2L8j313K141m78P38j826K8N91k39m30r36J769O7m31q28p8J638
$$ plain form
3298 839 -271 -45 -771 -231 -184 826 -604 -337 819 -391 -175 -439 590 -326 -842 -356 -733 907
3316 907 375 28 -1215 105 356 -430 -1310 -788 -375 -535 -1301 -1677 810 594 -182 -400 -149 453 47
3335 47 -1261 -1201 257 369 -820 -233 -509 1688 231 -1409 396 440 832 -1197 668 394 1189 -99
3353 -99 -110 -382 726 362 -2366 202 379 1283 -2462 -703 482 1483 -104 -158 -213 -630 1797 213
3371 213 -1593 -974 775 87 -1429 289 -254 -631 -243 -577 -58 644 -119 -1512 574 -460 1 -1461
3389 -1461 -1163 1853 -24 -850 -2119 408 -203 -164 -942 451 505 -355 -237 -2008 1365 618 -756 -1496
3407 -1496 -83 870 -400 -955 -249 799 612 -465 -867 600 -293 30 54 76 2224 187 -78 -547
3425 -547 1148 512 137 622 110 614 403 -135 78 -78 657 -148 960 -375 1335 151 -747 -78
$$ packed form
3298H39j110K26p26N40M7J010j430K67J156j210K16k64J029r16n16M86l77J640
3316I07n32l47j243J320K51p86q80N22M13j60p66l76K487k16p76k18K51O02m06
3335D7j308O0J458J12j189N87k76K197j457j640J805M4L92k029J865k74P95j288
3353i9j1k72J108l64k728K568J77R04l745J759J185J001j587n4n5m17K427j584
3371B13j806O19J749o88j516J718n43l77L88l34N19P02p63j393K086j034M61j462
3389a461K98L016j877q26j269K527o11L9p78J393N4q60J18j771L373p47j374p40
3407a496J413R53j270n55P06J048j87j077m02J467q93L23K4K2K148k037k65m69
3425e47J695o36l75M85n12N04k11n38K13j56P35q05J108j335J710j184q98O69
$$ plain form
3443 -78 596 76 -935 564 1007 734 -887 -1145 81 -106 322 -1414 -599 6 -335 -321 -759 -63 1379
3462 1379 328 -1991 -382 45 -380 53 -2108 969 188 312 -1130 895 1080 -922 -747 -493 1477
3479 1477 -989 -31 -158 1015 556 -494 -632 -887 580 382 -733 -2088 928 845 -514 -127 -193 113
3497 113 246 387 699 1112 -422 329 1084 -588 1680 802 -773 -902 320 1771 -358 -388 994 522
3515 522 -292 -435 257 653 839 634 529 -105 670 -93 -1411 -202 548 350 -854 -358 229 732 -888
3534 -888 -1457 446 -896 352 -173 -464 898 567 -2039 -1448 335 148 -698 -359 -76 -33 370 -558
3552 -558 36 486 -975 -378 -1547 243 -37 -93 -1513 -1314 -430 -247 228 -935 1653 -615 1133 -291
3570 -291 307 205 208 369 -770 27 825 1457 -419 511 963 206 -41 -151 710 416 754 -839 -109 1024
$$ packed form
3443g8O74n20j011J499M43k73j621k58J226j87M28j736Q15O05l41J4m38O96J442
3462A379j051k319J609M27m25M33k161L077p81J24j442K025J85k002J75K54J970
3479A477k466R58j27J173m59j050j38k55J467j98j115j355L016q3j359L87o6L06
3497A13J33J41L12M13j534P51P55j672K268q78j575j29J222J451k129l0J382m72
3515E22q14j43O92L96J86k05j05o34P75p63j318J209P50j98j204M96N87N03j620
3534h88n69J903j342J248n25k91J362l31k606N91J783j87q46L39K83M3M03r28
3552e58N94M50j461N97j169J790k80n6j420J99Q84J83M75j163K588k268J748j424
3570b91N98j02LJ61j139P97P98O32j876R30M52p57k47j10Q61k94L38j593P30J133
$$ plain form
3590 1024 383 187 -276 1225 15 -697 -828 199 570 8 396 57 -106 -173 -917 226 398 370 -463
3609 -463 -671 -210 -167 -796 -572 -196 -709 -373 -655 -583 61 424 -845 -267 354 -1151 285 -597 -59 -206
3629 -206 196 -736 -486 401 -203 -308 -598 -595 -547 208 418 -532 57 739 4 -239 -668 511 -268 478 -530
3650 -530 215 838 311 -1199 1803 1185 1048 -260 453 1021 188 397 -1117 961 246 82 -360 164
3668 164 1589 -126 106 -948 102 775 -1343 -78 -786 1204 -930 67 1215 -195 -205 -156 192
3685 192 -303 864 -921 271 -39 600 -147 51 718 -841 1071 -599 -608 -708 -106 367 -411 -90 -970
3704 -970 660 -813 -1081 13 591 -303 -870 518 -176 -51 -174 89 1556 583 -751 -948 284 511
3722 511 -371 -925 512 -222 -126 69 -497 1245 285 -386 -373 823 995 -721 166 -139 882 229 85
$$ packed form
3590A024o41j96m63J501j210p12j31J027L71n62L88l39j63o7p44J143J72k8q33
3609d63k08M61M3o29K24L76n13L36k82P2O44L63j269N78O21j505J436q82N38j47
3629b06M02r32K50Q87o04j05k90LM8P55K10r50N89O82p35k43m29J179p79P46j008
3650e30P45O23n27j510L002o18j37j308P13N68q33K09j514K078p15j64m42N24
3668A64J425j715K32j054J050O73k118J265p08J990k134R97J148j410j0M9L48
3685A92m95J167j785J192l10O39p47J98O67j559J912j670rj00O02M73p78L21q80
3704i70J630j473k68J094N78q94n67J388o94J25j23K63J467r73j334j97J232K27
3722E11q82n54J437p34R6J95n66J742r60o71J3J196J72j716Q87l05J021o53j44
$$ plain form
3741 85 184 -562 314 -288 -800 -320 1376 -216 -169 -328 -679 656 432 182 -486 -259 153 -381 623 59
3761 59 334 -183 -103 -685 1146 -479 -872 -561 -813 1106 -42 -36 -352 159 -434 -938 -315 -298 1074 -551
3781 -551 -991 -43 1571 -447 -462 101 468 99 -546 472 608 636 -166 -536 -248 1443 -17 -931 449
3800 449 -157 -351 -648 515 790 -315 -1060 -1469 1679 1120 123 232 719 1185 -507 -589 1302 166
3818 166 107 505 17 898 283 608 732 -840 607 264 -235 -302 -166 357 233 -47 520 -394 -582 363
3838 363 -731 -1305 -30 110 -556 -105 -85 -578 -788 -84 -428 1081 -1071 -151 -875 608 367 -357 415
3857 415 -473 -206 -601 75 -738 1062 207 -625 291 -633 152 -342 329 953 -167 -127 -363 936 90
3876 90 189 -549 -589 -145 84 203 -916 -27 -135 1094 -316 974 -64 131 1422 -188 -55 386 1543
$$ packed form
3741H5R9p46Q76o02n12M80J696j592M7j59l51J335k24k50o68K27M12n34J004n64
3761E9K75n17Q0n82J831j625l93L11k52J919j148Ol16N11n93n04O23J7J372j625
3781e51m40R48J614k018j5N63L67l69o45J018J36K8q02l70K88J691j460r14J380
3800D49o06j94k97J163K75j105p45m09L148n59r97J09M87M66j692q2J891j136
3818A66n9L98m88Q81o15L25J24j572J447l43m99o7J36N23j24k80N67r14j88R45
3838C63j094n74J275J40o66M51K0m93k10P04l44J509k152R20p24J483k41p24P72
3857D15q88K67l95O76q13J800q55q32R16r24P85m94O71O24j120M0k36J299q46
3876I0R9p38m0M44K29J19j119Q89j08J229j410J290j038J95J291j610J33M41J157
$$ plain form
3895 1543 -510 -331 234 307 547 -1183 1290 -428 252 -800 511 -175 -617 446 -967 1110 -803
3912 -803 2 -410 -237 694 -1263 -1053 -238 1101 -597 -597 168 -731 364 -423 137 -605 422 -219 639
3931 639 54 573 71 -685 739 46 458 -866 -934 -135 -155 535 650 597 -191 643 -210 115 421 250
3951 250 -211 191 783 118 560 -19 132 177 -399 905 -750 481 91 312 -117 -88 1360 -247 276
3970 276 -958 57 419 462 684 -128 402 -397 506 876 885 746 -331 -32 -59 200 -513 662 -137 506
3990 506 166 -1467 169 -124 515 -630 -578 -179 -130 5 -977 -97 -98 -257 -269 87 -926 202 134 -605
4010 -605 -422 -113 254 -778 -63 -325 597 -174 -396 -276 203 166 -1273 315 -5 694 206 196 -404 -437
4030 -437 1148 -472 -178 344 580 305 -685 299 783 592 -184 168 -698 699 899 783 -54 69 834
$$ packed form
3895A543k053J79N65P3K40j730K473j718O80j052J311o86m42J063j413K077j913
3912h03Q05m12J73R31j957K10Q15J339j698%P65q99J095p87N60p42J027o41Q58
3931F39n85N19n02p56J424o93M12j324o8P99k0O90J15n3p88Q34q53L25L06j71
3951B50m61M02N92o65M42n79J51M5n76J304j655J231l90K21m29K9J448j607N23
3970B76j234J015L62M3K22q12N30p99R03L70Rj39j077K99k7K59p13J175p99O43
3990E06l40j633J636k93O39j145N2L99M9J35r82Q80jj59j2L56j013J128o8p39
4010f05J83L09L67j032P15k62R22p71k22J20M79l7j439J588l20O99m88j0o00l3
4030d37J585j620K94N22K36k75r90R84M84j91p76L52q66J397K00j16q37J23P65
$$ plain form
4049 834 -266 -516 306 -4 373 284 978 110 253 569 658 355 -252 99 1 872 -259 119 -1158 -599
4069 -599 -517 -889 -37 565 -104 -632 -685 447 -932 -41 259 323 -314 221 -425 -266 189 -1088 430 -1224
4089 -1224 438 -720 361 220 88 85 24 220 -1302 981 -447 673 -707 429 1723 498 -284
4106 -284 396 195 -434 365 -247 -130 480 -271 1041 -70 423 652 1071 143 683 765 -5 -131 -90 508
4126 508 274 351 -8 1028 -278 -208 971 36 -434 -1277 163 457 -223 1163 -1149 768 205 568
4144 568 -1192 257 540 -826 -138 -377 282 -731 -152 606 186 421 -552 -280 -1527 -523 -311 592
4162 592 -91 -190 -270 -611 488 -629 -193 -1055 363 608 -937 335 -575 493 -805 305 -123 450
4180 450 402 449 917 570 514 -783 1022 192 -130 235 355 918 -182 973 10 677 -373 146 830
$$ packed form
4049H34j100k50Q22l10L77q9O94q68J43L16Q9l03o07L51r8Q71j131L78j277N59
4069e99Q2l72Q52O02o69n28n3J132j379Q91L00O4o37N35o46J59M55j277J518j654
4089a224J662j158J081j41j32lo1J96j522K283j428J120j380J136J294j225p82
4106b84O80k01o29P99o12J17O10p51J312j111M93K29M19r28N40Q2p70j26M1N98
4126E08k34P7l59J036j306P0J179r35m70q43J440K94o80J386k312J917n63L63
4144E68j760J449K83j366O88k39O59j013N79P58m20K35r73K72j247J004K12R03
4162E92o83r9q0l41J099j117M36q62J418K45j545J272r10J068j298J110m28N73
4180D50m8M7M68l47n6j297J805q30l22L65J20N63j100J155r63O67j050N19O84
$$ plain form
4199 830 424 1114 54 1450 -825 209 93 135 -738 -208 266 -389 444 -137 811 -209 -11 167 -856
4218 -856 -191 -315 -91 -948 -120 107 466 -489 -178 165 -1018 527 73 244 237 -276 599 -1434 628
4237 628 -449 -611 -787 -448 538 -1076 -218 -114 -540 -1214 -471 -617 25 242 -373 346 -454 650 -663
4256 -663 -6 0 -570 -601 -424 1253 -559 -591 51 502 693 155 500 247 520 -1497 -42 -75 741 321
4276 321 -1264 601 -696 191 -94 -214 467 -21 524 -650 -95 37 -87 -61 -1148 -441 472 -106 502
4295 502 -463 1011 877 -775 -276 -8 -582 725 -301 431 284 -49 -630 -597 151 398 -702 -882 -760
4314 -760 162 513 -876 234 633 559 -47 -778 -398 -1164 1262 -157 -118 1039 -263 -618 916 1627
4332 1627 136 433 245 -48 201 192 412 347 297 206 -600 524 -162 1124 -241 1615 -71 714 -849
$$ packed form
4199H30m06O90j060J396k275J034j16M2q73N30M74o55Q33n81R48j020J98J78j023
4218h56O65j24K24q57Q28K27L59r55L11L43j183J545m54J71pn13Q75k033K062
4237F28j077j62j76L39R86j614Q58J04m26o74P43j46O42K17o15P19q00J104j313
4256f63O57On70l1J77J677j812l2O42M51J91n38L45k53K73k017J455l3Q16m20
4276C21j585J865j297Q87k85j20O81m88N45j174N55J32j24K6j087P07R13n78O08
4295E02r65J474j34j652M99K68n74J307j026P32j47l33n81L3P48K47j100j80J22
4314g60R22L51j389J110L99p4o06p31L80p66K426j419L9J157j302l55J534P11
4332A627j491K97j88k93K49rK20o5n0r1q06J124o86J286j365J856j686P85j563
$$ plain form
4351 -849 744 -924 -334 -268 349 -144 815 539 -132 516 37 711 446 -860 -538 -317 306 446 -510
4370 -510 -235 373 700 -256 -331 -152 -800 423 -541 141 690 -444 -929 -126 54 34 -29 50 -301 785
4390 785 -17 -1131 519 1161 -246 -1105 -588 195 -587 -194 -587 385 -485 387 -157 -130 1146 393 1065
4409 1065 625 107 821 209 70 209 1357 538 381 934 9 38 93 347 676 175 -27 -60 -390 -1138
4429 -1138 432 1071 159 -114 288 -90 -411 -149 890 622 -559 -666 -1022 767 -731 311 -374 -1105
4447 -1105 -209 -840 -393 -157 295 -1122 -374 142 185 -1033 -931 185 -126 -143 -415 -311 -1269 25 -249
4466 -249 -824 512 -612 -613 -1295 572 -604 344 -541 -601 184 -42 -75 119 974 147 -98 261 -216 -19
4486 -19 22 -123 -231 -65 342 423 593 -1008 57 192 122 -621 220 1189 152 108 -574 467 175 945
$$ packed form
4351h49J593j668N90O6O17m93R59k76o71O48m79O74k65j306L22K21O23J40r56
4370e10K75O08L27r56p5J79o48J223r64O82N49j134m85Q03J80k0o3P9l51J086
4390G85q02j114J650O42j407q59N17P83p82L93l93R72q70Q72n44K7J276p53O72
4409A065m40n18P14o12j39J39J148q19j57N53r25K9N5K54L29n01k02l3l30p48
4429a138J570O39r12k73M02l78l21K62J039k68j181j07l56J789j498J042o85p31
4447a105Q96o31M47K36M52j417P48N16M3j218J02J116l11j7k72J04r58J294k74
4466b49n75J336j124jo82J867j176R48q85o0P85k26l3J94Q55q27k45L59m77J97
4486a9M1j45j08J66M07Q1J70j601J065J35p0p43Q41R69j037m4o82J041k92P70
$$ plain form
4506 945 141 244 -55 669 -427 -605 620 -38 710 153 -715 533 -684 25 506 233 -1135 376
4524 376 341 -645 -273 -1084 -1148 -1048 -45 -474 -856 -636 202 -466 -1170 714 386 -1418 -17 -554 -433
4543 -433 -734 80 -2008 981 324 140 -1021 -542 670 -1229 558 76 -606 -912 20 -294 -852 -614
4561 -614 495 -1046 -388 -364 299 274 513 -1292 488 -368 -149 -525 -251 1101 16 -561 206 -35 -24
4580 -24 -204 -601 110 1734 -232 586 -208 270 187 -102 13 403 156 -820 -52 486 -146 161 -727 37
4600 37 338 -970 999 16 38 536 -409 -574 -392 -485 47 -1143 1148 -179 -516 -675 330 -33 -379
4619 -379 573 -415 894 -1281 -262 166 646 -1050 730 69 -400 -426 1207 1186 -745 158 -65 -323
4637 -323 358 560 453 -103 140 -996 158 1867 -128 -81 -944 -34 230 -144 -19 1233 25 210
$$ packed form
4506I45q04J03k99P24j096j78J225o58P48n57q68J248j217P09M81k73j368J511
4524C76l5r86L72q11o4J00J003m29l82K20Q38o68p04J884l28j804J401n37J21
4543d33l01Q14k088K989o57j84j161M79J212j899J787m82o82l06R32l14n58K38
4561f14J109j541O58K4O63k5K39j805J780q56K19l76K74J352j085n77P67k41J1
4580b4j80l97P11J624j966Q18p94M78q3k89J15L90k47r76P68N38o32L07q88P64
4600C7L01j308J969r83K2M98r45j65J82r3N32j190K291j327l37j59J005l63l46
4619c79R52r88J309k175J019M28M80j696J780o61m69k6J633k1j931R03k23k58
4637c23O81K02j07n56K43j136J154J709j995M7q63R10K64l74J25J252j208J85
$$ plain form
4655 210 693 638 319 -368 1073 -31 -592 497 -404 -697 -159 -562 943 939 1397 -373 -447 -275 122 45
4675 45 186 -965 -99 -788 -224 -228 486 -470 -626 -321 -680 -444 -326 -71 -469 328 -241 -653 696 755 79
4696 79 -367 -1826 85 -885 629 -249 418 -723 -353 400 -479 33 -1013 488 -236 368 -1197 409
4714 409 563 153 1089 -237 119 505 -449 -952 1075 -140 232 20 -454 739 -38 172 178 613 1003
4733 1003 -185 1005 -650 427 -142 158 -542 -486 -577 175 867 -429 726 222 -210 -182 -54 -355 -899
4752 -899 -168 -391 -17 -426 -789 156 -1099 250 -912 343 -452 -487 160 -686 22 -163 876 -917
4770 -917 -147 190 218 -659 -668 -241 259 206 -914 13 -238 1005 -133 183 89 444 -689 -1635 -130 9
4790 9 -997 -627 443 556 52 1187 178 467 -243 352 468 189 605 507 601 -1141 807 127 -796
$$ packed form
4655B10M83n5l19o87J441j104n61J089r01k93N38m03J505mM58j770p4J72L97p7
4675D5J41j151Q66o89N64mP14r56j56L05l59K36J18K55l98P97n69m12J349N9o76
4696G9m46j459J911r70J514q78O67j141L70P53q79N12j046J501p24O04j565J606
4714D09J54m10R36j326L56L86r54n03K027j215L72k12m74J193p77K10OM35L90
4733A003j188J190j655J077n69L00p00N6r1P52O92j296J155n04m32K8J28l01n44
4752h99P31k23L74m09l63R45j255J349j162J255p95l5O47q46P08j85J039j793
4770i17P70L37K8q77rM27N00n3j120R27k51J243j138L16r4L55j133r46J505J39
4790Ij006L70J070J13n04J135j009K89p10N95J16k79M16r8R4j742J948o80r23
$$ plain form
4809 -796 218 -66 1035 -54 75 -731 274 205 -416 0 571 -320 928 1088 -1253 -248 285 271
4827 271 659 -802 -643 207 117 -652 -460 356 -421 -357 191 857 -598 349 -303 -332 407 -967 249 -532
4847 -532 -31 -525 -483 -250 395 -8 -373 -106 49 -288 170 -257 236 -301 8 -596 -8 1210 359 120
4867 120 344 263 263 -543 -192 -91 170 308 -46 -90 318 -270 630 -800 786 -25 830 151 -685 592
4887 592 -526 622 -4 262 159 -453 -407 806 419 -245 889 -205 139 -556 -73 -299 -398 337 131
4906 131 -421 404 -260 -381 -264 70 513 -393 -1405 141 -243 -596 -799 -594 -286 830 181 -527 -150
4925 -150 -7 505 -488 -765 322 -102 -439 -524 -100 -123 85 722 307 154 231 -540 -393 36 -331 816
4945 816 182 -120 572 515 316 484 834 -807 518 -4 249 82 -288 959 -136 1218 290 476 176
$$ packed form
4809g96J014k84J101j089J29q06J005o9o21M16N71q91J248J60k341J005N33j4
4827B71L88j461J59Q50r0p69J92Q16p77O4N48O66j455R47o52k9P39j374J216p81
4847e32N01m94M2K33O45m03l65K67J55l37M58m27M93n37L09o04N88J218q51k39
4867A20K24q1%q06L51J01K61J38l54m4M08n88R00j430J586q11Q55o79q36J277
4887E92j118J148o26K66j03o12M6J213l87o64J134j094L44o95M83k26r9P35k06
4906A31n52Q25o64j21J17L34M43r06j012J546l84l53k03K05L08J116o49p08L77
4925a50J43N12r93k77J087m24l37q5M24k3K08O37m15j53P7p71J47M29l67J147
4945H16o34l02O92n7j99J68L50j641J325n22K53j67l70J247j095J354r28J86l00
$$ plain form
4964 176 -22 611 -82 534 -696 943 384 661 281 -515 343 -701 52 -307 600 -1021 592 -366
4982 -366 -86 612 -982 -471 -572 351 -458 -921 -136 -559 -125 -428 27 159 -366 -7 -1070 80 -1176
5001 -1176 -304 -865 -403 -655 -393 5 190 786 -420 60 -333 1292 737 -31 992 342 -228 326 397
5020 397 -923 -419 271 1433 -168 -63 1254 -161 986 -525 -323 248 -247 -241 -752 1434 690 75
5038 75 -228 295 125 326 1116 -389 365 435 396 113 1456 408 -686 1165 -217 -392 72 -275 383
5057 383 -552 558 -597 -397 177 -537 -753 36 -237 -1285 -405 -47 3 -507 483 -798 -796 -236 -510 142
5077 142 -95 246 -641 -143 530 -433 286 -440 1601 -333 1074 -1249 -875 -579 -1002 17 1668 -839
5095 -839 -972 302 1092 254 -35 528 375 -58 -608 -370 1178 -553 -497 248 -1355 314 79 -526 -1049
$$ packed form
4964A76j98O33o93O16j230J639n59K77l80p96Q58j044P53l59R07j621J613r58
4982c66K80O98j594N11j01R23q09m63P85m23M34l03M55J32n25L59j063J150j256
5001a176Q72n61M62k52K62L98J85N96j206M80l93J625n55p68J023o50n70N54P1
5020C97j320N04O90J162j601J05J317j415J147j511K02N71m95On11K186p44o15
5038G5l03N23j70K01P90j505P54P0l9k83J343j048j094J851j382j75M64l47O58
5057C83r35J110j155K00N74p14k16P89k73j048Q80L58N0n10R90j281KN60k74O52
5077A42k37L41q87M98O73r63P19p26K041j934J407k323L74K96m23J019J651k507
5095h39j33J274P90q38k89N63j53m33n50K38J548j731N6P45j603J669k35o05n23
$$ plain form
5114 -1049 99 -596 13 -884 525 620 115 1052 -968 267 488 622 -195 -1324 364 -537 921 375
5132 375 362 45 -555 300 -295 244 118 -12 327 135 -744 145 -527 -184 608 -646 559 -1039 -726
5151 -726 -830 358 766 458 381 226 -65 -50 -205 -416 594 -178 -252 1684 -336 -329 -24 188 194 551 302
5172 302 -1631 256 -504 564 -329 511 -313 -569 -221 224 590 -156 1437 136 1136 -776 202 1054
5190 1054 -272 1268 -1019 430 232 734 876 -367 1723 -1825 373 575 -69 1031 707 1226 -306
5207 -306 509 -394 -573 385 465 272 -462 -772 -914 313 781 284 -347 -438 450 -686 -288 -85 62 -198
5227 -198 -522 -808 -36 -897 -444 220 -862 -61 -288 -112 -190 -117 745 -672 16 -91 452 1021 68 132
5247 132 -538 -168 -263 511 -643 -93 353 350 285 1228 932 -717 672 -117 1187 159 193 846 -675 875
$$ packed form
5114a049J148o95O09q97J409R5n05R37k020J235K21J34q17j129J688r01J458n46
5132C75j3l17o00Q55n95N39j26j30L39j92q79Q89o72L43P92j254J205j598L13
5151g26j04J188M08l08p7j55k91J5j55k11J010p72p4J936k020PL05K12OL57k49
5172C02j933J887p60J068q93Q40q24k56L48M45L66p46J593j301J000j912R78Q52
5190A054j326J540k287J449j98N02J42j243K090l548K198K02o44J100l24N19j532
5207c06Q15r03j79R58Q0j93p34l10j42J227M68m97o31r1Q88j136L98K03J47k60
5227a98l24k86P72q61M53O64j082Q01k27J76p8P3Q62j417O88j07N43N69r53O4
5247A32o70L70r5P74j154N50M46lo5R43k96j649J389p89J304j028L4O53j521J550
$$ plain form
5267 875 437 961 -61 30 108 -507 881 -32 -14 301 719 1024 -136 -720 -1031 501 -1001 -391 -446 -724
5287 -724 -477 -298 -867 -150 -538 -880 -236 -802 -253 -543 -526 610 -250 72 -710 -1011 -233 -390 -763 -689
5307 -689 -63 -677 152 -486 -365 607 -677 6 242 716 -154 -108 -85 46 -546 86 369 -708 1214 151
5327 151 513 -159 5 300 833 236 488 -7 479 684 -615 405 222 853 396 268 1339 196 127
5346 127 -703 1042 733 -517 -4 484 388 249 262 -457 -418 -347 -460 576 444 -367 795 454 -738 -173
5366 -173 -228 -555 -347 -634 -143 -316 -246 416 -266 375 -453 -21 -140 782 -1120 -517 -46 478 61 -739
5386 -739 198 -572 47 -632 164 -347 -119 41 -895 804 -310 1198 -109 -113 -140 1027 -233 103 640
5405 640 356 -73 537 551 974 -827 -459 442 201 185 676 -357 651 -162 127 443 -222 1095 603
$$ packed form
5267H75m38N24j022R1P8o15J388r13J8L15M18L05j160n84l11J532j502O10n5k78
5287g24K47J79n69P17l88l42O44n66N49k90J7J136q60L22p82l01P78j57l73P4
5307f89O26o14Q29o38J21R72j284O83K36M74q70M6K3J31n92O32K83j077J922j063
5327A51L62o72J64K95N33n97K52m95M86K05j299J020j83O31m57j28J071j143o9
5346A27q30J745l09j250N13M88r6j39J3p19L9P1j13J036j32q11J162l41j192N65
5366a73n5l27K08k87M91j73P0O62o82O41q28M32j19R22j902O03M71N24m17q00
5386g39R37p70O19o79P96n11K28J60r36J699j114J508j307mk7J167j260L36N37
5405F40k84m29O10J4M23j801L68R01k41j6M91j033J008q13K89L16o65J317m92
$$ plain form
5424 603 -66 -578 426 112 448 726 -459 748 35 -490 68 -20 -266 -703 630 -976 327 -108
5442 -108 22 -214 -482 -261 382 353 -138 652 597 -221 -344 -238 -422 357 312 380 -211 336 -45 247 -206
5463 -206 233 -399 -116 276 -274 663 -59 1001 552 -445 46 301 -406 329 630 -28 -141 95 283 -47
5483 -47 -504 807 -73 -226 -612 853 83 -702 679 159 -438 176 -174 346 365 -308 -641 -454 534 1112
5503 1112 396 656 795 240 307 215 197 35 -799 -575 -548 -5 -628 -393 -763 -218 623 -309 -547 96 9
5524 9 -770 -531 -254 -1137 -117 -283 -12 -625 -349 304 234 7 -487 -14 251 912 -118 -965 -166 -1502
5544 -1502 924 55 -62 375 -308 217 6 84 -72 782 407 -583 40 293 600 377 -232 -777 388
5563 388 -999 -106 330 407 -161 -49 398 -630 684 498 -135 335 304 1304 120 1351 98 -536
$$ packed form
5424F03o69n12J004l14L36K78j185J207p13n25N58q8k46m37J333j606J303m35
5442a08J30k36k68K21O43k9m91P90n5q18j23J06j84P79m5O8n91N47l81K92m53
5463b06M39o32K83L92n50R37p22J060m49r97M91K55p07P35L01o58j13K36J88l30
5483d7m57J311q80j53l86J465p70p85J381n20n97O14l50N20J9o73l33J87R88N78
5503A112p16K60J39n55O7r2j8j62q34K24K7N43o23K35l70N45Q41r32k38O43q7
5524Ip79K39K77q83J020j66K71o13K76O53p0k27m94M73K65O61j030q47P99j336
5544a502K426q69j17M37o83N25k11P8j56Q54l75r90O23K53L07k23o09n45J165
5563C88j387Q93M36P7n68J12M47j028J314j86o33M70l1J000j184J231j253o34
$$ plain form
5581 -536 818 443 62 -748 -260 280 622 157 557 268 24 194 133 65 -1403 -225 -756 -106 -5 -732
5601 -732 -76 -526 -272 -764 -331 128 -511 -630 93 323 600 -827 -143 673 65 158 163 283 299 -411 543
5622 543 -706 519 -854 -791 -894 -599 841 -431 664 -51 105 488 -519 266 998 403 988 -26
5640 -26 444 -737 165 322 154 -205 839 -811 -306 -305 251 -79 798 -746 641 546 260 802 -58 -345
5660 -345 710 -523 -634 -105 -223 17 395 192 -535 143 -293 -35 -131 -59 -530 -1034 506 215 905 -1595
5680 -1595 -148 128 -530 887 -241 87 -389 -385 -299 196 393 -1429 253 292 -100 974 130 215 -61
5699 -61 47 87 379 396 -50 141 -130 -581 34 691 -746 -658 508 -10 -137 -156 589 853 -436 -429 -134
5720 -134 1172 398 362 731 327 441 -517 310 -26 -265 -503 -282 168 -599 -159 730 428 70 329 428
$$ packed form
5581e36J354l75l81q10M88N40L42m65M00k89k44J70o1o8j468J178n31O50J01p27
5601g32O56m50K54m92M33M59o39j19P23K30K77j427O84Q16o08R3NJ20J6p10R54
5622E43j249J225j373O3j03K95J440j272J095p15J56L83j007P85P32n95N85j014
5640b6M70j181R02J57j68l59J044j650N05JN56l30Q77j544J387r5k86N42q60k87
5660c45J055j233j11N29j18K40L78k03p27O78m36K58r6P2m71n04J540k91O90k500
5680a595J447K76o58J417j128L28m76MQ6M95J97j822J682L9l92J074q44Q5k76
5699f1J08M0K92J7m46J91k71m51O15O57j437Q8J166n18j27j9P45K64j289PK95
5720a34J306p74l6L69m04J14r58Q27l36k39k38K21M50p67M40Q89l02l58K59R9
$$ plain form
5740 428 -378 -678 -741 51 -361 -278 -995 -496 652 -5 519 -65 686 214 94 204 40 8 -3 -124 -819
5761 -819 -390 -271 -454 682 -12 -1190 -660 -481 284 -32 43 1004 -404 -438 -154 -360 400 279 364 65
5781 65 123 -388 686 491 -295 -213 919 592 467 -287 285 -1 1130 -983 334 -302 -420 -742 -245
5800 -245 144 100 246 651 291 841 -30 -510 355 -403 920 628 217 -376 -242 -61 -300 -35 -370 -224
5820 -224 70 -1028 -161 -51 -272 612 -594 -185 -318 119 -463 -837 186 -500 200 148 309 -146 -203 434
5840 434 -722 -715 -1171 829 -148 456 -776 -373 376 -531 775 -322 48 -1017 -187 248 -79 -205 597
5859 597 1498 -786 -41 209 642 700 151 -250 -297 -50 -327 374 -76 574 151 -143 -311 -38 534 494 488
5880 488 381 40 168 451 382 -514 92 -600 486 -918 -264 -90 516 230 4 -185 -353 257 302 546
$$ packed form
5740D28q06l00o3P92m12Q3p17M99J148o57N24n84P51m72j20J10j64l2j1j21o95
5761h19M29J19j83J136o94j178N30J79P65l16P5R61j408l4K84k06P60j21Q5k99
5781F5N8n11J074j95p86Q2J132l27j25p54N72k86J131k113J317o36j18l22M97
5800b45L89m4J46M05l60N50q71m80Q65p58J323k92m11n93J34J81k39K65l35J46
5820b24K94j098Q67J10k21Q84j206M09j33M37n82l74J023o86P00n2J61m55n7O37
5840D34j156Pm56K000r77O04j232M03P49r07J306j097L70j065Q30M35l27j26Q02
5859E97R01k284P45K50M33N8n49m01m7K47k77P01m50O50m23k94j68K73N72m0o
5880D88j07l41J28K83o9q96O06o92J086j404O54J74O06k86k26j89j68O10M5K44
$$ plain form
5900 546 17 330 742 348 67 -253 -649 238 -310 140 -492 403 -1316 -193 -672 416 257 -314 93
5919 93 -686 131 235 64 -266 20 472 -198 357 193 -140 -158 -439 -134 -119 -141 453 620 76 518 502 472
5941 472 788 589 442 165 -243 536 717 567 227 505 535 75 59 43 477 177 -102 561 -632 884
5961 884 997 -616 -15 -1451 -372 -469 -368 -310 504 36 -779 320 -1802 411 -525 -676 413 -755
5979 -755 -37 -155 -726 -504 297 -583 533 -144 176 -261 -531 70 175 -82 -870 -623 -509 238 -221 300
5999 300 748 -361 315 -197 -564 -111 407 514 150 833 -482 473 -296 61 315 -493 206 -230 -5
6018 -5 96 -98 73 472 -9 692 301 -272 381 742 -176 1523 1040 287 -519 590 -426 589 230
6037 230 -504 285 93 -510 284 635 -292 529 -431 375 -680 404 -350 -288 946 222 -6 882 -154
$$ packed form
5900E46n29L13M12l94k81l20l96Q87n48M50o32Q95j719J123m79J088j59n71M07
5919I3p79Q17J04j71l30K86M52o70N55j64l33j8k81L05J5k2N94J67n44M42j6l0
5941D72L16j99j47k77m08P79J81j50l40K78L0m60j6j6M34l00k79O63j193J516
5961H84J13j613O01j436J079r7J01N8Q14m68q15J099k122K213r36j51J089j168
5979g55P18j18n71K22Q01q80J116o77L20m37k70O01J05k57p88K47J14P47m59N21
5999C00M48j109O76n12l67M53N18J07l64O83j315R55p69L57K54q08O99m36K25
6018eJ01j94J71L99m81P01l91n73O53L61r18J699m83p53q06J109j016J015l59
6037B30p34P89j92o03P94L51r27Q21r60Q06j055J084p54O2J234p24k28Q88j036
$$ plain form
6056 -154 181 -281 965 308 -212 -35 -306 -560 -123 -622 -354 249 -498 -502 120 34 258 706 -460 -55
6076 -55 -223 -528 -462 -466 264 -205 -369 -249 215 754 143 206 791 -13 -558 -406 -87 -905 -230 -338 211 -447
6098 -447 352 46 -298 82 466 392 -167 -72 683 780 414 613 -312 -635 210 691 813 -211 -136 -338 470
6119 470 551 324 789 775 673 542 395 358 -632 470 147 184 -481 341 666 185 323 666 729 -739 -160
6140 -160 2 -568 198 204 -188 -44 -127 -220 782 -455 -79 -144 -597 1002 -265 188 -170 -787 455 52
6160 52 -242 -610 517 452 813 507 -632 390 910 60 359 821 -1104 -853 144 -277 287 322 557 380
6180 380 -816 -83 73 749 -158 -440 -242 -332 693 93 -60 115 116 568 274 -1241 785 -434 -293
6199 -293 3 -407 945 211 -35 -929 410 280 -485 -1288 -453 -221 238 175 -73 -387 -800 -345 -620 -1640
$$ packed form
6056a54L35m62J246o57n20J77k71k54M37m99K68O03p47mO22q6K24M48j166M05
6076e5j68l05O6mP30m69j64J20M64N39o11O3N85q04n45J52L19q18O75j08N49o58
6098d47P99l06l44L80L84p4n59R5P55R7l66J99r25l23Q45M81J22j024P5k02Q08
6119D70Q1k27M65j4j02j31j47l7r90J102l23L7o65Q22L25m81J38L43O3j468N79
6140a60J62n70P66Ol92J44q3r3J002j237L76o5m53J599j267M53l58o17J242m03
6160E2k94l68J127o5L61l06j139J022N20q50K99M62j925K51R97m21N64L5K35j77
6180C80j196P33J56O76r07k82J98r0J025o00j53J75JM52k94j515K026j219J41
6199b93K96m10J352p34k46q94J339j30p65q03Q35K32M59o3k48l14m13M55k75j020
$$ plain form
6219 -1640 -1007 -79 -328 -545 -30 -748 865 -66 492 15 422 1293 169 1152 384 -79 353 125 871
6238 871 300 135 666 975 752 322 -364 -76 307 -384 789 364 -822 20 139 -106 -189 -252 22 582
6258 582 -103 -846 -27 -472 -255 -816 645 53 229 504 403 -160 -337 -951 292 72 7 325 -290 261
6278 261 -870 -491 183 -798 -64 91 36 -232 -974 -254 62 294 1 -377 -280 -497 -562 -89 -302 -142 -463
6299 -463 -13 263 -330 329 -366 1188 -301 990 -241 -628 -679 391 -220 -151 338 669 310 -269 -61
6318 -61 -215 -893 -1183 -319 811 -706 -628 828 225 15 17 818 112 497 212 -73 -269 901 343 837
6338 837 -354 431 -322 406 -420 -17 452 825 179 464 131 85 -453 -801 -316 -415 -218 7 -387 762
6358 762 602 -55 -1370 -519 85 1185 -268 -1183 386 -774 -344 -753 -1145 -1381 89 -1484 -354
$$ packed form
6219a640O33R28k49k17N15p18J613r31N58m77M07Q71j124R83p68m63M32k28P46
6238H71n71j65N31L09k23m30o86K88L83o91J173m25j186Q42J19k45q3o3K74N60
6258E82o85p43Q19m45K17n61J461n92J76K75j01n63j77o14J243k20o5L18o15N51
6278B61j131L79O74r81P34J55n5k68p42P20L16K32k93l78R7k17o5M73k13J60l21
6299d63M50K76n93O59o95J554j489J291j231l87n1J070o11O9M89L31l59n79K08
6318f1j54o78k90Q64J130j517P8J456o03k10KQ01p06L85k85k85j96J170n58M94
6338H37j191P85p53P28q26M03M69L73o46K85l33m6n38l48M85r9J97K25l94J149
6358G62j60o57j315Q51O04J100j453r15J569j160M30m09l92k36J470j573J130
$$ plain form
6375 -354 -1210 -834 -54 -157 -1065 565 -236 479 171 1456 571 332 87 -104 150 -1477 308 -744
6393 -744 1213 11 -1576 -332 -167 -82 464 -198 136 363 796 -777 -326 -287 1046 -109 629 392
6411 392 -232 65 -643 -186 143 -290 591 -92 395 -200 -646 229 -250 -590 237 29 29 1171 -221 -237
6431 -237 553 332 647 298 3 263 -715 286 -88 -9 -550 -553 28 207 -96 131 263 276 160 -423 -864
6452 -864 497 774 -784 -373 770 104 -519 152 699 1038 116 427 -80 614 65 100 178 -661 642
6471 642 451 -521 -410 528 350 -93 -233 760 -494 7 358 207 738 531 -1020 243 218 487 193
6490 193 -318 6 205 -352 6 843 715 815 -1224 563 504 90 -210 131 72 -475 -342 530 -264 -594
6510 -594 861 -55 -759 -242 522 -168 -90 766 -198 96 -80 845 32 1007 -70 522 158 -429 275 920
$$ packed form
6375c54q56L76P80j03r08J630q01P15l08J285q85k39k45j91K54j627J785j052
6393g44J957j202j587J244J65Q5N46o62L34K27M33j573M51L9J333j155P38k37
6411C92o24K97p08M57L29m33Q81o83M87n95m46Q75m79l40Q27k08%J142j392j6
6431b37P90k21L15l49k95K60r78J001l74P9n41lN81J79l03K27J32J3j16n83m41
6452h64J361K77j558M11J143o66o23O71N47L39r22L11n07O94n49L5P8q39J303
6471F42j91r72J11R38j78m43j40R93j254N01L51j51N31k07j551J263k5K69k94
6490A93n11L24J99n57L58Q37j28J00k039J787n9m14l00L41n9n47J33Q72p94l30
6510e94J455r16p04N17P64o90P8Q56r64K94j76R25q13R75j077N92l64n87P04O45
$$ plain form
6530 920 -512 -643 105 -443 -324 724 748 -148 653 693 336 615 318 -48 -418 178 -709 411 -547 29
6550 29 21 54 410 11 -32 -239 -714 -241 -388 582 132 324 -589 -340 -271 199 808 -52 -92 170 -39 -664
6572 -664 -139 54 96 -991 112 -812 318 -409 260 -282 546 401 317 -327 283 429 -197 170 476 -335
6592 -335 -133 4 -342 -889 841 -294 276 137 53 -211 -367 612 134 947 -55 -165 243 -1582 -414
6611 -414 -85 -448 362 200 -1148 543 18 -1105 579 482 322 625 250 -338 445 441 132 140 -913 -604
6631 -604 698 523 569 757 742 -149 397 181 51 -5 -326 -337 571 258 -299 -517 -659 471 364 -321 -568
6652 -568 -561 -861 5 43 -677 820 1214 979 551 -641 234 910 -767 -701 -87 -635 96 196 -403 649
6672 649 -997 474 715 358 386 -363 48 565 845 600 -575 -370 374 223 -789 -124 -375 438 -1766
$$ packed form
6530I20j432j31P48n48J19J048K4q96Q01M0l57K79k97l66l70N96q87J120r58N76
6550B9qL3L56l99m3k07m75M73j47R70m50J92r13K49O9M70O09q60m0K62k09o25
6572f64N25J93M2j087J103r24J130p27O69n42Q28j45q4o44O10J46o26L67L06q11
6592c35K02J37l46n47J730j135N70j39q4k64j56R79m78Q13j002j10M08j825J168
6611d14L29l63Q10j62j348J691n25j123J684r7j60L03l75n88P83ml09Qj053L09
6631f04J302j75M6J88j5q91N46k16j30n6l21j1R08l13n57k18j42J130j07o85k47
6652e68Pl00Q66L8p20J497L94k35m28j192Q75O76j677O6O14n48P31J00n99J052
6672F49j646J471K41l57K8p49M11N17K80k45j175K05P44j51j012O65k51Q13k204
$$ plain form
6691 -1766 317 405 -846 -30 -140 -375 169 303 19 452 -120 -273 -523 38 361 -395 -159 842 165
6710 165 -443 -696 252 -154 -202 605 416 -53 505 276 61 -285 410 478 -435 1004 -137 63 381 -52
6730 -52 403 126 330 -602 -909 461 -260 109 -544 485 -465 265 -241 -592 -75 185 -240 -182 -71 -577
6750 -577 -727 39 82 -434 -818 -84 1014 -391 -608 381 -314 -136 299 -522 877 -686 286 -509 -484
6769 -484 -679 -1020 -1180 -17 -1201 -239 575 -57 -970 -17 -388 -41 1254 -1617 365 -1094 180 -473
6787 -473 308 -448 -127 260 731 -126 -428 609 545 -232 -362 -57 306 -248 172 583 106 110 -312 -387 -503
6808 -503 -722 -152 54 433 -454 -280 999 -68 -185 1366 197 213 426 7 8 -26 23 1005 333 -255
6828 -255 1284 -754 -753 -234 562 394 -361 -198 -123 576 -119 270 -368 -543 -525 18 -690 -118 -171 69 244
$$ packed form
6691a766K083Q8j251Q16j10k35N44J34k84M33n72j53k50N61L23p56K36J001o77
6710A65o08k53R48m06m8Q07j89m69N58k29k15l46O95O8r13J439j141K00L18m33
6730e2M55k77K04r32l07J370p21L69o53J029r50P30n06l51N17K60m25N8J11n06
6750e77j50P66M3n16l84P34J098j405k17R89o95J78M35q21J399j563R72p95K5
6769d84j95l41j60J163j184R62Q14o32r13R53l71L47J295k871J982j459J274o53
6787d73P81p56L21L87M71q57l02J037o4p77j30L05L63n54M20M11m77Mm22p5j16
6808e03k19N70K06L79q87J74J279j067j17J551j169J6K13m19Jl4M9R82o72n88
6828b55J539k038JN19P96j68p55J63P5O99o95L89o38j75J8N43p08N72n3K40J75
$$ plain form
6849 244 -268 821 -946 572 -161 -228 -126 -264 -208 -785 782 299 -79 234 -167 -401 255 92 233
6868 233 -121 276 -83 -40 -518 -511 83 -491 485 -631 -549 -104 -1340 868 -250 -383 -599 848 32 479
6888 479 -600 -716 352 -406 -212 -16 -437 -579 -482 -590 806 -274 323 -597 260 -353 389 -77 635
6907 635 175 -449 -79 -581 622 691 -230 43 -638 -419 348 427 648 -364 162 -178 -498 395 256 -114
6927 -114 -75 -382 -451 229 579 -525 135 -60 74 318 -175 237 1125 305 -276 454 -586 -111 -633 -78
6947 -78 -163 -148 -770 -702 -267 439 343 56 -282 201 -279 197 227 -125 551 -182 -181 408 85 -171 289 119 -294
6970 -294 969 197 -336 365 598 841 81 -210 -236 -129 -301 260 -230 -78 1155 -332 -96 1127 -446
6989 -446 -134 1115 -104 720 -627 338 -636 -430 394 560 949 -249 814 888 -185 1422 -657 529
$$ packed form
6849B44n12J089j767J518p33o7J02j38N6n77J567m83l78L13m01k34O56j63J41
6868B33l54L97l59M3m78PN94n74R76j116Q2M45j236K208j118j33k16J447q16M47
6888D79j079j16J068p58J94J96m21j42R7j08J396j080N97r20Q57o13P42m66P12
6907F35m60o24L70n02J203O9r21K73o81K19P67P9K21j012N26l40l20Q93j39l70
6927a14L9l07o9O80L50j104O60j95J34K44m93M12Q88q20n81P30j040M75n22N55
6947g8q5J5o22O8M35P06r6k87l38M83m80M76L0l52O76p33JN89l23k56M60j70m13
6970b94J263p72n33P01K33K43p60k91k6J07j72N61m90J52J233j487K36J223j573
6989d46L12J249j219Q24j347R65r74K06Q24J66L89j198J063P4j073J607k079J186
$$ plain form
7007 529 369 542 -114 239 -770 272 -343 -250 -499 -998 -229 -31 -351 -775 77 -64 64 773 262 -1154
7027 -1154 265 230 189 211 131 -48 357 382 137 -230 123 -172 -2 604 -1381 -336 -66 -4 439 -26 717
7048 717 -667 -361 466 -472 -312 688 -374 -275 -693 355 -202 133 -190 -474 40 -599 -1113 -510 -220
7067 -220 264 -82 -248 295 -62 -336 838 -99 -553 -169 -100 1020 962 42 249 634 279 -733 -388 -757
7087 -757 -292 -563 -218 669 105 259 750 -482 -746 292 -249 -107 -794 -56 -56 53 733 167 -705 -18
7107 -18 345 337 331 700 -285 29 693 -943 -524 -464 -57 36 456 -20 -231 -156 43 -280 -228 413 165 71 -129
7130 -129 515 187 283 -793 -1126 -587 -738 -874 -994 -212 149 2 -815 174 505 -339 110 -385 413 291
7150 291 -634 70 933 -94 -14 1784 493 109 926 -222 125 280 130 -598 91 247 -556 522 -443
$$ packed form
7007E29j60J73o56L53j009J042o15R3k49m99P69J98l20m24Q52j41J28P09n11j416
7027a154J419l5m1K2q0j79M05K5k45l67L53k95J70O06j985J045K70O2M43m65P43
7048G17j384L06Q27r38J60J000j062R9m18J048n57L35l23k84N14o39n14O03K90
7067b20M84l46j66N43l57k74J174r37m54L84O9J120n8r20K07L85l55j012L45l69
7087g57M65k71L45Q87n64J54M91j232k64J038n41J42o87P38%J09O80n66q72O87
7107a8L63qoL69r85L14O64j636M19O0M07R3M20m76k11P5J99l23N2O41k48r4k00
7130a29O44l28R6j076l33N39j51j36j20P82L61j47q17R89L31q44M49m95P98j22
7150B91r25P04Q63j027Q0J798j291l84Q17j148L47J55j50p28O89J56q03J078r65
$$ plain form
7169 -443 35 92 999 -66 -523 496 361 25 313 80 -232 424 -730 115 418 -131 947 255 296
7188 296 -217 -126 -941 1110 -398 65 -453 -850 -366 -545 478 -256 -577 992 -96 -933 -572 -1060 -177
7207 -177 -256 -499 92 174 -870 793 225 -106 791 91 336 -490 -552 -193 919 419 888 616 -526 35
7227 35 -317 -522 -928 -303 -211 -463 25 -281 -153 198 -40 -104 275 541 -822 391 103 759 63 -776
7247 -776 -624 -480 -51 -502 -364 -330 -435 483 510 -93 331 -100 -192 107 353 57 -152 70 687 -175 71
7268 71 706 858 231 -233 107 478 -524 -722 -258 495 -530 1112 -667 350 90 64 674 628 -4
7287 -4 -629 56 458 518 -56 522 -225 80 -267 288 -123 257 -192 1087 -552 -542 -265 749 571 58
7307 58 -280 212 -169 -324 589 1373 409 58 546 7 659 -200 -75 -44 -143 -233 -351 -125 -367 -559 632
$$ packed form
7169d43M78N7R07j065m57J019j35l36K88k33l12O56j154Q45L03n49J078o92M1
7188B96n13R1q15K051j508M63n18l97M84j79J023p34l21J569j088q37L61m88Q83
7207a77p9k43N91Q2j044J663n68l31Q97p00K45q26o2L59J112n00M69k72j142N61
7227C5l52k05m06O25R2k52M88l06J28L51k38o4L79K66j363J213k88O56o96q39
7247g76J52J44M29m51J38L4j05R18K7o03M24m31r2K99K46k96k09K22O17q62K46
7268G1O35J52o27m64L40L71j002j98M64P53j025J642j779J017k60k6O10m6o32
7287do25O85M02O0n74N78p47L05l47N55m11L80m49J279j639J0K77J014j78n13
7307E8l38M92l81j55R13P84r64l51M88n39O52q59J25L1r9r0j18K26k42j92J191
$$ plain form
7328 632 -131 4 296 560 349 309 7 259 415 -256 -45 198 -480 762 160 -856 153 -114 -99 351
7348 351 195 -398 -495 596 205 577 490 -683 -423 98 261 -386 225 1046 -424 713 -12 -448 1109
7367 1109 169 1264 237 355 -256 -29 115 458 -42 459 -758 1053 -1193 -413 -162 687 -1000 -28
7385 -28 -140 -264 -213 -233 527 -291 409 -316 118 -422 -237 -304 491 -69 -4 32 189 -667 -482 -305 -526 808
7407 808 645 -85 422 210 -427 -142 -398 -218 -438 -663 -155 -391 647 629 -531 -77 -850 -42 518 294
7427 294 -519 -169 527 -12 -150 276 60 -866 -338 446 -164 543 -457 228 309 -378 -337 373 -340 -242 -67
7448 -67 848 201 72 35 -77 155 -71 316 333 -593 392 667 -442 1081 763 611 -202 -327 369 -158
7468 -158 1089 496 5 -160 334 309 478 -236 452 921 117 -24 416 272 592 184 330 71 -569 -192
$$ packed form
7328F32p63J35K92K64k11m0l02K52J56o71K11K43o78J242o02j016J009k67J5M50
7348C51j56n93r7J091l91L72q7j173K60N21J63o47O11Q21j470J137p25m36J557
7367A109r40J095j027J18o11K27J44L43n00N01j217J811k246P80K51Q49j687R72
7385b8j12j24N1k0P60q18P00p25M34n40J85o7P95n60O5L6J57q56J85J77k21J334
7407H08j63p30N07k12o37K85k56J80k20k25N08k36J038j8j160M54p73Q08N60k24
7427B94q13L50O96n39j38M26k16r26N28P84o10P07j000O85Q1o87M1P10p13R8J75
7448f7R15o47j29l7j12K32k26L87J7r26R85K75j109J523l18j52q13j25O96n27
7468a58J247n93m91j65M94k5J69p14O88M69q04j41M40j44L20m08J46k59o40L77
$$ plain form
7488 -192 1140 -103 302 482 561 -1324 -573 -293 168 748 -1240 -47 -547 342 -194 -391 302 692 235
7507 235 378 -11 -360 29 212 -273 -343 -57 -713 401 -288 -151 -684 288 -398 -134 378 -175 -338 673
7527 673 -604 175 -33 227 782 -152 300 92 -110 65 312 -120 -719 -704 -571 -193 -537 -284 151 -803
7547 -803 687 -678 -324 -880 65 -213 139 -149 -284 1162 -4 36 -612 96 -314 929 255 -279 -255
7566 -255 -693 -845 -517 -401 101 -581 -478 -533 388 192 108 264 252 -60 42 -165 590 -191 528 2 117
7587 117 -366 -1145 -646 138 -310 -491 29 -755 -902 -141 443 -496 332 -398 751 219 1116 1147 -313 1178
7607 1178 -434 -543 -172 708 -868 26 204 473 -216 -314 761 -532 189 -131 5 -356 -502 -388 -469
7626 -469 215 -345 -23 923 188 -60 -981 -96 -171 -788 -90 -43 78 -608 -664 243 129 -139 -180 151 -780
$$ packed form
7488a92J332j243M05J80P9j885P51K80M61N80j988J193n00Q89n36j97O93L90m57
7507B35J43l89l49L89J83m85p0K86o56J114o89J37n33R72o86K64N12n53j63J011
7527F73j277P79k08K60N55r34M52k08k02J75K47m32n99J5J33L78l44K53M35r54
7547h03J490j365L54n56R45k78L52k88j35J446j166M0o48P08m10J243o74n34K4
7566b55m38j52L28J16N02o82J03n5R21j96q4J56j2l12J02k07P55p81P19n26J15
7587A17m83p79M99P84m48j81N20p84j47P61N84r39Q28p30J149n32Q97L1j460J491
7607A178j612j09L71Q80j576Q94J78K69o89r8J075j293P21l20J36l61j46J14q1
7626d69O84n60L22R46p35k48r21Q85p5o17O98M7J21o86n6R07j14k68m1L31r31
$$ plain form
7647 -780 -575 820 -246 341 696 531 271 -84 129 211 377 -78 -523 300 -643 -391 139 260 463 -242
7667 -242 -445 -207 -581 -320 -238 -46 460 -714 -116 -329 39 134 -7 420 -815 509 -516 515 552
7686 552 -474 143 1397 -459 113 -398 -483 346 -466 -237 -40 -191 -533 344 1114 -605 -486 907 -127
7705 -127 -86 -102 -410 349 -621 90 161 377 -837 619 -126 -744 -312 311 22 384 -617 -11 785 -559
7725 -559 -92 253 -863 125 352 -326 377 12 560 -369 -29 403 472 -40 200 -1234 247 559 323
7744 323 -49 -412 -978 661 -238 -1378 -859 -323 -111 503 476 294 69 341 -426 250 973 952 100 -362
7764 -362 442 316 72 20 -238 427 1364 252 238 434 119 714 130 883 -553 255 -255 604 -650 -570
7784 -570 -906 -513 435 -477 -512 -588 1134 832 -169 -134 -554 -461 233 -46 -79 -593 -699 359 -159 179 198
$$ packed form
7647g80K05J395j066N87L55j65k60l55K13Q2J66m55m45Q23r43K52N30J21K03p05
7667b42k03K38l74K61Q2J92N06j174N98k13L68R5j41M27j235J324j025J031L7
7686E52j026O17J254j856N72n11q5Q29q12K29J97j51l42Q77P70j719J19J393j034
7705a27M1j6l08P59r70P11P1K16j214J456p45o18M32O23k89L62j001O06P96j344
7725e59M67L45j116R88K27o78P03l65N48r29L40M32O9n12K40j434J481L12k36
7744C23l72l63n66J639q99j140N19N36K12O14k7j82k25K72p67O76P23k1q52m62
7764c62Q04j26k44n2k58O65R37j112j4J96l15N95n84P53j436Q08n10Q59j254Q0
7784e70l36L93R48r12l5p6J722l02j001L5m20R3O94k79l3n14j06J058n18L38J9
$$ plain form
7805 198 544 -121 66 -319 639 -765 -516 -763 60 580 145 -56 -104 -348 317 992 -822 -31 122 -2
7825 -2 287 425 -48 335 405 82 -129 -374 123 329 -110 -468 551 -757 -10 762 -244 803 -1137
7844 -1137 -21 940 158 -339 -1658 976 128 534 552 -131 478 307 -640 -140 39 -544 667 -234 -566
7863 -566 440 119 135 -264 -178 257 811 -485 339 145 -218 79 496 -263 -97 -218 -320 -768 -589 -544
7883 -544 -701 303 11 -226 -65 29 -584 -311 -498 735 -1179 -263 818 486 -790 548 680 328
7901 328 700 55 -288 896 -1149 -1145 332 1380 895 -457 -105 1171 -577 -24 -515 370 -456 228
7919 228 -104 -1141 1662 260 -996 -717 119 92 -650 -608 293 438 413 34 -12 430 -300 -54 -1153 -302
7939 -302 -148 -501 170 -432 243 431 -453 -965 732 1260 301 709 631 605 1228 177 -181 -774 325 -206
$$ packed form
7805A98L46o65J87l85R58j404K49k47Q23N20m35k01m8k44O65O75j814P91J53j24
7825bK89J38m73L83P0l23k11k45M97K06m39l58J019j308P47P72j006J047j940
7844a137J116R61p82m97j319K634q48M06J8o83O09j71r47N00J79n83J211r01l32
7863e66J006l21J6l99Q6M35N54j296Q24j94l63K97M17p59J66j21j02m48J79M5
7883e44j57J004k92k37J61R4o13K73j87J233j914R16J081l32j276J338J32l52
7901C28L72o45l43J184k045MJ477J048m85j352L52J276j748N53m91Q85q26O84
7919B28l32j037K803j402j256K79Q36k7p42M2R01J45k5l79m6M42p30K46j099Q51
7939c02J54l53O71o02O75J88q84n12J697N28r59M08p8k6O23j051l58n93J099n31
$$ plain form
7959 -206 590 -1221 235 680 100 238 422 -686 -1096 376 -3 1106 -780 -895 670 447 -1173
7976 -1173 399 121 -818 347 -52 510 -130 574 317 -483 743 395 -754 377 -84 490 1131 49
7994 49 369 630 409 475 -1181 -511 235 -401 959 -649 178 -811 -172 1264 464 -217 1897 1218 -235
8013 -235 -338 -193 -1324 326 619 -397 752 -65 594 210 635 538 -417 -125 -350 652 645 780 -594
8032 -594 -994 149 -440 365 121 -135 -19 693 -602 831 102 -1128 266 238 -30 -20 -710 555 139
8051 139 -57 66 750 71 -42 363 86 -819 525 -350 -32 -154 151 -1229 -214 -517 -136 -80 1249
8070 1249 745 1111 167 -1063 -1353 1029 699 -154 353 1601 328 -1301 87 -657 -541 -584 -481 -939
8088 -939 -154 -935 -144 -720 1057 699 -591 317 -67 -628 499 -72 525 286 -498 346 37 -1131 303
$$ packed form
7959b06P96j811J456M45n80J38J84j108m10J472l79J109j886j15J565k23j620
7976a173J572k78r39J165l99N62o40P04k57q00J226l48j149J131m61N74O41j082
7994D9L20K61k21O6j656O70P46o36J360j608Q27r89O39J436q00o81K114o79j453
8013b35j03J45j131J650K93j016J149q17O59l84M25r7r55K92k25J002pJ35j374
8032e94m00J143n89Q05k44k56J16P12j295J433p29j230J394k8k68J0o90J265m16
8051A39j96J23O84o79j13M05k77r05J344q75L18j22L05j380J015l03L81N6J329
8070A249n04L66r44j230k90K382l30q53N07J248j273j629J388p44J16m3J03m58
8088i39P85p81P91n76J777l58j290R08l84n61J127n71N97k39p84Q44l09j168J434
$$ plain form
8107 303 1187 739 -520 -380 -221 -317 -290 416 48 375 69 -602 -607 226 -833 149 -12 -532 769 81
8127 81 447 763 -490 914 -650 250 497 -418 229 -665 1029 245 84 -406 -317 406 -177 644 -85
8146 -85 597 399 -562 -1018 -268 -668 -393 382 422 1200 -752 -556 -62 681 220 207 -98 -55 19 -419 358
8167 358 758 -886 474 131 -788 -952 -393 -15 -709 802 154 239 -191 1261 1308 211 -573 -2359 264
8186 264 -636 183 369 -1061 701
$$ packed form
8107C03Q84m48j259J40J59r6K7P06l68L27l06o71nQ33j059R82j61n20J301o88
8127H1L66L16j253J404j564R00K47r15O47q94J694p84j61m90Q9P23n83Q21p29
8146h5O82j98r61m56P50m00K75P75M0P78j952J96M94P43m61j3l05M3P4m38P77
8167C58M00j644J360l43r19j64N59L78o94J511o48Q5m30J452M7j097p84j786K623
8186B64r00Q19J86j430J762
8191G01
$$ Imaginary data points
##PAGE= N=2
##DATA TABLE= (X++(I..I)), XYDATA
$$ plain form
0 0 0 0 0 0 0 0 0 0 0 0 0 107 -107 108 -108 108 -215 216 -322 323 -430 458 -540 647 -756 955 -1078 1237
28 1237 -1418 1652 -1894 2157 -2466 2793 -3149 3550 -4001 4478 -5008 5597 -6241 6935 -7692
43 -7692 8528 -9442 10422 -11507 12700 -13993 15413 -16982 18713 -20614 22732 -25109
55 -25109 27781 -30783 34245 -38246 42922 -48493 55281 -63732 74593 -89148 109817
66 109817 -141591 197371 -323969 1279246 -1492825 -3286997 1332863 3273123 575938
75 575938 -3203294 -1007548 2697411 1772436 -1907659 -2268702 859961 2879194 -333391
84 -333391 -2833706 -334358 2735013 1182437 -2293956 -1478352 2069219 2185623 -1163092
93 -1163092 -2102764 792450 2341863 463956 -2028705 -939178 1955084 1706701 -1275524
$$ packed form
0@%%%%%%%%%%%J07k14K15k16K16l23M31n38O45p53Q88r98J187j403J711k033K315
28A237k655L070l546M051m623N259n942O699p551Q479r486J0605j1838J3176j4627
43g692J6220j7970J9864k1929K4207k6693K9406l2395L5695l9327M3346m7841
55b5109N2890n8564O5028p2491Q1168r1415J03774j19013J38325j63741J98965
66A09817k51408L38962n21340J603215k772071j794172M619860J940260k697185
75E75938l779232K195746L704959r24975l680095l61043L128663K019233l212585
84c33391k500315K499348L069371j552576l476393Q15604L547571J16404l348715
93a163092r39672K895214J549413j877907k492661J089527K894262k48383k982225
$$ plain form
102 -1275524 -1955512 619629 2347772 74320 -2450186 -433514 1982794 1033499 -1480380
111 -1480380 -1647388 1171816 1798656 -600816 -1767779 -15498 1836399 736907 -1749358
120 -1749358 -995930 1656295 1464055 -966399 -1729648 802230 2122860 -86153 -1851605
129 -1851605 -296039 1995070 1016743 -1424883 -1292169 1200109 1767108 -522777 -1740319
138 -1740319 71743 1802178 486370 -1509255 -924044 1314677 1197781 -877186 -1319007
147 -1319007 418337 1572031 -37479 -1384957 -224280 1314419 759437 -952060 -883256
156 -883256 844470 1237931 -340334 -1081274 -21973 1261174 501461 -1081417 -672694
165 -672694 793972 1018728 -533722 -1179323 187034 1144988 108246 -1120046 -460180
$$ packed form
102a275524o79988K575141J728143k273452k524506K016672K416308r49295k513879
111a480380j67008K819204O26840k399472j166963J752281J851897j099492k486265
120a749358P53428K652225j92240k430454p63249K531878J320630k209013j765452
129a851605J555566K291109r78327k441626J32714K492278N66999k289885j217542
138a740319J812062J730435j315808j995625N85211K238721j16896k074967m41821
147a319007J737344J153694j609510j347478J160677J538699n54982j711497O8804
156h83256J727726L93461j578265p40940J059301J283147p59713j582878M08723
165f72694J466666K24756j552450o45601J366357R57954j036742j228292O59866
$$ plain form
174 -460180 862990 707792 -712392 -870589 385066 1012162 -72733 -1085770 -122697
183 -122697 1058470 512278 -958868 -657596 886760 892101 -576151 -1008819 401214
192 401214 1113711 -29971 -1115860 -253173 1024906 579946 -858401 -909768 685798
201 685798 1029941 -388481 -1196196 86662 1230366 181322 -1091002 -463928 995990
210 995990 723302 -663570 -829351 479491 1040999 -63966 -945807 -177684 1068078
219 1068078 512233 -796577 -682436 665531 953682 -410962 -954469 119272 989140
228 989140 181805 -875740 -492234 716248 737748 -511955 -857877 191775 1020358
237 1020358 87278 -996343 -327900 920134 629656 -739432 -765446 482992 965713
$$ packed form
174d60180J323170j55198j420184j58197J255655O27096j084895j013037R63073
183a22697J181167n46192j471146L01272J544356N341j468252m32668J410033
192D01214P12497j143682j085889Q62687J278079m44960j438347n1367J595566
201F85798L44143j418422q07715J282858J143704j049044j272324O27074J459918
210I95990k72688j386872j65781J308842N61508j104965q81841P68123J245762
219A068078n55845j308810J14141J347967K88151j364644n43507J073741Q69868
228I89140q07335j057545L83506J208482K1500j249703l45922J049652Q28583
237A020358r33080j083621O68443J248034k90478j369088k6014J248438M82721
$$ plain form
246 965713 -224830 -1002744 -63666 953141 391545 -920982 -653578 731874 869225
255 869225 -566658 -1008885 286732 1059072 26295 -1117965 -254046 983907 544133
264 544133 -793338 -798667 577570 958278 -297811 -1068691 34416 1012736 286601 -957002
274 -957002 -554690 821885 699797 -536296 -841089 297895 912021 28239 -861692
283 -861692 -246183 826903 506976 -563742 -696205 445788 843460 -176598 -824512
292 -824512 -63039 816895 311862 -665324 -554557 530811 686934 -275920 -768380 -17511
302 -17511 852709 234530 -764423 -453683 655828 640094 -448492 -762326 222960 846729
312 846729 -31404 -777756 -269106 695275 475582 -622943 -657117 395145 758604 -244402
$$ packed form
246I65713j190543p77914R39078J016807n61596j312527K67404J385452J37351
255H69225j435883m42227J295617P72340j032777j144260Q63919J237953m39774
264E44133j337471n329J376237L80708j256089p70880J103107R78320p26135j243603
274i57002M02312J376575j22088j236093l04793J138984O14126q83782q89931
283h61692O15509J073086l19927j070718j32463J141993L97672j020058o47914
292h24512P61473Q79934n05033r77186J10767J085368J56123r62854m92460P50869
302a7511Q70220o18179r98953L10740J109511j5734j088586l13834R85286O23769
312H46729q78133p46352N08650R64381k19693j098525l4174J052262L63459j003006
$$ plain form
322 -244402 -834267 -34372 821162 188821 -787133 -370653 577045 538748 -458506 -669026
332 -669026 219263 693201 -40518 -730690 -196423 603654 367912 -588882 -508165 389903
342 389903 538610 -229297 -627736 41428 566892 137062 -520452 -264931 389393 414580
352 414580 -228433 -518927 146236 534455 59891 -511784 -194032 465698 324024 -351485
362 -351485 -421065 233074 437626 -36109 -498027 -119508 478293 238191 -388986 -392309
372 -392309 318709 477620 -182391 -531041 84059 551273 71884 -473205 -226807 459895
382 459895 335623 -327799 -425389 207479 502968 -93115 -526513 -75068 526388 144250
392 144250 -484695 -291989 359182 352775 -319845 -425661 133048 428771 -57654 -448974
$$ packed form
322b44402n89865P99895Q55534o32341r75954M16480R47698l8297r97254k10520
332f69026Q88289M73938p33719o90172N34267Q00077k35742r56794Q0717Q98068
342C89903J48707p67907l98439O69164N25464m29830o57514K55521O54324K5187
352D14580o43013k90494O65163L88219m74564n71675L17752O59730j41674o75509
362c51485o9580O54139K04552m73735m61918L78519N97801k40102o27177l323
372c92309P11018J58911o60011l48650O15100M67214m79389n45089K46398O86702
382D59895j24272o63422r7590O32868K95489n96083m33398M51445O01456l82138
392A44250o28945J92706O51171o407o72620j05816N58709K95723m86425l91320
$$ plain form
402 -448974 -118164 388070 223333 -375760 -292439 245630 373840 -159470 -403292 61836
412 61836 389253 65993 -356635 -151057 257182 261329 -199688 -323344 83410 317296
422 317296 28613 -385635 -132939 307548 204316 -276368 -301680 173116 321670 -62608
432 -62608 -368456 -27108 344292 183870 -301852 -268681 285683 363837 -134977 -409857
442 -409857 94346 457504 55118 -412160 -143504 399717 254163 -283185 -352588 211300
452 211300 398362 -86557 -435415 -44469 446527 122189 -405419 -262456 352119 311178
462 311178 -275648 -369484 130573 399758 -47997 -393295 -97767 353876 188137 -291504
472 -291504 -299733 186660 368463 -137410 -364184 -13340 346675 99906 -344703 -192085
$$ packed form
402d48974L30810N06234j64737n99093Q3321N38069J28210n33310k43822M65128
412F1836L27417l23260m22628K05578M08239M147m61017j23656M06754K33886
422C17296k88683m14248K52696M40487j03232m80684k5312M74796J48554l84278
432f2608l05848L41348L71400j60422m85722L3171N54364P8154m98814k74880
442d09857N04203L63158m02386m67278K68656N43221j45554n37348o9403N63888
452B11300J87062m84919l48858L90946M90996l24338n27608J42963O14575m0941
462C11178n86826r3836N00057K69185m47755l45298K95528M51643j65739m79641
472b91504q229M86393J81803n05873k26774L50844L60015k46769m44609J52618
$$ plain form
482 -192085 224249 239205 -165023 -314366 -3346 315172 51643 -342948 -180229 233377
492 233377 263851 -230330 -335741 109930 347324 -7783 -356219 -90346 310729 228258
502 228258 -253212 -281384 184152 371929 -61187 -395030 -12814 396952 145412 -380966
512 -380966 -200765 304166 274922 -204402 -358167 128711 358781 -7583 -362388 -98683
522 -98683 339253 205084 -284353 -269528 244339 307227 -107994 -340305 48537 345274
532 345274 38933 -269473 -141952 234931 198637 -159752 -255996 72767 259559 -3410
542 -3410 -269793 -105539 243811 113954 -191751 -198470 103428 212065 -68257 -221712 -58361
553 -58361 205262 103713 -183649 -192260 120236 231264 -87015 -257405 -7084 258811
$$ packed form
482a92085M16334J4956m04228j49343L11020L18518k63529l94591J62719M13606
492B33377L0474m94181j05411M45671K37394l55107l48436K65873M01075q2471
502B28258m81470k8172M65536J87777m33116l33843L82216M09766k51540n26378
512c80966J80201N04931k9244m79324j53765M86878K30070l66364l54805K63705
522i8683M37936j34169m89437J4825N13867O2888m15221k32311L88842K96737
532C45274l06341l08406J27521L76883l6294l58389r6244L28763J86792k62969
542c410k66383J64254L49350j29857l05705o719L01898J08637k80322j53455J63351
553e8361K63623j01549k87362q611L12496J11028l18279j70390K50321K65895
$$ plain form
563 258811 48219 -233848 -136319 180996 182361 -151393 -205531 41921 243152 1844 -269242
574 -269242 -61677 236924 116140 -222097 -169075 167038 218323 -144910 -214151 78274
584 78274 217626 25488 -234625 -49992 209638 131188 -151361 -157076 135058 203872 -61297
595 -61297 -204377 56695 200462 27095 -168195 -51414 156299 88056 -86926 -120254
605 -120254 72204 128793 -8467 -136220 -37603 154491 60306 -116217 -100422 93069 115091
616 115091 -49191 -132383 8262 128554 24953 -95483 -107549 89419 126462 -66635
626 -66635 -149496 2215 166455 11303 -169040 -70182 148849 79188 -128681 -130932 65685
637 65685 152541 -62896 -167652 -21347 172409 43986 -194426 -95343 154813 138113 -151758
$$ packed form
563B58811k10592k82067R7529L17315J365l33754n4138K47452K01231k41308k71086
574b69242K07565K98601j20784l38237N3022L36113N1285l63233o9241K92425
584G8274J39352j92138k60113J84633K59630p8450k82549n715K92134O8814k65169
595f1297j43080K61072J43767j73367j95290J16781K07713o8243j74982l3328
605a20254J92458N6589j37260j27753R8617J92094r4185j76523J5795J93491K2022
616A15091j64282q3192J40645J20292j03601j20436j2066J96968L7043j93097
626f6635q2861J51711J64240j55152j80343R8858K19031o9661k07869k251J96617
637F5685Q6856k15437j04756J46305J93756j28423k38412R9083K50156j6700k89871
$$ plain form
648 -151758 -162167 95669 185556 -54197 -188259 10191 174675 64270 -165835 -87764
658 -87764 130039 143482 -87860 -165725 68725 168350 -2029 -172704 -18643 159424 68336
669 68336 -116564 -92955 94547 117104 -21121 -134639 3594 138450 62544 -106528 -99842
680 -99842 113094 121456 -49316 -137321 17066 142142 36001 -122209 -89831 104019 117891
691 117891 -51844 -170069 16355 177199 20932 -169470 -87293 163769 109403 -127391
701 -127391 -156022 79882 165907 -39055 -179298 -39112 181493 58706 -167791 -129853
711 -129853 131485 154682 -117822 -184815 47889 193975 -23531 -182251 -40192 157748
721 157748 84713 -139719 -113207 84246 150877 -47107 -157773 -2362 160721 43591
$$ packed form
648a51758j0409K57836Q9887k39753j34062J98450J64484j10405k30105P8071
658h7764K17803J3443k31342p7865K34450R9625j70379j70675J54061J78067r1088
669F8336j84900K3609J87502K2557j38225j13518J38233J34856p5906j69072O686
680i9842K12936Q362j70772q8005J54387J25076j06141j58210L2378J93850J3872
691A17891j69735j18225J86424J60844j56267j90402Q2177K51062n4366k36794
701a27391k8631K35904Q6025k04962j40243J40186K20605j22787k26497L7938
711a29853K61338K3197k72504o6993K32704J46086k17506j58720J42059J97940
721A57748p3035k24432K6512J97453O6631j97984j10666J55411J63083j17130
$$ plain form
731 43591 -151890 -58070 108758 104776 -82082 -112211 45300 113141 17112 -107199 -42435
742 -42435 93027 101713 -71505 -104037 51039 129724 8146 -137307 -13435 123441 71361
753 71361 -89123 -91051 65134 122564 -10179 -143541 -9312 136848 68468 -130474 -99824
764 -99824 117193 115556 -79994 -143555 54152 131247 -8227 -144728 -35999 131257 50666
775 50666 -104285 -107555 83916 116637 -67916 -144148 30247 138834 -16231 -132103 -39403
786 -39403 124139 41540 -101819 -67893 54597 86434 -45101 -91768 -1899 95599 12019
797 12019 -91427 -42767 66714 58371 -71990 -55398 34074 59194 -18249 -59583 -6291 45846
809 45846 38385 -47064 -40574 23659 70502 -5897 -76564 7227 77087 32844 -66024 -30885
$$ packed form
731D3591j95481R3820J66828l982j86858l0129J57511O7841r6029j24311O4764
742d2435J35462Q686j73218l2532J55076P8685j21578j45453J23872J36876n2080
753G1361j60484j928J56185N7430j32743j33362J34229J46160o8380j98942L0650
764i9824K17017j637j95550o3561J97707P7095j39474j36501J08729J67256q0591
775E0666j54951l270J91471L2721j84553p6232J74395J08587j55065j15872R2700
786c9403J63542q2599j43359L3926J22490L1837j31535m6667Q9869R7498q3580
797A2019j03446M8660J09481q343j30361J6592Q9472K5120p7443m1334N3292N2137
809D5846p461q5449O490O4233M6843p6399p0667Q3791O9860m4243r8868L5139
$$ plain form
821 -30885 52986 70507 -29509 -67506 21675 74944 32747 -88282 -33848 87836 63037
832 63037 -70008 -81747 64601 91122 -36914 -105786 26690 97600 5831 -94493 -43119
843 -43119 94456 52709 -68245 -90264 57133 99023 -40085 -110561 2437 115685 1025
854 1025 -103961 -42342 80959 44916 -70090 -71382 26152 77329 -28160 -80360 -26015 72176
866 72176 33150 -81882 -49437 43281 61257 -41545 -67811 6232 64333 12288 -58555 -36856
878 -36856 32890 69855 -30689 -70369 851 82584 28529 -87779 -34759 69447 70635 -49574
890 -49574 -74125 27404 95260 10006 -92159 -24379 89638 78148 -83332 -81321 70723
901 70723 107310 -30762 -119021 25547 114173 18593 -106571 -40782 96590 71990 -65648
$$ packed form
821c0885Q3871J7521j00016l7997Q9181N3269m2197j21029N4434J21684k4799
832F3037j33045j1739J46348K6521j28036o8872J32476P0910r1769j00324N1374
843d3119J37575m1747j20954k2019J47397M1890j39108p0476J12998J13248j14660
854A025j04986O1619J23301l6043j15006j292R7534N1177j05489n2200N4345R8191
866G2176l9026j15032L2445R2718J7976j02802k6266P4043N8101n2045p0843K1699
878c6856O9746L6965j00544l9680P1220Q1733n4055j16308N3020J04206J188j20209
890d9574k4551J01529O7856q5254j02165O7780J14017j1490j61480K011J52044
901G0723L6587j38072q8259J44568Q8626r5580j25164O5789J37372k4600j37638
$$ plain form
912 -65648 -94962 52497 104700 -11691 -118121 -6779 111990 28758 -91134 -65117 84222
923 84222 63067 -52803 -76193 15020 77805 2687 -75265 -40366 65642 44152 -45708 -76383
$$ packed form
912f5648k9314J47459N2203j16391j06430J11342J18769q3232j19892K6017J49339
923H4222k1155j15870k3390R1213O2785p5118p7952L4899J06008k1490q9860l0675
$$ [...]
8191d67
##END NTUPLES=NMR FID
##END=
