##TITLE=1H_IAMT-144
 CDCl3,8 sc, 
 5.02.2021
##JCAMPDX= 6.0         $$ Bruker NMR JCAMP-DX V2.0
##DATA TYPE= NMR FID
##DATA CLASS= NTUPLES
##ORIGIN= UXNMR, Bruker Analytische Messtechnik GmbH
##OWNER= root
$$ XWIN-NMR		Version 3.5
$$ Fri Feb  5 10:27:03 2021 Russian Standard Time (UT+4h)  she@DPX200
##.OBSERVE FREQUENCY= 200.1315066352
##.OBSERVE NUCLEUS= ^1H
##.DELAY= (6, 6)
##.ACQUISITION MODE= SIMULTANEOUS
##.ACQUISITION SCHEME= undefined
##.AVERAGES= 8
##.DIGITISER RES= 18
##SPECTROMETER/DATA SYSTEM= spect
##.PULSE SEQUENCE= zg30
##.SOLVENT NAME= CDCl3
##.SHIFT REFERENCE= (INTERNAL, CDCl3, 0, 15.7039)
##AUDIT TRAIL= $$ (NUMBER, WHEN, WHO, WHERE, WHAT)
$$ ##TITLE= Audit trail, XWIN-NMR		Version 3.5
$$ ##JCAMPDX= 5.01
$$ ##ORIGIN= Bruker BioSpin GmbH
$$ ##OWNER= she
$$ F:/spectra/data/she/nmr/H-F/1/audita.txt
$$ ##AUDIT TRAIL=  $$ (NUMBER, WHEN, WHO, WHERE, WHAT)
(   1,<2021-02-05 10:25:29.29 +0400>,<she>,<DPX200>,
      <created by zg, POWCHK disabled, PULCHK disabled
       configuration hash MD5:
       00 E9 B6 7A A2 85 ED C7 34 08 36 98 17 FE 4E 26
       data hash MD5: 16K
       1E 58 25 62 A0 46 B6 42 89 C2 65 CF FA 0E 57 33>)
$$ ##END=
$$ 
$$ hash MD5
$$ 0A 19 2E EB DE 1A 82 91 D4 8B 8E 99 B6 B0 FE 24
##$RELAX= 
##$RELAX= 
##$RELAX= 
##$RELAX= 
##$RELAX= 
##$RELAX= 
$$ Bruker specific parameters
$$ --------------------------
##$DU= <F:/spectra>
##$EXPNO= 1
##$NAME= <H-F>
##$PROCNO= 1
##$TYPE= <nmr>
##$USER= <she>
##$AMP= (0..31)
100 100 100 100 100 100 100 100 100 100 100 100 100 100 100 100 100 100 
100 100 100 100 100 100 100 100 100 100 100 100 100 100 
##$AQSEQ= 0
##$AQ_mod= 1
##$AUNM= <au_zg>
##$AUTOPOS= <>
##$BF1= 200.13
##$BF2= 200.13
##$BF3= 200.13
##$BF4= 200.13
##$BF5= 200.13
##$BF6= 200.13
##$BF7= 200.13
##$BF8= 200.13
##$BYTORDA= 1
##$CFDGTYP= 0
##$CFRGTYP= 5
##$CHEMSTR= <none>
##$CNST= (0..31)
1 1 145 1 1 1 1 1 1 1 1 1 1 1 1 1 1 1 1 1 1 1 1 1 1 1 1 1 1 1 1 1 
##$CPDPRG= <>
##$CPDPRG1= <>
##$CPDPRG2= <>
##$CPDPRG3= <>
##$CPDPRG4= <mlev>
##$CPDPRG5= <mlev>
##$CPDPRG6= <mlev>
##$CPDPRG7= <mlev>
##$CPDPRG8= <mlev>
##$CPDPRGB= <>
##$CPDPRGT= <>
##$D= (0..31)
0 1.2 0 0 0 0 0 0 0 0.06 0 0.03 0 0 0 0 0.0002 0 0 0 0 0 0 0 0 0 0 0 0 
0 0 0 
##$DATE= 1612506328
##$DBL= (0..7)
120 120 120 120 120 120 120 120 
##$DBP= (0..7)
150 150 150 150 150 150 150 150 
##$DBP07= 0
##$DBPNAM0= <>
##$DBPNAM1= <>
##$DBPNAM2= <>
##$DBPNAM3= <>
##$DBPNAM4= <>
##$DBPNAM5= <>
##$DBPNAM6= <>
##$DBPNAM7= <>
##$DBPOAL= (0..7)
0.5 0.5 0.5 0.5 0.5 0.5 0.5 0.5 
##$DBPOFFS= (0..7)
0 0 0 0 0 0 0 0 
##$DE= 6
##$DECBNUC= <off>
##$DECIM= 24
##$DECNUC= <off>
##$DECSTAT= 4
##$DIGMOD= 1
##$DIGTYP= 9
##$DL= (0..7)
0 120 120 120 120 120 120 120 
##$DP= (0..7)
150 150 150 150 150 150 150 150 
##$DP07= 0
##$DPNAME0= <>
##$DPNAME1= <>
##$DPNAME2= <>
##$DPNAME3= <>
##$DPNAME4= <>
##$DPNAME5= <>
##$DPNAME6= <>
##$DPNAME7= <>
##$DPOAL= (0..7)
0.5 0.5 0.5 0.5 0.5 0.5 0.5 0.5 
##$DPOFFS= (0..7)
0 0 0 0 0 0 0 0 
##$DQDMODE= 0
##$DR= 18
##$DS= 0
##$DSLIST= <SSSSSSSSSSSSSSS>
$$ [...]
##$SUBNAM2= <"">
##$SUBNAM3= <"">
##$SUBNAM4= <"">
##$SUBNAM5= <"">
##$SUBNAM6= <"">
##$SUBNAM7= <"">
##$SUBNAM8= <"">
##$SUBNAM9= <"">
##$SW= 26.024554658588
##$SWIBOX= (0..15)
0 0 2 0 0 0 0 0 0 0 0 0 0 0 0 0 
##$SW_h= 5208.33333333333
##$TD= 16384
##$TD0= 1
##$TE= 0
##$TE2= 300
##$TE3= 300
##$TEG= 300
##$TL= (0..7)
0 120 120 120 120 120 120 120 
##$TP= (0..7)
150 150 150 150 150 150 150 150 
##$TP07= 0
##$TPNAME0= <>
##$TPNAME1= <>
##$TPNAME2= <>
##$TPNAME3= <>
##$TPNAME4= <>
##$TPNAME5= <>
##$TPNAME6= <>
##$TPNAME7= <>
##$TPOAL= (0..7)
0.5 0.5 0.5 0.5 0.5 0.5 0.5 0.5 
##$TPOFFS= (0..7)
0 0 0 0 0 0 0 0 
##$TUNHIN= 0
##$TUNHOUT= 0
##$TUNXOUT= 0
##$USERA1= <user>
##$USERA2= <user>
##$USERA3= <user>
##$USERA4= <user>
##$USERA5= <user>
##$V9= 5
##$VALIST= <valist>
##$VCLIST= <CCCCCCCCCCCCCCC>
##$VD= 0
##$VDLIST= <DDDDDDDDDDDDDDD>
##$VPLIST= <PPPPPPPPPPPPPPP>
##$VTLIST= <TTTTTTTTTTTTTTT>
##$WBST= 1024
##$WBSW= 4
##$XGAIN= (0..3)
0 0 0 0 
##$XL= 0
##$YL= 0
##$YMAX_a= 974974
##$YMIN_a= -651840
##$ZGOPTNS= <>
##$ZL1= 120
##$ZL2= 120
##$ZL3= 120
##$ZL4= 120
##$ABSF1= 10
##$ABSF2= 0
##$ABSG= 5
##$ABSL= 3
##$ALPHA= 0
##$AQORDER= 0
##$ASSFAC= 0
##$ASSFACI= 0
##$ASSFACX= 0
##$ASSWID= 0
##$AUNMP= <proc_1d>
##$AZFE= 0.1
##$AZFW= 0.1
##$BCFW= 1
##$BC_mod= 2
##$BYTORDP= 1
##$COROFFS= 0
##$CY= 11.3945322036743
##$DATMOD= 1
##$DC= 2
##$DFILT= <>
##$DTYPP= 0
##$F1P= 15.9154993809931
##$F2P= -4.1035820241983
##$FCOR= 0.5
##$FTSIZE= 0
##$FT_mod= 4
##$GAMMA= 1
##$GB= 0.15
##$INTBC= 1
##$INTSCL= 1
##$ISEN= 128
##$LB= 0.24
##$LEV0= 0
##$LPBIN= 0
##$MAXI= 10000
##$MC2= 0
##$MEAN= 0
##$ME_mod= 0
##$MI= 1.114404
##$NCOEF= 0
##$NC_proc= 0
##$NLEV= 6
##$NOISF1= 3.799351
##$NOISF2= 2.8
##$NSP= 1
##$NTH_PI= 0
##$NZP= 0
##$OFFSET= 15.70392
##$PC= 1
##$PHC0= -10583.62
##$PHC1= 17.20094
##$PH_mod= 1
##$PKNL= yes
##$PPARMOD= 0
##$PSCAL= 0
##$PSIGN= 0
##$REVERSE= no
##$SF= 200.130013532006
##$SI= 16384
##$SIGF1= 3
##$SIGF2= 2
##$SINO= 400
##$SIOLD= 16384
##$SREGLST= <1H.CDCl3>
##$SSB= 0
##$STSI= 0
##$STSR= 0
##$SW_p= 3612.71676300578
##$SYMM= 0
##$S_DEV= 0
##$TDeff= 0
##$TDoff= 0
##$TI= <>
##$TILT= no
##$TM1= 0
##$TM2= 0
##$TOPLEV= 0
##$USERP1= <user>
##$USERP2= <user>
##$USERP3= <user>
##$USERP4= <user>
##$USERP5= <user>
##$WDW= 1
##$XDIM= 8192
##$YMAX_p= 0
##$YMIN_p= 0
$$ End of Bruker specific parameters
$$ ---------------------------------
##NTUPLES= NMR FID
##VAR_NAME=  TIME,          FID/REAL,        FID/IMAG
##SYMBOL=    X,             R,               I
##VAR_TYPE=  INDEPENDENT,   DEPENDENT,       DEPENDENT
##VAR_FORM=  AFFN,          ASDF,            ASDF
##VAR_DIM=   8192,          8192,            8192
##UNITS=     SECONDS,       ARBITRARY UNITS, ARBITRARY UNITS
##FACTOR=    0.000192,      1,               1
##FIRST=     0,             0,               0
##LAST=      1.572672,      0,               0
##MIN=       0,             -651840,         0
##MAX=       1.572672,      974974,          0
$$ Real data points
##PAGE= N=1
##DATA TABLE= (X++(R..R)), XYDATA
$$ plain form
0 0 0 0 0 -8 8 0 16 -16 16 -24 33 -40 49 -64 79 -89 113 -133 152 -182 214 -246 287 -334 380 -433 495 -564
28 -564 635 -718 811 -911 1018 -1143 1273 -1416 1577 -1751 1940 -2152 2384 -2640 2917 -3236
44 -3236 3586 -3977 4421 -4932 5510 -6193 7000 -7969 9164 -10689 12693 -15468 19584
57 19584 -26343 39405 -74126 360079 974974 269063 -364205 -356084 281041 587575 305084
68 305084 -133399 -13559 456437 613190 113080 -429090 -384535 183048 502158 199604
78 199604 -332239 -417762 -49012 222234 28217 -290360 -282510 -20268 13156 -315058 -606840
89 -606840 -454898 -26967 164884 -78822 -383774 -361272 -132336 -107220 -341152 -454349
99 -454349 -195618 152312 134233 -246626 -475692 -202033 258585 320336 -71708 -371083
$$ packed form
0@%%%qJ6qJ6l2L2m0N7p3Q9j13J43j68K02k46K85l34L96m60N33o21P14q13R28j059
28e64J199j353J529j722J929k161K416k689K993l328L691m092M536n024N557o153
44c236O822p563Q398r353J0442j1703J3193j4969J7133j9853K3382k8161L5052
57A9584m5927O5748j13531M34205O14895p05911o33268Q121O37125L06534k82491
68C05084m38483J19840M69996J56753n00110n42170M4555N67583L19110l02554
78A99604n31843q5523L68750K71246j94017l18577P850K62242L3424l28214k91782
89f06840J51942M27931J91851k43706l04952K2502K28936K5116k33932j13197
99d54349K58731L47930j8079l80859k29066K73659M60618O1751l92044k99375
$$ plain form
109 -371083 -178638 219115 266335 -81136 -277923 52211 547883 551829 9742 -422428
119 -422428 -226084 317850 519299 173749 -209987 -105211 326741 463082 85407 -302664
129 -302664 -170185 301145 460613 65097 -397163 -349794 130778 438375 235695 -141141
139 -141141 -197508 52327 169579 -49766 -295547 -188934 183488 365246 134831 -195903
149 -195903 -204387 78278 247327 105895 -95268 -58610 135406 172409 -19627 -138643 61657
160 61657 375378 386811 46639 -237399 -143038 153421 242679 43541 -110576 40050 298741
171 298741 256289 -98197 -334202 -136256 236514 286968 -75645 -413440 -300071 97437
181 97437 257165 -14068 -319615 -248815 56841 113669 -213492 -514563 -376277 63987
$$ packed form
109c71083J92445L97753M7220l47471j96787L30134M95672L946n42087m32170
119d22428J96344N43934K01449l45550l83736J04776M31952J36341l77675l88071
129c02664J32479M71330J59468l95516m62260M7369M80572L07597k02680l76836
139a41141n6367K49835J17252k19345k45781J06613L72422J81758k30415l30734
149a95903q484K82665J69049j41432k01163L6658J94016L7003j92036j19016K00300
160F1657L13721J1433l40172k84038R4361K96459Q9258j99138j54117J50626K58691
171B98741m2452l54486k36005J97946L72770N0454l62613l37795J13369L97508
181I7437J59728k71233l05547P0800L05656N6828l27161l01071J38286M40264
$$ plain form
191 63987 277731 18336 -361562 -383536 -64203 141675 -26077 -302966 -289827 2430
201 2430 179389 10277 -247662 -205288 111341 294954 118358 -172368 -213019 8927 178854
212 178854 102420 -43399 11977 224471 286857 78259 -143440 -91754 154138 263870 103447
223 103447 -88492 -36880 183863 249717 56110 -119413 -16792 218396 228198 -52592 -283622
234 -283622 -158191 179939 310806 87198 -172853 -128702 117251 179541 -62376 -287515
244 -287515 -170430 168194 297378 42484 -264550 -216155 123187 303377 96452 -213381
254 -213381 -229105 36505 204958 58781 -165972 -117370 173224 315934 99965 -217678
264 -217678 -252737 10384 219718 125774 -104968 -138964 60605 192798 59890 -151551
$$ packed form
191F3987K13744k59395l79898k1974L19333K05878j67752k76889J3139K92257
201B430J76959j69112k57939M2374L16629J83613j76596k90726m0651K21946J69927
212A78854p6434j45819N5376K12494O2386k08598k21699N1686K45892J09732j60423
223A03447j91939N1612K20743O5854j93607j75523J02621K35188R802k80790k31030
234b83622J25431L38130J30867k23608k60051M4151K45953O2290k41917k25139
244b87515J17085L38624J29184k54894l07034M8395L39342J80190k06925l09833
254b13381j5724K65610J68453j46177k24753M8602K90594J42710k15969l17643
264b17678l5059K63121K09334r3944k30742l3996J99569J32193j32908k11441
$$ plain form
274 -151551 -143892 61692 160927 -6535 -231653 -213146 31688 185924 65096 -137490 -142411
285 -142411 21072 75123 -93682 -263031 -179196 79783 186555 2001 -221305 -176037
295 -176037 72303 174820 -13355 -236130 -189645 62918 177411 1226 -205273 -124605
305 -124605 165014 280045 57435 -220707 -206454 61111 221188 77136 -146169 -115102
315 -115102 148168 285540 99970 -167802 -169305 81855 238924 91188 -155716 -162609 82442
326 82442 249463 123451 -104795 -120816 73964 180240 27978 -190432 -178440 62426
336 62426 225306 110779 -106837 -129779 48352 149816 15261 -173014 -149342 62844
346 62844 176879 34842 -160307 -124250 104462 212617 46743 -177186 -173065 31161 145383
$$ packed form
274a51551P659K05584R9235j67462k25118J8507K44834J54236j20828k02586m921
285a42411J63483N4051j68805j69349Q3835K58979J06772j84554k23306M5268
295a76037K48340J02517j88175k22775M6485K52563J14493j76185k06499Q0668
305a24605K89619J15031k22610k78142J4253K67565J60077j44052k23305L1067
315a15102K63270J37372j85570k67772j503K51160J57069j47736k46904o893K45051
326H2442J67021j26012k28246j6021J94780J06276j52262k18410J1992K40866
336F2426J62880j14527k17616k2942J78131J01464j34555j88275K3672K12186
346F2844J14035j42037j95149L6057K28712J08155j65874k23929M121K04226J14222
$$ plain form
357 145383 18447 -152048 -95518 137445 229352 36965 -200682 -180298 57869 190293
367 190293 42513 -174778 -154060 86298 222174 73258 -147507 -136848 75468 179529
377 179529 15081 -203891 -178958 74497 234077 105902 -119812 -137100 53886 167765
387 167765 36190 -166209 -160987 50430 188059 73157 -123916 -120696 79223 189279 50502
398 50502 -159344 -168565 17994 143325 41821 -125840 -109351 80419 176094 39806 -156639
409 -156639 -164194 13549 122958 12159 -159881 -136925 67029 180207 47602 -152673
419 -152673 -154961 26053 128023 3447 -176991 -154913 56396 183006 64144 -124390
429 -124390 -120822 60691 156868 22063 -170217 -158876 53394 194763 92442 -95675 -99514
$$ packed form
357A45383j26936j70495N6530K32963R1907j92387k37647K0384K38167J32424
367A90293j47780k17291K0718K40358J35876j48916k20765J0659K12316J04061
377A79529j64448k18972K4933K53455J59580j28175k25714j7288J90986J13879
387A67765j31575k02399N222K11417J37629j14902j97073L220J99919J10056j38777
398E0502k09846r221J86559J25331j01504j67661J6489J89770R5675j36288j96445
409a56639p555J77743J09409j10799j72040K2956K03954J13178j32605k00275
419a52673k288J81014J01970j24576j80438K2078K11309J26610j18862j88534
429a24390L568J81513R6177j34805j92280J1341K12270J41369j02321j88117l839
$$ plain form
440 -99514 80650 183183 54696 -138453 -139326 52303 177577 73182 -104993 -96008 95013
451 95013 204784 77441 -125023 -146409 21117 139311 49265 -113118 -104307 77224 186379
462 186379 65855 -123205 -137594 27516 135074 31973 -139043 -134259 52198 178219
472 178219 83895 -90280 -103742 46341 135582 29996 -132008 -125635 55049 181556 92893
483 92893 -76083 -89569 67205 166869 62711 -114947 -131344 31245 154016 76156 -80995
494 -80995 -85036 73020 166778 52736 -132799 -157128 -739 116198 37551 -123795 -135665
505 -135665 23611 132468 35981 -142102 -172938 -32744 70693 -15342 -173630 -173257 2593
516 2593 125950 34604 -142458 -171144 -26541 81403 -704 -157032 -164039 5714 134402
$$ packed form
440i9514J80164J02533j28487j93149q73J91629J25274j04395j78175Q985J91021
451I5013J09771j27343k02464k1386J67526J18194r0046j62383Q811J81531J09155
462A86379j20524j89060j4389J65110J07558j03101j71016M784J86457J26021
472A78219r4324j74175j3462J50083Q9241j05586j62004O373J80684J26507q8663
483I2893j68976j3486J56774R9664j04158j77658j6397J62589J22771p7860j57151
494h0995m041J58056R3758j14042j85535k4329J56389J16937p8647j61346j1870
505a35665J59276J08857r6487j78083l0836J40194J03437q6035j58288L73J75850
516B593J23357r1346j77062k8686J44603J07944q2107j56328p007J69753J28688
$$ plain form
527 134402 61762 -95719 -109722 39767 143419 50343 -119572 -135888 33435 172661 110358
538 110358 -45702 -64156 82486 185716 95220 -74808 -99731 48454 167442 98252 -53781
549 -53781 -65510 88843 198034 108717 -69531 -113114 17332 129286 65029 -82969 -98322
560 -98322 52380 164077 82605 -85555 -119358 11709 114343 37805 -119305 -137496 18190
571 18190 147351 86139 -68100 -102455 20624 117390 41981 -110334 -130926 19980 147315
582 147315 88699 -63440 -89888 44905 149898 72327 -90754 -128448 3882 121859 68174
593 68174 -70746 -88838 43938 140272 59235 -106066 -146833 -22908 86033 27386 -117968
604 -117968 -139238 -1372 107452 36172 -123660 -164483 -45550 54084 -13298 -156858 -170294
$$ packed form
527A34402p2640j57481j4003J49489J03652r3076j69915j6316J69323J39226o2303
538A10358j56060j8454J46642J03230r0496j70028k4923J48185J18988o9190j52033
549e3781j1729J54353J09191q9317j78248m3583J30446J11954o4257j47998j5353
560i8322J50702J11697q1472j68160l3803J31067J02634p6538j57110j8191J55686
571A8190J29161o1212j54239l4355J23079R6766p5409j52315k0592J50906J27335
582A47315n8616j52139k6448J34793J04993p7571j63081l7694J32330J17977n3685
593F8174j38920j8092J32776R6334q1037j65301m0767J23925J08941n8647j45354
604a17968k1270J37866J08824p1280j59832m0823J18933R9634o7382j43560j3436
$$ plain form
615 -170294 -21321 96646 31279 -120534 -150038 -22565 80767 12983 -136837 -159546 -11045
626 -11045 122047 75793 -65287 -91302 36187 139280 69630 -83314 -109926 36078 166932
637 166932 118881 -26634 -56818 74466 187757 127719 -26740 -74667 37936 147936 101052
648 101052 -30289 -50356 81524 188157 118894 -44206 -99144 8310 116595 71837 -61742
659 -61742 -91854 26715 127559 68126 -69092 -98655 12116 98192 25586 -121026 -145620
670 -145620 -7821 114919 70427 -64397 -97384 9813 94379 23602 -116458 -132925 9652
681 9652 127369 66444 -81091 -106278 27547 137574 72617 -84410 -129596 -11109 101800
692 101800 53079 -82575 -104367 30678 142287 76841 -89589 -150134 -41248 77681 42427
$$ packed form
615a70294J48973J17967o5367j51813k9504J27473J03332o7784j49820k2709J48501
626a1045J33092m6254j41080k6015J27489J03093o9650j52944k6612J46004J30854
637A66932m8051j45515l0184J31284J13291o0038j54459m7927J12603J10000m6884
648A01052j31341k0067J31880J06633o9263j63100n4938J07454J08285m4758j33579
659f1742l0112J18569J00844n9433j37218k9563J10771Q6076p2606j46612k4594
670a45620J37799J22740m4492j34824l2987J07197Q4566p0777j40060j6467J42577
681I652J17717o0925j47535k5187J33825J10027o4957j57027m5186J18487J12909
692A01800m8721j35654k1792J35045J11609o5446j66430o0545J08886J18929l5254
$$ plain form
703 42427 -91906 -131071 -15993 95239 48983 -91611 -141378 -42268 59628 18187 -113184
714 -113184 -153362 -44719 69473 44958 -65604 -98854 -9921 67273 14160 -106904 -127658
725 -127658 -6702 106224 74384 -38175 -62686 35534 115228 61206 -53570 -65298 51584
736 51584 140608 78534 -45719 -50567 84689 187310 122430 -26790 -72802 29830 126910
747 126910 78153 -43151 -53148 79784 178476 100434 -66780 -116106 5423 128484 86416
758 86416 -64419 -121840 -15842 102003 73863 -51774 -97076 -5023 86201 33348 -112131
769 -112131 -163660 -48894 89191 85128 -33686 -99975 -37392 46056 23509 -74577 -105052
780 -105052 -16556 71986 38924 -65925 -90744 5089 96978 66161 -42889 -88513 -22887
$$ packed form
703D2427j34333l9165J15078J11232m6256j40594m9767R9110J01896m1441j31371
714a13184m0178J08643J14192k4515j10562l3250Q8933P7194n3113j21064k0754
725a27658J20956J12926l1840j12559k4511R8220P9694n4022j14776j1728J16882
736E1584Q9024o2074j24253m848J35256J02621o4880j49220m6012J02632R7080
747A26910m8757j21304r997J32932R8692p8042j67214m9326J21529J23061m2068
758H6416j50835n7421J05998J17845k8140j25637m5302R2053R1224n2853j45479
769a12131n1529J14766J38085m063j18814o6289O2583Q3448k2547r8086l0475
780a05052Q8496Q8542l3062j04849k4819R5833R1889l0817j09050m5624O5626
$$ plain form
791 -22887 45975 14286 -65486 -58386 50455 120641 49692 -82651 -114223 -13163 77812 33698
803 33698 -81112 -100892 6471 91830 35127 -88224 -106987 6953 99571 34195 -117082
814 -117082 -160705 -37177 96618 79250 -44592 -96126 -8883 85406 43890 -89735 -133437
825 -133437 -17251 117675 103646 -26964 -95418 -15578 100176 101243 -2082 -64188 -5729
836 -5729 80208 66345 -24176 -51114 40422 139624 118983 2556 -68897 -22713 57993 58044 -6298
849 -6298 -21100 46474 96014 42399 -54861 -67877 23374 96369 45234 -70575 -104125 -18103
861 -18103 65459 38479 -45023 -54741 28118 76461 -4404 -134099 -145022 -8696 113418 75196
873 75196 -62524 -117019 -27500 74842 48326 -67182 -108566 -14608 85769 48261 -79777
$$ packed form
791b2887O8862l1689p9772P100J08841P0186p0949j32343l1572J01060R0975m4114
803C3698j14810j9780J07363Q5359n6703j23351j8763J13940R2618o5376j51277
814a17082m3623J23528J33795j7368j23842n1534Q7243R4289m1516j33625m3702
825a33437J16186J34926j4029j30610o8454P9840J15754J067j03325o2106N8459
836e729Q5937j3863r0521k6938R1536R9202k0641j16427p1453M6184Q0706N1o4342
849f298j4802O7574M9540n3615r7260j3016R1251P2995n1135j15809l3550Q6022
861a8103Q3562k6980q3502r718Q2859M8343q0865j29695j0923J36326J22114l8222
873G5196j37720n4495Q9519J02342k6516j15508m1384R3958J00377l7508j28038
$$ plain form
884 -79777 -120461 -6518 126705 116825 -22869 -120199 -69201 41876 60186 -21371 -66336
895 -66336 2890 94114 77516 -34097 -101072 -41278 61142 70644 -18569 -81155 -39043 38388
907 38388 45318 -13093 -38044 12221 60629 18891 -77737 -106514 -23562 68532 60267 -16513
919 -16513 -44857 10240 56639 9151 -77671 -78273 25902 103808 46762 -72426 -95070 14293
931 14293 117619 85740 -33796 -83202 -5973 77212 38669 -69964 -84958 38633 153333
942 153333 110467 -45962 -129557 -47224 82380 92331 -15175 -83173 -19905 77745 71035 -30437
954 -30437 -84722 -12838 91785 82083 -41473 -127454 -73135 46901 87952 24681 -37310 -18668
966 -18668 31711 17510 -56906 -85848 -15472 70623 62267 -24527 -72698 -24717 47582 47045 -17139
$$ packed form
884g9777m0684J13943J33223r880j39694r7330N0998J11077J8310q1557m4965
895f6336O9226R1224j6598j11613o6975N9794J02420R502q9213o2586M2112P7431
907C8388O930n8411k4951N0265M8408m1738r6628k8777Q2952R2094q265p6780
919a6513k8344N5097M6399m7488q6822o02J04175P7906n7046j19188k2644J09363
931A4293J03326l1879j19536m9406P7229Q3185l8543j08633j4994J23591J14700
942A53333m2866j56429q3595Q2333J29604R951j07506o7998O3268R7650o710j01472
954c0437n4285P1884J04623r702j23556q5981N4319J20036M1051o3271o1991J8642
966a8668N0379j4201p4416k8942P0376Q6095q356q6794m8171M7981P2299n37o4184
$$ plain form
979 -17139 -47605 -3315 38514 -144 -73995 -66435 38043 118028 71296 -50305 -100214 -27636
991 -27636 58575 38420 -49175 -65617 26606 102843 52069 -70392 -103285 2279 112635
1002 112635 80400 -57671 -126280 -41643 80148 86214 -12633 -68665 -3349 86899 61830
1013 61830 -63245 -129141 -45543 86225 106475 5176 -77617 -42558 46757 61792 -14499
1024 -14499 -70249 -27383 49407 46123 -34744 -79499 -21938 68175 78894 1315 -63548 -43945
1036 -43945 9633 8044 -40010 -44661 24267 81397 43615 -50890 -84845 -17286 60727 45036
1048 45036 -37077 -67657 -4560 59911 33413 -42737 -51113 35432 105204 50932 -77298 -121099
1060 -121099 -22083 97042 96287 -4570 -60146 -1393 78184 55475 -47943 -89588 -4032
$$ packed form
979a7139l0466M4290M1829l8658p3851P560J04478P9985m6732j21601m9909P2578
991b7636Q6211k0155q7595j6442R2223P6237n0774j22461l2893J05564J10356
1002A12635l2235j38071o8609Q4637J21791O066r8847n6032O5316R0248k5069
1013F1830j25075o5896Q3598J31768K0250j01299q2793L5059Q9315J5035p6291
1024a4499n5750M2866P6790l284q0867m4755N7561R0113J0719p7579o4863J9603
1036d3945N3578j589m8054m651O8928N7130l7782r4505l3955O7559P8013j5691
1048D5036q2113l0580O3097O4471k6498p6150q376Q6545O9772n4272j28230m3801
1060a21099R9016J19125p55j00857n5576N8753P9577k2709j03418m1645Q5556
$$ plain form
1071 -4032 101215 85282 -33173 -100620 -30704 86506 104590 7763 -75719 -49120 30395
1082 30395 40164 -29663 -68137 -6946 81132 79419 -16065 -90290 -57307 26600 47182 -10952
1094 -10952 -55099 -22019 34808 31905 -25059 -49637 392 58148 36746 -46805 -84879 -28663
1106 -28663 47156 48318 -10416 -33682 15190 61825 23809 -64181 -85733 -3075 81245 59880
1118 59880 -34936 -74958 -9033 71488 56538 -35333 -79795 -17881 60101 38110 -59594 -98440
1130 -98440 -17041 87882 85627 -22594 -101540 -61139 29316 42153 -32234 -77847 -23355 61962
1142 61962 62086 -25657 -86862 -40575 51439 67189 -10819 -75909 -45782 33371 59392 13058
1154 13058 -23975 8357 62156 49974 -25621 -67640 -15741 66123 78878 19680 -23187 5833
$$ packed form
1071d032J05247j5933j18455o7447O9916J17210J8084r6827q3482K6599P9515
1082C0395R769o9827l8474O1191Q8078j713r5484p4225L2983Q3907K0582n8134
1094a0952m4147L3080N6827k903n6964k4578N0029N7756k1402q3551l8074N6216
1106b8663P5819J162n8734k3266M8872M6635l8016q7990k1552Q2658Q4320k1365
1118E9880r4816m0022O5925Q0521j4950r1871m4462O1914P7982k1991r7704l8846
1130i8440Q1399J04923k255j08221p8946M0401R0455J2837p4387m5613N4492Q5317
1142F1962J24q7743o1205M6287R2014J5750p8008o5090L0127P9153K6021m6334
1154A3058l7033L2332N3799j2182p5595m2019N1899Q1864J2755n9198m2867K9020
$$ plain form
1166 5833 57524 51024 -8527 -35963 12162 67320 44860 -30823 -57359 7564 85488 76108
1178 76108 -10378 -65633 -27012 37424 28536 -42395 -68486 -3073 73082 56114 -39542 -94730
1190 -94730 -41160 46557 48268 -37190 -94627 -47653 38440 50802 -18997 -69578 -26292 50854
1202 50854 50092 -37012 -98680 -52540 41484 67274 4942 -51299 -24049 43673 51353 -16787
1214 -16787 -68473 -31950 42291 53431 -9254 -55943 -20942 49103 59213 -5123 -56835 -30457
1226 -30457 27465 26562 -34664 -65398 -14127 57757 55718 -19718 -71932 -37290 28609 29043 -35864
1239 -35864 -69403 -19001 51168 47337 -25307 -66986 -16742 60087 56908 -26285 -79749 -32371
1251 -32371 53855 69521 7333 -37989 2704 72546 69069 -12835 -66029 -16936 71523 86895
$$ packed form
1166E833N1691o500n9551k7436M8125N5158k2460p5683k6536O4923P7924r380
1178G6108q6486n5255L8621O4436q888p0931k6091O5413P6155j6968r5656n5188
1190i4730N3570Q7717J711q5458n7437M6974Q6093J2362o9799n0581M3286P7146
1202E0854p62q7104o1668M6140R4024K5790o2332n6241K7250O7722P680o8140
1214a6787n1686L6523P4241J1140o2685m6689L5001P0045J0110o4336n1712K6378
1226c0457N7922r03o1226l0734N1271P1884k039p5436n2214L4642O5899M34o4907
1239c5864l3539N0402P0169l831p2644m1679N0244P6829l179q3193n3464M7378
1251c2371Q6226J5666o2188m5322M0693O9842l477q1904n3194M9093Q8459J5372
$$ plain form
1263 86895 16888 -40197 -7803 68519 82877 15079 -43773 -17656 48656 55817 -8340 -52734
1275 -52734 -11962 64821 75098 1292 -63589 -42917 22690 33640 -24768 -66769 -30715 35451
1287 35451 40955 -24305 -71607 -37569 28119 28982 -42039 -89614 -48991 27110 40242 -18657
1299 -18657 -62288 -25569 39582 37178 -37351 -84204 -38016 41509 51172 -13995 -58158 -16229
1311 -16229 57322 60481 -15016 -69339 -31005 44191 52936 -12699 -58165 -16169 60465 68890
1323 68890 -4128 -62137 -32094 37683 44827 -21661 -67825 -26631 50115 62955 -4128 -60582
1335 -60582 -34281 31743 39914 -23007 -67925 -30804 40209 52962 -5156 -50886 -18196 48361
1347 48361 53488 -14067 -63566 -28182 44323 60664 8301 -32314 250 62203 63743 -3673
$$ packed form
1263H6895p0007n7085L2394P6322J4358o7798n8852K6117O6312P161o4157m4394
1275e2734M0772P6783J0277p3806o4881K0672O5607J0950n8408m2001L6054O6166
1287C5451N504o5260m7302L4038O5688Q63p1021m7575M0623P6101J3132n8899
1299a8657m3631L6719O5151k404p4529m6853M6188P9525R663o5167m4163M1929
1311a6229P3551L159p5497n4323L8334P5196Q745o5635m5466M1996P6634Q425
1323F8890p3018n8009L0043O9777P144o6488m6164M1194P6746J2840o7083n6454
1335f0582K6301O6024Q171o2921m4918L7121P1013J2753n8118m5730L2690O6557
1347D8361N127o7555m9499L5384P2505J6341n2363m0615L2564O1953J540o7416
$$ plain form
1359 -3673 -50365 -13857 55947 64313 4120 -39302 -3591 64900 72984 6765 -47002 -19917
1371 -19917 41945 46410 -14552 -54422 -14421 55446 61455 -7723 -62566 -34625 29559 34997
1383 34997 -28456 -73942 -39153 29847 41810 -16662 -63512 -33913 27514 29579 -37528 -84540
1395 -84540 -46892 25983 41475 -13709 -58645 -28388 35525 42241 -20461 -68010 -36458 29700
1407 29700 41774 -10834 -49388 -14396 51754 59206 -4866 -57272 -30975 32786 45034 -7577
1419 -7577 -48139 -16037 47996 58244 370 -48332 -23142 35072 40242 -17708 -58924 -25371
1431 -25371 41844 56800 2660 -45847 -23842 32886 39823 -16513 -58824 -28412 35265 49359
1443 49359 -1586 -43807 -16283 44455 51532 -8707 -57415 -30751 33549 50350 3884 -36061
$$ packed form
1359c673m6692L6508O9804Q366o0193m3422L5711O8491Q084o6219n3767K7085
1371a9917O1862M465o0962l9870M0001O9867O009o9178n4843K7941O4184N438
1383C4997o3453m5486L4789O9000J1963n8472m6850K9599O1427K065o7107m7012
1395h4540L7648P2875J5492n5184m4936L0257O3913O716o2702m7549L1552O6158
1407B9700J2074n2608l8554L4992O6150P452o4072n2406K6297O3761J2248n2611
1419g577m0562L2102O4033J0248n7874m8702K5190N8214N170n7950m1216L3553
1431b5371O7215J4956n4140m8507K2005N6728O937n6336m2311L0412O3677J4094
1443D9359n0945m2221K7524O0738P077o0239m8708K6664O4300J6801m6466l9945
$$ plain form
1455 -36061 -9423 49377 57300 -426 -48448 -23117 37389 49525 -1612 -43283 -14842 48593
1467 48593 62778 7243 -44596 -25979 28998 39144 -11080 -50806 -21840 39895 53417 -1038
1479 -1038 -50115 -29613 27807 37420 -16243 -61250 -36777 24880 43678 -1818 -45684 -25389
1491 -25389 29623 37004 -19027 -65063 -39259 24025 42760 -3198 -46698 -24452 34388 47152
1503 47152 -6430 -55685 -35881 22317 39015 -5393 -45861 -20261 41133 56094 2566 -49856
1515 -49856 -33046 25142 41521 -5401 -49022 -26005 36405 56746 8448 -41480 -26946 26447
1527 26447 39797 -9036 -52808 -29755 32234 53388 7917 -40965 -25469 29637 43932 -5104
1539 -5104 -51912 -34139 22953 42979 2163 -37541 -16934 37760 47811 -6758 -55784 -35927
$$ packed form
1455c6061K6638N8800P923n7726m8022K5331O0506J2136n1137m1671K8441O3435
1467D8593J4185n5535n1839J8617N4977J0146n0224l9726K8966O1735J3522n4455
1479a038m9077K0502N7420R613n3663m5007K4473O1657J8798m5496m3866K0295
1491b5389N5012P381n6031m6036K5804O3284J8735m5958m3500K2246N8840J2764
1503D7152n3582m9255J9804N8198J6698m4408m0468K5600O1394J4961n3528n2422
1515d9856J6810N8188J6379m6922m3621K3017O2410K0341m8298m9928J4534N3393
1527B6447J3350m8833m3772K3053O1989K1154m5471m8882J5496N5106J4295m9036
1539e104m6808J7773N7092K0026m0816l9704K0607N4694J0051n4569m9026J9857
$$ plain form
1551 -35927 24568 44187 1487 -41065 -21978 34556 48799 -640 -47648 -27701 28020 39595
1563 39595 -10271 -53277 -26857 39334 61294 10131 -45010 -32392 23200 40068 -5378 -48442
1575 -48442 -25558 36493 56609 8103 -44032 -27378 33556 53334 3484 -49738 -36509 23130
1587 23130 50739 13539 -31046 -17673 35722 49533 -980 -51338 -35543 22982 47036 8862
1599 8862 -35651 -22803 29298 45930 436 -45274 -31133 20264 34249 -8857 -48604 -26737
1611 -26737 31156 48050 876 -46605 -31119 19112 28912 -18113 -56092 -28295 33742 49527
1623 49527 -1043 -49996 -31448 25406 38865 -10479 -55106 -32862 28426 46861 -434 -46932
1635 -46932 -24989 38160 54579 -818 -57859 -44610 16917 45960 9861 -34834 -21961 31334
$$ packed form
1551c5927O0495J9619m2700m2552J9087N6534J4243m9439m7008J9947N5721J1575
1563C9595m9866m3006K6420O6191K1960n1163n5141J2618N5592J6868m5446m3064
1575d8442K2884O2051K0116m8506n2135J6654O0934J9778m9850n3222J3229N9639
1587B3130K7609l7200m4585J3373N3395J3811n0513n0358J5795N8525K4054l8174
1599H862m4513J2848N2101J6632m5494m5710J4141N1397J3985m3106l9747K1867
1611b6737N7893J6894m7174m7481J5486N0231R800m7025l7979K7797O2037J5785
1623D9527n0570m8953J8548N6854J3459m9344m4627K2244O1288J8435m7295m6498
1635d6932K1943O3149J6419n5397n7041J3249O1527K9043l6099m4695J2873N3295
$$ plain form
1647 31334 46605 -2436 -53072 -38972 19420 44926 5455 -43432 -36256 17126 43870 10559
1659 10559 -32817 -26883 13889 24663 -13268 -47089 -24282 32174 52757 12007 -34475 -27352
1671 -27352 16987 31689 -1200 -30886 -11765 34550 43562 1658 -32978 -8030 48264 57490
1683 57490 5504 -42775 -25512 30450 50688 13398 -23713 -2329 49903 55454 -2368 -51536
1695 -51536 -29644 34647 56942 9988 -42983 -31651 26721 50438 6768 -44655 -35982 15422
1707 15422 33490 -10687 -59352 -45452 15987 47133 9917 -44735 -47175 -5247 16957 -12534
1719 -12534 -48112 -37157 10947 32799 -568 -43073 -36667 8501 29421 -423 -37507 -31642
1731 -31642 6088 22371 -3162 -27921 -7438 35910 40250 -6745 -47288 -31698 18016 37864
$$ packed form
1647C1334J5271m9041n0636J4100N8392K5506l9471m8887P176N3382K6744l3311
1659A0559m3376N934M0772J0774l7931l3821K2807N6456K0583m0750m6482P123
1671b7352M4339J4702l2889k9686J9121M6315R012m1904l4636K4948N6294R226
1683E7490n1986m8279J7263N5962K0238l7290l7111K1384N2232N551n7822m9168
1695e1536K1892O4291K2295m6954n2971J1332N8372K3717m3670n1423Q673N1404
1707A5422J8068m4177m8665J3900O1439L1146l7216n4652k440M1928K2204k9491
1719a2534l5578J0955M8104K1852l3367m2505O406M5168K0920k9844l7084N865
1731c1642L7730J6283k5533k4759K0483M3348M340m6995m0543J5590M9714J9848
$$ plain form
1743 37864 6779 -25712 -10529 31398 36573 -9171 -44727 -19877 34458 44712 -6796 -55094
1755 -55094 -37255 26205 54675 15083 -34976 -29228 15924 30232 -11020 -51555 -29848 34767
1767 34767 63062 18510 -41025 -40874 13961 49340 22636 -23329 -26149 15606 41718 18267
1779 18267 -17822 -9355 37996 59235 22092 -26152 -29781 11243 42163 28237 -87 -208 27660
1792 27660 34529 3564 -26807 -13304 25517 36485 2367 -34447 -24603 16525 31765 1407
1804 1407 -30968 -20244 12598 11711 -31271 -62578 -35624 22351 39415 -6386 -55287 -46926 1755
1817 1755 19432 -18024 -57136 -40123 14175 34262 -8384 -57305 -43216 19005 49824 10320
1829 10320 -47221 -51443 -1141 36114 16167 -23814 -19801 26225 50189 14015 -38730 -41353
$$ packed form
1743C7864l1085l2491J5183M1927N175m5744l5556K4850N4335J0254n1508m8298
1755e5094J7839O3460K8470l9592n0059N748M5152J4308m1252m0535K1707O4615
1767C4767K8295m4552n9535J51N4835L5379k6704m5965k820M1755K6112k3451
1779A8267l6089Q467M7351K1239l7143m8244l629M1024L0920j3926k8324j21K7868
1792B7660O869l0965l0371J3503L8821J0968l4118l6814R844M1128J5240l0358
1804A407l2375J0724L2842q87m2982l1307K6954N7975J7064m5801m8901Q361M8681
1817A755J7677l7456l9112J7013N4298K0087m2646m8921J4089O2221L0819l9504
1829A0320n7541m222N0302L7255j9947l9981M013M6026K3964l6174n2745k623
$$ plain form
1841 -41353 8339 48068 31816 -12360 -24545 7588 33615 17454 -13316 -12312 17896 29904
1853 29904 600 -35275 -28129 16074 43508 22590 -13746 -17582 5515 12763 -11658 -30448
1865 -30448 -8523 33719 41302 -1245 -39918 -22919 28230 47383 10943 -30400 -22419 20254
1877 20254 37209 4244 -27667 -4697 50626 63153 9902 -47619 -39634 21164 58705 29633
1889 29633 -21307 -23911 21432 47222 14179 -33499 -31048 17902 45631 11154 -43888 -49691
1901 -49691 1099 42262 24002 -23582 -38598 -11527 9309 -10383 -43198 -39632 1822 28027
1913 28027 4818 -37085 -42937 -10885 11875 -4166 -31518 -29351 -869 12239 -11489 -35763
1925 -35763 -18237 24770 36302 -146 -39226 -32116 8312 28192 4406 -21414 -4239 37449
$$ packed form
1841d1353M9692L9729j6252m4176j2185L2133K6027j6161l0770J004L0208J2008
1853B9904k9304l5875P146M4203K7434k0918l6336l836K3097P248k4421j8790
1865c0448K1925M2242P583m2547l8673J6999N1149J9153l6440m1343P981M2673
1877B0254J6955l2965l1911K2970N5323J2527n3251n7521P985O0798L7541k9072
1889B9633n0940k604M5343K5790l3043m7678K451M8950K7729l4477n5042n803
1901d9691N0790M1163j8260m7584j5016K7071K0836j9692l2815L566M1454K6205
1913B8027k3209m1903n852L2052K2760j6041k7352K167K8482J3108k3728k4274
1925c5763J7526M3007J1532l6448l9080P110M0428J9880k3786k5820J7175M1688
$$ plain form
1937 37449 43402 -1397 -41637 -23447 32140 55064 15813 -33591 -29085 22258 50249 20104
1949 20104 -22806 -18255 25363 42330 2503 -46299 -38339 21693 60864 32025 -24000 -38421
1961 -38421 -1255 29770 13729 -23165 -25789 11579 36416 12193 -28779 -29406 13224 43304
1973 43304 23173 -19806 -32302 -5277 20332 12292 -8972 -3390 25826 33547 1704 -32004
1985 -32004 -25295 13765 34777 12418 -20475 -17229 15350 28475 1825 -25583 -12652 23022
1997 23022 29282 -10834 -49120 -33552 19503 44150 10657 -33915 -32116 6402 22850 -9271
2009 -9271 -46837 -35539 15812 40028 4671 -44707 -42618 6356 37659 11233 -35705 -41571
2021 -41571 -2500 27208 8361 -28409 -25776 15873 41786 16638 -30435 -38978 -3820 29386
$$ packed form
1937C7449N953m4799m0240J8190N5587K2924l9251m9404M506N1343K7991l0145
1949B0104m2910M551M3618J6967l9827m8802P960O0032L9171k8839n6025j4421
1961c8421L7166L1025j6041l6894k624L7368K4837k4223m0972o27M2630L0080
1973D3304k0131m2979j2496K7025K5609q040k1264N582K9216P721l1843l3708
1985c2004O709L9060K1012k2359l2893L246L2579J3125k6650k7408J2931L5674
1997B3022O260m0116l8286J5568N3055K4647l3493m4572J799L8518J6448l2121
2009i271l7566J1298N1351K4216l5357m9378K089M8974L1303k6426m6938n866
2021d1571L9071K9708j8847l6770K633M1649K5913k5148m7073q543L5158L3206
$$ plain form
2033 29386 19980 -10224 -16492 11090 29317 10697 -19324 -18368 13047 31527 11734 -22465 -23575
2046 -23575 9158 32202 17518 -9027 -8163 14878 20821 -6624 -33282 -19743 22908 41873
2058 41873 12342 -26653 -24197 11272 29659 5127 -27755 -22107 14872 30336 -58 -34947
2070 -34947 -23089 24964 46836 12986 -35422 -39741 538 31430 14308 -20883 -20583 16301
2082 16301 36621 8841 -32281 -33121 7773 36729 16171 -26096 -33659 2407 32821 19654
2094 19654 -14036 -21124 4850 22749 3316 -28145 -27187 9438 35314 19187 -15750 -21589 3937
2107 3937 22040 5711 -21634 -20070 9924 27288 6857 -22661 -18342 15269 32360 8363
2119 8363 -26082 -27178 4030 23402 4460 -24035 -17359 18554 35274 6638 -32383 -33612 3425
$$ packed form
2033B9386r406l0204o268K7582J8227j8620l0021R56L1415J8480j9793l4199j110
2046b3575L2733K3044j4684k6545Q64K3041N943k7445k6658J3539M2651J8965
2058D1873k9531l8995K456L5469J8387k4532l2882N648L6979J5464l0394l4889
2070c4947J1858M8053K1872l3850m8408m319M0279L0892j7122l5191L00L6884
2082A6301K0320k7780m1122q40M0894K8956k0558m2267p563L6066L0414j3167
2094A9654l3690p088K5974J7899j9433l1461R58L6625K5876j6127l4937n839K5526
2107C937J8103j6329k7345J564K9994J7364k0431k9518M319L3611J7091k3997
2119H363l4445j096L1208J9372j8942k8495O676L5913J6720k8636l9021j229L7037
$$ plain form
2132 3425 28004 8210 -27043 -27611 8291 31065 8973 -27698 -28630 6189 29043 6558 -33609
2145 -33609 -37314 2046 33980 19834 -16374 -25015 2020 22878 6157 -26646 -28120 6884
2157 6884 33790 17534 -18404 -24521 5678 30068 16412 -16695 -24281 2137 23087 8772
2169 8772 -17815 -15139 17076 34887 12167 -24113 -28538 1691 25514 10706 -18548 -19033 11311
2182 11311 29227 8667 -22855 -22489 9705 28695 6427 -28658 -28052 9716 36219 17978 -16456
2195 -16456 -19995 8971 27997 9291 -24341 -23316 13534 38665 20704 -14240 -19387 12627
2207 12627 36363 18536 -17948 -24547 6871 33104 18168 -14820 -18146 12084 34141 15956
2219 15956 -20452 -28702 -836 23374 10119 -22417 -25764 4122 25865 8475 -26490 -34264
$$ packed form
2132C425K4579j9794l5253n68L5902K2774k2092l6671r32L4819K2854k2485m0167
2145c3609l705L9360L1934j4146l6208q641K7035K0858j6721l2803j474L5004
2157F884K6906j6256l5938o117L0199K4390j3656l3107p586K6418K0950j4315
2169H772k6587K676L2215J7811k2720l6280m425L0229K3823j4808k9254m85L0344
2182A1311J7916k0560l1522L66L2194J8990k2268l5085O06L7768K6503j8241l4434
2195a6456l539K8966J9026j8706l3632J025L6850K5131j7961l4944n147L2014
2207A2627K3736j7827l6484o599L1418K6233j4936l2988l326L0230K2057j8185
2219A5956l6408q250K7866K4210j3255l2536l347K9886K1743j7390l4965p774
$$ plain form
2231 -34264 -7446 14648 -197 -31324 -33832 -2804 19509 3059 -28473 -31833 -3715 16305
2243 16305 -1608 -34416 -36315 -1980 24402 10185 -20719 -24279 4248 24581 6284 -25460
2255 -25460 -26554 6912 32197 16079 -16395 -18711 13826 36946 19495 -15597 -22824 7103
2267 7103 30849 16500 -13626 -15024 16326 37436 18732 -16853 -24143 5145 29038 14753
2279 14753 -18290 -22798 7932 31552 16876 -14976 -21012 5322 25471 9051 -22749 -24833
2291 -24833 7803 33040 18731 -13464 -19007 8184 29488 14651 -16752 -21142 8777 32353
2303 32353 18563 -10889 -13489 15572 35560 17266 -16844 -22862 6211 30160 16211 -14093
2315 -14093 -17787 9469 29198 12170 -20464 -27387 -1590 18539 3359 -28085 -31090 -1011
$$ packed form
2231c4264K6818K2094j4845l1127k508L1028K2313j6450l1532l360K8118K0020
2243A6305j7913l2808j899L4335K6382j4217l0904l560K8527K0333j8297l1744
2255b5460j094L3466K5285j6118l2474k316L2537K3120j7451l5092p227K9927
2267G103K3746j4349l0126j398L1350K1110j8704l5585p290K9288K3893j4285
2279A4753l3043m508L0730K3620j4676l1852o036K6334K0149j6420l1800k084
2291b4833L2636K5237j4309l2195n543K7191K1304j4837l1403m390K9919K3576
2303C2353j3790k9452k600K9061J9988j8294l4110o018K9073K3949j3949l0304
2315a4093l694K7256J9729j7028l2634o923K5797K0129j5180l1444l005L0079
$$ plain form
2327 -1011 20825 5126 -28513 -36347 -11655 8902 -4955 -34296 -37017 -7813 14037 169
2339 169 -29245 -33433 -6829 13774 -609 -31292 -35220 -4772 20413 9778 -17121 -20811 5149
2352 5149 25283 11207 -18269 -21957 6806 30367 18412 -9521 -12262 15816 37614 23455
2364 23455 -7602 -15660 9461 31454 19808 -7691 -10938 16181 36286 21438 -9164 -16568
2376 -16568 7252 27981 14722 -14766 -19703 7306 29534 18067 -10812 -17901 4084 22473
2388 22473 9534 -19265 -22707 4792 27116 15802 -12278 -17907 6011 25962 14056 -15214
2400 -15214 -22044 2938 25158 15260 -9952 -13985 10445 28853 15281 -14728 -22731 1160 23045
2413 23045 13146 -14583 -20636 2862 22970 11364 -17569 -26269 -6144 13055 1629 -25686
$$ packed form
2327a011K1836j5699l3639p834K4692K0557j3857k9341k721K9204K1850j3868
2339A69k9414m188K6604K0603j4383l0683l928L0448K5185j0635k6899l690K5960
2352E149K0134j4076k9476l688K8763K3561j1955k7933k741K8078K1798j4159
2364B3455l1057q058K5121K1993j1646k7499l247K7119K0105j4848l0602p404
2376a6568K3820K0729j3259k9488m937K7009K2228j1467k8879p089K1985J8389
2388B2473j2939k8799l442K7499K2324j1314k8080n629K3918J9951j1906k9270
2400a5214o830K4982K2220r898k5212m033K4430J8408j3572l0009q003K3891K1885
2413B3045r899k7729o053K3498K0108j1606k8933q700K0125J9199j1426k7315
$$ plain form
2425 -25686 -30460 -5224 15609 4727 -23833 -33120 -12368 7771 -2217 -29171 -34993 -10868 10839
2438 10839 2786 -21973 -27385 -5544 13992 3200 -24573 -30499 -4441 20330 13152 -11883 -18148
2451 -18148 4750 25822 16925 -9399 -16664 6140 28089 19968 -5851 -10165 14764 37361 27518
2464 27518 -2537 -13848 6528 28627 22011 -3925 -10289 11613 31781 21868 -6074 -14685 5401
2477 5401 25993 15559 -12870 -21437 1274 24277 17566 -7347 -16997 731 18780 8560 -17756
2490 -17756 -24164 -587 21789 13084 -12385 -20079 1390 21315 12330 -14457 -23101 -1859 19165
2503 19165 11374 -13181 -17988 5040 25342 15008 -14278 -24806 -3595 18627 10817 -15666
2515 -15666 -22533 165 22435 12944 -15799 -27356 -7404 14754 6696 -21092 -30345 -7785 15375
$$ packed form
2425b5686m774K5236K0833j0882k8560r287K0752K0139r988k6954n822K4125K1707
2438A0839q053k4759n412K1841J9536j0792k7773n926K6058K4771p178k5035o265
2451a8148K2898K1072q897k6324p265K2804K1949q121k5819m314K4929K2597r843
2464B7518l0055j1311K0376K2099o616k5936o364K1902K0168r913k7942q611K0086
2477E401K0592j0434k8429q567K2711K3003o711k4913r650J7728J8049j0220k6316
2490a7756o408K3577K2376q705k5469p694K1469J9925q985k6787q644K1242K1024
2503A9165p791k4555m807K3028K0302j0334k9286j0528K1211K2222p810k6483
2515a5666o867K2698K2270r491k8743j1557J9952K2158q058k7788r253K2560K3160
$$ plain form
2528 15375 9241 -17297 -27812 -8802 12823 4970 -23007 -33596 -11405 13792 10953 -12385
2540 -12385 -22254 -4687 14835 8057 -16576 -23707 -2183 20508 14320 -9899 -17119 3814 25334
2553 25334 19685 -4611 -13976 4060 22429 14054 -7413 -9626 14864 34278 22646 -6735 -16411
2566 -16411 4690 26504 18936 -6649 -13605 7391 26581 16717 -9664 -16045 6573 26694 14325
2579 14325 -17878 -27846 -2893 23605 18758 -7673 -19747 -2306 17440 9519 -17827 -26339 -3633
2592 -3633 20876 14371 -13056 -24106 -5150 18589 15392 -9601 -22514 -7279 12762 8528 -11968
2605 -11968 -17720 1588 21367 15180 -10458 -22315 -6456 13102 8755 -11210 -16388 1012 17355
2618 17355 8923 -13619 -19441 -329 17176 7112 -18195 -24180 -3292 15636 8725 -12861 -17279
$$ packed form
2528A5375o134k6538j0515J9010K1625p853k7977j0589K2191K5197k839k3338
2540a2385r869J7567J9522o778k4633p131K1524K2691o188k4219p220K0933K1520
2553B5334n649k4296r365J8036J8369q375k1467k213K4490J9414j1632k9381r676
2566a6411K1101K1814p568k5585o956K0996J9190r864k6381o381K2618K0121j2369
2579A4325l2203r968K4953K6498m847k6431j2074J7441J9746p921k7346q512K2706
2592c633K4509o505k7427j1050J8956K3739l197k4993j2913J5235K0041m234k0496
2605a1968n752J9308J9779o187k5638j1857J5859J9558m347j9965n178J7400J6343
2618A7355q432k2542n822J9112J7505j0064k5307n985K0888J8928o911k1586m418
$$ plain form
2631 -17279 2253 18516 4812 -23258 -28344 -2603 21938 14836 -12023 -21203 -1645 19014
2643 19014 11300 -13388 -21470 353 22027 12728 -13908 -22376 723 26900 23797 -3058 -20058
2656 -20058 -6575 14902 13460 -6061 -12169 5799 24290 17759 -6835 -19262 -2921 19285
2668 19285 17486 -3724 -15845 -4614 12708 10780 -4107 -8759 5018 17337 6845 -15933
2680 -15933 -22312 -2487 17696 14023 -5344 -13084 -180 12058 4690 -14587 -17249 3466 19222
2693 19222 7857 -17215 -20727 1776 21888 15802 -9718 -20174 -3735 14029 7587 -14232
2705 -14232 -18361 3283 24790 17112 -11699 -25911 -7610 17127 16686 -7168 -19536 -4869 16008
2718 16008 14205 -6478 -17452 -1978 18715 15015 -9022 -23257 -10056 12330 16580 1392
$$ packed form
2631a7279J9532J6263j3704k8070n086K5741K4541p102k6859r180J9558K0659
2643A9014p714k4688q082K1823K1674r299k6636q468K3099K6177l103k6855j7000
2656b0058J3483K1477j442j9521o108J7968J8491o531k4594j2427J6341K2206
2668A9285j799k1210j2121J1231J7322j928j4887m652J3777J2319j0492k2778
2680a5933o379J9825K0183l673j9367p740J2904J2238p368j9277k662K0715J5756
2693A9222j1365k5072l512K2503K0112o086k5520j0456J6439J7764o442k1819
2705a4232m129K1644K1507p678k8811j4212J8301K4737m41k3854j2368J4667K0877
2718A6008j803k0683j0974J5474K0693l700k4037j4235J3201K2386M250j5188
$$ plain form
2730 1392 -9814 -1868 11111 7146 -11170 -18167 -2615 15475 13008 -5179 -14818 -3745 11362
2743 11362 9812 -5766 -11544 232 11026 1784 -16037 -17078 4240 23122 15284 -9542 -21549
2756 -21549 -6882 10848 6637 -11717 -15133 3628 19739 9863 -15691 -23645 -1590 22893 17775
2769 17775 -10701 -25873 -10265 14289 16152 -2236 -12953 745 19177 13363 -12642 -25098
2781 -25098 -6489 20500 23727 1523 -16194 -8528 11722 15525 -213 -11443 -2275 13152 10592
2794 10592 -7115 -16027 -2272 18244 19529 388 -13724 -7799 6321 6346 -5613 -8887 4404
2807 4404 17284 10066 -10481 -17782 -2055 15883 11647 -8125 -16221 -2567 13254 9343 -9022
2820 -9022 -13423 4329 21231 11571 -15490 -25997 -5884 19084 18829 -3460 -15837 -2497 16247
$$ packed form
2730A392j1206P946J2979l965j8316o997J5552J8090k467j8187r639J1073J5107
2743A1362j550j5578n778J1776J0794r242j7821j041K1318J8882p838k4826j2007
2756b1549J4667J7730m211j8354l416J8761J6111r876k5554p954K2055K4483n118
2769A7775k8476j5172J5608K4554J863j8388j0717J3698J8432n814k6005j2456
2781b5098J8609K6989L227k2204j7717P666K0250L803j5738j1230R168J5427k560
2794A0592j7707q912J3755K0516J285j9141j4112N925J4120K5j1959l274J3291
2807D404J2880p218k0547p301J5727J7938m236j9772q096J3654J5821l911j8365
2820i022m401J7752J6902r660k7061j0507K0113K4968k55k2289j2377J3340J8744
$$ plain form
2833 16247 11907 -11477 -21687 -3856 19675 16910 -8271 -24159 -10422 15057 19443 -1250
2845 -1250 -18446 -11020 6127 6356 -10905 -19723 -5292 16170 16181 -6000 -23259 -15596 3945 8686
2859 8686 -4264 -13646 -5708 6534 4573 -9673 -14709 -190 16378 10683 -9934 -20471 -7388
2872 -7388 10934 12439 -524 -6217 5335 16477 7605 -12775 -15936 4879 24724 18549 -4889
2885 -4889 -15594 -214 20798 19618 -769 -11215 2464 18826 12403 -9893 -17587 2268 26439
2898 26439 24084 -2649 -20773 -9460 12442 14733 -3079 -14928 -3968 14349 13627 -6317 -19550
2911 -19550 -7250 13864 15128 -4794 -19866 -12341 6181 10722 -1320 -10614 -2541 11092 8069
2924 8069 -10177 -19345 -6912 10951 12339 -2235 -12066 -3877 9630 7090 -7982 -13756 -608
$$ packed form
2833A6247m340k3384j0210J7831K3531k765k5181j5888J3737K5479M386k0693
2845a250j7196P426J7147K29j7261q818J4431K1462J1k2181j7259P663J9541M741
2859H686j2950r382P938J2242j961j4246n036J4519J6568n695k0617j0537J3083
2872g388J8322J505j2963n693J1552J1142q872k0380l161K0815J9845o175k3438
2885d889j0705J5380K1012j180k0387j0446J3679J6362o423k2296p694J9855K4171
2898B6439k355k6733j8124J1313K1902K291j7812j1849J0960J8317p22j9944j3233
2911a9550J2300K1114J264j9922j5072P525J8522M541j2042r294Q073J3633l023
2924H069j8246r168J2433J7863J388j4574r831Q189J3507k540j5072n774J3148
$$ plain form
2937 -608 12745 6666 -12779 -19388 -3312 15631 13475 -6686 -17628 -6932 7640 2990 -14736
2950 -14736 -19044 -1227 17300 11768 -12575 -25268 -10232 11500 11859 -7927 -20148 -9430 8812
2963 8812 9576 -6784 -15690 -1982 17124 15063 -7614 -21536 -9867 12952 19682 5494 -7164
2976 -7164 -1377 13549 14334 -516 -8698 2036 18300 17756 1488 -9243 106 17674 20942 6425
2990 6425 -5081 633 11345 9444 -3799 -8161 4272 18989 15447 -4092 -14662 -4447 11003
3003 11003 9756 -6414 -14230 -3869 10294 7349 -9059 -17011 -3535 13226 9050 -11692 -23511
3016 -23511 -11080 7839 10350 -5824 -16458 -5784 10696 8972 -10294 -21087 -9228 10339
3028 10339 12339 -4373 -16896 -8322 9897 12470 -3251 -14488 -7286 8083 8742 -6289 -16623
$$ packed form
2937f08J3353o079j9445o609J6076J8943k156k0161j0942J0696J4572m650j7726
2950a4736m308J7817J8527n532k4343j2693J5036K1732L59j9786j2221J0718J8242
2963H812P64j6360q906J3708J9106k061k2677j3922J1669K2819O730j4188j2658
2976g164N787J4926P85j4850q182J0734J6264n44j6268j0731R349J7568L268j4517
2990F425j1506N714J0712j901j3243m362J2433J4717l542j9539j0570J0215J5450
3003A1003j247j6170p816J0361J4163k945j6408p952J3476J6761m176k0742j1819
3016b3511J2431J8919K511j6174j0634J0674J6480j724j9266j0793J1859J9567
3028A0339K000j6712j2523Q574J8219K573j5721j1237P202J5369O59j5031j0334
$$ plain form
3041 -16623 -6598 11665 14290 -1282 -14892 -9451 4289 5494 -6413 -13723 -4655 9438 9230
3054 9230 -6001 -16127 -6822 9102 9755 -5530 -15503 -7588 7040 9164 -2768 -9862 358
3067 358 14906 11736 -6414 -15771 -3895 15160 17581 2741 -8478 -343 15981 17622 1996
3080 1996 -8252 2110 17395 17146 39 -10591 138 19377 22484 5342 -9744 -4210 11169
3093 11169 13344 -545 -10654 -3011 13005 14947 -1632 -14493 -7668 8349 10501 -4735 -17350
3106 -17350 -11146 4639 8322 -4358 -15006 -8308 5813 5736 -9423 -20174 -11565 4179 7429
3119 7429 -5287 -15636 -7619 7165 8063 -6733 -17095 -8565 6600 8622 -4935 -14592 -6003
3132 -6003 10462 12389 -3395 -14446 -6081 9090 9794 -5191 -15326 -5981 11477 14492 -1652
$$ packed form
3041a6623J0025J8263K625j5572j3610N441J3740J205j1907p310R068J4093k08
3054I230j5231j0126R305J5924O53j5285r973P915J4628K124j1932p094J0220
3067C58J4548l170j8150r357J1876J9055K421j4840j1219Q135J6324J641j5626
3080A996j0248J0362J5285k49j7107j0630J0729J9239L107j7142j5086N534J5379
3093A1169K175j3889j0109P643J6016J942j6579j2861O825J6017K152j5236j2615
3106a7350O204J5785L683j2680j0648O698J4121p7j5159j0751Q609J5744L250
3119G429j2716j0349Q017J4784Q98j4796j0362Q530J5165K022j3557r657Q589
3132f003J6465J927j5784j1051Q365J5171P04j4985j0135R345J7458L015j6144
$$ plain form
3145 -1652 -14264 -7550 8155 9851 -4700 -15249 -6814 9814 12339 -2259 -14264 -6146 10383
3158 10383 12462 -3070 -15405 -8485 8022 12481 155 -10029 -2917 12569 13520 -1764 -12711
3171 -12711 -4351 11843 15372 2362 -8750 -2014 14059 17206 3417 -7857 -1261 12450 13504
3184 13504 180 -9463 -960 15345 17409 1925 -10619 -4230 10816 12120 -2089 -12401 -5580
3197 -5580 9628 11904 -2423 -13335 -5967 8702 8942 -6619 -18278 -10727 5390 9292 -3836
3210 -3836 -15319 -9008 5863 7908 -6874 -17570 -10641 4442 7709 -5067 -15294 -7691 8419
3223 8419 11095 -3827 -15453 -9218 5501 9164 -3035 -12848 -5424 10093 12974 -1501 -12567
3236 -12567 -5843 8638 10406 -3155 -13753 -6201 10402 13675 280 -10903 -5147 8682 9890
$$ packed form
3145a652j2612O714J5705J696j4551j0549Q435J6628K525j4598j2005Q118J6529
3158A0383K079j5532j2335O920J6507M459j2326j0184P112J5486R51j5284j0947
3171a2711Q360J6194L529j3010j1112O736J6073L147j3789j1274O596J3711J054
3184A3504j3324r643Q503J6305K064j5484j2544O389J5046J304j4209j0312O821
3197e580J5208K276j4327j0912P368J4669K40j5561j1659P551J6117L902j3128
3210c836j1483O311J4871K045j4782j0696O929J5083L267j2776j0227P603J6110
3223H419K676j4922j1626O235J4719L663j2199r813P424J5517K881j4475j1066
3236a2567O724J4481J768j3561j0598P552J6603L273j3395j1183N756J3829J208
$$ plain form
3249 9890 -3288 -13358 -5908 9411 12360 -847 -11547 -4611 10296 12227 -2249 -13423 -7263
3262 -7263 7881 11717 -323 -10202 -3051 11087 13073 -780 -11519 -5218 9591 12069 -257
3275 -257 -10324 -3770 11608 15032 1791 -9509 -4283 8817 10849 -760 -10812 -3443 11065
3288 11065 13795 543 -10905 -4885 8675 10711 -1861 -12887 -7301 7112 11050 -940 -11507
3301 -11507 -5669 7649 8876 -4305 -14712 -8891 6097 9501 -1868 -12967 -7246 6886 9675
3314 9675 -2947 -13414 -8284 4957 8492 -2993 -12316 -5664 8854 11486 -1527 -12578 -7284
3327 -7284 5820 9435 -1586 -11686 -5868 8423 11450 -239 -10460 -5035 7584 9566 -2364
3340 -2364 -12368 -6507 8452 12587 971 -9829 -5321 7571 9766 -1540 -11302 -6547 6559
$$ packed form
3249I890j3178j0070P450J5319K949j3207j0700O936J4907J931j4476j1174O160
3262g263J5144L836j2040r879P151J4138J986j3853j0739O301J4809K478j2326
3275b57j0067O554J5378L424j3241j1300N226J3100K032j1609j0052P369J4508
3288A1065K730j3252j1448O020J3560K036j2572j1026N586J4413L938j1990j0567
3301a1507N838J3318J227j3181j0407N821J4988L404j1369j1099N721J4132K789
3314I675j2622j0467N130J3241L535j1485r323O652J4518K632j3013j1051N294
3327g284J3104L615j1021j0100N818J4291L027j1689j0221N425J2619J982j1930
3340b364j0004N861J4959M135j1616j0800M508J2892K195j1306r762M755J3106
$$ plain form
3353 6559 10419 -653 -10496 -4604 9011 11711 -1319 -12359 -7925 5559 10045 325 -9705
3366 -9705 -4479 8148 10773 -233 -10681 -6063 6601 9638 -1502 -11425 -6396 7798 12566
3379 12566 1424 -9386 -5911 5730 8661 -1459 -10781 -5509 7900 11714 266 -10390 -5698
3392 -5698 7474 10835 31 -11092 -7446 5741 10993 1143 -8692 -4117 8547 11083 -703
3405 -703 -11502 -7349 6346 11422 1271 -9162 -5252 8045 11686 1013 -9944 -7126 5780
3418 5780 9724 79 -9853 -5964 7138 11414 1036 -9799 -6423 5197 8352 -1223 -11236 -6814
3432 -6814 5984 10802 821 -9526 -6618 4824 7663 -2251 -11496 -6908 5607 9901 -385 -10608
3446 -10608 -6470 6359 10243 -749 -11480 -8446 4106 8867 -296 -9705 -4511 8184 10949
$$ packed form
3353F559L860j1072r843N892J3615K700j3030j1040M434J3484M486r720j0030
3366i705N226J2627K625j1006j0448M618J2664L037j1140r923N029J4194M768
3379A2566j1142j0810L475J1641K931j0120r322N272J3409L814j1448j0656M692
3392e698J3172L361j0804j1123L646J3187N252r850r835M575J2664K536j1786
3405g03j0799M153J3695N076j0151j0433L910J3297L641j0673j0957K818J2906
3418E780L944r645r932L889J3102M276j0378j0835L376J1620L155r575j0013M422
3432f814J2798M818r981j0347K908J1442K839r914r245M588J2515M294j0286j0223
3446a0608M138J2829L884j0992j0731L034J2552M761r163r409N194J2695K765
$$ plain form
3459 10949 -1377 -12841 -9123 4853 10834 1295 -10096 -7604 5404 10391 887 -9732 -6870
3472 -6870 4906 8939 -1308 -12379 -9002 5928 12593 2981 -9136 -8381 2751 7866 120 -9518
3486 -9518 -6222 5930 10747 1352 -9123 -5521 6684 11123 2381 -8436 -6714 4449 10098 2379
3500 2379 -5938 -1841 9689 11977 1191 -9238 -5519 7278 12439 2781 -7335 -3710 8526
3513 8526 11741 1477 -8604 -4935 7093 10749 -172 -11510 -7582 6369 11957 1697 -9919
3526 -9919 -7496 3931 7498 -2440 -13208 -9674 5017 11093 360 -11836 -10281 2056 7661
3539 7661 -47 -10931 -9401 1991 7550 -477 -10596 -7533 5256 10402 951 -10707 -10134 1123
3553 1123 7662 2086 -6331 -3786 5754 8114 -1238 -10364 -6454 5898 9986 896 -9411 -7583
$$ packed form
3459A0949j2326j1464L718J3976N981r539j1391K492J3008M987r504j0619K862
3472f870J1776M033j0247j1071L377J4930O665r612j2117P55J1132N115p746r638
3486i518L296J2152M817r395j0475L602J2205M439q742j0817J722J1163N649p719
3500B379q317M097J1530K288j0786j0429L719J2797N161r658j0116L625J2236
3513H526L215j0264j0081L669J2028L656j0921j1338L928J3951N588j0260j1616
3526i919K423J1427L567r938j0768L534J4691O076j0733j2196J555J2337N605
3539G661p708j0884J530J1392N559q027j0119L063J2789N146r451j1658N73J1257
3553A123O539n576q417K545R540K360r352r126L910J2352M088r090j0307J828
$$ plain form
3567 -7583 4265 9024 1139 -6965 -3604 5594 6936 -3996 -12500 -6621 8271 12866 2095 -9778
3581 -9778 -8078 3541 8708 456 -8594 -5641 6597 10727 448 -10014 -5447 8976 14479 4031
3595 4031 -8859 -8457 3748 11380 4795 -4399 -2082 8500 12164 2910 -7983 -6069 5942 12220
3609 12220 5404 -5816 -5706 4328 9798 3318 -5105 -4019 4422 7221 -1249 -10121 -7292 4185
3623 4185 9089 1803 -7517 -6586 1283 3348 -3776 -10728 -6537 4606 7233 -2797 -12322 -8687 2898
3638 2898 7191 -1165 -10560 -8615 1714 5769 -3140 -10952 -5634 7593 11025 79 -12314 -10798
3652 -10798 2426 10277 3776 -6359 -5753 4528 9165 1103 -8120 -6179 5855 11766 3057 -9487
3666 -9487 -9682 2319 10985 6323 -3406 -4987 2012 5557 -223 -7986 -5074 5664 10891 3512 -6570
$$ packed form
3567g583J1848M759p885q104L361R198J342j0932q504N879J4892M595j0771j1873
3581i778J700J1619N167q252r050K953J2238M130j0279j0462M567J4423N503j0448
3595D031j2890M02J2205P632o585r194K317J0582L664r254j0893J914J2011O278
3609A2220o816j1220J10J0034N470o480q423J086Q441K799q470q872K829J1477
3623D185M904p286r320R31P869K065p124o952M191J1143K627j0030r525L635J1585
3638B898M293q356r395J945J0329M055q909p812N318J3227L432j0946j2393J516
3652a0798J3224P851o501j0135O06J0281M637q062r223J941J2034N911q709j2544
3666i487j95J2001Q666m662r729j581O999L545n780p763K912J0738N227p379j0082
$$ plain form
3681 -6570 -7220 1772 7649 3311 -3988 -3807 3224 6154 -427 -6479 -2151 8660 11391 2253 -8038
3696 -8038 -6806 3303 8921 3505 -3958 -1553 7471 9637 -138 -8384 -5036 7272 12134 2612
3710 2612 -9080 -8135 3966 10454 3539 -6235 -5640 3457 7631 -876 -11688 -10060 3592 11155
3724 11155 3830 -8225 -10422 -1529 5421 1010 -7790 -8631 709 6197 -26 -9548 -9352 1087 7705
3739 7705 3111 -7190 -9209 -1878 3887 233 -5519 -3569 4675 7763 426 -8834 -7442 2698
3753 2698 8798 3763 -5442 -4495 3313 7001 939 -5247 -2168 7292 9938 27 -10219 -7899 5192
3768 5192 12435 5299 -5264 -5704 2669 7344 703 -8162 -5220 6413 11837 2978 -9390 -9385 2961
3783 2961 12098 6343 -5614 -8246 205 7221 2519 -5881 -4475 5223 10926 3650 -8395 -9696
$$ packed form
3681f570o50Q992N877m338p299J81P031K930o581o052M328J0811K731r138j0291
3696h038J232J0109N618n416p463K405R024K166r775q246L348J2308M862r522
3710B612j1692R45J2101O488o915r774N95R097M174q507j0812J628J3652P563
3724A1155p325j2055k197Q893O950m411q800q41R340N488o223r522J96J0439O618
3739G705m594j0301k019P331N765l654n752J950Q244L088p337r260J392J0140
3753B698O100n035r205R47P808L688o062o186L079R460K646r911j0246K320J3091
3768E192P243p136j0563m40Q373M675o641q865K942J1633N424q859j2368NJ2346
3783B961R137n755j1957k632Q451P016m702q400J406R698N703p276j2045j301
$$ plain form
3797 -9696 529 9533 5809 -3470 -5318 1763 6691 1947 -4994 -4777 4019 8481 1726 -8015 -7763
3812 -7763 2063 8186 3903 -4397 -4543 2015 5180 -1679 -9123 -6195 4679 9342 996 -8711 -7926
3827 -7926 2116 7467 609 -8174 -7063 3048 7192 -743 -9905 -7244 4841 11025 2671 -9224
3841 -9224 -9987 191 8071 2729 -6476 -5595 4126 9456 1932 -8712 -8622 2459 10512 4732 -6281
3856 -6281 -8192 927 7791 4240 -3431 -4029 3365 7306 1015 -8125 -7235 3387 9975 5195 -4046
3871 -4046 -5749 617 5783 1714 -4982 -3968 4000 7049 179 -8158 -5610 4599 9927 3145 -6805
3886 -6805 -7211 947 6219 961 -5904 -3253 5971 8856 680 -8923 -7742 3079 9454 3233 -7114
3901 -7114 -7204 2282 8080 2670 -6057 -5442 3595 8225 1241 -8980 -8195 2613 9674 4712 -4881
$$ packed form
3797i696J0225R004l724r279j848P081M928m744o941K17Q796M462o755r741K52
3812g763R826O123m283q300j46O558L165o859p444K928J0874M663q346r707P85
3827g926J0042N351o858q783J111J0111M144p935r162K661J2085O184q354j1895
3841i224p63J0178P880n342r205Q81R721N330p524j0644R0J1081Q053n780j1013
3856f281j911R119O864l551p671n98P394L941o291r140Q90J0622O588m780r241
3871d046j703O366N166m069o696J014P968L049o870q337K548J0209N328o782r950
3886f805m06Q158N272n258o865K651R224K885q176r603J181J0821O375o221j0347
3901g114r0R486N798n410q727O15R037M630o984j0221P85J0808P061m962r593
$$ plain form
3916 -4881 -6169 1002 6651 2275 -6165 -6137 2693 8351 2863 -5871 -5916 2108 7694 3528 -5147 -5768
3932 -5768 1446 6038 1266 -5636 -4212 4079 8024 2409 -6248 -6761 872 6315 1507 -5282 -4440
3947 -4440 3028 6384 638 -6742 -6023 2953 7561 1190 -8019 -7792 1216 6887 2242 -5119 -5342 2019
3963 2019 6012 -111 -8750 -7527 2931 8785 3248 -6058 -7281 878 6909 3114 -5197 -6035 1104
3978 1104 6496 1704 -5884 -5404 3174 8728 4248 -5652 -7683 -301 6120 3236 -3746 -4271 2555
3993 2555 6753 2203 -5341 -5777 1926 7111 2405 -5752 -6293 1866 6865 3114 -3607 -4423 2100 6344
4009 6344 1388 -6050 -5375 2975 8262 3424 -4444 -5019 2669 7627 3370 -4752 -5073 2506 7893 3084
4025 3084 -4736 -4678 3329 8576 3884 -4719 -5640 1515 7749 3247 -4951 -5301 2326 7712 3426 -5085
$$ packed form
3916d881j288P171N649m376q440K8Q830N658n488q734m5Q024N586m166q675o21
3932e768P214M592m772o902J424Q291L945n615q657n13P633N443m808o789Q42
3947d440P468L356n746p380P19Q976M608o371r209K27R008N671m645p361k23P361
3963B019L993o123q639J223J0458N854n537r306j223Q159O031l795q311q38P139
3978A104N392m792p588M80Q578N554m480r900k031P382O421k884o982n25O826
3993B555M198m550p544m36P703N185m706q157n41Q159M999l751o721q16O523M244
4009F344m956p438O75Q350N287m838p868n75P688M958m257q122l21P579N387m809
4025C084p820N8Q007N247m692q603r21P155O234m502q198l50P627N386m286q511
$$ plain form
4041 -5085 -6580 221 5890 2357 -5525 -6296 417 5822 1779 -6096 -7374 -457 5546 1092 -7179
4056 -7179 -8278 -673 4902 2167 -5385 -6704 -133 4753 663 -6807 -7430 632 6102 2377 -5391
4071 -5391 -6745 675 6823 2792 -4970 -6688 702 6174 2440 -4630 -5103 2734 8274 4034 -4688
4086 -4688 -6693 970 7133 3885 -4060 -4949 2304 7761 4129 -3822 -4994 2065 6824 2940 -5091
4101 -5091 -6117 1936 7966 4560 -3179 -5046 1182 6919 3480 -4475 -5186 2037 7401 3437 -4162
4116 -4162 -4257 3086 8106 3961 -4473 -5600 1568 7626 3843 -3673 -4505 2636 7669 3673 -4222 -5636
4132 -5636 1572 6855 2733 -5081 -6042 1563 7286 3286 -4998 -6728 -85 5355 1398 -6192 -6947
4147 -6947 313 5263 1564 -6360 -7370 -530 4863 853 -7230 -8332 -1267 4517 1241 -5660 -6726
$$ packed form
4041e085j495O801N669l533p882p71O713N405m043p875j278O917O003m454q271
4056g179j099P605N575k735p552j319O571M886m090p470o23Q062N470l725p768
4071e391j354P420O148m031p762j718P390N472l734p070m73P837N540m240q722
4086d688k005P663O163l248p945q89P253N457l632p951j172P059M759l884q031
4101e091j026Q053O030l406p739j867O228N737l439p955p11P223N364l964p599
4116d162r5P343N020m145q434j127P168O058l783p516q32P141N033l996p895j414
4132e636P208N283m122p814r61P605N723m000q284j730O643N440l957p590p55
4147f947P260M950l699p924j010O840N393m010q083j102P065N784l276o901j066
$$ plain form
4162 -6726 -470 4976 1319 -6421 -7579 143 5840 1957 -4749 -5848 1250 6592 2980 -4629 -5851
4177 -5851 855 6370 2994 -3990 -4560 2424 7860 4092 -3252 -5184 2055 7231 3730 -3885 -5068
4192 -5068 2197 7990 4536 -2717 -4747 1826 6611 3154 -4326 -5150 2012 7959 3860 -3612 -4700
4207 -4700 1760 6478 3830 -3578 -5308 725 5655 2881 -3240 -3227 3035 6636 3185 -3927 -5992
4222 -5992 1308 6500 3403 -3501 -4552 1227 6175 3232 -3810 -5076 1222 5895 2307 -5124 -5882
4237 -5882 954 6365 2832 -4289 -6113 -534 4609 1567 -5300 -6390 -25 4571 1627 -4950 -6231
4252 -6231 -531 4560 1414 -6140 -7179 -1349 4454 1930 -4295 -5831 -621 4547 1996 -5068 -6431
4267 -6431 -333 5081 2241 -4154 -5487 930 6208 3763 -3428 -5162 444 5140 2891 -3163 -4281
$$ packed form
4162f726O256N446l657p740j158P722N697l883o706j099P098N342l612p609j222
4177e851O706N515l376o984n70O984N436l768p344j932P239N176l501p615j183
4192e068P265N793l454p253k030O573M785l457p480q24P162N947m099p472j088
4207d700O460M718k648p408j730O033M930k774o121J3O262L601l451p112k065
4222e992P300N192l097o904j051N779M948k943p042j266O298M673l588p431p58
4237e882O836N411l533p121j824N579N143l042o867j090O365M596k944o577j281
4252f231N700N091l146p554j039N830N803k524o225j536N210N168k551p064j363
4267f431O098N414k840o395j333O417N278k445p191j734N606M696k249o054j118
$$ plain form
4282 -4281 1856 6565 3938 -2791 -4777 1151 6456 3680 -3344 -4902 853 6323 4274 -2163 -4301
4297 -4301 1019 5842 2829 -3850 -4715 1086 6032 2601 -3773 -4801 485 5052 4097 -3533 -4879
4312 -4879 519 4918 2429 -2833 -4841 1232 5853 3973 -3374 -5640 551 5916 2471 -3281 -5496
4327 -5496 510 5857 2926 -2802 -5068 213 4789 1985 -3925 -5271 721 6839 2978 -2844 -5706
4342 -5706 126 5239 3192 -2984 -5068 -522 5177 2764 -3676 -5256 -588 4625 2998 -4308 -6702
4357 -6702 -132 4555 3584 -3794 -5078 -582 4781 3137 -3402 -5409 -916 5028 2083 -4460 -5523
4372 -5523 32 5875 3866 -3292 -5532 -913 5301 3267 -4025 -3585 734 4907 2610 -2812 -4422
4387 -4422 997 5325 2869 -3906 -5193 -398 5225 3336 -2381 -3998 -538 5166 2379 -4211 -6112
$$ packed form
4282d281O137M709k627o729j986N928N305k776p024j558N755N470k049o437k138
4297d301N320M823l013o679q65N801M946l431o374j028N286M567r55p630j346
4312d879N398M399k489n262k008O073M621j880p347k266O191N365l445n752k215
4327e496O006N347k931n728k266N281M576k804n910j346N992O118l861n822k862
4342e706N832N113k047o176k084M546N699k413o440j580M668N213j627p306k394
4357f702O570M687r71p378j284M496N363j644o539k007M493N944k945o543j063
4372e523N555N843k009p158k240M619O214k034p292M40M319M173k297n422j610
4387d422N419M328k456o775j287M795N623j889n717j617L460N704k787o590j901
$$ plain form
4402 -6112 390 6073 3420 -3192 -5217 -274 6003 3314 -3077 -4624 -263 5025 2801 -3559 -5257
4417 -5257 288 6042 4132 -2581 -5665 -717 5089 3643 -2491 -4430 177 5516 4077 -3035 -5236
4432 -5236 -471 4965 3599 -2214 -4985 -30 4620 3459 -2194 -3800 932 5590 3356 -3184 -5269
4447 -5269 -140 5195 3993 -1496 -3570 655 4925 2545 -3757 -4635 776 5919 3169 -3469 -5597
4462 -5597 -273 5294 3884 -2940 -5229 -444 3910 1382 -4336 -5187 219 5796 3242 -4138 -7149
4477 -7149 -1919 4089 3010 -3082 -5454 -1159 3621 1785 -3764 -5136 -389 4683 2763 -3899 -6577
4492 -6577 -1999 3727 3914 -1288 -4230 -337 3672 1699 -3652 -4183 657 5122 3294 -2859 -4993
4507 -4993 -323 4520 3543 -1647 -3658 567 4201 1698 -3054 -4039 1490 6453 4107 -2729 -4743
$$ packed form
4402f112O502N683k653o612k025M943O277k689o391j547M361N288k224o360j698
4417e257N545N754j910o713l084M948N806j446o134j939M607N339j439p112k201
4432e236M765N436j366n813k771M955M650j161n653j606M732M658k234o540k085
4447e269N129N335j202n489k074M225M270k380o302q78N411N143k750o638k128
4462e597N324N567j410o824k289M785M354k528n718q51N406N577k554p380l011
4477g149N230O008j079o092k372M295M780j836n549j372M747N072j920o662k678
4492f577M578N726J87n202k942L893M009j973n351n31M840M465j828o153k134
4507d993M670M843r77n190k011M225L634k503m752r85N529M963k346o836k014
$$ plain form
4522 -4743 126 4625 2970 -2505 -3619 1108 5654 2907 -2830 -4790 732 6590 4247 -2226 -4959
4537 -4959 -719 4600 4115 -1315 -3375 1036 5668 3688 -2986 -5073 -162 5625 4960 -742 -3967
4552 -3967 -1088 3658 3036 -1601 -3810 541 4218 2180 -3295 -5392 -1043 4405 3962 -1937 -4863
4567 -4863 -2193 1802 148 -3298 -3930 232 3650 930 -4965 -6670 -1760 3489 2235 -3417 -5085
4582 -5085 -2006 1833 577 -3506 -4530 388 4620 1447 -5291 -6759 -1284 4668 3985 -1254 -4513
4597 -4513 -576 3827 2677 -2349 -3845 1059 5611 3953 -2293 -5222 -831 5549 5780 -271 -3276
4612 -3276 -614 3658 2852 -972 -3084 553 5505 4867 -1287 -4273 -385 3857 3767 -80 -2480 -209
4628 -209 3133 2773 -1921 -2779 1001 5159 3601 -2026 -4096 -815 3675 3169 -887 -2120 1065 4359
$$ packed form
4522d743M869M499j655n475j114M727M546k747n737j960N522N858k343o473k733
4537d959M240N319m85n430k060M411M632j980o674k087M911N787o65n702l225
4552c967K879M746o22m637k209M351L677k038n475k097M349N448m43n899k926
4567d863K670L995j654l446o32M162L418k720n895j705M910N249j254n652j668
4582e085L079L839j256m083j024M918M232l173o738j468N475N952o83n239l259
4597d513L937M403j150n026j496M904M552j658o246k929M391O380K31o051l005
4612c276K662M272q06l824k112L637M952o38o154k986L888M242r0l847k400K271
4628b09L342l60m694q58L780M158j558n627k070L281M490n06m056j233L185L294
$$ plain form
4644 4359 1998 -3030 -4162 606 5292 4178 -1601 -5018 -1228 3965 3351 -2008 -3642 16 3949
4659 3949 1631 -4151 -6139 -881 4992 3998 -2604 -6530 -3357 1717 1751 -2049 -4668 -1724 2381 1675
4675 1675 -4034 -6529 -2088 3142 3187 -2376 -6173 -3653 1261 1766 -1139 -3218 -531 2884 1733 -3103
4691 -3103 -4892 -657 4208 3761 -424 -3701 -968 3490 2928 -492 -1849 1212 4645 2579 -2530
4706 -2530 -3495 884 6235 5173 -679 -3355 262 4008 3150 -1030 -2698 1183 5613 3951 -1934
4721 -1934 -4766 -321 4858 4856 -1126 -4424 -1385 3354 3824 -1303 -3642 -332 4654 3735 -1973 -5161
4737 -5161 -2034 3349 4074 -221 -3363 -1474 2548 2512 -1807 -3907 -982 3399 3081 -1859 -4711 -2065
4753 -2065 2474 3204 -1087 -3349 -1304 1798 1108 -2879 -4648 -543 4001 2646 -2925 -5448 -2821
$$ packed form
4644D359k361n028j132M768M686j114n779l417L790N193o14n359j634L658L933
4659C949k318n782j988N258N873r94o602l926L173N074L4l800k619K944M105p06
4675A675n709k495M441N230M5n563l797K520M914N05k905k079K687L415j151m836
4691c103j789M235M865m47m185l277K733M458n62l420j357L061L433k066n109
4706b530r65M379N351j062n852k676L617L746q58m180j668L881M430j662n885
4721a934k832M445N179kn982l298L039M739M70n127k339L310M986r19n708l188
4737e161L127N383P25m295l142J889M022l6m319k100K925M381l18m940k852K646
4753b065M539P30m291k262K045L102o90l987j769M105M544j355n571k523K627
$$ plain form
4768 -2821 1988 1799 -2191 -4220 -1053 2322 1049 -3721 -5214 -1049 4099 2934 -2955 -6174 -2643
4783 -2643 2904 3478 -991 -3616 -654 3475 2417 -2556 -4770 -137 5107 4530 -787 -3999 -1043
4798 -1043 4001 4544 677 -2259 312 3845 3400 -747 -3236 162 5058 5104 115 -3086 -526 3374
4814 3374 3397 -426 -2527 296 3626 3015 -1439 -3554 20 4115 3377 -1677 -3808 -1028 2487 2478 -1382
4831 -1382 -3386 -146 3681 2514 -2597 -4682 -980 3204 3011 -1398 -4248 -1204 3144 2254 -2031
4846 -2031 -4132 -931 3247 2653 -2609 -5022 -1858 3019 3302 -1268 -4289 -1779 2101 1634 -1933 -4293
4862 -4293 -1248 3544 2498 -2103 -4819 -1983 2420 2781 -1233 -4034 -1860 1562 1681 -1929 -3497
4877 -3497 -580 3357 2586 -1743 -4272 -1705 2944 2902 -715 -3080 -624 2909 2365 -1236 -2789 165
$$ packed form
4768b821M809j89l990k029L167L375j273m770j493M165N148j165n889l219L531
4783b643N547N74m469k625K962M129j058m973k214M633N244n77n317l212K956
4798a043N044N43l867k936K571L533m45m147k489L398M896M6m989l201K560L900
4814C374K3l823k101K823L330o11m454k115L574M095p38n054k131K780L515rl860
4831a382k004L240L827j167n111k085L702M184j93m409k850L044M348q90m285
4846b031k101L201M178n94n262k413L164M877K83m570l021K510L880m67l567k360
4862d293L045M792j046m601k716K836M403L61m014k801K174L422J19l610j568
4877c497K917L937p71m329k529K567M649m2l617k365K456L533n44l601j553K954
$$ plain form
4893 165 4108 3137 -1174 -3587 -449 3926 4108 -383 -2483 -253 3348 2747 -799 -2815 1 4192
4909 4192 3562 -1308 -3407 -418 3615 3725 -688 -3235 -761 3094 3296 -668 -3134 -715 3060 2821
4925 2821 -1291 -4182 -1619 2492 2626 -899 -3641 -1044 2565 2414 -1249 -3803 -1620 2356 2579 -1152
4941 -1152 -3946 -986 2832 2581 -1461 -3621 -963 2327 2047 -1707 -3852 -1571 2636 2729 -1054 -3579
4957 -3579 -1519 1992 1868 -1524 -3534 -1268 2886 2522 -1226 -3983 -1603 2325 2712 -677 -3711 -1444
4973 -1444 2177 2373 -851 -3115 -876 2464 2376 -1301 -3463 -1259 2720 3181 -555 -3247 -1362 2489
4989 2489 2789 -758 -2774 -631 2577 2602 -1281 -3252 -1499 3135 3720 -601 -3007 -1418 2088 2750
5005 2750 -439 -2835 -1171 2463 2865 -969 -2689 -958 2313 2861 -760 -3638 -1545 2817 3188 -419
$$ packed form
4893A65L943r71m311k413L138M375J82m491k100K230L601o01l546k016K816M191
4909D192o30m870k099K989M033J10m413k547K474L855K02l964k466K419L775k39
4925B821m112k891K563M111J34l525k742K597L609j51l663k554K183L976K23l731
4941a152k794K960L818k51m042k160K658L290k80l754k145K281M207R3l783k525
4957c579K060L511j24l392k010K266M154l64l748k757K380L928L87l389l034K267
4973a444L621J96l224k264K239L340q8l677k162K204L979M61l736k692J885L851
4989B489L00l547k016K143L208K5l883j971J753M634N85m321k406J589L506O62
5005B750l189k396J664L634M02l834j720J731L271N48l621k878K093M362L71l607
$$ plain form
5021 -419 -3292 -1322 2757 3207 -853 -3259 -1325 2377 3168 -632 -3367 -1341 3179 3233 -758 -3522
5037 -3522 -1537 1940 2326 -473 -3276 -1245 2944 2970 -560 -3258 -1603 2690 3237 -918 -3742 -1587
5053 -1587 3046 3313 -328 -3132 -1365 1893 2775 -1323 -2983 -1138 2556 2265 -475 -3433 -1410 2116
5069 2116 3034 -838 -3442 -870 2422 2824 -555 -3257 -1333 2660 2194 -1413 -3248 -1822 1865 2724
5085 2724 -1206 -3436 -1426 2270 2334 -982 -2590 -1365 1943 2442 -877 -3806 -988 2249 2362 -472
5101 -472 -3121 -1469 1870 2509 -720 -3129 -1790 2855 2632 -360 -2804 -365 2744 2279 -1445 -2493
5117 -2493 -1405 2509 3811 55 -3487 -879 2850 3280 -106 -3019 -989 3153 2512 -615 -2231
5132 -2231 -840 2538 2662 -512 -3319 -555 2330 3242 24 -2137 -1847 2520 2452 119 -2549 51
$$ packed form
5021d19k873J970M079M50m060k406J934L702P91l800k735K026M520N4l991k764
5037c522J985L477L86k799k803K031M189K6l530k698J655M293N47m155k824K155
5053a587M633K67l641k804J767L258Q82m098j660J845L694k91k740k958K023L526
5069B116R18l872k604K572L292M02l379k702J924L993m66l607j835J426L687Q59
5085B724l930k230K010L696O4l316j608J225L308M99l319k929K818L237J13k834
5101d72k649J652L339O39l229k409J339M645k23k992k444K439L109m65l724j048
5117b493J088L914J302l756l542K608L729M30l386k913K030M142o41l127j616
5132b231J391L378J24l174k807K764K885R12l218k161K90M367o8k333k668K600
$$ plain form
5148 51 2505 2505 -420 -2938 -1532 2148 3532 461 -2636 -1265 2405 2194 -1036 -3850 -2573 1780
5164 1780 2748 -1624 -3014 -1133 2360 1512 -1024 -3166 -3056 1154 2313 -350 -3248 -959 1384 2455
5180 2455 19 -4027 -1510 612 2536 -404 -3561 -1394 1262 2220 -1959 -3387 -1430 2008 1787
5195 1787 -84 -3518 -530 1603 1606 -731 -4118 -1286 1634 2578 -239 -2977 -1903 2754 2220 -291
5211 -291 -2853 -689 1986 2097 -787 -2643 -741 2512 3415 170 -2512 -1693 3281 3750 311 -1263
5227 -1263 -386 2780 3643 287 -1748 -82 2848 3315 511 -1993 -414 2315 3265 499 -2356 -743
5243 -743 1942 2485 -58 -2077 -698 2119 2345 -479 -2894 -1376 2053 2541 -273 -2767 -1641 1584
5259 1584 2225 -554 -2961 -1740 1009 1770 -896 -3185 -1721 1603 1795 -916 -3366 -2314 765 1827
$$ packed form
5148E1K454%k925k518J406L680J384l071l097J371L670k11l230k814J277M353
5164A780R68m372j390J881L493q48k536k142J10M210J159k663k898K289K343J071
5180B455k436m046K517K122J924k940l157K167K656R58m179j428J957L438k21
5195A787j871l434K988K133Lk337l387K832K920R44k817k738J074M657n34k511
5211b91k562K164K675J11k884j856J902L253R03l245k682Q19M974M69l439j574
5227a263Q77L166Q63l356k035J666K930M67k804k504J579K729R50k766k855J613
5243g43K685N43k543k019J379K817K26k824k415J518L429M88k814k494J126L225
5259A584O41k779k407J221K749P61k666k289J464L324J92k711k450J052L079J062
$$ plain form
5275 1827 -776 -3111 -1662 982 1574 -1137 -2889 -1747 1086 1944 -1070 -3608 -2189 1337 2179 -676
5291 -676 -2706 -1740 618 1571 -949 -3076 -1609 1738 1722 -436 -2980 -1974 1171 2630 172 -2444
5307 -2444 -1772 1492 2364 361 -2081 -589 2271 2748 227 -1846 -1016 2615 3264 935 -1430 -488
5323 -488 2130 3904 1122 -1533 -458 1583 3137 1975 -931 -663 2217 2970 1118 -1372 -370 2348
5339 2348 3126 764 -2170 -1107 2193 2538 -54 -2184 -1836 1392 2317 -278 -2852 -1568 1711 2120
5355 2120 -601 -3428 -2071 917 2303 -247 -3065 -2327 657 1620 -885 -2727 -2118 1186 1762 -1093
5371 -1093 -3305 -2137 1131 2109 -143 -2917 -2270 658 1236 -304 -2537 -1464 1222 1950 -914 -3073
5387 -3073 -1947 1566 2546 98 -2516 -1714 1056 1572 -121 -2299 -1001 1866 2268 -459 -2913 -1513
$$ packed form
5275A827k603k335J449K644N92k711j752J142K833Q58l014k538J419L526Q42k855
5291f76k030R66K358R53k520k127J467L347j6k158k544J006L145J459k458k616
5307b444O72L264Q72k003k442J492K860M77k521k073Q30L631O49k329k365R42
5323d88K618J774k782k655J075K041J554j162k906K68K880P53j852k490J002K718
5339B348P78k362k934J063L300L45k592k130L48L228R25k595k574J284L279M09
5355B120k721k827J357K988J386k550k818P38K984R63k505j842O09L304N76k855
5371a093k212J168L268R78k252k774O47K928N78j540k233J073K686P28k864k159
5387c073J126L513R80k448k614Q02K770N16j693k178J298K867M02k727k454J400
$$ plain form
5403 -1513 1907 3128 138 -2352 -1412 1882 2781 448 -1752 -418 2499 3181 378 -2239 -985 2118
5419 2118 3306 379 -1655 -1427 2180 3267 677 -1860 -766 2216 3460 610 -2375 -1528 1571
5434 1571 3057 836 -1774 -763 1321 1838 95 -2080 -1867 1841 2548 -322 -2368 -2122 1024 1167
5450 1167 -777 -2729 -1874 834 1302 -1253 -3139 -1243 1644 2621 -749 -3010 -2719 758 1609 -778
5466 -778 -2524 -1479 1228 1587 -1290 -3392 -1156 1794 2681 209 -2123 -2208 1228 2592 982 -1066
5482 -1066 -1884 1860 1047 -732 -2808 -510 1826 3259 536 -1611 -1863 1111 1857 655 -1495 -1229
5498 -1229 1590 2266 -320 -2152 -1052 1434 3179 937 -1684 -1276 1420 2105 375 -1178 -289 1566
5514 1566 2101 20 -1737 -707 2204 2935 498 -1545 -1030 1564 2060 383 -1578 -731 1782 2658
$$ packed form
5403a513L420J221k990k490R40L294Q99k333k200J334K917O82k803k617J254L103
5419B118J188k927k034K28L607J087k590k537J094K982J244k850k985Q47L099
5434A571J486k221k610J011K084N17j743k175K13L708P07k870k046K46L146J43
5450A167j944j952Q55K708M68k555j886J896K887R77l370k261K91L477Q51k387
5466g78j746J045K707L59k877k102K236K950Q87k472k332q5L436J364j610k048
5482a066q18L744q13j779k076K298K336J433k723k147k52K974P46j202k150K66
5498a229K819O76k586j832J100K486J745k242k621M08K696O85j730j553Q89J855
5514A566N35k081j757J030K911P31k437k043N15K594M96j677j961Q47K513Q76
$$ plain form
5530 2658 -220 -2625 -1289 1456 2592 404 -1980 -1654 606 1723 -217 -2477 -1161 1684 2204
5545 2204 -256 -3227 -1942 789 1565 137 -2315 -1930 148 1110 -815 -2606 -1503 1053 2286 -169
5561 -169 -2401 -2013 471 2325 444 -1633 -1255 433 1231 -333 -1800 -1002 1366 2030 -20 -2418
5577 -2418 -1804 512 1985 724 -1493 -913 1144 1632 -423 -1935 -644 2120 2283 7 -2263 -1744
5593 -1744 924 2244 701 -1492 -856 1127 1460 -287 -1697 -809 1288 2792 694 -2213 -1954 858
5609 858 2537 651 -1649 -1503 976 1947 329 -2170 -1341 1659 2452 652 -2247 -1609 456 1772
5625 1772 628 -1279 -1157 776 1776 -175 -2218 -1165 1053 2195 263 -1700 -1648 588 1521 -95
5641 -95 -1737 -1075 1159 1723 -397 -2198 -1533 1030 2209 258 -1896 -1663 1017 1413 49 -1495 -1197
$$ packed form
5530B658k878k405J336K745J136k188k384L26K260J117j940k260J316K845N20
5545B204k460k971J285K731P76j428k452L85K078R62j925j791J103K556J233k455
5561a69k232L88K484J854j881k077L78J688P98j564j467P98K368O64k050k398
5577b418O14K316J473j261k217N80K057M88k055j512J291K764J63k276k270N19
5593a744K668J320j543k193O36J983L33j747j410Q88K097J504k098k907K59K812
5609H58J679j886k300J46K479R71j618k499Q29L000P93j800k899O38K065J316
5625A772j144j907J22J933J000j951k043J053K218J142j932j963N2K236R33j616
5641i5j642O62K234N64k120j801O65K563J179j951k154K33K680L96j364j544K98
$$ plain form
5658 -1197 1745 2675 -66 -2690 -1951 952 2414 868 -1870 -1611 869 1572 -30 -1578 -644 790
5674 790 2867 2 -3145 -1733 777 2395 1018 -1210 -1797 1206 1241 462 -1514 -1016 1461 1946 642
5691 642 -1961 -1852 -303 2294 1232 -1040 -1714 -45 1522 -194 -1751 -1014 792 1893 319 -2437
5707 -2437 -1477 894 2061 438 -1726 -1221 738 1322 71 -1676 -1449 1384 2248 -108 -1994 -1214
5723 -1214 811 1937 432 -1633 -1218 911 2108 29 -1697 -1282 1390 2205 448 -2073 -1924 1296
5739 1296 1866 862 -1335 -1129 1020 2305 448 -2082 -1341 875 2995 1637 -884 -1331 608 1660
5755 1660 911 -1506 -906 1443 1594 -83 -1721 -1525 1054 1991 369 -1969 -1687 167 1186 -474
5771 -474 -1074 -1228 186 1460 -360 -2645 -1243 1096 1787 -133 -2109 -1792 117 981 -310 -2273
$$ packed form
5658a197K942R30k741k624P39K903J462j546k738K59K480P03j602j548R34J434
5674G90K077k865l147J412K510J618j377k228n87L003L5p79j976M98K477M85j304
5691F42k603J09J549K597j062k272o74J669J567j716j557P37J806J101j574k756
5707b437R60K371J167j623k164N05J959N84j251j747K27K833Q64k356j886P80
5723a214K025J126j505k065M15K129J197k079j726M15K672Q15j757k521J49L220
5739A296N70j004k197K06K149J285j857k530P41K216K120j358k521m47J939J052
5755A660p49k417O00K349J51j677j638J96K579R37j622k338K82J854J019j660
5771d74o00j54J414J274j820k285J402K339O91j920j976L17J909Q64j291j963
$$ plain form
5787 -2273 -1534 506 1037 -416 -2155 -1838 955 1886 311 -2092 -2011 470 1395 38 -1655 -1254 766
5804 766 1690 152 -2065 -1731 628 2119 435 -1522 -1708 453 1853 506 -1542 -1144 948 2189
5820 2189 242 -1609 -1026 1268 2175 334 -1328 -995 1192 2269 379 -839 -870 1229 2333 635
5836 635 -1031 -612 1577 1805 990 -979 -891 1192 2021 294 -1480 -841 1016 2224 624 -1562 -987
5853 -987 915 1745 449 -1347 -1066 690 1752 21 -1690 -1458 738 1706 146 -1554 -1528 144 830
5870 830 50 -1794 -1682 313 1254 -51 -2329 -1715 177 1338 101 -1704 -2299 445 1365 119 -1883
5887 -1883 -1399 49 1059 -231 -2043 -1552 -418 1298 -319 -1935 -1841 273 1069 648 -1468 -1144 639
5904 639 1165 100 -1107 -1079 917 2045 940 -511 -1453 110 2548 906 -1062 -663 1010 1977 1179
$$ packed form
5787b273P39K040N31j453j739L17K793R31j575k403Q1K481R25j357j693M01K020
5804G66R24j538k217L34K359J491j684j957j86K161J400j347k048L98K092J241
5820B189j947j851N83K294R07j841j662L33K187J077j890j218l1K099J104j698
5836F35j666M19K189K28q15j969Q8K083Q29j727j774O39J857J208j600k186N75
5853i87J902Q30j296j796K81J756J062j731j711K32K196R68j560j700K6J672O86
5870H30p80j844J12J995R41j305k278O14J892J161j237j805n95K744R20j246k002
5887a883M84J448J010j290j812M91J134J716j617j616R4K114P96m21k116L24J783
5904F39N26j065j207K8J996J128j105j451r42J563K438j642j968L99J673R67p98
$$ plain form
5921 1179 -1276 -329 538 2058 867 -1073 -760 1293 2232 1079 -1058 -923 900 1941 902 -662
5937 -662 -710 786 1859 672 -1130 -994 1073 2052 896 -928 -1190 625 1954 727 -1562 -1244 668
5954 668 1596 256 -1289 -1230 313 1448 425 -1644 -1173 309 1370 334 -1555 -1574 -41 1136 31
5971 31 -1619 -1600 -159 1093 -169 -1772 -1484 -78 1270 119 -1717 -1822 237 1223 19 -1524 -1514
5988 -1514 155 1163 59 -1686 -1370 75 1347 191 -1383 -1274 379 1524 600 -1583 -1424 530
6004 530 1590 799 -1462 -1114 445 2323 993 -1088 -1428 888 1547 841 -912 -1360 740 1889 855
6021 855 -1125 -1113 1034 1638 603 -1027 -616 924 1774 475 -917 -1054 743 1544 880 -791 -966
6038 -966 660 1669 685 -1184 -907 757 1720 594 -1353 -1098 482 1605 545 -1042 -1090 -40 1505
$$ packed form
5921A179k455R47Q67J520j191j940L13K053R39j153k137J35J823J041j039j564
5937f62m8J496J073j187j802J36K067R79j156j824k62J815J329j227k289L18J912
5954F68R28j340j545N9J543J135j023k069M71J482J061j036j889j9J533J177j105
5971C1j650J9J441J252j262j603K88J406J348j151j836j05K059R86j204j543J0
5988a514J669J008j104j745L16J445J272j156j574J09J653J145r24k183J59J954
6004E30J060p91k261L48J559J878j330k081l40K316O59p06j753m48K100J149j034
6021H55j980J2K147O04j035j630M11J540Q50j299j392j37J797Q01o64j671j75
6038i66J626J009r84j869K77J664R63j126j947K55J580J123j060j587m8J050J545
$$ plain form
6055 1505 398 -1240 -1063 470 1469 331 -1316 -1462 391 1322 232 -1198 -1622 212 1180 104
6071 104 -1251 -1416 65 1198 72 -1289 -1660 532 1348 530 -1216 -1648 633 1328 528 -1119 -1712
6088 -1712 272 1280 351 -1318 -1612 189 1227 453 -1483 -1595 428 1100 178 -1223 -1152 199 1046
6105 1046 431 -942 -1270 821 1476 571 -1097 -984 544 1471 709 -962 -1253 587 1348 215 -1110
6122 -1110 -1124 307 1356 636 -1083 -1164 745 1374 420 -1371 -1269 500 1421 515 -992 -1258 138 1425
6140 1425 357 -1157 -1082 621 1507 621 -1213 -1027 618 1362 748 -1092 -1320 493 1247 549 -617
6157 -617 -894 301 1440 774 -984 -1000 615 1616 550 -1146 -1366 540 1353 634 -1077 -1186 428
6174 428 1361 447 -1062 -840 215 1359 544 -819 -1184 494 1421 651 -721 -1174 364 1387 631
$$ packed form
6055A505j107j638J77J533R99j138j647j46J853R31j090j430m24J834R68j076
6071A04j355j65J481J133j126j361l71K192Q16q18j746m32K281O95q00j647n93
6088a712J984J008r29j669k94J801J038p74j936j12K023O72r22j401P1J351Q47
6105A046o15j373l28K091O55r05j668J13J528R27p62j671k91J840P61j133j325
6122a110j4J431J049p20j719q1J909O29r54j791J02J769R21r06j507k66J396J287
6140A425j068j514P5J703Q86q86j834J86J645P44o14j840k28J813P54o98j166
6157f17k77J195J139o66j758j6J615J001j066j696k20J906Q13p19j711j09J614
6174D28R33r14j509K22J055J144q15j363l65J678R27p70j372m53J538J023p56
$$ plain form
6191 631 -755 -1145 156 1133 517 -1315 -1095 269 1412 696 -1079 -1148 225 1039 334 -873 -1033 -29
6209 -29 950 704 -782 -1008 -132 1477 666 -973 -1282 294 1334 447 -1265 -1382 317 561 366 -976
6227 -976 -582 263 992 508 -1055 -1201 -15 2176 -88 -532 -305 157 1576 853 -891 -1286 212 1535
6245 1535 236 -502 -838 203 1096 389 -943 -1048 440 1496 939 -785 -952 219 1310 670 -421
6262 -421 -624 404 1522 541 -527 -1008 702 1645 972 -425 -986 256 1268 491 -724 -734 349
6279 349 1046 253 -758 -1012 278 1672 726 -1037 -1488 -113 1044 475 -945 -1003 87 1054 598 -1068
6297 -1068 -1229 227 1377 333 -1122 -1628 -349 937 320 -1232 -1251 -239 901 159 -1081 -1489 43
6314 43 958 487 -1016 -1630 -417 823 689 -594 -1002 -15 979 474 -970 -1117 -74 1307 507 -940
$$ packed form
6191F31j386l90J301R77o16j832K20J364J143p16j775o9J373Q14p05j207j60J004
6209b9R79k46j486k26Q76J609q11j639l09J576J040q87j712j17J699K44j95j342
6227i76L94Q45P29m84j563j46J186K191k264m44K27M62J419p23j744l95J498J323
6245A535j299p38l36J041Q93p07j332j05J488J056n57j724j67J171J091o40j091
6262d21k03J028J118r81j068m81J710R43o73j397n61J242J012p77j215j0J083
6279C49O97p93j011k54J290J394r46j763m51J375J157n69j420n8J090R67m56j666
6297a068j61J456J150j044j455n06J279J286o17j552j9J012J140p42j240m08J532
6314D3R15m71j503o14J213J240j34j283m08R87R94n05j444j47J043J381q00j447
$$ plain form
6332 -940 -1112 187 1076 301 -848 -977 494 1420 774 -506 -1022 295 1373 768 -504 -837 281
6349 281 1263 704 -871 -826 895 1670 851 -626 -854 416 1403 758 -458 -1008 297 991 298 -637
6367 -637 -610 295 1577 543 -861 -1235 -99 1553 935 -415 -872 -107 871 547 -983 -1218 11 1353
6385 1353 600 -1179 -1213 -251 1458 439 -477 -1057 -448 822 252 -1152 -1129 298 1218 597 -931 -1154
6403 -1154 140 643 476 -735 -1344 -157 661 -299 -944 -1104 -72 1089 93 -1217 -1557 110 776
6420 776 450 -729 -869 79 960 355 -1000 -1354 36 1294 490 -804 -809 214 972 674 -625 -714 164
6439 164 876 418 -765 -627 349 1379 729 -450 -657 -49 1193 618 -111 -457 271 1183 392 -682
6457 -682 -874 108 1185 1040 -402 -698 41 803 143 -739 -592 589 1275 364 -1051 -1090 -12 1193
$$ packed form
6332i40j72J299Q89p75j149j29J471R26o46j280n16J317J078o05j272l33J118
6349B81R82n59j575M5J721P75q19j477k28J270R87o45j216n50J305O94o93r35
6367f37K7R05J282j034j404l74J136J652o18j350m57P65R78l24j530k35J229J342
6385A353p53j779l4R62J709j019r16n80O09J270n70j404K3J427R20o21j528k23
6403a154J294N03j67j211o09J187Q18r60o45j60J032J161r96j310l40J667O66
6420G76l26j179j40R48Q81o05j355l54J390J258q04j294nJ023P58k98j299q9Q78
6439A64P12m58j183J38R76J030o50j179k07O08J242n75p29l46P28R12p91j074
6457f82j92R82J077j45j442k96P39P62o60q82J47J181O86r11j415l9J078J205
$$ plain form
6475 1193 688 -799 -1157 -288 400 196 -1167 -954 88 1041 332 -996 -982 -160 955 449 -520 -1127
6493 -1127 -81 687 487 -840 -1061 -79 970 81 -958 -1218 -346 1078 631 -549 -1053 -187 675 140
6511 140 -811 -677 14 940 503 -522 -1201 -13 894 740 -194 -742 158 954 458 -489 -827 456 1094
6530 1094 455 -626 -668 275 852 668 -440 -701 337 761 370 -748 -658 375 1166 853 -517 -1005
6548 -1005 -185 898 713 -367 -658 39 891 290 -867 -983 242 1012 881 -762 -1154 -275 765 274
6566 274 -390 -500 111 839 244 -613 -1082 512 1007 766 -524 -1317 -352 406 480 -269 -731 225 722 314
6586 314 -897 -899 -306 957 535 -597 -1191 -658 594 471 -574 -768 232 838 486 -682 -1052 300
6604 300 828 621 -520 -1280 230 852 548 -471 -685 -174 1008 799 -668 -1227 -2 785 682 -483
$$ packed form
6475A193n05j487l58Q69O88k04j363K13J042R53p09j328J4Q22J115n06r69o07
6493a127J046P68k00j327k21R82J049q89j039k60Q72J424m47j180n04Q66Q62n35
6511A40r51J34O91R26m37j025o79J188R07j54r34n48R00P96m96r47l38J283O38
6530A094o39j081m2R43N77j84j108k61J038M24l91j118R0J033P91l13j370m88
6548a005Q20J083j85j080k91O97Q52o01j157j16J225P70j31j643l92Q79J040m91
6566B74o64j10O11P28n95q57m69J594M95k41j290p93R65P58P4p49m62R56M97m08
6586C14j211kN93J263m22j132n94N33J252j23j045j94J000O06l52j168l70J352
6604C00N28k07j141p60J510O22l04j019k14N11J182k09j467n59J225P87j03j165
$$ plain form
6622 -483 -1027 114 877 541 -580 -615 -78 1144 571 -685 -847 -81 998 883 -160 -828 -45 822
6640 822 537 -688 -900 80 971 766 -676 -957 -381 570 712 -592 -763 -68 860 176 -654 -1056 281
6659 281 910 561 -715 -1028 -46 919 348 -554 -783 183 576 197 -489 -713 41 1102 576 -446 -1150
6678 -1150 -368 793 470 -131 -916 -187 616 356 -939 -1139 297 1049 591 -857 -978 -106 695 912
6696 912 -407 -587 161 722 569 -490 -961 -163 603 702 -573 -1157 -156 870 432 -377 -845 -426 511
6715 511 160 -380 -283 -313 1302 376 -899 -1095 -130 291 943 -645 -1318 752 614 574 -508 -646 -42
6734 -42 888 221 -21 -964 -216 939 481 -554 -1107 -103 987 372 -586 -1205 -34 715 391 -294 -736
6753 -736 -73 684 500 -584 -789 295 583 454 -244 -844 -153 605 509 -227 -694 -158 512 538 -288 -869
$$ packed form
6622d83n44J141P63l36j121l5N37J222n73j256j62P66J079j15j043o68P83Q67
6640H22k85j225k12R80Q91k05j442k81N76R51J42j304j71O95R28o84q30m02J337
6659B81O29l49j276l13R82R65n71r02k29R66L93l79o86k24P54J061n26j022p04
6678a150P82J161l23o01p85P29Q03k60j295k00J436P52m58j448j21Q72Q01K17
6696I12j319j80P48N61j53j059m71P98P66R9j275n84J001J026m38q09m68M19R37
6715E11l51n40R7l0J615r26j275j96R65M21O52j588o73K070j38m0j082j38O04
6734d2R30o67k42r43P48J155m58j035n53J004J090o15r58o19J171P49l24o85m42
6753g36O63P57j84j084k05J084K88j29o98o00O91P58r6p36m67N36O70K6q26n81
$$ plain form
6773 -869 287 1167 984 -327 -648 -420 887 614 -158 -821 188 731 365 -552 -641 298 822 603 -133
6792 -133 -719 -93 835 834 -332 -1015 -278 455 521 -647 -702 4 434 389 -663 -764 -264 681 507 -644
6812 -644 -1085 -348 729 530 -349 -717 -49 256 183 -447 -610 -202 523 291 -364 -873 -173 421 277 -363
6832 -363 -436 -314 729 294 -497 -850 -102 734 371 -420 -916 -86 562 458 -190 -518 -76 879 567 -298
6852 -298 -361 110 898 598 -139 -417 64 589 712 -106 -647 320 1066 688 17 -399 136 617 693 48 -276
6873 -276 208 817 547 -187 -553 260 1084 790 -255 -515 203 837 434 -188 -465 -239 751 417 -405 -819
6893 -819 -74 680 425 -496 -1041 -211 863 326 -491 -730 -176 396 432 -555 -810 -187 464 109 -690 -763
6913 -763 -359 509 601 -483 -983 -466 724 107 -521 -798 -156 560 310 -597 -1074 -306 488 367 -193 -849
$$ packed form
6773h69J156Q80j83j311l21K28J307k73p72o63J009N43l66r17q9R39N24k19p36
6792a33n86O26R28jj166o83P37P33O6j168n5P06M30m5j052j01N00R45j74j151
6812f44m41P37J077j99q79l68O68L05p3o30j63M08P25k32o55n09P00N94j44o40
6832c63p3J22J043m35p91l53P48Q36l63p91m96Q30O48j04o48l28M42R55l12q65
6852b98o3M71P88l00p37k78M81N25J23q18n41R67P46l78o71m16N35M81P6o45l24
6873b76M84O09k70p34l66Q13Q24k94j045k60P18O34m03o22k77K26R90l34q22m14
6893h19P45P54k55r21n45Q30J074n37q17k39N54N72L6r87k55O23O51l55p99p3
6913g63M04Q68R2j084n00N17J190o17o28k77O42P16k50r07m77P68P94j21n60o56
$$ plain form
6933 -849 -388 150 221 -255 -781 -249 636 359 -538 -450 -79 640 423 -162 -360 -92 801 409 -89 -430 -22
6954 -22 514 639 118 -376 327 733 903 -132 -540 21 1048 859 -54 -286 51 981 661 21 -467 -218
6974 -218 795 565 190 -678 -25 729 568 -326 -888 83 752 520 -372 -868 -90 341 583 -342 -794 -42
6994 -42 719 -44 -268 -670 -163 159 338 -388 -815 -481 321 63 -791 -834 54 22 196 -472 -320 225 459
7015 459 323 -759 -828 -516 410 210 -570 -592 -398 160 192 -360 -864 -388 454 281 -190 -958 -136 112 548
7036 548 -357 -590 -414 693 323 -511 -693 -210 350 959 -17 -213 -32 852 675 411 -113 -295 628 180
7056 180 -361 -379 -188 1473 474 57 -1178 -517 211 215 637 -971 300 381 172 -199 -769 507 1258 342
7076 342 10 -433 -27 108 709 -300 -496 -92 775 393 -237 -150 -30 207 409 -33 -779 -193 291 236
$$ packed form
6933h49M61N38P1m76n26N32Q85k77q97Q8L71P19k17n85j98K68Q93l92m98l41M08
6954b2N36J25n21m94P03M06J70j035m08N61J027j89r13k32L37R30l20o40m88K49
6974b18J013k30l75q68O53P54j61q94n62R71O69k32q92m96P78M31K42r25m52P52
6994d2P61p63k24m02N07L22J79p26m27L34Q02k58q54m3Q88l2J74o68J52N45K34
7015D59j36j082o9L12R26k00p80k2J94N58L2n52n04M76Q42j73m71p68Q22K48M36
7036E48r05k33J76J107l70q34j82M83N60O09r76j96J81Q84j77k64n24j82R23m48
7056A80n41j8J91J661r99m17j235O61P28MM22j608J271Q1k09l71n70J276P51r16
7076C42l32m43M06J35O01j009j96M04Q67l82o30Q7J20K37K02m42p46N86M84n5
$$ plain form
7096 236 -238 -633 -60 447 70 -614 -670 162 296 284 -233 -465 -228 458 38 -340 -781 -119 299 340 -255
7117 -255 -610 -369 374 363 -178 -627 -255 372 584 -417 -520 -181 553 280 -351 -642 -325 552 432 -160
7137 -160 -619 109 541 577 -403 -721 30 623 128 -226 -716 92 346 573 20 -288 -152 451 308 18
7157 18 -147 137 732 321 -52 -781 52 431 352 -235 -273 -37 528 816 -118 -380 241 426 6 -342 -425
7178 -425 -100 679 671 -377 -503 -94 361 396 -168 -803 291 270 378 -301 -789 168 340 -29 -564 -667 -144
7199 -144 -169 186 -561 -924 193 578 -131 -667 -528 -351 396 301 -806 -360 230 531 98 -226 -344 -115
7219 -115 339 234 -217 -419 232 309 570 -292 -397 -348 411 363 -166 -536 -153 254 337 -205 -522 -392 571
7240 571 452 -172 -200 126 61 323 -147 -640 -119 406 494 -116 -406 -45 503 143 -336 -425 -370 319 372 63
$$ packed form
7096B36m74l95N73N07l77o84n6Q32J34j2n17k32K37O86m20l78m41O62M18M1n95
7117b55l55K41P43j1n41m49L72O27K12j001j03L39P34k73o31k91L17Q77j20n92
7137a60m59P28M32L6r80l18P51N93m95l54m90Q08K54K27n53l08J36O03j43k90
7157A8j65K84N95m11l73p29Q33L79p9n87l8K36N65K88r34k62O21J85m20l48q3
7178d25L25P79qj048j26M09M55L5n64o35J094k1J08o79m88R57J72l69n35j03N23
7199a44k5L55p47l63J117L85p09n36J39J77P47r5j107M46N90L01m33l24j18K29
7219a15M54j05m51k02O51P7K61q62j05M9P59m8n29l70L83M07Q3n42l17J30R63
7240E71j19o24k8L26o5K62m70m93N21N25Q8o10k90L61N48l60m79q9N5O89N3l09
$$ plain form
7262 63 -398 -269 581 207 -341 -357 -186 585 1068 90 -317 -270 190 164 -461 -579 81 362 225 -275 -657
7283 -657 -27 347 610 -252 -559 469 114 110 573 -757 151 54 642 172 -585 -185 223 295 -924 -454
7303 -454 9 439 451 -158 -574 -217 260 241 -394 -420 50 492 439 -75 -638 -269 407 249 -5 -492 84
7324 84 459 613 -127 -327 165 270 425 -269 -648 -301 417 327 -176 -365 71 503 509 -191 -443 -517 336 221
7346 221 -197 -793 -182 592 281 -331 -606 -132 341 325 -413 -598 -102 332 227 -188 -518 -145 634 10
7366 10 -296 -566 186 469 298 -245 -713 -123 396 406 -370 -393 113 534 381 -102 -237 -95 486 356 -258
7387 -258 -389 -84 506 329 27 -125 13 532 295 -172 -456 1 612 230 -48 -484 37 459 266 -11
7407 -11 -543 170 502 337 58 -225 -34 116 394 -279 -705 -254 127 301 -317 -447 -214 36 68 75 -163
$$ packed form
7262F3m61J29Q50l74n48j6J71P71M83r78m07M7M60k6o25j18O60K81j37n00l82
7283f57O30L74K63q62l07J028l55mM63j330R08r7N88m70p57M00M08P2j219M70
7303d54M63M30J2o09m16L57M77j9o35k6M70M42n3n14n63L69O76j58k54m87N76
7324H4L75J54p40k00M92J05J55o94l79L47P18r0n03j89M36M32Op00k52p4Q53j15
7346B21m18n96O11P74l11o12k75M74M73j6p38j85M96M34j05m15l30L73P79o24
7366A0l06k70P52K83j71n43m68N90N19J0p76k3N06M21j53m83j35J42N81j30o14
7387b58j31L05N90j77l02j52J38N19k37m67k84M57O11l82k78m36N21M22j93k77
7407a1n32P13L32j65k79k83J91J50K78o73m26M51L81J74o18j30K33K50L2Pk38
$$ plain form
7428 -163 -113 278 424 -32 -455 -39 287 557 -269 -575 -38 354 604 -352 -833 30 199 166 -39 -666 -334
7449 -334 247 488 -202 -522 -52 280 291 -225 -709 -492 431 379 -289 -328 -18 190 469 -203 -215 -124 395 319
7471 319 -222 -338 -125 390 366 -383 -167 29 440 104 93 -389 -39 452 439 -6 -371 148 429 575 159
7492 159 -78 3 449 210 -143 -230 106 468 504 -67 -366 -249 461 423 35 -276 -78 351 22 -215 -552
7513 -552 -131 207 443 -446 -545 -290 126 378 -277 -625 -139 -86 133 -389 -672 29 310 207 -106 -652 -375
7534 -375 133 -13 -281 -386 120 219 166 -229 -550 -90 394 230 -321 -338 -282 295 513 -169 -200 159 452 196
7556 196 -23 -308 -343 790 437 48 -382 -66 582 170 -102 -590 168 559 587 261 -260 -116 445 415 56
7577 56 -435 13 601 734 368 -34 177 726 327 -162 -281 307 615 350 348 -340 22 440 384 -89 -201
$$ packed form
7428a63N0L91J46m56m23M16L26K70q26l06N37L92K50r56m81Q63J69l3k05o27L32
7449c34N81K41o90l20M70L32J1n16m84K17R23n2o68l9L10K08K79o72j2R1N19p6
7471C19n41j16K13N15k4p49K16J96M11l36j1m82L50M91j3m45l65N19K81J46m16
7492A59k37Q1M46k39l53q7L36L62L6n71k99J17P10l8l88l11J98M29l29k37l37
7513e52M21L38K36q89r9K55M16K52o55l48M86N3K19n22k83P01K81j03l13n46K77
7534c75N08j46k68j05N06R9n3l95l21M60M84j64n51j7N6N77K18o82l1L59K93k56
7556A96k19k85l5J133l53l89m30L16O48m12k72m88P58L91K8l26n21J44N61l0l59
7577E6m91M48N88J33l66m02K11N49l99m89j19N88L08k65ko88L62M18n6m73j12
$$ plain form
7598 -201 -74 156 336 -119 -587 -213 433 -13 -149 -445 -236 7 171 79 -639 -168 92 150 -159 -728 -281
7619 -281 26 164 -492 -648 -337 253 -57 -351 -595 -78 141 255 -361 -515 -309 31 217 -168 -773 -63
7639 -63 318 354 -239 -405 1 457 307 -303 53 25 487 633 160 -242 63 700 633 -254 -381 160 602
7660 602 197 247 -126 -151 360 348 231 -127 292 131 670 -52 -233 -78 230 394 -207 -245 14 304 312 114
7682 114 -104 38 535 447 -276 -296 -82 536 556 -375 -452 -60 479 303 -278 -519 -64 466 120 -476 -486 -275
7704 -275 200 71 -83 -353 -154 113 -41 -91 -606 -250 117 72 -398 -325 -312 -51 -219 -168 -541 -273 -97 -99
7726 -99 -281 -220 -176 292 262 -239 -625 -338 360 -127 -90 -492 130 662 309 -119 -478 224 168 475 -135 -244
7748 -244 344 310 625 -49 -121 120 601 204 -9 -387 -139 525 418 -35 -158 200 251 211 -271 87 197
$$ packed form
7598b01J27K30J80m55m68L74O46m46j36k96K09K43J64r2p18M71K60N8l09n69M47
7619b81L07J38o56j56L11N90l10k94k44N17K19J14o16j54K06L40J86l85o05P10
7639f3L81L6n93j66M06M56j50o10L56k8M62J46m73m02L05O37o7q87j27N41M42
7660F02m05N0l73k5N11j2j17l58M19j61N39p22j81J55L08J64o01l8K59K90Qj98
7682A14k18J42M97q8p23k0K14O18K0r31p7L92N39j76n81k41M55N30l46n96j0K11
7704b75M75j29j54k70J99K67j54n0n15L56L67m5m70P3J3K61j68N1l73K68J76k
7726i9j82O1M4M68l0n01l86K87O98m87L7m02O22N32l53m28l59P02n6L07o10j09
7748b44N88l4L15o74p2K41M81l97k13l78K48O64j07m53j23L58N1m0m82L58J10
$$ plain form
7769 197 630 312 158 -161 -279 642 107 3 -416 50 505 310 394 -167 313 1004 258 147 -607 -187
7789 -187 125 132 -176 -112 -1039 210 -156 -440 -127 271 -276 -170 77 -611 -139 335 -237 -69 -530 -137 149
7810 149 336 -519 -609 -286 29 239 -268 -500 7 -53 19 -424 -389 -253 -33 220 -315 -354 -334 296 285 -79
7832 -79 -143 -291 324 444 -393 -414 -16 352 382 -129 -70 81 239 205 21 -235 -60 500 385 173 -98 147
7854 147 329 150 -313 -473 -100 560 441 67 -267 -148 234 380 -93 -261 272 530 296 -5 -398 -208
7874 -208 353 523 0 -394 246 413 466 15 -416 -19 314 434 -184 -414 275 535 650 -98 -389 29
7894 29 184 291 103 -72 -309 396 323 -127 -367 3 150 249 -364 -581 -111 455 361 -249 -199 -176 261 75
7916 75 -227 -461 142 358 387 87 -168 -203 372 87 -306 -331 -10 388 540 -351 -506 -335 -65 85 -141
$$ packed form
7769A97M33l18j54l19j18R21n35j04m19M66M55j95Q4n61M80O91p46j11p54M20
7789a87L12Pl08O4r27J249l66k84L13L98n47J06K47o88M72M74n72J68m61L93K86
7810A49J87q55r0L23L15K10n07k32N07o0P2m43L5J36K20K53n35l9K0O30j1l64
7832g9o4j48O15J20q37k1L98L68L0n11N9J51J58l4j84k56J75N60j15k12k71K45
7854A47J82j79m63j60L73O60j19l74l34J19L82J46m73j68N33K58k34l01l93J90
7874b08N61J70n23l94O40J67N3m51m31L97L33J20o18k30O89K60J15p48k91M18
7894B9J55J07j88j75k37P05p3m50k40L70J47R9o13k17M70N66r4o10N0K3M37j86
7916G5l02k34O03K16K9l00k55l5N75k85l93k5L21L98J52q91j55J71K70J50k26
$$ plain form
7937 -141 -335 69 505 237 -115 -211 61 234 172 20 -861 -38 89 401 -79 -242 -361 34 268 -270 -540
7958 -540 -206 413 280 -248 -251 124 545 190 -448 -68 250 306 171 -173 -603 -206 621 201 -70 -288 -202
7979 -202 88 273 -58 -263 41 246 284 -164 -140 -11 604 247 -258 -402 108 372 62 -101 -245 23 481
8000 481 594 62 -207 206 199 440 -52 -299 480 353 534 72 -318 -58 340 363 17 -548 77 360 64
8021 64 -330 -282 -306 191 214 -542 -353 93 308 167 93 -385 -46 -23 -7 -291 -523 -118 152 39 -453 -434 -539
8044 -539 342 -128 -337 -157 -24 64 37 12 -669 -218 240 -75 -338 -18 -163 196 58 -269 -536 -239 -41
8065 -41 101 -15 61 -179 579 240 -32 -242 -83 76 218 -202 -186 46 37 139 167 -287 328 289 161 186 -265
8088 -265 142 302 211 -38 -99 211 330 389 -21 -249 318 334 148 203 -100 -177 147 135 -49 -224 184 313
$$ packed form
7937a41j94M04M36k68l52r6K72J73o2j52q81Q23J27L12m80j63j19L95K34n38k70
7958e40L34O19j33n28lL75M21l55o38L80L18N6j35l44m30L97Q27m20k71k18Q6
7979b02K90J85l31k05L04K05L8m48K4J29O15l57n05j44N10K64l10j63j44K68M58
8000D81J13n32k69M13pK41m92k47P79j27J81m62l90K60L98K3l46n65O25K83k96
8021F4l94M8k4M97K3p56J89M46K15j41p4m78L39K3J6k84k32M05K70j13m92J9j05
8044e39Q81m70k09J80J33Q8k7k5o81M51M58l15k63L20j45L59j38l27k67K97J98
8065d1J42j16P6k40P58l39k72k10J59J59J42m20J6K32rJ02K8m54O15l9j28K5m51
8088b65M07J60r1k49o1L10J19N9m10k28N67J6j86N5l03p7L24j2j84j75M08J29
$$ plain form
8110 313 331 -14 -244 -10 306 301 142 17 -105 241 367 -82 -504 33 -54 103 -476 -208 -300 129 129 -66
8132 -66 -304 -170 -277 142 -427 -286 -149 -103 -154 -400 -298 -184 -157 -169 4 -593 -235 234 254 -152 -122 -11
8154 -11 162 122 -274 -229 79 328 280 -171 -652 -105 206 405 -184 -85 164 174 76 -231 -13 -103 383 350 -262
8177 -262 -80 -148 97 308 -80 -192 -72 494 407 41 -84 -29 295 464
$$ packed form
8110C13J8l45k30K34L16nj59j25j22L46J26m49m22N37q7J57n79K68r2M29%j95
8132f6k38J34j07M19n69J41J37M6n1k46J02J14K7j2J73n97L58M69K0m06L0J11
8154a1J73m0l96M5L08K49m8m51m81N47L11J99n89R9K49J0r8l07K18r0M86l3o12
8177b62J82o8K45K11l88j12J20N66q7l66j25N5L24J69
8191D64
$$ Imaginary data points
##PAGE= N=2
##DATA TABLE= (X++(I..I)), XYDATA
$$ plain form
0 0 0 0 0 -8 8 -8 8 -16 24 -24 40 -48 56 -70 89 -105 123 -151 180 -206 247 -288 331 -384 444 -507 577
27 577 -658 746 -841 948 -1070 1194 -1337 1496 -1666 1850 -2060 2285 -2532 2805 -3107 3440
43 3440 -3807 4221 -4681 5196 -5787 6467 -7248 8172 -9281 10632 -12333 14546 -17553
56 -17553 21899 -28802 41475 -72503 309096 194580 -465570 -94584 483075 635638 88633
67 88633 -304382 -126524 378367 407887 -54202 -406360 -97406 454628 551166 4171 -514712
78 -514712 -451185 40254 281709 65856 -192977 -65850 218230 198143 -156411 -360560
88 -360560 -132870 243718 276917 -47455 -276820 -100652 213261 243870 9695 -82586 124965
99 124965 304668 110896 -281431 -359424 43156 461238 382347 -68209 -293556 -43609
$$ packed form
0@%%%qJ6j6J6k4M0m8O4q8J04j26J59j94K28k74L31l86M53n35O19p15Q28r51J084
27E77j235J404j587J789k018K264k531K833l162L516l910M345m817N337n912O547
43C440p247Q028q902R877j0983J2254j3715J5420j7453J9913k2965K6879l2099
56a7553L9452n0701P0277j13978L81599j14516o60150L70986N77659J52563n47005
67H8633l93015J77858N04891K9520m62089l52158L08954N52034R6538n46995n18883
78e14712O3527M91439K41455k15853k58833J27127K84080k0087l54554k04149
88c60560K27690L76588L3199l24372k29365J76168L13913L0609k34175r2281K07551
99A24965J79703j93772l92327p7993M02580M18082p8891m50556k25347K49947
$$ plain form
109 -43609 260420 134775 -281280 -407998 -35613 346799 187979 -350040 -575495 -190861
119 -190861 302113 262471 -262734 -622360 -411569 27192 84915 -283906 -506556 -206925
129 -206925 243517 223916 -282177 -651840 -431334 88071 273983 -32145 -348123 -238218
139 -238218 118412 229626 -8912 -206253 -53231 252191 282493 -24600 -260394 -88767
149 -88767 297340 443252 242087 28661 71835 223662 188272 -17942 -75210 167132 428021
160 428021 349104 12997 -149658 60445 334586 295279 -513 -161691 769 213710
170 213710 131988 -157707 -221387 89759 393355 267266 -183682 -440603 -215191 175505
180 175505 225499 -89789 -299490 -99084 226739 206136 -149420 -364180 -141534 232918
$$ packed form
109d3609L04029j25645m16055j26718L72385L82412j58820n38019k25455L84634
119a90861M92974l9642n25205l59626K10791M38761N7723l68821k22650K99631
129b06925M50442j9601n06093l69663K20506N19405J85912l06128l15978J09905
139b38218L56630J11214k38538j97341J53022L05422L0302l07093k35794J71627
149h8767L86107J45912k01165k13426M3174J51827l5390k06214n7268K42342K60889
160D28021p8917l36107j62655K10103K74141l9307k95792j61178J62460K12941
170B13710q1722k89695o3680L11146L03596j26089m50948k56921K25412L90696
180A75505M9994l15288k09701K00406L25823k0603l55556k14760K22646L74452
$$ plain form
190 232918 264690 -100151 -393299 -232932 179043 333208 86618 -188379 -134971 119737
200 119737 174494 -76974 -289661 -144671 197557 303007 54870 -207973 -166201 70439
210 70439 153026 -23509 -200986 -134795 61473 85651 -108695 -234818 -89295 145388 146418
221 146418 -106905 -303069 -214747 3053 36291 -138316 -221284 -38401 180017 112344 -187287
232 -187287 -338597 -139080 158447 172377 -101332 -276548 -102189 194700 224265 -25831
242 -25831 -185651 -18104 251507 235504 -82620 -292574 -91478 296809 403400 129170
252 129170 -141510 -70450 197854 267379 37006 -169719 -53857 238047 308587 57839
262 57839 -177790 -86443 204530 306892 83892 -183017 -175754 48263 156498 15761 -133403
$$ packed form
190B32918L1772l64841k93148J60367M11975J54165k46590k74997N3408K54708
200A19737N4757k51468k12687J44990L42228J05450k48137k62843M1772K36640
210G0439Q2587j76535j77477O6191J96268K4178j94346j26123J45523K34683J030
221A46418k53323j96164Q8322K17800L3238j74607q2968J82883K18418o7673k99631
232a87287j51310J99517K97527J3930k73709j75216J74359K96889K9565k50096
242b5831j59820J67547K69611j6003l18124k09954K01096L88287J06591k74230
252A29170k70680P1060K68304O9525k30373k06725J15862K91904P0540k50748
262E7839k35629R1347K90973J02362k23000k66909P263K24017J08235j40737j49164
$$ plain form
273 -133403 -44786 166716 188072 -45547 -252056 -178742 61043 142739 -26559 -188887 -107018
284 -107018 97800 132099 -49208 -184263 -76517 122087 115469 -118900 -274134 -119917
$$ packed form
273a33403Q8617K11502K1356k33619k06509P3314K39785Q1696j69298j62328Q1869
284a07018K04818L4299j81307j35055J07746J98604o618k34369j55234J54217
$$ [...]
8191a55
##END NTUPLES=NMR FID
##END=
