##TITLE=1H_IAMT-143
 CDCl3,8 sc, 
 3.02.2021
##JCAMPDX= 6.0         $$ Bruker NMR JCAMP-DX V2.0
##DATA TYPE= NMR FID
##DATA CLASS= NTUPLES
##ORIGIN= UXNMR, Bruker Analytische Messtechnik GmbH
##OWNER= root
$$ XWIN-NMR		Version 3.5
$$ Wed Feb  3 11:23:48 2021 Russian Standard Time (UT+4h)  she@DPX200
##.OBSERVE FREQUENCY= 200.1315066352
##.OBSERVE NUCLEUS= ^1H
##.DELAY= (6, 6)
##.ACQUISITION MODE= SIMULTANEOUS
##.ACQUISITION SCHEME= undefined
##.AVERAGES= 8
##.DIGITISER RES= 18
##SPECTROMETER/DATA SYSTEM= spect
##.PULSE SEQUENCE= zg30
##.SOLVENT NAME= CDCl3
##.SHIFT REFERENCE= (INTERNAL, CDCl3, 0, 15.7039)
##AUDIT TRAIL= $$ (NUMBER, WHEN, WHO, WHERE, WHAT)
$$ ##TITLE= Audit trail, XWIN-NMR		Version 3.5
$$ ##JCAMPDX= 5.01
$$ ##ORIGIN= Bruker BioSpin GmbH
$$ ##OWNER= she
$$ F:/spectra/data/she/nmr/H-F/1/audita.txt
$$ ##AUDIT TRAIL=  $$ (NUMBER, WHEN, WHO, WHERE, WHAT)
(   1,<2021-02-03 11:22:35.71 +0400>,<she>,<DPX200>,
      <created by zg, POWCHK disabled, PULCHK disabled
       configuration hash MD5:
       00 E9 B6 7A A2 85 ED C7 34 08 36 98 17 FE 4E 26
       data hash MD5: 16K
       01 D0 DD A1 DC B3 D0 11 F4 4B 2D 2F 45 6C 02 FA>)
$$ ##END=
$$ 
$$ hash MD5
$$ 7B 8C A1 B8 D9 D5 37 82 F6 7B 38 89 8E 55 AD B7
##$RELAX= 
##$RELAX= 
##$RELAX= 
##$RELAX= 
##$RELAX= 
##$RELAX= 
$$ Bruker specific parameters
$$ --------------------------
##$DU= <F:/spectra>
##$EXPNO= 1
##$NAME= <H-F>
##$PROCNO= 1
##$TYPE= <nmr>
##$USER= <she>
##$AMP= (0..31)
100 100 100 100 100 100 100 100 100 100 100 100 100 100 100 100 100 100 
100 100 100 100 100 100 100 100 100 100 100 100 100 100 
##$AQSEQ= 0
##$AQ_mod= 1
##$AUNM= <au_zg>
##$AUTOPOS= <>
##$BF1= 200.13
##$BF2= 200.13
##$BF3= 200.13
##$BF4= 200.13
##$BF5= 200.13
##$BF6= 200.13
##$BF7= 200.13
##$BF8= 200.13
##$BYTORDA= 1
##$CFDGTYP= 0
##$CFRGTYP= 5
##$CHEMSTR= <none>
##$CNST= (0..31)
1 1 145 1 1 1 1 1 1 1 1 1 1 1 1 1 1 1 1 1 1 1 1 1 1 1 1 1 1 1 1 1 
##$CPDPRG= <>
##$CPDPRG1= <>
##$CPDPRG2= <>
##$CPDPRG3= <>
##$CPDPRG4= <mlev>
##$CPDPRG5= <mlev>
##$CPDPRG6= <mlev>
##$CPDPRG7= <mlev>
##$CPDPRG8= <mlev>
##$CPDPRGB= <>
##$CPDPRGT= <>
##$D= (0..31)
0 1.2 0 0 0 0 0 0 0 0.06 0 0.03 0 0 0 0 0.0002 0 0 0 0 0 0 0 0 0 0 0 0 
0 0 0 
##$DATE= 1612336955
##$DBL= (0..7)
120 120 120 120 120 120 120 120 
##$DBP= (0..7)
150 150 150 150 150 150 150 150 
##$DBP07= 0
##$DBPNAM0= <>
##$DBPNAM1= <>
##$DBPNAM2= <>
##$DBPNAM3= <>
##$DBPNAM4= <>
##$DBPNAM5= <>
##$DBPNAM6= <>
##$DBPNAM7= <>
##$DBPOAL= (0..7)
0.5 0.5 0.5 0.5 0.5 0.5 0.5 0.5 
##$DBPOFFS= (0..7)
0 0 0 0 0 0 0 0 
##$DE= 6
##$DECBNUC= <off>
##$DECIM= 24
##$DECNUC= <off>
##$DECSTAT= 4
##$DIGMOD= 1
##$DIGTYP= 9
##$DL= (0..7)
0 120 120 120 120 120 120 120 
##$DP= (0..7)
150 150 150 150 150 150 150 150 
##$DP07= 0
##$DPNAME0= <>
##$DPNAME1= <>
##$DPNAME2= <>
##$DPNAME3= <>
##$DPNAME4= <>
##$DPNAME5= <>
##$DPNAME6= <>
##$DPNAME7= <>
##$DPOAL= (0..7)
0.5 0.5 0.5 0.5 0.5 0.5 0.5 0.5 
##$DPOFFS= (0..7)
0 0 0 0 0 0 0 0 
##$DQDMODE= 0
##$DR= 18
##$DS= 0
##$DSLIST= <SSSSSSSSSSSSSSS>
$$ [...]
##$SUBNAM2= <"">
##$SUBNAM3= <"">
##$SUBNAM4= <"">
##$SUBNAM5= <"">
##$SUBNAM6= <"">
##$SUBNAM7= <"">
##$SUBNAM8= <"">
##$SUBNAM9= <"">
##$SW= 26.024554658588
##$SWIBOX= (0..15)
0 0 2 0 0 0 0 0 0 0 0 0 0 0 0 0 
##$SW_h= 5208.33333333333
##$TD= 16384
##$TD0= 1
##$TE= 0
##$TE2= 300
##$TE3= 300
##$TEG= 300
##$TL= (0..7)
0 120 120 120 120 120 120 120 
##$TP= (0..7)
150 150 150 150 150 150 150 150 
##$TP07= 0
##$TPNAME0= <>
##$TPNAME1= <>
##$TPNAME2= <>
##$TPNAME3= <>
##$TPNAME4= <>
##$TPNAME5= <>
##$TPNAME6= <>
##$TPNAME7= <>
##$TPOAL= (0..7)
0.5 0.5 0.5 0.5 0.5 0.5 0.5 0.5 
##$TPOFFS= (0..7)
0 0 0 0 0 0 0 0 
##$TUNHIN= 0
##$TUNHOUT= 0
##$TUNXOUT= 0
##$USERA1= <user>
##$USERA2= <user>
##$USERA3= <user>
##$USERA4= <user>
##$USERA5= <user>
##$V9= 5
##$VALIST= <valist>
##$VCLIST= <CCCCCCCCCCCCCCC>
##$VD= 0
##$VDLIST= <DDDDDDDDDDDDDDD>
##$VPLIST= <PPPPPPPPPPPPPPP>
##$VTLIST= <TTTTTTTTTTTTTTT>
##$WBST= 1024
##$WBSW= 4
##$XGAIN= (0..3)
0 0 0 0 
##$XL= 0
##$YL= 0
##$YMAX_a= 769439
##$YMIN_a= -403882
##$ZGOPTNS= <>
##$ZL1= 120
##$ZL2= 120
##$ZL3= 120
##$ZL4= 120
##$ABSF1= 10
##$ABSF2= 0
##$ABSG= 5
##$ABSL= 3
##$ALPHA= 0
##$AQORDER= 0
##$ASSFAC= 0
##$ASSFACI= 0
##$ASSFACX= 0
##$ASSWID= 0
##$AUNMP= <proc_1d>
##$AZFE= 0.1
##$AZFW= 0.1
##$BCFW= 1
##$BC_mod= 2
##$BYTORDP= 1
##$COROFFS= 0
##$CY= 11.3945322036743
##$DATMOD= 1
##$DC= 2
##$DFILT= <>
##$DTYPP= 0
##$F1P= 15.9154993809931
##$F2P= -4.1035820241983
##$FCOR= 0.5
##$FTSIZE= 0
##$FT_mod= 4
##$GAMMA= 1
##$GB= 0.15
##$INTBC= 1
##$INTSCL= 1
##$ISEN= 128
##$LB= 0.24
##$LEV0= 0
##$LPBIN= 0
##$MAXI= 10000
##$MC2= 0
##$MEAN= 0
##$ME_mod= 0
##$MI= 1.114404
##$NCOEF= 0
##$NC_proc= 0
##$NLEV= 6
##$NOISF1= 3.799351
##$NOISF2= 2.8
##$NSP= 1
##$NTH_PI= 0
##$NZP= 0
##$OFFSET= 15.70392
##$PC= 1
##$PHC0= -10582.21
##$PHC1= 15.40095
##$PH_mod= 1
##$PKNL= yes
##$PPARMOD= 0
##$PSCAL= 0
##$PSIGN= 0
##$REVERSE= no
##$SF= 200.130013532006
##$SI= 16384
##$SIGF1= 3
##$SIGF2= 2
##$SINO= 400
##$SIOLD= 16384
##$SREGLST= <1H.CDCl3>
##$SSB= 0
##$STSI= 0
##$STSR= 0
##$SW_p= 3612.71676300578
##$SYMM= 0
##$S_DEV= 0
##$TDeff= 0
##$TDoff= 0
##$TI= <>
##$TILT= no
##$TM1= 0
##$TM2= 0
##$TOPLEV= 0
##$USERP1= <user>
##$USERP2= <user>
##$USERP3= <user>
##$USERP4= <user>
##$USERP5= <user>
##$WDW= 1
##$XDIM= 8192
##$YMAX_p= 0
##$YMIN_p= 0
$$ End of Bruker specific parameters
$$ ---------------------------------
##NTUPLES= NMR FID
##VAR_NAME=  TIME,          FID/REAL,        FID/IMAG
##SYMBOL=    X,             R,               I
##VAR_TYPE=  INDEPENDENT,   DEPENDENT,       DEPENDENT
##VAR_FORM=  AFFN,          ASDF,            ASDF
##VAR_DIM=   8192,          8192,            8192
##UNITS=     SECONDS,       ARBITRARY UNITS, ARBITRARY UNITS
##FACTOR=    0.000192,      1,               1
##FIRST=     0,             0,               0
##LAST=      1.572672,      0,               0
##MIN=       0,             -403882,         0
##MAX=       1.572672,      769439,          0
$$ Real data points
##PAGE= N=1
##DATA TABLE= (X++(R..R)), XYDATA
$$ [...]
756 -87512 23122 93039 43600 -42651 -54273 12683 51882 12174 -49416 -50363 550 23021
768 23021 -20111 -68354 -48723 9162 29758 -10849 -45004 -27490 4935 -12011 -70193 -86434
780 -86434 -17111 63313 51743 -38208 -90832 -37074 49167 56591 -25546 -87403 -45409 46101
792 46101 66372 -9031 -70209 -24448 71792 93115 6620 -84917 -70738 22562 74963 32148
804 32148 -30841 -22064 38891 58225 4795 -49909 -33001 30297 53030 -181 -52408 -27802
816 -27802 38069 55944 4857 -42235 -15972 39390 38815 -33703 -81450 -29856 68307 89944
828 89944 12466 -62404 -43554 38490 64689 2535 -63480 -38368 50884 83985 20475 -53267
840 -53267 -40349 43919 90665 39129 -42541 -58065 1364 46031 25515 -10917 -801 43101
852 43101 47809 -4714 -56210 -40965 15810 41865 3357 -36267 -18589 24206 23204 -27509
864 -27509 -54441 -15183 43064 31047 -51557 -105131 -52673 48534 78307 3115 -72322 -60687
876 -60687 13856 37542 -25847 -87993 -51593 47762 85212 11083 -81337 -73294 20237 84228
888 84228 39843 -50098 -70880 -4314 52657 29458 -21633 -18896 38964 70960 23977 -50622
900 -50622 -61399 2408 57649 41338 -8330 -15497 20557 39083 6023 -33646 -21110 30146
912 30146 46095 -4194 -55943 -38818 29029 58636 19484 -29105 -23257 19623 25787 -28269
924 -28269 -70641 -28777 53154 75551 8844 -58602 -44632 24770 52197 297 -57777 -35850
936 -35850 39695 62482 -3977 -67510 -35480 58882 95125 21808 -75538 -80781 7159 70044
948 70044 33080 -37577 -36251 34196 74638 18430 -68134 -77426 3039 77407 48444 -36881
960 -36881 -70710 -18985 45518 43041 -8546 -35410 -8967 17665 -3771 -46610 -42916 9983
972 9983 48750 30680 -14217 -29462 -10745 909 -19454 -33125 -1134 44397 37689 -25043
984 -25043 -65255 -21534 56598 72351 -865 -73271 -52215 27230 59427 1700 -58838 -26527
996 -26527 64683 92783 9078 -94325 -89490 17137 95182 53827 -43866 -72533 -1437 68408
1008 68408 46157 -30462 -58054 -3641 52038 30793 -39204 -60340 -7070 54819 53600 1364
1020 1364 -31058 -15932 6982 -5643 -29541 -16048 29326 44937 5377 -37917 -27845 21851
1032 21851 41952 1753 -45934 -32861 26021 44522 -6002 -56551 -28487 49899 81154 16372
1044 16372 -70423 -77329 595 60444 36960 -26638 -37587 16447 54495 21072 -43821 -53846
1056 -53846 8673 58995 33080 -32974 -49539 -784 45036 35295 -5867 -17380 12968 25392
1068 25392 -11397 -51226 -29032 41244 73874 26786 -38894 -43791 12066 47289 11934 -45365
1080 -45365 -39931 24233 59890 13535 -57616 -55304 20800 78790 39733 -52002 -86157 -30275
1092 -30275 39933 40390 -15557 -40182 -6228 34345 19921 -35549 -58627 -22387 25932 25545 -13290
1105 -13290 -33102 -11234 14899 9158 -10183 -9765 13504 14606 -20762 -48955 -19152 39241 57563
1118 57563 11784 -35270 -22750 30106 49103 -3808 -58534 -35425 46213 85312 27721 -54998
1130 -54998 -57603 22705 85629 47329 -42863 -75317 -9507 60190 49094 -20606 -50498 -2260
1142 -2260 59418 50699 -22995 -71354 -38174 27194 47565 9360 -24974 -14058 16425 19323
1154 19323 -6547 -20233 -722 20348 6475 -22662 -22781 12074 36039 19089 -10943 -8882
1166 -8882 21233 28274 -9671 -49091 -27490 40782 71275 27132 -39958 -47019 12153 58501
1178 58501 28774 -38984 -53617 1375 51175 26686 -36360 -51161 2826 55782 34830 -41382
1190 -41382 -78468 -36870 25883 31381 -16566 -44274 -17954 21512 13841 -33342 -55840 -22578
1202 -22578 21772 14955 -31606 -47805 -12260 30967 25718 -16511 -35133 -5889 25631 11608
1214 11608 -31921 -36751 11516 56737 42671 -9366 -31346 3875 44943 33808 -14303 -30899
1226 -30899 10484 55075 43077 -5328 -24120 13038 53313 39812 -15237 -38218 -1923 40489
1238 40489 32793 -11755 -24014 11881 48277 28513 -29237 -52476 -11547 36658 27220 -22221
1250 -22221 -42157 -4006 40294 28607 -25979 -50557 -12386 35049 26295 -30448 -53730 -12454
1262 -12454 42751 44507 -4402 -39130 -16440 25675 23184 -18693 -37723 -2418 41426 36928
1274 36928 -7798 -33464 -7153 32764 27743 -17302 -40021 -9619 28251 20854 -19654 -32738
1286 -32738 4218 40264 20096 -39112 -62532 -21717 29577 24215 -27310 -51753 -15850 30897
1298 30897 23204 -30495 -61128 -27504 24294 22003 -27544 -53238 -18198 32782 38239 -6521
1310 -6521 -40886 -20524 21442 23094 -12669 -30596 1285 39483 36843 11 -18709 9665
1322 9665 42715 30501 -14105 -28000 12190 52823 41032 -5488 -20882 17414 59492 41574
1334 41574 -19302 -45123 -2028 51615 45297 -11636 -41564 -6425 48203 48065 -12548 -57564
1346 -57564 -32822 22161 36464 -5412 -42789 -24215 19605 33067 -3820 -38770 -28215 7548
1358 7548 14611 -13919 -32268 -13230 18068 19178 -8033 -22859 -3219 18478 5055 -29912
1370 -29912 -33515 5707 41407 23761 -24792 -36283 5354 48613 29199 -31392 -57232 -12268
1382 -12268 44542 40603 -16243 -48032 -12954 43820 44290 -15833 -62374 -38238 22961 41311
1394 41311 -90 -42569 -31180 15018 35895 3970 -35471 -32617 1380 14547 -6442 -23719
1406 -23719 -9549 17455 20730 -2735 -19501 -3978 18668 10382 -18951 -24397 9171 41269
1418 41269 27689 -13139 -25616 12532 51387 34353 -24105 -47901 -3798 51977 53340 -738
1430 -738 -37692 -10657 43805 52518 -899 -47014 -28846 26334 47603 10581 -32360 -24740 20314
1443 20314 42263 10823 -32622 -32683 -876 18090 2590 -18317 -13278 9865 16153 -5634 -22412
1456 -22412 -10467 11851 7046 -24717 -33291 -4096 28842 22648 -15090 -34748 -6313 32037
1468 32037 22257 -25564 -49652 -13366 39028 42983 -7031 -45452 -22459 34307 46629 -2018
1480 -2018 -50497 -36920 18813 43808 13854 -27206 -24366 16598 37431 8509 -31655 -30607
1492 -30607 4620 25587 7700 -18418 -14809 12116 24348 2668 -20822 -13240 9904 11087
1504 11087 -13893 -26934 -2763 29781 28869 -7209 -33225 -13813 26337 28507 -13924 -42606
1516 -42606 -17822 30339 41517 2526 -36407 -20593 26298 39750 -339 -44451 -32123 17314
1528 17314 43186 14823 -25198 -24474 15056 35518 9348 -30261 -28505 6314 26804 8465
1540 8465 -18177 -12624 18012 29390 3851 -26243 -18991 13626 22328 -2604 -25858 -11706 23958
1553 23958 32018 283 -28370 -15723 21926 26997 -9773 -38463 -18905 27760 43819 6269
1565 6269 -32634 -25499 16375 33451 809 -35188 -26079 16674 35198 7787 -29291 -22044 17392
1578 17392 34745 5008 -35429 -32667 6705 29233 9783 -21054 -16511 16330 29315 -73
1590 -73 -32895 -25943 13738 30771 4406 -27831 -22382 15014 34787 10548 -25040 -22322 9099
1603 9099 22041 -1843 -29568 -19190 19055 35693 10153 -25331 -23278 8577 22574 -2448
1615 -2448 -29067 -19519 15806 26494 -245 -27811 -16963 19417 27338 -6974 -39957 -26869
1627 -26869 15034 30854 1307 -31002 -19288 23447 38068 -401 -41409 -33813 14292 39798
1639 39798 13437 -27043 -26506 15660 43715 18877 -23395 -27659 9432 36028 18816 -15674
1651 -15674 -22476 9538 38606 27482 -3399 -13514 4353 17204 5154 -13194 -5822 18800
1663 18800 27858 7780 -16619 -12405 15062 22231 -3822 -26657 -13940 15585 20402 -8797 -34060
1676 -34060 -14999 26144 34497 -7108 -51431 -41128 8027 35266 9341 -31163 -31480 8399
1688 8399 33758 5947 -36354 -38094 3433 34427 14002 -27105 -35072 -1249 32986 25066 -9765
1701 -9765 -23170 -4568 12303 2154 -17715 -13845 13308 29259 9640 -17041 -19801 6831
1713 6831 19124 -189 -21698 -14352 14727 24836 -1193 -28723 -16742 21063 35324 2046
1725 2046 -38452 -36853 3847 32181 14887 -19932 -23623 10693 33371 13211 -27178 -32261 1480
1738 1480 32302 23774 -7758 -19556 4143 27761 22101 -1785 -7228 11108 22440 7642 -12734
1751 -12734 -6546 20988 36208 18419 -7611 -7663 16507 23108 -588 -24563 -8498 28255 40309
1764 40309 4981 -34597 -31685 14371 41795 13475 -34765 -45042 -6794 26139 12693 -25985
1776 -25985 -36486 -2423 29812 12542 -34188 -54274 -24375 16910 23651 -6261 -30433 -22192
1788 -22192 2114 6374 -8656 -16481 -5267 4079 -3212 -15924 -14925 3573 16834 8392 -7220
1801 -7220 -6228 10061 8935 -13493 -26086 -3851 33640 41004 3992 -33703 -25608 20374 42279
1814 42279 13405 -29825 -32224 9173 39436 19392 -25547 -31660 10216 46154 27207 -26743
1826 -26743 -48603 -15785 31401 35853 -339 -26161 -9463 21454 22183 -6059 -23900 -6932
1838 -6932 19663 23580 635 -15155 -3433 18345 21036 4626 -2975 8027 14091 887 -14257
1851 -14257 -8079 18724 35300 19036 -11329 -16762 6920 22216 5529 -18937 -15790 13656
1863 13656 29626 7967 -28071 -31422 5384 33770 14872 -27662 -42341 -15522 13382 8112
1875 8112 -19247 -26954 -2330 18023 906 -36528 -46032 -14109 19606 15319 -17450 -34710 -14419
1888 -14419 13197 9380 -16717 -26221 -2041 19624 7596 -24019 -32187 -521 34661 32353 -4165
1901 -4165 -24958 -8867 16622 16220 -5452 -13263 8556 31092 24698 -6862 -20549 180 27077
1914 27077 24939 -1343 -17441 -3825 15717 14291 -1156 -5258 11884 27232 10102 -20168
1926 -20168 -24476 655 23900 16293 -9166 -15057 7491 24353 8353 -21085 -23681 7330 31996
1939 31996 15069 -22706 -31764 62 34993 28347 -9021 -24823 -3978 22681 15541 -16588
1951 -16588 -27304 333 34037 30937 -6138 -30397 -14044 15924 19882 -4356 -20135 -7971
1963 -7971 13588 12496 -12125 -22722 -3677 20235 14267 -16775 -33464 -18350 7032 10044 -8573
1976 -8573 -17638 -1999 12539 1146 -26837 -33231 -7302 19211 14169 -13340 -30108 -11996 14495
1989 14495 14877 -7707 -18020 -3844 13393 5180 -17871 -23811 2523 30122 25371 -4445 -20898
2002 -20898 -4195 16210 12428 -6961 -11599 9960 29214 16681 -13878 -20577 8566 35442
2014 35442 23933 -12696 -29591 -5713 25526 25298 -4654 -19952 1933 30705 23145 -13801
2026 -13801 -36335 -14014 23374 32142 2453 -24669 -16891 13351 23621 2899 -19179 -13367
2038 -13367 8124 14483 -1047 -16991 -10299 10831 17338 3841 -8147 -5155 2170 -1910 -11455
2051 -11455 -11029 8396 20648 7911 -14704 -19524 4365 22801 8942 -18948 -23573 2858 26552
2064 26552 13382 -19885 -29853 3787 36478 25128 -18355 -42483 -19744 22752 31038 -258
2076 -258 -27800 -15226 17536 25098 -3818 -30206 -19234 11227 24873 4918 -21886 -20055 5545
2089 5545 19781 9404 -7617 -10682 -383 1103 -7572 -10850 1566 16932 12122 -6795 -16325
2102 -16325 -2916 12287 7102 -12749 -17698 1861 20981 12156 -15771 -24774 1497 29418 21269
2115 21269 -13433 -34483 -16439 19916 27963 1390 -22657 -11192 18544 24305 -2513 -26663
2127 -26663 -18262 12545 24876 6427 -16343 -12983 11037 20668 6130 -11610 -9074 6661 11024
2140 11024 -2638 -12738 -2019 17809 17767 -1423 -14381 -3600 13666 10920 -10046 -20371 -2874
2153 -2874 23092 22769 -6381 -25286 -8260 19754 22302 -5252 -26795 -15090 14850 24245 2109
2166 2109 -20292 -10859 17065 24197 2005 -23519 -19536 6656 21518 8604 -9644 -8777 7511
2179 7511 14499 363 -13008 -7396 8373 11879 -4167 -16250 -6062 14223 16024 -4236 -17480
2192 -17480 -8024 9599 7181 -14789 -26246 -8422 19624 20333 -9719 -31365 -17230 11662 18028
2205 18028 -8179 -31537 -22714 7619 20076 -1243 -24763 -17670 9141 19479 -1875 -25706
2217 -25706 -22269 4594 20918 7988 -13014 -11089 8653 18198 4678 -11939 -7880 10886 18194
2230 18194 4624 -9172 92 20122 24468 4466 -11602 -3033 15931 20060 620 -14673 -2832
2243 -2832 22670 27698 4516 -15776 -7304 16541 21557 -796 -20907 -12993 14401 24138 4412
2256 4412 -19132 -13728 10137 17531 -657 -21219 -16053 7173 17884 765 -17230 -10703 12153
2269 12153 17198 -1255 -21508 -15736 6733 17068 1353 -15804 -9044 12069 19573 -774 -19761
2282 -19761 -13532 8931 16468 -1176 -20679 -14558 10271 21310 3542 -19233 -17643 1491 10314
2295 10314 -3272 -22088 -17065 4488 13309 -2625 -21730 -16978 2526 8806 -6957 -23960 -18960
2308 -18960 3722 11487 -3744 -19585 -11288 9642 13888 -6127 -23853 -14410 12206 21348 3394
2321 3394 -16676 -9280 17390 27894 8129 -14072 -10812 14024 27372 12767 -7539 -4331 19369
2334 19369 31831 16762 -5805 -7266 10635 23043 13656 -3872 -4811 12427 21344 9799 -4903
2347 -4903 -3360 9958 12793 -2136 -16197 -9113 10853 15945 -1836 -17381 -10750 9021 12787
2360 12787 -7684 -25848 -17702 6721 16191 -3710 -24908 -18418 8044 19722 195 -25988
2372 -25988 -26367 14 17848 6217 -15942 -19207 2027 18212 8581 -12910 -18290 -2720 11599
2385 11599 5093 -10810 -13128 2159 13065 4566 -9170 -9595 1362 5246 -5125 -15536 -8885
2398 -8885 7478 10748 -4890 -19447 -9916 9387 13677 -7248 -26295 -18403 8121 20435 2256
2411 2256 -20549 -15248 10098 22355 5932 -19985 -20215 5394 24924 15415 -9235 -14419 7050
2424 7050 26233 20172 -1669 -10576 2407 18769 16334 2939 -639 10831 21330 14765 1992
2437 1992 -1157 9269 15009 5535 -5769 -1746 13328 17681 3145 -11190 -5140 11595 15068
2450 15068 -3864 -23723 -17702 8264 19677 901 -23906 -23524 1078 17330 1755 -25465
2462 -25465 -30810 -7850 13831 5840 -18118 -24952 -6052 12582 6340 -15287 -25035 -10887 7609
2475 7609 7926 -7419 -14221 -3847 8379 5771 -5670 -8213 45 7056 -413 -10611 -6026 10148
2489 10148 17084 4055 -11523 -9418 8193 15640 975 -17172 -13345 10784 22275 5770 -17821
2502 -17821 -16107 7904 23620 8869 -18182 -24486 -1062 21264 16090 -8158 -16589 552 18489
2515 18489 12616 -8283 -17522 -1998 17342 14824 -2326 -10074 2897 17233 14325 -755 -6434
2528 -6434 3760 13720 8279 -5139 -4248 11429 21878 10714 -6906 -8362 7163 17477 6440
2541 6440 -11951 -12499 7404 20851 8960 -13288 -16807 1475 15512 5574 -17208 -23452 -4823
2554 -4823 13299 6185 -14234 -20056 -4522 10213 3259 -17253 -24756 -9884 7227 4148 -11758
2567 -11758 -16437 -2815 8862 1153 -14801 -17462 -1601 11899 4319 -14206 -16478 2134 17514
2580 17514 9877 -8936 -13801 1343 14899 7024 -11986 -14320 6470 24262 15345 -7618 -16926
2593 -16926 -1709 16474 14411 -4526 -13735 -730 14649 11474 -4469 -9875 2639 15800 10065
2606 10065 -8513 -16496 -3500 12638 11207 -2595 -7157 3427 11886 4347 -10854 -12473 3712
2619 3712 16717 8368 -10718 -13626 3511 18801 11415 -6913 -12272 1444 14879 7455 -11032
2632 -11032 -14540 5057 21812 14731 -7353 -16646 -3654 13083 10164 -7380 -14489 -853 14078
2645 14078 9089 -8157 -14635 -1935 12336 8003 -10231 -18514 -6342 9040 7048 -7697 -12466
2658 -12466 168 11521 4884 -14158 -21203 -6255 11691 10155 -6840 -15591 -4460 10165 8056
2671 8056 -7079 -14322 -3462 10837 8152 -8415 -15287 -2938 13294 13912 136 -9636 -4564
2684 -4564 4972 3920 -6052 -7030 5517 15391 7556 -8462 -11684 1447 13464 8220 -7428 -12119
2698 -12119 1454 13248 6012 -10199 -11217 7073 21463 10714 -14650 -24336 -5180 19095
2710 19095 18776 -2682 -16865 -5548 13375 14155 -4532 -17608 -7075 13436 16391 -1718 -16841
2723 -16841 -10240 9267 17541 6468 -8109 -10259 -504 4276 -1183 -4767 834 9255 6678 -2974
2737 -2974 -7338 -1080 5623 2788 -6202 -6249 4750 12001 2500 -11551 -10206 7216 19064 9098
2751 9098 -13712 -21294 -2886 17419 14213 -6480 -14898 48 18204 14202 -9002 -23054 -9042
2764 -9042 15567 20620 273 -17989 -11414 8069 16216 3303 -11217 -9479 3956 7861 -3760
2777 -3760 -13712 -6635 8160 12133 1299 -10201 -8861 -464 1069 -5788 -8066 1308 10294 3913
2791 3913 -10744 -15337 -1955 13227 10586 -7207 -17224 -7168 8979 9130 -4743 -11160 776
2804 776 15203 11091 -9165 -21253 -8779 13248 18366 2459 -11407 -7507 6590 10158 95
2817 95 -8612 -2503 9617 8847 -5281 -12773 -2377 13118 14219 503 -9439 -4589 6161 5147
2831 5147 -6934 -10682 2849 17418 12321 -7379 -17420 -5271 14308 15641 -2638 -16254 -6839
2844 -6839 11986 14719 -791 -12624 -3797 14486 17767 -98 -17340 -12524 7753 17572 7906
2857 7906 -4931 -5141 5374 8861 681 -8756 -4623 7326 9316 -485 -8231 -3930 5750 6728 -2062
2872 -2062 -7028 -1123 5635 -282 -13847 -15641 -146 15105 10177 -9530 -20517 -9467 7105
2885 7105 6948 -9976 -19365 -6630 11181 10117 -9919 -22046 -10318 12386 16935 -2368 -22428
2898 -22428 -17158 3753 13925 4417 -8242 -5765 6900 11143 -1237 -13439 -8357 8799 16124
2911 16124 5813 -6941 -5984 5550 10908 4382 -3116 15 8734 7426 -4108 -9736 841 14943
2925 14943 15345 1517 -9782 -5203 7135 8115 -2706 -9216 199 13309 11339 -3947 -13784 -5005
2939 -5005 11339 13891 -1458 -13727 -7623 7846 11050 -57 -8756 -1803 11182 11635 -3678
2952 -3678 -15882 -8104 9704 14503 1809 -9532 -5020 8465 11453 -1245 -12954 -6904 9160
2965 9160 12613 -1658 -15102 -10044 6743 13971 2701 -11846 -11723 349 5424 -3882 -14236
2978 -14236 -9410 4666 9638 -746 -14164 -13840 -2276 3848 -2256 -10807 -8411 944 2346 -6048
2992 -6048 -10860 -3830 7419 7212 -5919 -15502 -8427 6342 9805 52 -7439 -830 11503 11186
3006 11186 -3529 -13615 -3774 14660 18893 3002 -11756 -6112 11606 19921 9078 -6963 -6445
3019 -6445 7671 13994 3948 -8509 -5038 10421 17619 7895 -7087 -9416 2006 9751 4189
3032 4189 -5303 -4569 4198 7409 73 -7332 -3676 6214 8069 -2583 -12735 -7825 4790 8416
3046 8416 -1119 -9285 -4210 8009 9848 -3582 -15777 -9847 7043 13130 1406 -11589 -8982
3059 -8982 5575 12987 2727 -11561 -11371 3208 10539 1712 -10695 -10395 2508 10853 3739 -8169
3073 -8169 -10403 -1353 4067 -2583 -10378 -6972 3602 7005 -2040 -11791 -9085 2319 6489 -3679
3087 -3679 -13434 -8072 4879 8154 -2683 -12375 -6804 8520 13219 -435 -16251 -12353 6115
3100 6115 16340 7018 -7182 -8168 5976 15486 7404 -7115 -8177 5671 15500 8509 -3809 -5798
3114 -5798 5137 15351 10914 -296 -4001 2688 7478 3203 -2897 -353 8102 10350 1806 -6548
3128 -6548 -3800 6454 9177 -1923 -11191 -6166 6936 9824 -1520 -12772 -8181 6888 11692
3141 11692 -2310 -18015 -14469 3848 13363 2618 -12204 -13497 825 12229 3851 -11977 -14449
3154 -14449 -897 9672 4749 -6956 -10508 -31 9469 5163 -6524 -9885 -1229 5651 2357
3167 2357 -6130 -5605 3176 7592 1482 -7135 -5344 3625 6588 -2674 -11605 -6933 7029 11376 670
3182 670 -11711 -9098 4802 11862 375 -13821 -11237 4236 13562 4377 -9798 -9977 4280 14117
3196 14117 5957 -9042 -11930 954 12760 8998 -2958 -6947 2646 11339 7092 -3952 -4926 3478
3210 3478 9619 4633 -3596 -3403 6848 12634 6047 -5281 -5072 4941 9499 1302 -7811 -4873 7128
3225 7128 12497 2749 -9665 -8772 4796 11855 2037 -12388 -11710 1815 11371 4677 -8940 -11731
3239 -11731 60 8986 2051 -10583 -12947 -1086 8259 3301 -7192 -10309 -617 7894 2557 -8472
3253 -8472 -10607 -1166 5563 699 -7395 -5926 4256 9657 2345 -9581 -9297 2779 8584 2125
3267 2125 -9258 -8411 3754 11737 4761 -7138 -8704 2834 10830 2841 -9431 -9506 2927 12132
3281 12132 6835 -5950 -9219 815 9936 4793 -6649 -8942 498 8674 4734 -5058 -5986 3130
3295 3130 9899 4100 -7282 -8454 2241 9847 4837 -5463 -6091 4066 10899 4954 -7120 -7806
3309 -7806 3139 10422 3983 -7398 -8079 3695 12777 7619 -5965 -9962 -111 9340 4978 -5769
3323 -5769 -8442 754 9224 5599 -4460 -8035 451 8058 3206 -6968 -9374 -265 7759 4475
3337 4475 -4645 -6819 1385 7308 1145 -8914 -9179 1489 8525 2606 -8222 -9234 2169 11046
3351 11046 4784 -8873 -11442 -771 8913 5372 -6492 -9081 455 10798 7253 -5842 -10641
3364 -10641 -2002 7928 5555 -4761 -9165 -1434 8005 6906 -2379 -6920 -1483 5695 2684 -5198
3378 -5198 -6673 1418 7920 4440 -5125 -6380 2390 9171 3163 -8068 -8811 1471 9276 4296 -6273
3393 -6273 -7890 2492 11703 5585 -8839 -12581 -701 10680 8243 -4826 -11254 -2286 9521
3406 9521 8865 -3122 -10003 -3175 6398 5961 -3502 -7806 -1654 7810 7715 -2084 -7526 -2529 4768 3380
3422 3380 -3346 -5093 1070 6479 3198 -4489 -5700 2751 9357 3225 -7514 -9250 1834 10421
3436 10421 5908 -4928 -7340 1734 11641 6200 -6915 -11262 -491 11519 9110 -3787 -10099
3449 -10099 -2543 9619 9454 -2767 -10781 -4429 5902 6953 -2764 -8364 -2762 6416 6530 -2489
3463 -2489 -8458 -3551 4021 2522 -4892 -7741 -985 6716 4185 -5081 -8703 -1325 6516 2727 -7365
3478 -7365 -9838 -355 8723 5403 -6332 -10099 -5 10646 6946 -7133 -12856 -3845 8680 8926
3492 8926 -2097 -8334 -2537 7895 6978 -3900 -9853 -2793 7057 7057 -2152 -8373 -3087 6330 6997
3507 6997 -1414 -5915 -1373 4249 1638 -5549 -6350 2329 9974 5830 -5731 -9530 -513 8725 5608
3522 5608 -4965 -8430 571 10282 7455 -4376 -9094 1222 13117 9979 -4266 -11755 -3196 9923
3536 9923 12485 1734 -6874 -1802 8314 8770 -1284 -7687 -2231 7589 8768 281 -6060 -2497
3550 -2497 5651 6702 -1057 -5548 -1567 3781 1837 -5578 -6916 -84 7295 4222 -6022 -10230 -2662
3565 -2662 4912 1563 -8327 -10194 -1206 8198 4582 -7642 -13031 -3444 7855 6066 -6318 -12569
3579 -12569 -5472 6110 6555 -2939 -9361 -2454 8454 7238 -4231 -11656 -5339 6065 9100 969
3593 969 -5859 -2955 5321 5567 -1843 -6535 -760 6947 5665 -3009 -8209 -2066 7842 8824 -90 -6305
3609 -6305 -2434 3937 3375 -3676 -5993 717 9320 7695 -2915 -9345 -3262 6979 7909 -57 -6300
3624 -6300 -2643 5276 5980 -817 -4901 1481 9315 6747 -3159 -8479 -2096 7573 9008 1334 -4286
3639 -4286 134 7246 5467 -3523 -6753 238 9398 7721 -3362 -9750 -3269 8275 9290 -1460
3653 -1460 -9438 -4912 4146 4719 -3906 -10422 -4995 6547 8718 -1902 -11602 -9054 1006 4711
3667 4711 -1529 -8018 -6652 860 3664 -2032 -8077 -4644 3040 4070 -2353 -7675 -4942 1563 3700
3682 3700 -764 -3975 437 6331 3471 -5355 -8808 -1618 7971 8227 -774 -7194 -1891 6927 7452
3697 7452 -1621 -6873 -395 8546 7972 -2726 -10328 -3644 9424 12973 2648 -7940 -6383 2937
3711 2937 6742 881 -5394 -2203 6038 8236 -340 -8270 -4914 5009 8636 1996 -5878 -5027 1865
3726 1865 5524 1091 -3503 245 7140 6196 -3176 -9137 -4446 6593 9511 2194 -6119 -3932 4563
3741 4563 6404 -589 -6593 -2542 6019 6969 -1493 -8886 -5579 5308 9127 1599 -6982 -5861 917
3756 917 3447 -1960 -6727 -3400 4933 5970 -2348 -9444 -5627 2659 4774 -2151 -7836 -4224 3603
3771 3603 4690 -3555 -9029 -3051 7425 7875 -2730 -11744 -7165 4688 9279 1513 -7254 -4317
3785 -4317 5782 8561 -725 -9276 -5951 5613 11235 3911 -6636 -7322 2755 9010 4500 -2939
3799 -2939 -3650 2048 4909 149 -5165 -2591 5214 8492 2018 -5013 -3937 1505 3140 -878 -3692
3814 -3692 -35 6043 4218 -4067 -8518 -1582 8428 8363 -2185 -9691 -5856 4499 7969 -9 -6884
3829 -6884 -2720 6730 7777 -2588 -11271 -7127 5570 11242 3267 -8233 -7972 2228 8261 2827
3843 2827 -5514 -5423 1994 5510 448 -6750 -5081 3777 8163 2450 -5384 -5434 681 3767 -249 -4849
3859 -4849 -2365 4864 5838 -1495 -7459 -3858 4497 6524 -488 -7348 -4874 3536 6509 -143 -6411
3874 -6411 -3355 5888 7369 -669 -8885 -6643 2784 8095 2631 -5261 -4259 3287 5971 -231 -6730
3889 -6730 -4074 3925 6871 800 -6731 -5179 3343 7308 1501 -5262 -3440 2954 4641 -1637 -7291
3904 -7291 -3400 6274 9229 931 -7918 -6560 2546 7035 1475 -5830 -4839 3325 7041 1110 -6692
3919 -6692 -4741 4279 8401 1741 -7111 -7479 332 6726 3942 -2985 -3318 1953 4128 -102 -5339
3934 -5339 -3873 2928 5875 1163 -5142 -4106 2686 5711 646 -4458 -2637 3157 4183 -1070 -6817
3949 -6817 -3446 6115 8968 1157 -7387 -5747 3220 7142 1607 -5932 -5338 3570 8604 2565 -6021
3964 -6021 -5778 2513 7615 2632 -5549 -7005 756 7004 3594 -3571 -4623 1597 5376 1371 -5215
3979 -5215 -5738 490 5188 1918 -4211 -4382 1621 4569 -357 -6328 -5221 1676 4874 -103 -6974
3994 -6974 -5822 2040 6535 1376 -5689 -6252 854 5233 635 -6410 -5465 2760 8382 3025 -5407
4009 -5407 -6245 752 6623 3463 -3489 -4957 1230 6187 3038 -3205 -3054 3286 7092 2448 -4961
4024 -4961 -5187 1741 7573 3677 -2855 -3563 3114 6194 1685 -4937 -4659 3092 7809 2391 -5810 -5789
4040 -5789 2829 8499 3964 -5067 -6693 429 6006 3412 -4660 -5905 1624 7780 3545 -4643 -6299
4055 -6299 28 5883 3411 -3829 -5944 420 5668 3075 -3569 -4331 1417 4603 734 -5279 -5172
4070 -5172 1375 5906 1639 -5255 -5104 1778 6013 819 -7064 -7176 142 6115 1770 -6351 -6694 1146
4086 1146 6537 1663 -7080 -8533 -908 5855 2884 -5811 -7925 -784 6017 3486 -4071 -6493 -1456
4101 -1456 4405 2548 -3864 -5301 1096 6351 3461 -3180 -4360 1433 6087 3259 -2794 -3772 2475
4116 2475 7187 3600 -3210 -2450 4456 8307 3460 -4662 -5053 2804 9248 5061 -3461 -4779 2334
4131 2334 8142 4483 -3677 -5525 645 6864 4012 -4041 -5396 712 6863 4326 -3405 -6070 -887
4146 -887 4792 2846 -3204 -5313 198 4991 1835 -4539 -5075 807 4489 1124 -5341 -6290 581 5911
4162 5911 2219 -4987 -5571 650 5159 1422 -5877 -6817 518 6331 2719 -5620 -7168 -179 5886
4177 5886 3518 -4732 -7634 -2013 4300 3155 -3724 -5889 -352 4569 2441 -4552 -6419 -1095 3986
4192 3986 2479 -3913 -5540 -130 5152 2387 -3225 -4475 558 4835 1918 -4154 -4753 2230 7510
4207 7510 3997 -3633 -4885 1839 7147 4417 -2432 -4977 1475 7812 5565 -1486 -3977 1845 7214
4222 7214 5099 -2066 -4684 150 6569 5280 -1476 -4027 703 5795 3803 -1863 -4094 -4 4544
4237 4544 2424 -2943 -4404 1006 5432 2385 -3928 -5505 -564 4430 2017 -4547 -6126 -7 5198
4252 5198 2386 -4521 -6231 -344 5003 2400 -4931 -7352 -1642 5423 4255 -3085 -6608 -1590 3662
4267 3662 3201 -2973 -6021 -1943 4232 3143 -2646 -5056 -706 3910 2683 -2791 -5461 -1434 3252
4282 3252 2456 -2704 -4192 173 4901 2411 -3717 -5287 -59 5191 2791 -3711 -5811 87 6379
4297 6379 4557 -2657 -5506 -858 5086 4253 -2626 -5504 -483 6213 5331 -1529 -4709 -996 4973
4312 4973 5361 -836 -4980 -1403 4428 4995 -229 -2796 377 4388 3522 -1860 -4015 -238 5358 4179
4328 4179 -2153 -4112 531 5308 3801 -2397 -4666 -300 4661 2964 -3952 -5947 -55 6466 4565
4343 4565 -2828 -7011 -2346 4372 4558 -2231 -6396 -2372 4877 4386 -1805 -5739 -2434 3401 4020 -1962
4359 -1962 -6135 -2759 3551 4029 -995 -4208 -1411 2992 2643 -2184 -4931 -1384 4013 3064 -2283 -4150
4375 -4150 -247 4494 3115 -2916 -5678 -1379 4943 4166 -2866 -5866 -950 5059 4521 -2210 -6230
4390 -6230 -2287 4585 4364 -2319 -6474 -2000 4879 5416 -1086 -5970 -3301 2993 4445 -879 -5170
4405 -5170 -2230 3604 3687 -1488 -4577 -1183 3983 3996 -2013 -5979 -2258 3649 4141 -874 -3960 -636
4421 -636 3984 3116 -2313 -5499 -1071 5299 5065 -2018 -5782 -1871 4659 5536 -40 -4380 -1789 3613
4437 3613 4106 -1233 -4628 -350 5775 5322 -553 -4965 -2380 3679 4946 -75 -3841 -686 3952
4452 3952 3740 -1410 -3945 -39 4719 4581 -1918 -5759 -2016 4460 4549 -888 -4529 -1415 4163 3845
4468 3845 -2390 -6546 -2565 4619 5343 -1411 -6096 -3144 3610 4402 -965 -5806 -3203 2834 3708 -1675
4484 -1675 -5673 -2812 3286 4493 -415 -4929 -3540 1714 2421 -1556 -4653 -1577 3798 3054 -1933
4499 -1933 -5437 -2420 3116 3844 -1076 -5140 -1925 3000 2732 -2195 -4342 -840 4578 4056 -2412 -6907
4515 -6907 -3243 3955 5470 -186 -4566 -2041 2809 3678 -966 -4662 -966 4952 5085 -1243 -5329
4530 -5329 -2164 4608 6097 1576 -3104 -1679 3022 4043 -320 -3226 534 6160 5701 61 -4648
4545 -4648 -2058 4310 6323 1510 -3445 -1601 3553 4111 111 -3522 -895 4273 4814 -739 -5616
4560 -5616 -3669 2562 4780 892 -3400 -2622 1249 1887 -1595 -4961 -2853 2496 2868 -1826 -5554 -2940
4576 -2940 1727 2509 -1457 -4762 -2758 1669 1743 -3420 -6323 -1965 3744 3936 -2001 -6525 -3750 2013
4592 2013 4034 -1289 -5567 -2544 3485 4577 -1215 -6029 -3998 3477 6252 1032 -5086 -4553 1369
4607 1369 4491 1582 -2553 -2179 2373 3610 30 -4634 -3179 2751 4907 1933 -2188 -1829 1089
4622 1089 2652 623 -1527 443 3851 3440 -1604 -4030 -452 5168 5814 1389 -3462 -1743 3047
4637 3047 4209 -47 -3077 383 5680 5930 -175 -5407 -2975 4356 7313 2248 -4287 -3562 2348
4652 2348 4928 1639 -2872 -2334 2597 4258 -20 -5318 -4531 1423 4447 1213 -3626 -3899 -210 1860
4668 1860 -726 -4038 -3124 1128 2279 -1572 -5969 -4626 1180 3255 -391 -4693 -4357 384 2229
4683 2229 -1828 -5548 -3137 2518 4457 -3 -5688 -4618 1121 4431 1253 -3651 -2853 2025 3954
4698 3954 516 -3818 -2763 2815 5703 1300 -3707 -3081 1775 4634 2025 -1344 -604 2913 3959
4713 3959 97 -4213 -1831 4349 6207 1436 -3843 -2804 2189 5115 1433 -3065 -1979 3436 4906
4728 4906 -238 -4874 -2749 4067 7442 2808 -3629 -4402 945 5129 2474 -2331 -2090 2165 4467
4743 4467 1016 -3645 -3238 2165 5499 1969 -3197 -4259 212 2801 1208 -1894 -1754 1094 2598
4758 2598 -1355 -5126 -3449 2019 3723 -554 -4674 -4225 463 2559 -1232 -5330 -3801 1640 3027
4773 3027 -1820 -6335 -4280 1617 4530 699 -5141 -5119 384 3929 231 -4445 -3731 1888 5023 1540
4789 1540 -4325 -4582 1161 5297 2591 -2766 -2906 1381 4537 2046 -2211 -1977 2638 5620 1882 -3070
4805 -3070 -2947 2005 4697 2610 -1203 -1243 2056 3943 1061 -3256 -1834 3241 5017 1239 -3438 -2905
4821 -2905 1663 4438 1841 -2632 -2011 1989 3644 -134 -4331 -2211 3186 5610 1305 -4199 -4530
4836 -4530 969 4482 1380 -3099 -2938 1544 3709 579 -4008 -3648 1628 4924 1320 -4878 -5136 617
4852 617 3940 1724 -2915 -3838 102 2725 344 -4119 -3883 474 3151 747 -3814 -4194 -370 2750
4868 2750 673 -2979 -3348 -107 2295 -408 -3364 -2544 1220 3404 934 -3575 -3535 1168 3581 499
4884 499 -3411 -2781 2100 4472 1594 -3323 -2931 1754 4808 2425 -2919 -2978 1623 4593 2231 -2083
4900 -2083 -2782 1788 5151 2703 -2328 -3636 1074 4382 3063 -1051 -2086 998 3448 2214 -2334
4915 -2334 -2432 1325 4129 1499 -2625 -2860 782 4067 1491 -2245 -2838 531 3337 60 -2960 -2673
4931 -2673 1569 4442 888 -3686 -4322 74 4398 2010 -3046 -3866 37 3336 2114 -2658 -4138
4946 -4138 28 3998 1352 -3378 -4872 -626 3050 2364 -1571 -3244 -737 2794 1209 -1876 -2942
4961 -2942 509 2835 448 -2262 -3375 593 3339 1315 -3153 -3252 413 2718 570 -2967 -2995 565
4977 565 3475 1442 -2903 -3881 430 4019 1893 -3033 -4646 -292 4682 3477 -1856 -3845 -589
4992 -589 3783 2521 -1776 -3925 -232 3205 2275 -1356 -3504 -379 3529 2820 -1477 -3228 114 2121
5008 2121 2001 -1023 -2124 97 3071 1267 -1824 -3052 1418 4208 919 -2193 -3369 -292 3979
5023 3979 2635 -2223 -3315 786 4131 1910 -2729 -4399 553 4252 2713 -2369 -4134 -340 4501
5038 4501 3568 -1961 -3826 -353 2994 3142 -1252 -3320 -766 2984 2009 -2381 -3110 -195 3089 2617
5054 2617 -1374 -2589 86 2313 2046 -1761 -3096 940 3187 805 -2711 -3056 506 4279 2612
5069 2612 -2871 -4052 102 3859 2013 -2657 -4262 -778 3584 2500 -2480 -4241 -350 3916 2616
5084 2616 -2751 -4488 -1393 3622 2948 -1773 -4089 -1436 2548 2265 -1836 -3510 -347 2776 1760
5099 1760 -1669 -3300 -408 3050 2344 -2122 -3432 -356 2269 1771 -1715 -2575 548 3433 2130 -2270
5115 -2270 -3326 937 4334 2333 -2304 -3162 217 4204 3152 -1559 -3578 46 4165 2700 -1514
5130 -1514 -3252 112 4294 3669 -1120 -3901 -268 3982 3483 -732 -2945 -787 3223 3157 -390 -2960
5146 -2960 -677 3300 2536 -1169 -3185 -457 2777 2544 -1097 -3137 -482 2770 2259 -1517 -3633 -436
5162 -436 2378 1172 -2124 -3259 -195 2974 1837 -2565 -4383 -660 3320 2368 -2415 -4352 -1328
5177 -1328 2688 2433 -2132 -4171 -1188 2930 1939 -2334 -4768 -1672 2657 2947 -1401 -4345 -1879 1909
5193 1909 2453 -1265 -3279 -1358 1774 1861 -1226 -3443 -992 2574 2336 -1394 -3267 -830 2224 2027
5209 2027 -363 -2276 -7 2754 2359 -1131 -2566 743 3927 3173 -1180 -2522 644 4025 4058 -167
5225 -167 -3060 274 3662 3576 -397 -2478 -30 4078 3994 -148 -3391 -866 3551 4049 -58 -3286
5241 -3286 -1708 2299 3348 194 -2634 -1451 1987 2432 -399 -2788 -1108 1577 2055 -800 -3104
5256 -3104 -1712 1726 2055 -1274 -3039 -1212 1431 1331 -2102 -3632 -926 2339 2183 -2245 -4526 -1270
5272 -1270 2482 2245 -1789 -4224 -1775 2140 2645 -1430 -4678 -2234 2350 2648 -1077 -4511 -2483 1899
5288 1899 3020 -167 -4091 -2625 1543 2924 -182 -2941 -2332 1408 2910 -44 -2079 -1339 1987
5303 1987 2450 -406 -2328 -505 2416 2667 -277 -2207 -306 2912 3075 -272 -2421 195 3678 2981
5319 2981 -890 -2717 -198 4606 4489 48 -3235 -1190 3643 4295 285 -2606 -1025 2883 3504 241
5335 241 -3328 -1779 2877 3892 433 -3324 -2612 991 3178 361 -2541 -2061 1000 1994 -1115 -3269
5351 -3269 -1445 1251 1958 -1098 -3618 -2245 1439 2078 -1148 -3255 -1324 1504 1327 -2066 -4014 -1428
5367 -1428 2693 2336 -1236 -4967 -2455 1986 2948 -719 -3956 -2336 1700 3027 -528 -3449 -2025
5382 -2025 2436 3282 61 -2802 -2233 1349 3410 512 -2564 -1579 1857 3225 98 -2459 -1178 1755
5398 1755 2975 447 -2249 -855 2430 2587 -959 -2440 -129 3093 3083 -235 -2820 -917 3586 3910
5414 3910 362 -2655 -1023 2799 3211 -370 -2749 -1049 3405 4325 21 -3592 -2338 2456 4065
5429 4065 1190 -2624 -2698 1091 3076 524 -2534 -2241 1694 2654 95 -3153 -2637 543 2618 433
5445 433 -1827 -2197 276 777 -1423 -2693 -1339 1033 1208 -1655 -3994 -2347 1498 2217 -823 -2999
5461 -2999 -1790 1482 1710 -1633 -3667 -1397 2385 3544 -974 -4441 -2514 2235 3895 671 -2778
5476 -2778 -2661 1343 3669 396 -2736 -2271 1875 3815 967 -2386 -2696 1080 3606 1953 -1670 -1679
5492 -1679 1100 2563 720 -1796 -686 1167 2507 1282 -1354 -1024 1664 2237 582 -1656 -264
5507 -264 2366 2412 -752 -2471 -1053 2764 3630 -64 -2773 -1617 2033 2652 73 -2878 -1440 2444
5523 2444 3661 -404 -4103 -2944 1542 3684 1110 -2505 -3253 263 2579 722 -2409 -2246 862
5538 862 2434 343 -3164 -3256 -184 2840 1434 -1949 -2814 -368 1239 -222 -1683 -1033 1016 1454
5554 1454 -962 -3395 -2424 1564 2861 595 -2631 -2211 860 2140 27 -2396 -1285 2254 3481
5569 3481 2 -3804 -2578 1731 4114 1578 -2366 -2752 567 3416 1618 -2169 -1732 1452 3228
5584 3228 1019 -2337 -2600 905 3297 2010 -1514 -1656 897 2228 575 -1573 -1153 1299 2530 825
5600 825 -2332 -1909 1257 2886 459 -2111 -1482 1510 2841 157 -2734 -2189 1794 3915 874 -3081
5616 -3081 -2783 968 3205 1220 -2361 -1989 803 3387 981 -3287 -2634 787 3671 1807 -1804 -3680
5632 -3680 -950 2051 1824 -1260 -1732 524 1920 350 -2574 -2262 563 2647 1228 -1860 -2296 304
5648 304 1851 488 -1575 -806 1289 1996 -456 -3479 -2080 1878 3773 514 -3198 -2767 859 2661
5664 2661 978 -2454 -2085 1320 3431 478 -3302 -3455 1000 3926 1952 -2175 -3556 -562 2946
5679 2946 2095 -1475 -2169 156 2183 1351 -1691 -2553 160 2381 1463 -1313 -2037 80 1721 796 -1223
5696 -1223 -1181 775 2075 550 -2360 -1847 1124 2838 546 -2291 -1623 1281 2432 317 -2450 -2046
5712 -2046 1681 3612 951 -2798 -2756 769 3547 1307 -1866 -2347 809 3233 1542 -2320 -2670 827
5728 827 3786 2716 -1417 -3448 -864 2899 2554 -809 -2216 93 2072 1023 -1105 -1785 830 2540
5744 2540 1362 -1724 -2247 70 2118 719 -1042 -1207 697 1883 197 -2545 -1951 1329 3430 605
5760 605 -2899 -2983 347 2754 1069 -2447 -3085 559 2823 744 -2976 -3198 410 3012 1498 -2445
5776 -2445 -4254 -1001 2372 1903 -1838 -3219 -836 1593 1263 -1435 -2310 -707 1877 851 -1506 -2224
5792 -2224 -642 1428 666 -1299 -1798 143 2004 562 -1879 -1815 654 2892 993 -1902 -1860 1384
5808 1384 2981 1073 -1851 -2605 1551 3722 1964 -1837 -2332 617 3645 2511 -1165 -2502 -418
5823 -418 3117 2374 -1213 -2352 251 3071 2795 -250 -2332 -768 2468 2467 29 -1442 -194 1529
5839 1529 843 -550 -1237 194 1778 880 -1776 -1618 664 2193 692 -1647 -1674 619 1966 365
5855 365 -2879 -2666 628 2984 947 -2940 -3846 -333 2578 1970 -2062 -3697 -1241 2527 1649 -2262
5871 -2262 -3362 -987 1868 1580 -1450 -3548 -1936 1363 1859 -700 -2910 -1665 953 978 -504 -1917
5887 -1917 -802 1240 785 -1325 -1737 297 1723 752 -1416 -1810 443 2186 1115 -1296 -1781 791
5903 791 3172 1596 -1453 -2201 717 3503 2311 -1378 -2807 458 3562 2885 -668 -2872 -246 3134
5919 3134 3094 236 -2391 -351 2487 2822 -277 -2368 -927 2224 2610 49 -2267 -957 1312 2050
5935 2050 -30 -1468 -216 1321 1034 -993 -1512 177 1493 860 -1710 -2148 29 2010 835 -1783
5951 -1783 -2521 -399 2269 1017 -1898 -3202 -376 2590 1405 -1978 -3499 -1129 2325 2261 -1379 -3791
5967 -3791 -1708 1976 1921 -1023 -3495 -1587 1263 1897 -429 -2592 -1347 1529 1752 -444 -2187 -942
5983 -942 1432 1765 -393 -1889 -927 1190 1104 -1002 -1774 128 1974 1269 -1147 -1892 157 2464 2018
6000 2018 -873 -2378 288 2871 2077 -1151 -2120 232 3169 2627 -793 -2883 -329 3193 3140 -457
6016 -457 -2940 -1176 2213 2994 326 -2373 -783 2438 2266 -203 -2378 -964 1730 2589 159 -2054
6032 -2054 -1312 999 2179 -268 -1408 -215 1426 1158 -653 -1645 -408 1768 1182 -1390 -2429 -320
6048 -320 1964 1449 -1150 -2669 -382 1988 1465 -1854 -2893 -220 2452 1763 -1477 -3240 -1100 2334
6064 2334 2382 -761 -3164 -1434 1879 2649 -437 -2624 -1548 1373 2448 119 -2143 -1385 1241 2206
6080 2206 -493 -2202 -1043 887 1991 241 -1793 -1113 1080 1300 -656 -1530 155 1525 1102 -1051
6096 -1051 -1526 81 2545 1960 -744 -2492 -110 2565 1993 -952 -2450 -138 2708 2388 -1084 -3219
6112 -3219 -1005 2366 2700 -246 -2947 -1767 1635 2967 334 -2295 -1642 1124 2343 332 -2040
6127 -2040 -1524 785 2109 291 -1499 -1393 833 1683 133 -1347 -427 887 886 -425 -978 -49 1470
6144 1470 1157 -1099 -1778 197 1979 1664 -1232 -2608 -837 2220 2204 -1208 -2539 -693 2593 2611 -539
6161 -539 -3123 -1334 2000 3065 309 -2908 -2060 1304 2832 769 -2080 -1711 406 2152 727 -1671
6177 -1671 -1666 609 1265 468 -1287 -1206 646 954 487 -955 -695 818 670 -878 -1336 213 1535 1316
6195 1316 -1425 -2063 -457 2180 1824 -1218 -2917 -1136 2179 2358 -522 -2761 -1574 1672 2732 -319
6211 -319 -3163 -1862 1573 2897 442 -2639 -2143 607 2898 1208 -1710 -2380 247 1951 794 -951
6227 -951 -1216 407 1338 197 -1029 -863 1268 1434 -163 -1326 -320 1471 1356 -620 -1518 -256 1961
6244 1961 1522 -952 -2392 -345 2633 2376 -320 -2705 -1344 1948 2920 331 -2560 -1438 1614 2475
6260 2475 553 -2342 -1622 1356 2714 856 -2384 -2930 568 2211 862 -997 -1667 -47 1051 240
6276 240 -1276 -1148 915 1232 -370 -1769 -1196 587 916 -405 -1750 -802 992 1254 -1319 -2424 -819
6293 -819 1745 2206 -710 -2852 -1534 1441 2547 -399 -3259 -1688 1594 2479 44 -2404 -2024 1218
6309 1218 3129 906 -2177 -1732 787 2442 965 -1466 -1562 491 2468 1256 -786 -1452 628 2060
6325 2060 979 -392 -909 590 1284 362 -813 -362 1451 1847 118 -1390 -629 1454 2179 380 -1399
6342 -1399 -575 1613 1971 -323 -2321 -655 2158 2722 -153 -2704 -2075 1392 2966 839 -2141 -1834
6358 -1834 737 1728 224 -2179 -1823 1167 2361 612 -2597 -2746 121 2473 990 -1455 -2016 -415
6374 -415 711 165 -1374 -1412 434 1050 -202 -1860 -1335 450 845 -128 -1493 -736 670 946 -699
6391 -699 -1970 -713 1344 1526 -238 -2478 -1197 1307 2054 -191 -2374 -1227 1444 2385 175 -2044
6407 -2044 -1578 1458 3095 1144 -1561 -1773 1112 2525 1449 -960 -1633 560 2416 1505 -1218 -1584
6423 -1584 461 2272 1452 -488 -1067 175 1135 1023 -614 -786 1050 1328 263 -1384 -838 1326 1800
6440 1800 503 -1516 -683 864 1511 -278 -2029 -691 1735 1897 -667 -3160 -2371 1113 2833 899
6456 899 -2384 -2712 -89 1897 349 -1966 -2385 142 2037 809 -2386 -2946 -513 1832 1403 -1008
6472 -1008 -2084 -1352 511 620 -762 -1261 437 294 -7 -1429 -1336 488 1082 -2 -1210 -886 912
6489 912 1329 -283 -1465 -842 1602 2225 177 -2355 -1673 1416 3095 1192 -2055 -1788 1013 2793
6505 2793 1365 -1653 -2077 301 3175 1982 -813 -2125 176 2276 2177 115 -1240 -299 1756 1615
6521 1615 -462 -946 171 1423 996 35 -438 61 871 343 -306 -454 1222 1316 -670 -1820 -712 1569
6539 1569 2295 15 -2088 -2150 769 2333 479 -2155 -1986 1186 2517 486 -2807 -3227 235 2672
6555 2672 1711 -1858 -3634 -1221 1745 1711 -358 -2398 -1179 998 1379 -1059 -2254 -744 1044 1329
6571 1329 -367 -1453 -817 256 408 -72 -224 443 582 -867 -1780 -685 1240 1896 297 -1847 -1454
6588 -1454 1027 2439 265 -2114 -1424 1201 3019 654 -2299 -2264 912 3024 2074 -1674 -2640 -70
6604 -70 2621 2261 -642 -2341 -220 2429 2430 -480 -2018 -598 1431 1672 38 -1266 -311 927 1301
6621 1301 -143 -871 150 1300 837 -854 -966 206 942 501 -1114 -1282 984 1723 -193 -1888 -1425
6638 -1425 976 2467 1012 -1833 -2577 34 2386 1139 -1543 -1930 -31 2000 1241 -1402 -2393 -207
6654 -207 2547 1726 -1067 -2803 -969 1315 1556 -321 -1582 -531 979 848 -839 -1571 -286 1727
6670 1727 810 -903 -1692 -458 980 717 -1006 -1079 430 1135 -35 -1307 -1431 577 1945 513 -1612
6687 -1612 -2106 105 1891 1004 -1374 -1868 -213 1906 1062 -1373 -2445 95 2137 1367 -1618 -2454
6703 -2454 -380 1739 1556 -941 -1993 -597 1558 1398 -393 -1562 -383 1196 1448 -382 -1314 -241
6719 -241 1301 901 -622 -980 98 1107 1087 -442 -900 83 1387 975 -899 -1069 900 1639 758 -1297
6737 -1297 -955 841 2292 1041 -1060 -1482 379 2397 1510 -971 -1546 243 1956 1399 -1237 -2074
6753 -2074 -285 2344 1965 -766 -2202 -658 1249 1907 149 -1555 -1174 1031 1370 -29 -1214 -1018
6769 -1018 686 933 -498 -1212 -853 346 745 -524 -1054 -447 342 -112 -860 -1024 375 1322 140 -2085
6787 -2085 -2087 202 1640 466 -1891 -2185 -384 1760 1052 -1658 -2480 -639 2051 1611 -1285 -2720 -1077
6804 -1077 1849 2051 -605 -2458 -1446 1169 2219 296 -1306 -1051 606 1535 155 -1080 -895 585
6820 585 1229 428 -707 115 903 555 143 -308 594 1347 695 -383 -313 1223 2335 838 -1102 -1571
6838 -1571 843 2831 1841 -1060 -2047 394 3002 2413 -594 -2054 -546 2043 2116 67 -2588 -1518
6854 -1518 1639 2641 194 -2167 -1729 259 1845 504 -1324 -1251 -299 711 128 -855 -792 -102 -176 -422
6872 -422 -1017 -382 275 -66 -1155 -1310 -307 590 -186 -1907 -1850 -52 1513 435 -1984 -2517 -631 2049
6890 2049 1611 -1645 -3330 -1012 1678 2421 -512 -2965 -1533 1378 2198 18 -2153 -1439 1151 2227
6906 2227 595 -1477 -1604 504 1866 1096 -520 -932 -122 934 817 72 348 934 661 -313 -603 739
6924 739 1650 1062 -430 -907 737 1916 1547 -855 -1628 657 2950 1841 -950 -1902 237 2777 2858
6941 2858 95 -2152 -1174 1572 2652 314 -2199 -1502 925 2102 239 -1797 -1623 452 1457 349
6957 349 -1264 -1717 59 834 134 -1102 -1283 -133 114 -772 -1128 -388 353 9 -1147 -1557 -832 827
6975 827 509 -1251 -2128 -505 1501 933 -1165 -2188 -779 1325 1351 -953 -2621 -815 1574 1998 -447
6992 -447 -2254 -1534 1318 2205 342 -1623 -999 813 1922 417 -973 -1087 540 1613 560 -626
7008 -626 -628 745 1709 288 -616 -420 733 953 263 -372 -48 1385 1054 -114 -1006 561 1588 1355
7026 1355 -2 -1189 -289 1694 1665 -282 -1262 167 1770 1736 -221 -1730 -658 1538 1744 -21 -2107
7043 -2107 -1291 871 1924 -25 -1553 -1224 399 1114 -116 -1694 -1275 500 1252 -441 -1763 -1682 -277
7060 -277 606 14 -1592 -1661 -16 470 -537 -1407 -1046 46 389 -456 -1466 -820 448 595 -264 -1335
7078 -1335 -675 1057 1056 -563 -1052 -163 1245 1218 -189 -1652 -345 1507 2016 19 -1362 -695 1415
7095 1415 2263 469 -1537 -1138 1135 1961 1260 -1189 -1129 837 1934 936 -729 -946 464 1694 834
7112 834 -246 -654 1 983 739 87 -2 594 914 156 -386 177 744 725 -189 -728 -366 1147 996 -552
7132 -552 -1480 -278 1244 1082 -562 -1802 -1047 1461 1993 -364 -2395 -1685 703 2135 16 -2142
7148 -2142 -2240 -149 1628 1000 -1412 -2088 -731 917 978 -915 -1699 -810 901 612 -500 -985 -502 -43
7166 -43 -415 -587 -112 328 -34 -816 -1159 -10 1236 883 -617 -1632 -440 1510 1521 -388 -1485 -559
7184 -559 1926 2398 225 -2041 -1149 1417 2994 1177 -1529 -1782 707 2826 1803 -984 -2123 64
7200 64 2042 1589 0 -943 -278 951 1783 247 -1012 -203 882 876 59 -252 143 314 -11 -262 132
7219 132 806 714 -696 -1400 -101 1329 1086 -955 -2000 -815 1576 1821 -647 -2598 -1689 777 2144
7236 2144 254 -2354 -2051 275 2220 869 -1580 -2305 135 1849 1153 -1210 -1731 -933 987 1313
7252 1313 50 -1479 -743 409 435 -296 -345 271 359 59 -702 -720 510 306 -623 -914 183 1011 691
7271 691 -721 -1672 -521 1822 1697 -516 -2339 -1178 1209 1977 971 -1480 -1737 466 2512 1007
7287 1007 -1480 -1657 104 1698 1322 -881 -1909 328 1898 1648 -189 -1344 -533 733 744 170 -59
7304 -59 430 513 655 -432 -371 -36 976 67 -425 -198 821 1412 -572 -1160 -204 1709 1514 -16 -1204
7323 -1204 -834 1101 1519 203 -1422 -1698 318 2177 850 -1447 -1436 596 1599 1304 -718 -1620 -341
7340 -341 1077 1255 -653 -1179 249 1624 825 -860 -1256 -246 924 949 -291 -975 73 396 16
7357 16 -354 -304 184 579 -97 -1061 -876 -289 1072 329 -932 -770 93 891 61 -1333 -961 608 1550
7376 1550 -27 -1395 -1691 -106 1018 344 -1092 -1579 -462 965 505 -979 -1445 -62 1039 415
7392 415 -1354 -1429 51 1575 1290 -567 -1649 -521 740 535 -513 -561 -158 854 560 -360 -857 193
7410 193 1080 884 -139 -330 327 678 629 -181 -469 877 1119 179 -956 -652 610 1243 636 -1240 -709
7429 -709 588 1745 984 -942 -813 773 1725 1258 -992 -1544 6 1683 1339 -666 -1296 1 1408
7446 1408 1274 -338 -1864 -552 968 1514 66 -1589 -1020 527 752 -55 -211 -326 -69 -118 -872 -636
7464 -636 56 356 76 -982 -445 -144 -13 -437 -1333 -519 763 882 -196 -2234 -1531 655 1203 273
7482 273 -1634 -2101 -530 1313 886 -1273 -2118 -537 1289 840 -960 -2118 -1307 1015 1619 242 -1612
7499 -1612 -1292 47 1393 800 -336 -541 576 846 207 -112 285 917 636 153 141 808 865 527 -225
7518 -225 132 1479 1966 253 -1020 -479 1299 2322 1236 -1182 -1152 599 2337 1492 -1154 -1942 66
7535 66 2267 1914 -418 -2435 -950 1527 2106 111 -1761 -975 731 1470 314 -1306 -1106 -73 1028
7552 1028 320 -810 -842 -531 -155 -84 -161 158 -314 -694 -1159 -760 735 797 -511 -1729 -1282 226 1013
7571 1013 26 -1691 -1894 -50 1421 237 -1886 -2295 -169 1791 1697 -893 -2607 -1511 985 1851
7587 1851 58 -1501 -1371 429 1363 308 -899 -1011 403 1145 696 -191 -391 443 397 492 -127 389
7605 389 566 459 -23 380 1456 1366 523 -430 -375 1111 2330 932 -628 -866 484 2455 1192 -870
7623 -870 -1436 10 2092 1752 -428 -1730 -420 1513 1752 -226 -1589 -866 785 1470 552 -1432 -1275
7640 -1275 68 771 64 -918 -651 -254 113 -95 -722 -440 10 -109 -907 -787 -370 362 -179 -923 -829 320
7660 320 469 -94 -1579 -1417 -26 1079 370 -1220 -1783 -319 1140 996 -802 -1577 -703 1309 878
7677 878 -540 -1498 -587 710 1270 271 -1381 -981 809 1260 197 -780 -652 337 587 426 -421 -98
7695 -98 647 785 58 -440 65 700 682 459 -147 330 1120 924 174 -353 485 1399 1089 -128 -473 455
7715 455 1392 1094 4 -762 -66 1241 1382 -282 -614 -294 840 1325 -610 -1407 -373 944 884 -331
7733 -331 -1878 -578 196 794 -183 -1845 -1484 105 571 -478 -1229 -656 243 351 -386 -1309 -1114 219
7751 219 451 -181 -1159 -658 108 380 27 -751 -512 156 466 -528 -990 -186 542 348 -483 -897 -254 895
7771 895 771 -136 -1135 0 1167 1101 -515 -987 -119 1401 1634 149 -1367 -1084 862 1911 257
7788 257 -1089 -801 420 1501 815 -537 -815 167 1107 485 -470 -361 146 622 584 66 -347 49 665
7807 665 214 -221 364 577 36 -523 -654 429 1184 301 -812 -1115 148 1212 1151 -634 -1816 -809
7825 -809 975 1046 -369 -1884 -1102 1070 1720 -243 -2243 -1692 413 1544 618 -1434 -1835 -452 962
7842 962 540 -769 -913 -450 592 211 -514 -815 -231 184 127 -90 -216 249 74 -383 -471 82 924 192
7862 192 -584 -935 398 1448 821 -778 -1449 -665 1482 1316 -667 -2075 -773 1316 1845 301 -1318
7879 -1318 -1062 606 1694 714 -1268 -1496 160 1481 1174 -414 -1211 -639 723 933 215 -842 -166
7896 -166 250 239 -51 170 -145 -89 -356 -184 166 625 328 -738 -1198 97 1361 561 -869 -1281 3
7915 3 1404 1230 -399 -2299 -848 1276 1630 222 -1548 -1612 449 1752 604 -1383 -1556 -20 1549
7932 1549 954 -652 -1065 -222 672 765 -412 -1287 -654 272 632 136 108 166 -81 146 -183 -149 585 244
7952 244 -559 -784 266 978 824 -439 -1132 -133 1309 942 -907 -1767 -805 1360 1694 97 -1635 -1186
7970 -1186 916 1501 590 -1267 -1383 58 1203 664 -574 -1012 -118 1056 719 -259 -1013 -209 367 182
7988 182 -278 -27 -361 158 -160 -3 -92 155 221 -321 -345 -677 974 1080 -292 -649 -37 1079 801 107
8008 107 -853 110 689 1331 491 -382 -638 924 1378 222 -861 -1155 890 1365 506 -905 -726 -304
8026 -304 1000 1388 63 -499 6 349 840 302 206 265 678 238 -154 -473 490 1519 -281 -66 398
8045 398 171 419 207 -508 -395 580 892 -736 -1358 -188 -159 260 137 -563 -1153 -50 -124 -538 -590 -696
8065 -696 -43 944 179 -1663 -431 433 544 -493 -844 -701 -368 1004 355 -188 -1353 -32 1181 91
8083 91 -476 -773 112 666 550 -1007 -899 -391 -385 403 -295 -631 44 1099 301 -67 114 208 -14 163 -79
8104 -79 -30 -364 487 259 -641 653 -27 686 422 -867 -89 440 1810 203 -1174 -106 820 1008 892
8123 892 -568 -431 706 503 1012 -60 -876 -554 893 1194 -706 -1354 -760 1495 598 -222 -1115 -370
8141 -370 1129 961 16 -865 -744 -93 -237 -177 -1000 -468 336 -560 -496 -687 -573 961 -492 -1481 -407
8160 -407 102 -8 -354 -1786 -922 1212 891 -1194 -1718 -2259 44 2095 272 -802 -1612 -984 1829
8177 1829 881 -453 -415 -551 1324 1182 -278 -1607 -936 1006 1479 65 -1457 -380
8191c80
$$ Imaginary data points
##PAGE= N=2
##DATA TABLE= (X++(I..I)), XYDATA
0 0 0 0 0 -8 8 -8 8 -16 17 -22 31 -39 47 -55 71 -81 97 -120 143 -166 197 -228 264 -308 353 -405 461
27 461 -526 596 -671 757 -854 955 -1069 1194 -1331 1480 -1646 1828 -2024 2242 -2487 2752
43 2752 -3045 3377 -3743 4156 -4629 5171 -5794 6535 -7419 8496 -9852 11612 -14002 17459
57 17459 -22939 32984 -57554 244387 139995 -403882 -120275 371117 556191 140010 -237989
68 -237989 -182496 231891 374223 100010 -240982 -154372 206981 389161 126908 -247909
78 -247909 -335411 -92120 123971 104739 -23028 -21361 51485 15787 -131183 -173472 -34257
89 -34257 117794 66837 -118602 -177349 -1154 165760 90353 -115449 -128870 102926 265044
100 265044 86028 -259426 -339315 -9084 364397 329197 -49733 -282638 -107531 194981
110 194981 190218 -119790 -309825 -116433 209451 229903 -100325 -345632 -202986 121636
120 121636 208058 -46271 -312609 -284335 -51760 46035 -101164 -232703 -113112 105102
130 105102 100061 -154127 -346872 -236243 28218 117260 -43966 -188912 -92116 103558 112999
141 112999 -74218 -177725 -26057 201103 202441 -44404 -224184 -85968 216419 325554
151 325554 152832 -36460 -6336 152451 176224 19475 -88274 37159 264157 296340
161 296340 89425 -85229 -23901 161407 211282 70565 -58293 -13711 108447 97779 -47382
172 -47382 -103367 52365 228362 170530 -83589 -248844 -135209 88727 129437 -48243 -172395
183 -172395 -50942 146954 124824 -116733 -264030 -122745 137739 179910 -60141 -276970
193 -276970 -190689 90242 215658 54234 -154748 -142232 42249 118299 -31531 -204560
203 -204560 -148140 86727 202724 69412 -125954 -143271 -1699 85665 5993 -112742 -97840
214 -97840 26536 70434 -35694 -131022 -65767 77299 101419 -38973 -167991 -129989 6927
225 6927 48903 -55649 -126380 -25529 127654 108562 -80832 -210036 -113751 88345 139916
236 139916 -12666 -147551 -72966 113394 158102 10001 -115364 -38878 134916 163788 -14599
247 -14599 -171192 -80843 158540 254675 104708 -79686 -62302 98903 157942 23167 -119519
258 -119519 -55208 147658 219398 57467 -126764 -97854 99018 202850 74782 -121507
268 -121507 -146671 11884 125141 46194 -87746 -73030 72828 141447 19583 -149162 -162874
279 -162874 -16031 94377 39225 -75022 -78783 20543 66361 -9609 -91508 -59744 42594
290 42594 58394 -54484 -142270 -67029 91645 125411 -3700 -112055 -48822 87599 89288
301 89288 -71581 -187966 -77945 139522 185340 1503 -175303 -112651 98333 176466 12174
312 12174 -189553 -165690 50140 174228 52396 -140458 -141732 49035 173516 69176 -133991
323 -133991 -184103 -35459 106241 70326 -59453 -86272 19180 97588 38310 -73238 -89143
334 -89143 3905 66740 11585 -66938 -38026 66000 94694 3331 -72014 -16485 96418 93514
346 93514 -51873 -156389 -59658 136948 184712 24730 -130057 -81398 96812 156602 4377
357 4377 -166026 -125783 83732 189692 58079 -132580 -131963 53167 177007 78714 -118353
368 -118353 -167113 -24887 110491 72847 -52156 -75767 27772 100218 36372 -78802 -91964
379 -91964 4566 69660 15454 -64395 -37990 64323 94923 4530 -81240 -38060 76535 92256
391 92256 -35940 -141594 -63847 117190 172750 29002 -125363 -92862 75614 148954 20198
402 20198 -150659 -133540 53658 172940 77504 -96212 -121016 21377 135451 66330 -98877
413 -98877 -148378 -26216 99908 74645 -41217 -78726 2276 74700 36807 -59740 -83411
424 -83411 -12632 39772 -1637 -60165 -27691 62908 82080 -10947 -98365 -62870 49961 79645
436 79645 -29048 -131161 -71587 87372 140060 12061 -129105 -102275 54946 128367 7814
447 7814 -156810 -145884 35951 160883 79172 -92115 -131948 -5184 110473 59449 -89636
458 -89636 -136871 -23925 96343 75244 -35052 -74482 4260 83918 52431 -46360 -77684
469 -77684 -5793 61540 36665 -23588 -10614 67029 95908 24312 -57975 -39249 58510 98825
481 98825 15905 -77766 -40522 91799 151081 55361 -73729 -72923 49611 121852 35143 -99473
493 -99473 -96656 46082 146536 77408 -68919 -106968 182 99797 52640 -82393 -127777
504 -127777 -26598 82138 62278 -41794 -81816 -12381 57388 21813 -77777 -104972 -22658
515 -22658 55093 24527 -55787 -62413 18100 70363 16592 -76324 -84141 5349 64795 8820
527 8820 -80432 -66255 47441 114145 41792 -81631 -100298 5656 87755 31547 -85102
538 -85102 -96687 17805 108416 58063 -60236 -93432 -5754 74249 27755 -86211 -112076
549 -112076 -9346 86253 57789 -45460 -80366 -6438 65105 28901 -71278 -95866 -5877
560 -5877 77212 46783 -42796 -56298 30983 101368 57253 -50990 -80604 7794 96181 70005
572 70005 -19494 -37067 48643 123191 84760 -18699 -53125 23518 102615 71935 -24029 -46818
584 -46818 39408 119670 87448 -12364 -51543 11336 74116 35922 -56829 -72017 16641 88800
596 88800 45378 -55885 -81995 -4387 63630 13866 -97976 -125173 -28132 62929 28100 -77849
608 -77849 -107437 -20454 63172 23112 -96393 -139305 -49177 55845 41057 -58997 -98995
619 -98995 -21805 68698 55464 -44886 -98164 -38684 46692 45034 -28354 -55306 8503 77926
631 77926 56330 -24849 -54814 5179 64460 32765 -47923 -57195 26967 93316 54349 -37318
643 -37318 -55996 19967 80362 27530 -80944 -96487 11543 107970 69096 -51684 -96895
654 -96895 -10328 90793 67530 -53012 -113304 -36833 71821 73483 -18739 -69678 -7608 83005
666 83005 80971 -14798 -79720 -35358 52566 70932 15835 -17820 20866 71134 57454 -2842
678 -2842 -22107 30686 74944 36519 -38153 -37666 48274 107418 60159 -32548 -50158 28261 86848
691 86848 27645 -86323 -100295 13042 112082 67738 -67022 -123955 -36774 74227 58252
702 58252 -70858 -148113 -77715 41312 56411 -39867 -114420 -71265 27355 47757 -36915 -115733
714 -115733 -92221 -10705 25919 -10332 -47257 -27778 14509 15368 -26885 -46133 -11209 25841
726 25841 8049 -35326 -25190 39211 75028 30637 -38349 -30680 51548 98809 31295 -72991
738 -72991 -74621 43038 137294 92914 -30128 -80491 5379 103679 77194 -46387 -103019 -15318
750 -15318 104564 101390 -15919 -97430 -43497 69566 95761 2248 -88715 -69145 17323 54511
762 54511 11952 -32590 -12678 40184 41840 -16262 -61847 -32133 27639 37098 -4232 -22572
774 -22572 12120 48042 25663 -26826 -32196 27293 71680 24977 -61514 -73954 15806 99841
786 99841 78719 -17347 -65736 -11135 58787 39799 -49223 -86878 -15010 77010 69978 -27894
798 -27894 -92010 -48102 41902 54096 -25422 -91605 -64508 5852 21350 -28572 -61007 -24894
810 -24894 32847 24811 -48866 -94213 -53473 13341 20741 -29293 -52725 -6754 47391 26684
822 26684 -46687 -75654 -11646 63821 52762 -34675 -78127 -14301 78043 86316 7751 -48311
834 -48311 -10215 62858 63593 -16382 -65824 -14009 80361 104257 33374 -41714 -32434 31653 57805
847 57805 15354 -28155 -10776 35722 38712 -5628 -32856 407 50636 45314 -15201 -56015
859 -56015 -30493 16204 16191 -20459 -26405 22775 61515 24648 -62065 -89363 -19183 65556 58197
872 58197 -28458 -78988 -27865 56564 60514 -13577 -65592 -20660 59002 53749 -38173 -96901
884 -96901 -41321 68111 104645 28425 -61741 -61419 11028 47666 2600 -50655 -32074 33340
896 33340 55033 1203 -55758 -40858 26497 53544 4572 -54854 -53363 -4328 18594 -5674
908 -5674 -26667 -1896 41423 31803 -31728 -76915 -42677 23628 38616 -8070 -40861 -13044
920 -13044 34274 30833 -23665 -52893 -8394 54160 41080 -34783 -75329 -22113 59137 72158
932 72158 6758 -43919 -15021 45327 39206 -34445 -73412 -10189 81677 89845 1760 -74308
944 -74308 -43794 47623 77518 9615 -62534 -42535 37461 63784 2982 -58258 -33315 54319
956 54319 89507 19797 -73977 -81628 -5595 57399 40546 -12846 -24469 9961 31727 189
968 189 -41820 -33075 16585 38521 4401 -33882 -27931 10563 26535 5809 -11492 6589 26874
981 26874 -521 -57646 -65258 3798 75165 64363 -17393 -69112 -27962 45573 47472 -27600
993 -27600 -72586 -19715 65563 69488 -19873 -88523 -40879 68354 99823 12976 -87478 -81735
1005 -81735 10869 71958 35617 -35061 -37765 26476 64529 15909 -58569 -62961 4564 55361
1017 55361 32609 -21671 -35035 -22 28207 11277 -17358 -10173 17449 14268 -27697 -53036
1029 -53036 -19325 39349 48700 -305 -41354 -20464 25189 21558 -36988 -68230 -17748 57026
1041 57026 63970 -9795 -75492 -47108 36760 68825 10642 -59338 -51805 14485 47795 10630
1053 10630 -37967 -21964 42858 67206 12403 -56869 -54822 7560 50222 29103 -10976 -8936
1065 -8936 26694 35041 -4745 -36399 -9322 44953 49048 -10726 -59291 -28978 40709 65381
1077 65381 16045 -38311 -25503 28717 39662 -19689 -72608 -37341 49436 83593 20384 -62734
1089 -62734 -65221 6093 58997 26670 -39598 -51739 -2914 39619 20273 -24841 -30402 14402
1101 14402 46338 20353 -31621 -44799 -11611 19665 16019 743 5855 24549 17556 -19426
1113 -19426 -38175 -6401 36665 31399 -19424 -48424 -13579 42861 46546 -14142 -57533 -24172
1125 -24172 43504 47034 -28850 -89679 -53330 42623 81371 18649 -68308 -72227 1645 52360
1137 52360 12157 -60518 -67099 1508 57583 32569 -40891 -62261 -9375 48039 37212 -20356
1149 -20356 -50711 -22654 18680 24708 4309 -2505 19778 32708 8092 -23983 -18899 16110
1161 16110 32112 12234 -6425 6646 37532 39137 -980 -29928 -2258 50822 52127 -8221
1173 -8221 -56251 -30326 43800 74697 26034 -38551 -40175 17206 45766 1482 -53572 -45326
1185 -45326 23132 64268 24296 -44602 -58749 -1977 47303 22605 -37064 -53883 -13703 28823
1197 28823 17510 -21642 -28437 12463 40415 11644 -41456 -49089 -3711 33816 18845 -18918
1209 -18918 -22655 14676 38332 9487 -35097 -34128 12093 38942 7151 -39298 -37843 12379 47702
1222 47702 21826 -29725 -39287 657 28181 -449 -45890 -44412 7529 43298 18447 -35189
1234 -35189 -45317 -2926 27789 1851 -42863 -41737 4901 36212 11817 -34771 -35219 14203
1246 14203 47564 15338 -39564 -45574 4323 44369 25439 -20725 -21395 27462 60643 31032
1258 31032 -30778 -39878 11052 56408 39433 -9137 -25328 14990 54592 39472 -9211 -24634
1270 -24634 10080 39885 19748 -24290 -31539 11121 49654 30928 -17293 -33541 -534 23957
1282 23957 1091 -39160 -37243 7872 37077 8986 -40421 -44741 3837 38695 9126 -49817
1294 -49817 -58276 -8433 34825 17523 -30772 -41235 4083 42408 17778 -39905 -55103 -9334
1306 -9334 35727 25624 -18531 -36061 544 38430 28020 -18351 -33520 -2277 25632 11676
1318 11676 -24553 -25615 12399 41384 18356 -25015 -29841 7422 31786 2681 -42675 -39503
1330 -39503 12264 45638 18218 -35889 -42593 8112 43747 14174 -45746 -56614 -2610 48388
1342 48388 34393 -24206 -46140 -3888 47438 37631 -18030 -45613 -13263 34715 38894 2194
1354 2194 -20297 4933 39665 34365 -3527 -20666 1628 27140 22460 -2944 -6842 18267 38794
1367 38794 19501 -15595 -15491 19975 34625 2307 -38549 -30809 21285 54331 20524 -37120
1379 -37120 -45303 4957 42955 13766 -48641 -60992 -8311 43639 30717 -32111 -59180 -16245
1391 -16245 36555 28503 -30219 -64006 -33531 19485 30891 -5310 -34611 -18288 18006 21290
1403 21290 -11294 -30566 -13670 12013 11123 -9730 -13892 9005 30335 13713 -16568 -19560 10120
1416 10120 26588 2579 -31314 -24112 22608 51179 20928 -31688 -40656 8655 48946 22706
1428 22706 -36436 -53352 -4833 49595 43354 -16190 -47265 -13875 37060 35708 -17509 -50708
1440 -50708 -25046 27254 40061 3700 -29840 -16011 20852 29560 -236 -24164 -13503 11357
1452 11357 16532 281 -8879 11158 29194 15210 -14817 -20675 7731 28775 12082 -21715
1464 -21715 -23813 15041 45880 25292 -24876 -36570 4542 41047 21438 -31075 -49854 -6416
1476 -6416 47744 42262 -14994 -50498 -22682 27702 31535 -14711 -49014 -27166 20030 33914
1488 33914 -1069 -32952 -20705 16331 21227 -9272 -36159 -23679 7431 17467 -2453 -18511
1500 -18511 -2808 18709 11995 -17785 -27662 -3279 23150 12030 -20114 -28858 6258 40446
1512 40446 28995 -18686 -38899 -6506 32538 25297 -19323 -40973 -7142 41774 42803 -7099
1524 -7099 -40741 -16700 28735 34332 -7526 -40509 -21730 25231 39559 5869 -27245 -17049
1536 -17049 18853 23774 -5722 -29770 -16251 16919 25296 -948 -21101 -4066 24663 21736
1548 21736 -12332 -31698 -11070 20321 18952 -10581 -26535 494 34990 27553 -15610 -38966
1560 -38966 -11424 29970 28043 -13137 -39080 -12582 34328 38974 -1973 -33283 -15895 22040
1572 22040 25561 -10972 -36458 -13514 30403 40422 1746 -31453 -18537 20441 29700 -3135
1584 -3135 -30981 -15443 21234 28907 -1110 -24614 -6221 29181 29580 -9636 -37395 -20171 19232
1597 19232 31322 2121 -24292 -10494 22168 25356 -9472 -33627 -16628 17312 22637 -8921
1609 -8921 -32513 -15443 22212 28278 -5639 -30171 -15891 12125 12537 -17906 -34458 -10564 27489
1622 27489 27356 -10356 -34816 -14121 21547 21195 -15693 -39972 -14451 27166 34481 -6454 -36721
1635 -36721 -15240 31278 37027 -4785 -41381 -27422 20220 36922 7282 -26432 -17231 23120
1647 23120 36653 3221 -32913 -27856 9099 29826 11760 -16869 -16391 10662 21643 3448
1659 3448 -15985 -9407 10280 10966 -9814 -22907 -5899 23481 27267 -1581 -19525 -5128 20470
1672 20470 12960 -17792 -28870 1748 39942 36003 -8607 -36279 -11558 36251 44213 236
1684 236 -36157 -19891 24845 40723 7926 -25264 -12113 31098 42300 4941 -36147 -31461
1696 -31461 10959 37315 18132 -16047 -19773 5947 19747 1063 -21372 -15695 4413 10230
1708 10230 -10810 -30651 -18775 11766 17432 -7698 -28150 -20002 3271 1989 -25457 -40378
1720 -40378 -15640 22092 26861 -11800 -43002 -26682 13915 26578 -4296 -37576 -27150 12998
1732 12998 31487 5486 -26649 -19265 18838 34517 9544 -25155 -27061 4442 28856 17440
1744 17440 -4005 -3216 16096 21186 1340 -16545 -7259 16214 24395 1633 -17308 -5067 21541
1757 21541 24635 -2145 -21667 -3506 24669 22904 -15456 -41900 -16521 33865 47740 8414
1769 8414 -35725 -30145 12939 32471 7103 -29168 -24536 17696 42833 16098 -25430 -28552 9674
1782 9674 40298 26960 -14061 -30490 -8778 20307 23355 7079 -1391 9742 14418 766 -15048
1795 -15048 -11210 7451 14232 2651 -10328 -4598 10113 5880 -16389 -24747 -3975 19477 8886
1808 8886 -30596 -51352 -23295 23582 32153 -8732 -47846 -36755 4498 20287 -12649 -48740
1820 -48740 -37734 12539 38252 5927 -42868 -47024 -712 35435 19196 -23990 -38689 -9228
1832 -9228 25495 22090 -6501 -15548 7916 28368 17908 -10385 -21447 -647 23800 23150 7159
1845 7159 2015 13462 18871 4416 -9904 -313 21456 27499 4660 -17847 -9855 20148 30007
1858 30007 9062 -14845 -9194 16008 19773 -6169 -32916 -17915 23856 41639 11917 -28374
1870 -28374 -30722 2509 23731 8206 -21144 -21225 8388 25166 5046 -26274 -21204 14371 34073
1883 34073 13434 -25504 -33129 -2953 23765 15372 -9152 -11140 12764 24388 1168 -29839
1895 -29839 -26663 7585 31933 14642 -21301 -30282 -3784 21841 12538 -16215 -23751 -3883 10563
1908 10563 -2068 -30171 -30078 964 24781 12364 -19015 -31141 -13152 3703 -2267 -18050 -17239
1921 -17239 5321 14962 -2146 -23532 -18612 9526 22346 3790 -22575 -21136 6714 21906
1933 21906 6486 -15678 -6648 25587 35601 7465 -27338 -24457 13777 40387 24260 -11341
1945 -11341 -16458 13982 35889 18352 -14049 -18746 11052 35579 20118 -17418 -26027 4354
1957 4354 33853 25385 -5396 -20073 -4015 13073 5017 -15601 -18155 7019 26979 12310 -16840
1970 -16840 -25517 -4334 15857 7807 -13348 -19339 -613 13865 1769 -18744 -15909 10830 26234
1983 26234 6777 -26176 -32564 -6036 20103 15020 -8177 -13113 4862 16260 2530 -21230
1995 -21230 -20395 5994 23689 10204 -19629 -23126 2447 22103 12274 -11830 -14778 3890 13026
2008 13026 -4289 -27499 -21042 13982 34061 11090 -24374 -30925 -1723 23170 9718 -20343
2020 -20343 -27050 3372 28544 14114 -20446 -28892 2333 32199 22874 -14519 -34597 -13048
2032 -13048 21468 25591 1129 -13817 -1985 18168 17245 -5248 -18542 -7086 15221 17345 1865
2045 1865 -6875 1771 11031 7244 -4641 -3203 8997 12236 -2277 -19693 -11240 15540 27925
2058 27925 7411 -17644 -15352 9500 21473 -236 -29437 -23614 14249 37886 14936 -27684
2070 -27684 -35789 -1533 32400 22328 -16905 -36345 -11932 21734 22315 -7439 -24333 -5838
2082 -5838 21966 21214 -8751 -31612 -19309 11079 22044 5668 -10457 -7524 4794 5428 -4276
2095 -4276 -8770 1253 10356 2489 -12947 -14062 6840 19315 9318 -11446 -12886 5049 15031
2108 15031 127 -22980 -19283 12695 33369 15934 -18990 -28673 -2001 25829 18838 -14013
2120 -14013 -29487 -6863 22616 21248 -6806 -22584 -6285 19841 19915 -8012 -27458 -15913 11067
2133 11067 17958 743 -13538 -5377 10335 8532 -8439 -18227 -5291 10754 7158 -10714 -15958
2146 -15958 1401 17976 8106 -13317 -19357 327 18297 7591 -17648 -24457 2605 29010
2158 29010 22642 -9628 -24256 -4902 20411 20416 -7988 -23852 -4098 25026 26649 0 -19750
2171 -19750 -5952 18674 23299 1845 -17106 -9337 12757 17485 2935 -6440 2911 15900 10353
2184 10353 -7942 -17477 -3923 13354 11986 -8245 -13309 2792 16518 7872 -14585 -21702 -1270
2197 -1270 17876 9158 -19485 -28902 -3215 24566 21687 -10686 -29381 -12413 14390 16155 -10603
2210 -10603 -27128 -10007 19071 21617 -4036 -23685 -12579 12390 18477 -3266 -22058 -13706
2222 -13706 9516 16710 254 -12658 -5993 10719 9709 -8683 -20351 -7673 10858 10577 -8047
2235 -8047 -17761 -3579 14750 10211 -12301 -24074 -9303 12598 11024 -12565 -23515 -4616 19888
2248 19888 17287 -8383 -23787 -8842 15554 16399 -6275 -21777 -4720 20389 24756 2091 -13638
2261 -13638 -4091 17853 19993 216 -13466 -134 23812 25688 4178 -9806 2060 23139
2273 23139 22431 400 -14733 -1971 20792 21872 752 -12289 791 20615 19015 -5301 -22319
2286 -22319 -10876 12699 16076 -4623 -20857 -10541 10174 13209 -7078 -23763 -16146 3153
2298 3153 6694 -11881 -25267 -12537 9187 10249 -8846 -22665 -13925 4493 6108 -12421 -23544
2311 -23544 -9042 12910 12230 -9299 -19943 -6066 15179 13832 -10162 -25674 -10144 17134
2323 17134 19923 -2161 -19103 -8282 15033 18511 -3404 -22391 -13861 10272 18613 -524 -16548
2336 -16548 -10417 10918 17880 401 -17561 -13977 3424 10477 -1521 -11912 -3314 11883 12359
2349 12359 -3646 -12370 -2852 13671 12934 -6228 -14023 642 21913 21390 14 -10980 2507
2362 2507 23477 22137 -1577 -16423 -1001 26817 30919 7066 -12293 -3862 20916 29249 7889
2375 7889 -15775 -11802 13119 23790 9041 -10295 -8893 8168 15859 2165 -15617 -16034 -388
2388 -388 7138 -3353 -14997 -10684 496 3059 -9420 -19805 -12433 -326 -2969 -18549 -25734
2401 -25734 -9560 9787 7249 -14847 -28121 -14513 8844 10021 -12597 -29849 -15488 13103
2413 13103 19169 -1772 -22451 -14342 11775 22020 2434 -22067 -18159 8775 24333 11923
2425 11923 -8995 -11405 6368 17385 8974 -8345 -10030 4010 12953 5702 -4618 -1806 9311
2438 9311 12558 787 -9581 -4859 8671 9452 -5218 -12487 -552 17755 16296 -4259 -17494
2451 -17494 -4557 17708 19696 -3358 -22151 -8942 20246 29264 8087 -15659 -11544 13845
2463 13845 26577 9718 -14910 -13613 10690 27335 15453 -6663 -9831 7606 20562 10933
2475 10933 -8021 -12355 387 12525 6658 -3937 -4371 3612 6323 -3927 -14825 -9717 3549
2488 3549 4708 -10907 -21726 -11269 5975 8100 -10261 -24865 -17399 3568 7062 -13492 -30346
2501 -30346 -18109 8960 17984 -3054 -27197 -23529 2327 17520 2353 -21439 -21094 3059 18597
2514 18597 8955 -10950 -13015 5079 18542 8614 -10644 -13347 4265 17747 12529 -1828 -3089
2527 -3089 8892 15546 5780 -7556 -5020 10670 16368 3593 -9464 -3615 14066 19613 3765
2540 3765 -13425 -9370 9835 16956 716 -17061 -10775 11954 22161 6045 -15359 -14559 5140
2553 5140 17022 4040 -15331 -13421 7353 19246 8627 -10831 -12209 4988 16522 5993
2565 5993 -11270 -11921 4440 14176 5493 -7982 -5992 9738 16407 1915 -16625 -14192 5766
2578 5766 16131 4363 -12944 -11199 5622 14393 360 -18279 -16115 3990 14581 -268 -20939
2591 -20939 -20129 1488 16616 6985 -14705 -20337 -5332 7260 103 -15351 -14438 2355 13539
2604 13539 3720 -13389 -16023 -641 11790 4341 -10616 -11485 2534 11175 3577 -7372 -3980
2617 -3980 11201 17221 2340 -15179 -12003 8433 20043 9310 -7411 -6301 9857 18496 5998
2630 5998 -12601 -10957 8817 20223 6991 -12595 -12575 6772 20081 10717 -9002 -13334 1434
2643 1434 12503 3329 -12365 -11547 6125 17394 8027 -10627 -14539 114 11510 3636 -11231
2656 -11231 -11720 4180 13875 4589 -11658 -12125 4646 16783 6373 -13572 -16934 -885 12983
2669 12983 8228 -6380 -8739 3994 13855 4844 -12994 -15913 170 13765 9203 -5365 -10714
2682 -10714 -1132 8660 4684 -6152 -6917 3286 8125 -2447 -14245 -10239 7015 16107 5929
2695 5929 -10524 -11727 1454 9538 -1054 -14418 -8725 10721 19012 3461 -18192 -18140 5230
2708 5230 22311 11376 -13581 -21430 -2774 15976 12290 -6317 -13454 765 16778 11173 -10907
2721 -10907 -21139 -6982 13670 16336 1572 -10815 -6954 4955 7781 -733 -6075 -773 5358
2734 5358 1505 -6380 -5749 3133 9728 4742 -5016 -5263 3575 5767 -4419 -13937 -5897 12662 19235
2749 19235 3880 -16175 -15571 5478 18761 6997 -14682 -16518 3393 18686 9752 -11434 -17046
2762 -17046 1990 21567 14621 -11065 -23638 -9061 13223 16351 636 -11169 -4272 9242
2774 9242 8670 -5831 -13734 -3823 10223 10048 -2574 -9997 -3445 7259 7472 -891 -4499 2569 6971
2789 6971 -1551 -12562 -8939 7822 18686 9875 -8686 -14533 -987 11793 6360 -8525 -10774
2802 -10774 3646 14907 6863 -12015 -16468 163 17364 12508 -8989 -20278 -8710 7317
2814 7317 9311 -1910 -8309 -996 7461 1937 -13187 -16627 -2638 10969 7356 -6979 -12569 -2768
2828 -2768 7623 3872 -8629 -10472 2513 11550 2200 -14672 -15373 3576 20410 14602 -7167
2841 -7167 -16495 -3329 13104 10208 -6463 -12639 1982 19172 16125 -3486 -15643 -4504 14597
2854 14597 16566 1015 -11282 -5703 7640 11018 2108 -4553 1051 10270 7334 -5139 -11255 -3350
2868 -3350 7343 6991 -1095 -3510 3251 7683 -178 -12019 -10207 5738 14478 3799 -13799 -15777
2882 -15777 1621 16495 10682 -8171 -14491 -386 12951 5173 -13345 -17441 1342 21109 16988
2895 16988 -6873 -21389 -9642 11049 14050 -1758 -13683 -6795 7054 9137 -3732 -12428 -3968
2908 -3968 10365 9746 -6075 -17090 -11047 2980 7187 -200 -6800 -2767 3611 -291 -11849 -13535
2922 -13535 -1636 9208 5256 -8835 -14116 -3802 8685 7154 -5689 -10765 -920 9336 3534
2935 3534 -9653 -12195 2881 18023 14363 -2854 -12160 -2263 12031 11311 -1643 -6908 3808
2948 3808 16262 13154 -2249 -8798 2427 17338 14701 -2136 -10947 -1346 12909 12872 283 -7569
2962 -7569 1718 14545 11480 -6452 -16412 -5877 10941 12754 -508 -11687 -6423 6568 8519
2975 8519 -4278 -12976 -6592 6149 6411 -5765 -14227 -7825 6374 9581 -894 -10138 -6704 760
2989 760 510 -7259 -8640 560 9998 6419 -7165 -13309 -3437 8724 6594 -6401 -11801 -2310 8597
3004 8597 5552 -7586 -12341 380 14222 9377 -10125 -20627 -9231 9862 13262 -1251 -13341
3017 -13341 -7865 6756 8934 -4573 -14846 -7936 6792 9839 -2276 -13081 -8312 6258 12120
3030 12120 2568 -7662 -5611 3397 5361 -1741 -5535 1892 12209 11234 -53 -6907 513 11782
3044 11782 10860 -413 -5853 2656 14753 13462 377 -7335 1951 16535 14782 -917 -11984
3057 -11984 -3977 12001 15205 2261 -8595 -4145 10055 12020 -1563 -12978 -8906 4994 9826
3070 9826 333 -10197 -7846 2683 5739 -3328 -11195 -7322 2056 1974 -7523 -13418 -5658 5862 6861
3085 6861 -5424 -13229 -6280 4966 3670 -8645 -14128 -3590 11017 10669 -5259 -16303 -7538
3098 -7538 9650 12825 -2187 -15321 -10068 6025 13088 2204 -10497 -6634 6939 11418 -547
3111 -547 -12907 -10274 3475 11077 4003 -6022 -6030 2305 6510 307 -6722 -3284 4187 4112 -3864 -7684
3127 -7684 -557 10517 9147 -2615 -9508 -1819 9417 8191 -4490 -9873 314 14740 15023 -600
3141 -600 -11205 -2856 14058 16530 976 -11603 -6515 10960 18141 6803 -8162 -6323 8293
3154 8293 14542 4278 -8486 -7964 4257 11913 5173 -5824 -5732 4086 8025 198 -8783 -7295 1058
3169 1058 4394 -2677 -8761 -4557 4648 4394 -5734 -13052 -6176 4840 4865 -7754 -15587 -7612 7635
3184 7635 10321 -4550 -15823 -9698 4777 9026 -3607 -14882 -9372 6852 12798 1500 -12084
3197 -12084 -9349 4977 11923 1850 -9990 -9012 2088 10360 4307 -5329 -4148 5573 9054 -320
3211 -320 -7866 -4605 5755 8791 1156 -7229 -2913 7098 9464 -1075 -9110 -3788 6736 8749
3225 8749 -2166 -10699 -3926 10495 13350 962 -11940 -7870 6558 12185 1549 -10092 -6686
3238 -6686 6772 13251 3923 -7593 -5615 6443 10772 2397 -8958 -7122 5233 11512 4484 -5417
3252 -5417 -4270 4652 8893 -176 -8284 -4953 4768 7798 -577 -8530 -4544 7766 9951 -1087
3266 -1087 -11472 -8158 3962 8094 -935 -10544 -6973 5470 9755 -889 -12164 -9305 2991
3279 2991 8525 -836 -11926 -9832 3105 10402 2496 -8995 -8595 1709 6882 -132 -8626 -6652
3293 -6652 4262 9246 1684 -7827 -5413 5629 9226 380 -9051 -6333 4865 10156 2495 -7214
3307 -7214 -4814 7067 11110 927 -9922 -7263 5113 11149 2784 -8052 -7010 5138 11993
3320 11993 3435 -7883 -7846 2401 8089 2393 -7036 -6184 3936 10130 3129 -6961 -6684 2404 7243
3335 7243 612 -7191 -6019 4116 8685 1626 -6886 -4424 5090 7863 -977 -9757 -7451 5376
3349 5376 11399 2589 -8093 -7238 5060 11011 1937 -9225 -9302 2356 10112 3737 -7473 -7823 3368
3364 3368 10818 4029 -7887 -8969 125 7558 3557 -5079 -5969 2035 8039 2840 -5289 -5364 2081
3379 2081 5889 152 -7753 -5063 4762 9418 2045 -7786 -6102 4315 8309 174 -9177 -7062 4910
3394 4910 11262 2773 -9248 -8314 4771 11675 3192 -9901 -11990 331 10573 6834 -5864 -8854
3408 -8854 270 8713 3883 -6290 -9081 -605 6839 4025 -4950 -6976 276 6873 3946 -4153 -5356
3423 -5356 577 4029 209 -5884 -3841 5349 9461 1318 -8634 -6865 4035 9043 1034 -8986
3437 -8986 -7202 3804 11200 4144 -8106 -8713 3968 11840 3804 -9438 -11454 691 11304 7633
3451 7633 -4905 -9039 170 9064 5452 -5760 -9312 -1267 7788 5924 -3303 -6190 914 8064
3465 8064 4033 -4221 -5893 1550 6480 2775 -5242 -4746 4617 10491 3838 -6077 -5892 3882 8958
3480 8958 2110 -8169 -7151 4124 12902 5581 -8047 -10472 1489 10709 4959 -7048 -10677 -1372
3494 -1372 8388 5349 -5269 -8440 246 7816 2985 -7916 -11452 -3482 5685 4361 -3957 -6706
3508 -6706 -448 4607 -135 -7460 -6240 2181 6131 147 -9168 -7940 3386 10691 4356 -7273
3522 -7273 -8258 1573 8307 2289 -8073 -7804 5202 13601 6560 -7523 -10723 689 11514 8189
3536 8189 -4419 -9661 -1516 9445 7682 -2478 -6500 726 8461 5518 -4178 -8630 -1800 6889
3550 6889 6345 -1526 -4261 978 5747 1733 -5157 -5664 2393 7455 2758 -5981 -5842 3717 9608 3465
3566 3465 -6043 -6374 3404 8890 2579 -8373 -8122 4199 13113 7199 -6291 -9572 -343 9089 5482
3581 5482 -5459 -8434 831 10081 5938 -5675 -9873 -1167 8143 5778 -5109 -10669 -4620 4114
3595 4114 3509 -4058 -6232 -404 4892 347 -8820 -11021 -2839 6154 3984 -5345 -8569 -2101 4196
3610 4196 1826 -5788 -7171 202 6005 2034 -7437 -9047 1063 10707 7851 -2301 -7242 -1450
3624 -1450 5392 4395 -2519 -3535 3721 10109 5708 -4140 -6131 2066 9690 7158 -2154 -5641 701
3639 701 7750 5345 -2780 -3639 4501 10155 4048 -7042 -9532 -36 10232 8234 -3320 -7745 -699
3654 -699 7858 5136 -4872 -9029 -1349 8046 6662 -4485 -10105 -2868 7720 8309 -586 -7214 -3928
3669 -3928 3107 3799 -2775 -5889 -283 6927 5750 -2491 -6706 -2513 3388 3018 -2436 -4599 410
3684 410 5155 1334 -5919 -6581 1777 7546 3129 -7296 -10713 -3046 5750 4099 -4943 -7273 -342
3699 -342 6714 1997 -8910 -12662 -3090 8321 7769 -3988 -11722 -5237 5434 7142 -1529 -7055
3713 -7055 -2988 4411 4355 -3770 -8045 -992 9569 9303 85 -6667 -3686 4400 5999 832 -2722
3728 -2722 2003 8097 5915 -2869 -5513 1680 10016 8848 -1116 -7460 -2370 7106 7363 283 -3874
3743 -3874 1313 7800 5338 -4432 -9260 -2701 7768 8545 -668 -7211 -3305 4320 4872 -1981 -6116
3758 -6116 -1935 4677 3906 -4656 -8706 -1535 7277 6157 -2812 -7433 -2704 3940 2736 -4978 -7731
3773 -7731 684 9054 6328 -5376 -10930 -3267 7045 7333 -2843 -10225 -3985 6383 6967 -3300
3787 -3300 -9251 -2923 7638 8111 -2765 -11849 -8056 3753 8347 1649 -5618 -4278 1905 3145
3801 3145 -2403 -6620 -2992 4257 5119 -2009 -7032 -3051 3976 4560 -1044 -3765 -436 3772 1331
3816 1331 -5974 -6323 3006 11041 7077 -4052 -9011 -2196 7595 7428 -2080 -7140 -355 8749 7281
3831 7281 -3467 -8689 -657 10246 10407 -1572 -10980 -6317 5858 9929 2667 -5045 -2605 4327
3845 4327 5383 -1240 -7322 -3424 5507 7426 32 -6399 -3486 3840 4935 -391 -4753 -1984 4064
3860 4064 3192 -3951 -7342 -524 7204 6148 -2115 -7698 -3146 4219 4461 -3017 -7259 -1326 7113
3875 7113 6305 -2583 -8596 -3203 6041 7074 -1191 -8063 -4049 4207 5738 -1260 -5894 -1459 5705
3890 5705 5341 -2764 -8406 -4234 4405 6628 -107 -5223 -2021 4309 4049 -2802 -7231 -1714 6467
3905 6467 5885 -3362 -9385 -3326 6234 7828 -95 -7160 -4236 3219 4858 -2149 -7593 -2453 6489
3920 6489 7888 -280 -8330 -5722 2799 6912 931 -5466 -4460 1843 3979 -458 -3980 -1277 4303
3935 4303 4762 -2004 -6949 -3678 3722 5695 298 -4213 -1090 4688 4021 -2845 -6335 -987 6894
3950 6894 6809 -1911 -7413 -1966 6994 8103 177 -6671 -3788 5392 7029 -236 -6659 -2973 6488
3965 6488 8731 1413 -6228 -5146 3017 6681 1260 -5488 -3977 3570 5908 868 -4801 -3458 2870
3980 2870 5201 34 -5811 -4055 3060 4968 -274 -4781 -1780 4307 5108 -1918 -7469 -4291 4083
3995 4083 6443 -187 -5985 -3416 3800 5834 -528 -7202 -4603 3698 6383 -550 -7753 -5063 3420
4010 3420 7243 1435 -5967 -5992 680 3961 -397 -5868 -3827 3280 5364 -858 -6662 -4906 2158
4025 2158 5292 -513 -6699 -4872 2450 4990 -432 -5644 -3178 4188 5911 -1162 -8051 -4932 4432
4040 4432 8199 1408 -5802 -4177 3973 7252 2317 -4891 -3969 3849 7847 2809 -4478 -2955 4967
4055 4967 8634 3537 -3412 -3622 2809 6792 2614 -3285 -2046 4229 6658 1594 -3542 -2326 3642
4070 3642 6074 -106 -5881 -3024 4713 6606 122 -6120 -3916 3562 6056 -431 -7810 -5509 3247
4085 3247 6421 488 -6862 -5401 2987 6818 787 -8033 -7647 833 6188 1559 -5907 -5183 1517
4100 1517 5293 1241 -5880 -5526 1151 4621 -269 -6051 -4630 2557 5418 615 -5555 -4729 1593
4115 1593 4066 -1004 -6914 -3919 3853 5875 -620 -6849 -4632 3137 6185 -74 -7846 -6127 2914
4130 2914 6848 1865 -5566 -4932 2753 6655 1710 -6024 -5345 2551 7375 2847 -4130 -3987 3138 7062
4146 7062 3576 -3505 -3529 2857 6231 2594 -3085 -1295 5185 7425 2075 -3954 -2613 4385 7120
4161 7120 1915 -4505 -3015 4289 7306 2014 -4702 -3596 3040 6326 935 -6679 -5437 3045 7427
4176 7427 2136 -5633 -6191 441 5218 1101 -5878 -6298 438 4534 728 -5079 -5005 1106 4111 325
4192 325 -6046 -6088 196 4348 316 -4923 -4248 1598 4124 -154 -5612 -4521 2250 5332 -70 -6355
4208 -6355 -4767 2628 6781 1671 -4941 -5334 1506 5652 1359 -5566 -5119 1909 6455 2554 -4187
4223 -4187 -5058 1347 5722 2334 -4567 -5423 1154 5790 2749 -2584 -3115 1670 4972 1531 -3680 -3398
4239 -3398 2761 5915 1708 -3911 -2712 3439 6562 2341 -4091 -4030 2620 6264 2072 -4216 -3077
4254 -3077 3378 7077 2681 -4148 -5086 1824 7078 3053 -4108 -5240 1057 6109 3587 -3313 -4892
4269 -4892 35 4427 1569 -4207 -5016 341 4588 2023 -3539 -4636 -107 3565 742 -4638 -4827
4284 -4827 572 3540 177 -4601 -4287 1560 4867 571 -6038 -6162 566 5628 1644 -5420 -5454 1191
4300 1191 5980 2869 -4150 -5373 187 5700 2689 -4027 -5126 952 6238 3975 -2590 -5261 -504
4315 -504 4730 3111 -2424 -3695 775 4465 2015 -2232 -3108 1720 5227 1741 -4001 -4567 1412 5293
4331 5293 2448 -2783 -3449 1705 5409 1646 -4869 -4901 1710 6616 2708 -4517 -5518 979 6899 3938
4347 3938 -3267 -5919 -593 5227 3249 -3364 -4522 330 5555 3963 -2481 -5378 -835 4402 3482
4362 3482 -2388 -4583 -56 4229 2908 -2129 -3687 502 4172 1645 -3879 -4546 797 4898 2216
4377 2216 -3347 -4101 1399 5429 2049 -4505 -6016 71 5406 2715 -3636 -5118 325 5606 3089
4392 3089 -4143 -6286 -261 5613 3709 -3240 -5857 -530 5110 4383 -1721 -5158 -1122 4048 2651
4407 2651 -3073 -4342 691 4848 3271 -3084 -5480 -875 4466 3309 -2798 -4491 -157 4110 2076
4422 2076 -3086 -4374 905 5640 2865 -4685 -6449 -433 5233 4241 -2151 -4699 -741 4131 2848
4437 2848 -2989 -4910 145 5139 2945 -3318 -5561 -531 5047 4204 -2144 -4462 -934 3263 1706
4452 1706 -2983 -3638 1374 5354 2830 -3477 -5412 3 5139 3618 -2819 -4461 355 5104 3389
4467 3389 -2800 -4571 886 6197 4177 -3225 -5998 -690 5405 4620 -1033 -4089 -515 4848 4180
4482 4180 -2525 -5308 -910 5217 4499 -1408 -4271 -1033 3870 3737 -1905 -4025 -370 3462 1903
4497 1903 -3494 -4994 -197 4609 3165 -2358 -5475 -1620 2807 1301 -3787 -4829 152 4420 1639
4512 1639 -4541 -6559 -1249 4743 3091 -3146 -6436 -2149 3094 2739 -2277 -4032 -223 4565 2333
4527 2333 -4312 -6857 -1376 5098 4848 -1307 -4827 -1726 3149 3344 -1580 -3541 652 4893 2899
4542 2899 -2914 -4944 133 5989 5338 -580 -4517 -1863 3508 3505 -1348 -3109 832 5278 4139 -1932
4558 -1932 -5050 -1117 4983 5040 -265 -3575 -1240 3394 3521 -165 -2648 360 4737 3320 -2122 -4099
4574 -4099 -81 4297 3846 -509 -2800 514 4015 2386 -2895 -4043 413 5614 3495 -2726 -5425
4589 -5425 -1097 4577 4330 -2162 -5673 -1631 3725 2129 -3989 -6505 -2197 4474 4536 -2329 -7448 -5446
4605 -5446 1587 3012 -1457 -4621 -3166 1167 1756 -2569 -5619 -2902 2534 2749 -1663 -5263 -3506
4620 -3506 750 1915 -544 -2103 96 2514 1244 -3497 -4260 471 5593 3996 -1301 -4163 -803
4635 -803 4279 3946 -782 -2744 1085 5716 3350 -2464 -4763 218 7090 7579 284 -4982 -2489 3884
4651 3884 5493 904 -2817 -499 4349 4354 -353 -4456 -1443 4601 5716 525 -3660 -2322 2272 3601
4667 3601 684 -2202 -403 3528 3026 -1822 -4560 -1128 3744 4094 -243 -3984 -2078 3074 2996 -1689
4683 -1689 -4513 -1186 3629 3121 -2287 -5848 -3022 2872 4094 -1014 -5288 -3819 1264 1970 -2316
4698 -2316 -5296 -2412 2542 2894 -1960 -6217 -4495 1134 2318 -1357 -4614 -2543 1194 1454 -2703
4713 -2703 -5351 -1703 3840 3203 -2670 -6357 -3281 2622 4101 112 -3347 -1243 3420 3766 -1567
4728 -1567 -4741 -727 5731 6408 500 -4703 -2895 3942 6797 2293 -2598 -940 3330 4591 567
4743 567 -2588 -450 5199 6390 1651 -3502 -2382 2621 4646 1622 -1473 -388 2603 2921 -478
4758 -478 -3375 -378 4275 4031 -973 -4678 -1953 2657 3591 -464 -3478 -1324 3422 3207 -2570 -5725
4774 -5725 -1890 3886 4730 -1109 -5620 -3291 3009 4200 -838 -5161 -3005 2738 3859 -957 -5590
4789 -5590 -3655 2239 4394 -94 -5109 -4161 914 2543 -901 -4405 -2513 1923 3158 -1127 -5128
4804 -5128 -3576 1205 2929 -517 -3850 -2681 956 2168 -1190 -3916 -1279 3286 3491 -1688 -4956
4819 -4956 -2417 2656 4272 541 -2814 -1338 3210 3258 -967 -3209 -441 4618 5039 113 -4075 -1895
4835 -1895 4330 6244 1687 -2816 -1371 2829 4193 570 -3004 -1197 4623 5420 885 -4438 -2547
4850 -2547 2847 4708 1466 -3233 -2601 1537 3651 421 -3328 -2217 2606 3553 -389 -4027 -3053 1139
4866 1139 3656 637 -3214 -2800 1234 2346 -1072 -3605 -2077 1960 2663 -610 -4201 -2377 2058
4881 2058 3275 -678 -4137 -2394 2106 3190 -1167 -4710 -2652 2520 4315 3 -4741 -3181 1493
4896 1493 3578 -193 -3960 -3388 1519 3998 455 -4167 -3331 1306 4206 772 -3054 -2882 1121 3454
4912 3454 468 -3084 -1458 2417 3122 -346 -3425 -2369 1605 3930 802 -2074 -1527 2240 3318
4927 3318 -440 -3174 -1277 2842 4210 328 -3618 -2158 3061 5263 1287 -3786 -2918 2201 3914
4942 3914 1212 -2779 -2503 1996 4383 839 -3725 -3265 978 4004 1692 -3125 -3522 761 3152 1508
4958 1508 -2164 -2142 1286 2720 -835 -3178 -2476 919 3267 156 -3437 -2672 1901 3381 -377 -3774
4974 -3774 -1992 1748 3564 -15 -3626 -3196 2214 4563 291 -3971 -3970 1534 4101 1390 -3805 -3489
4990 -3489 650 4506 1847 -3145 -3383 340 3680 1914 -2472 -3694 842 4033 2286 -2803 -3268
5005 -3268 1078 3118 1690 -1620 -2518 616 3154 818 -3068 -2094 2123 3796 200 -3915 -3039 1359
5021 1359 4279 754 -3126 -3181 1171 4688 872 -3899 -3451 2039 4786 1015 -4015 -3774 1035 5015
5037 5015 2243 -3136 -4162 -31 3208 2171 -2061 -3429 554 3945 1835 -2448 -3150 554 3415
5052 3415 1009 -1942 -2691 582 3224 1445 -2287 -2204 1558 2898 48 -2415 -2168 1979 4138 1175
5068 1175 -3397 -2286 2079 4616 1188 -3391 -3369 1515 3964 1766 -3096 -3238 1790 4342 1324 -3768
5084 -3768 -3973 686 4286 2015 -2205 -3907 105 3671 2211 -2285 -3309 33 2807 746 -2744
5099 -2744 -3392 188 3528 1374 -2438 -3159 498 2997 876 -2927 -2861 516 2819 345 -3290 -2877
5115 -2877 1545 3325 263 -3589 -3715 1332 3547 1407 -3208 -3902 703 3514 1461 -3150 -3597 533
5131 533 3798 1170 -3142 -3804 539 4138 2185 -2343 -3795 178 3494 1894 -1879 -3143 273
5146 273 3286 1997 -1422 -2633 1018 3551 1820 -1707 -2181 952 3246 2176 -1324 -1771 1445 3279
5162 3279 1559 -1650 -2015 1638 3636 1570 -2149 -2591 1661 4708 2052 -2415 -3306 769 3650 1943
5178 1943 -2714 -3272 795 3539 1430 -3072 -3674 -50 3340 1870 -2622 -4311 -687 3124 1896
5193 1896 -2070 -3880 -878 1863 1077 -2259 -3276 -450 2425 1345 -2398 -3320 -525 2308 1149
5208 1149 -1984 -2830 -368 2137 900 -2555 -2371 740 2892 935 -2853 -3183 565 3229 1930 -2248
5224 -2248 -3545 552 3764 2058 -2200 -3302 520 3276 2287 -1994 -3520 15 4270 3058 -1160
5239 -1160 -3522 -125 3334 3075 -170 -2588 -118 3326 2971 -377 -2199 352 3111 2566 -390 -1992
5255 -1992 -10 3329 2767 -626 -1530 522 3108 1737 -1591 -1726 1123 3377 1948 -2124 -2979 780
5271 780 3919 1787 -2270 -3469 -575 2964 1966 -2347 -4152 -966 3170 2086 -2515 -4631 -1959
5286 -1959 2152 2019 -2089 -4922 -2317 1820 1736 -1517 -3969 -1874 1017 1466 -1420 -3482 -1760 1706
5302 1706 1419 -1641 -2979 -466 1926 1033 -1733 -2815 -386 2369 1949 -1716 -2440 758 3215 1397
5318 1397 -2188 -3049 747 4035 3029 -1672 -3629 -6 4376 3538 -1000 -2699 -392 3270 3307 -539
5334 -539 -2990 -268 4148 3657 -534 -3158 -885 3234 4083 645 -2200 -333 2887 2792 -277 -2229
5350 -2229 448 2889 2729 -788 -2182 -371 3028 2728 -986 -2741 -74 2768 1229 -1726 -2833
5365 -2833 40 3383 2249 -2477 -3979 -638 3250 2294 -1747 -4487 -1747 1986 1830 -1936 -4784
5380 -4784 -1711 2098 1983 -1949 -4742 -2644 1329 1860 -1421 -3944 -2436 1415 1166 -1669 -3716 -1428
5396 -1428 1383 1357 -1461 -2858 -1154 1486 938 -1377 -2867 97 2646 1650 -1938 -3092 42 2997
5412 2997 2992 -994 -3261 -22 3555 2312 -992 -3109 433 3852 3389 -1269 -3498 -671 4125 4392
5428 4392 157 -3049 -1420 2662 3521 454 -1946 -503 3077 3305 -319 -2860 -1153 2585 3326 833
5444 833 -2075 -808 1663 1704 52 -964 528 2536 1627 -1957 -2626 -42 2896 2427 -830 -2486
5460 -2486 -418 2333 1565 -1554 -2982 161 2839 1969 -2242 -4557 -1450 3351 3020 -1155 -4500 -2178
5476 -2178 1971 2291 -1345 -3921 -2199 1764 2335 -1346 -4071 -2526 834 2413 -6 -3433 -2698 425
5492 425 1461 -488 -2452 -1283 1350 1404 -853 -2773 -1513 1223 1844 -589 -1567 5 1933 1494
5508 1494 -1405 -2811 -80 3201 3023 -761 -3365 -472 2939 2858 -295 -2485 -99 3488 3392 -898
5524 -898 -3504 -945 3966 4427 409 -3031 -2411 1789 3407 1098 -2046 -1203 2070 2779 -90 -2673
5540 -2673 -1514 1962 3426 755 -2656 -2339 788 2331 442 -1128 -198 1353 1219 -1599 -2890 -894
5556 -894 2643 2531 -631 -3110 -1599 1457 1918 -695 -2207 -889 2053 2170 -1488 -3985 -1507 2877
5572 2877 3296 -303 -3592 -2531 1011 2804 -66 -2949 -1720 1873 2531 -286 -2994 -1911 1207
5587 1207 2837 535 -2478 -2117 913 2113 47 -1884 -699 1692 1978 -294 -2841 -1440 1740
5602 1740 2332 -209 -2545 -973 2066 1985 -639 -2949 -980 3059 3612 -287 -3627 -1644 2385 3377
5618 3377 695 -2566 -1647 1376 3045 -56 -3119 -1693 2078 3243 627 -3348 -2941 823 3031
5633 3031 1322 -1859 -1695 854 1770 311 -2282 -1147 1803 2430 279 -2521 -1987 604 2081 13
5649 13 -1570 -761 1826 1385 -1270 -2800 -549 2716 3399 -656 -3472 -1942 1802 3242 519 -2631
5665 -2631 -1744 2184 3007 -569 -3339 -1921 2756 4146 925 -3160 -3238 757 3417 1477 -2312 -2376
5681 -2376 844 2489 751 -2302 -1787 850 2795 1240 -1916 -2044 534 1960 318 -1209 -1011 1044
5697 1044 1547 -126 -2449 -1253 1681 2094 -523 -2707 -1185 1555 1918 -728 -2928 -1483 2266 3163
5713 3163 -622 -3797 -2294 1663 3605 650 -3439 -2626 1100 2636 304 -3488 -2614 1790 3643
5728 3643 746 -2939 -3228 320 3055 1957 -1943 -2028 210 2155 714 -1264 -1115 1102 2437 814
5744 814 -1787 -1980 941 2457 898 -1113 -292 1445 1863 -601 -2058 -288 2845 2951 -363 -2592
5760 -2592 -1448 2336 3382 834 -2229 -1812 1624 3054 351 -2860 -1568 2341 3627 967 -3137
5775 -3137 -2800 855 3640 1619 -1876 -2498 231 2030 1090 -1850 -2002 704 2121 541 -2123 -2039
5791 -2039 336 1896 116 -1887 -1227 265 1644 -102 -2524 -1810 1182 1929 -544 -2805 -1620 1254
5807 1254 1773 -698 -3219 -2120 1405 2782 -188 -3365 -2646 1005 3467 809 -2483 -2911 472 2774
5823 2774 1247 -2489 -2422 693 2918 1471 -2031 -2518 -9 2565 2207 -865 -1653 291 1609 1167
5839 1167 -377 -572 1110 1876 622 -1763 -1098 1687 2437 685 -1352 -962 1399 2231 266 -2385
5855 -2385 -1115 2078 3386 58 -2489 -1937 1713 3869 1458 -2286 -3130 641 3192 1353 -2199
5870 -2199 -2741 331 2674 1707 -2175 -3043 -278 2666 1816 -1520 -2747 -849 1206 1145 -938 -1705 -486
5887 -486 1043 347 -1602 -1657 86 1178 93 -1852 -1700 438 1736 -94 -2345 -2068 691 2143
5903 2143 -437 -2661 -1931 1300 2387 180 -2969 -2947 760 3196 1126 -2734 -3110 366 3070 1944
5919 1944 -1640 -2797 -41 2766 1941 -1240 -2481 300 2685 2090 -707 -1966 -307 2145 2116 -391
5935 -391 -1095 246 2102 1328 -472 -583 1045 2022 1045 -1671 -1269 1457 2805 935 -1744 -1378 1153
5952 1153 2539 1195 -1641 -1987 1239 2962 783 -2482 -2459 494 2983 1579 -1959 -3246 -533 2789
5968 2789 1797 -1596 -3235 -594 1941 1449 -1596 -2791 -817 1466 1394 -1814 -2824 -706 1507 1231
5984 1231 -1043 -2100 -797 799 681 -1380 -1728 215 1419 9 -2258 -1979 754 2235 854 -1984
6000 -1984 -2307 387 2657 703 -2138 -2212 714 2590 1307 -2216 -3142 157 3749 2149 -1892 -2887
6016 -2887 106 3011 2399 -686 -2551 -50 2580 2154 -797 -2080 -73 2466 2276 -366 -1885 -354
6032 -354 2070 1968 -408 -1127 -5 1841 984 -734 -1193 764 2000 939 -1335 -1584 704 2733
6048 2733 1253 -1754 -1989 679 2525 1312 -1849 -2095 675 2772 1079 -2187 -2719 108 2533 1392
6064 1392 -2165 -3284 -593 2462 1908 -1654 -3044 -902 1702 1555 -853 -2555 -1142 1529 1230 -1321
6080 -1321 -2516 -791 964 1135 -654 -1705 -869 1030 827 -892 -1463 71 1407 156 -1336 -1610
6096 -1610 704 2132 738 -1696 -2371 455 2565 1069 -1713 -1889 416 2542 1173 -1835 -2577 -37
6112 -37 3611 2296 -1433 -3062 -663 2542 2411 -376 -2595 -1143 2029 2293 -214 -2281 -828 1857
6128 1857 1781 -145 -1782 -960 1578 1819 -210 -1530 -573 1119 777 -874 -940 633 1378 783 -1277
6145 -1277 -1324 798 2310 767 -1899 -2009 512 2678 1335 -1708 -2778 187 2868 1645 -1630 -2931
6161 -2931 -346 2541 2301 -1247 -3441 -1034 2171 2583 -579 -2651 -1672 1163 2114 -41 -2018 -1233
6177 -1233 1040 1887 -228 -1399 -1191 643 1210 -610 -1296 -555 856 671 -786 -1005 596 1612 357
6194 357 -1713 -1654 404 2144 818 -2089 -2840 138 2710 1507 -1560 -2840 -555 2372 2129 -1301
6210 -1301 -3251 -885 2154 2489 -440 -3097 -1698 1611 2633 423 -2711 -1807 1179 1974 365 -1837
6226 -1837 -1224 442 970 -123 -1090 -652 1047 1044 -552 -1211 92 1225 856 -774 -1433 201 2057
6243 2057 957 -1484 -1929 449 2941 2130 -1360 -2840 -178 2835 3047 -142 -2792 -872 2494 2537
6259 2537 -466 -2714 -857 2534 2689 241 -1978 -1814 1832 2812 836 -1395 -1439 925 1554 364
6275 364 -1149 -819 1319 1221 -302 -1257 -269 952 772 -204 -1217 -486 1393 864 -1251 -2001 8 1979
6293 1979 901 -1625 -2898 -700 2187 1758 -1647 -3364 -1210 1587 1736 -1307 -3198 -1714 1512
6308 1512 2337 -314 -3109 -2010 1194 1832 -401 -2499 -1868 659 1775 -205 -2089 -1665 719 1596
6324 1596 -154 -1508 -1129 512 860 -300 -1349 -79 1433 998 -565 -1436 -318 1872 1644 -250
6340 -250 -1402 -8 2101 1678 -673 -2045 305 2753 2212 -1057 -2480 -568 2639 3067 723 -2330
6356 -2330 -949 2102 2456 298 -1914 -530 2216 2499 417 -2251 -1196 1932 2810 534 -1337 -1401
6372 -1401 397 1597 392 -933 -751 775 1222 -277 -1927 -1017 1379 1337 -254 -1557 -895 841
6388 841 935 -953 -1645 -235 1278 627 -1312 -2503 -579 1525 1608 -922 -2798 -1208 1256 1453 -1278
6405 -1278 -3133 -1398 1418 1893 -815 -3119 -2395 1021 2269 -56 -2292 -1641 609 1951 256 -1996
6421 -1996 -1864 752 2176 583 -1368 -1283 290 1401 603 -340 -355 969 1059 -371 -1006 -123 2033 1792
6439 1792 71 -1146 -529 1704 1781 70 -1084 742 2307 1753 -461 -2032 -503 2457 3142 -42
6455 -42 -2371 -1535 1503 2906 644 -1420 -1138 1665 2647 509 -2173 -1774 969 2890 1367 -1715
6471 -1715 -1838 -314 1228 1065 -643 -1177 352 690 -381 -1577 -826 533 756 -243 -1516 -1315 808
6488 808 400 -879 -1775 -395 1439 841 -1438 -2946 -1344 1763 2336 -1067 -3302 -2355 1251 2061 15
6505 15 -2501 -1928 806 2851 512 -2535 -2518 418 2485 1263 -1389 -2182 -208 1409 1062 -904 -1045
6522 -1045 -58 1422 1098 -492 -740 164 1028 320 -177 -10 1185 882 -807 -1155 302 2576 1587 -512
6540 -512 -2095 -736 1975 2433 -355 -2317 -927 2176 2302 -290 -2720 -2048 1861 3675 852 -2754
6556 -2754 -2702 647 2970 1876 -1051 -2203 -338 1949 978 -1268 -1889 381 1685 929 -1126 -1499
6572 -1499 -620 812 645 -482 -838 17 154 -978 -1042 -407 1350 1312 -936 -2278 -1108 1131 1562 -408
6590 -408 -2377 -988 1695 1940 -790 -2804 -1917 1491 2825 543 -2615 -2472 751 2319 1078 -1982
6606 -1982 -2063 190 2177 1437 -1266 -2088 144 1834 1440 -633 -1488 -448 1222 1128 -490 -754 589
6623 589 1466 358 -756 -434 856 1031 1 -789 -583 1083 1328 -511 -1998 -971 1708 2054 57
6640 57 -2268 -1731 1054 2777 473 -2137 -1675 771 2102 296 -2003 -1935 632 2556 1210 -1959
6656 -1959 -2381 161 2085 1385 -861 -1513 -206 1150 735 -556 -852 719 1752 366 -987 -1168
6672 -1168 184 1304 743 -1104 -887 833 1254 -225 -1321 -827 1149 1710 281 -1917 -1420 929
6688 929 2539 416 -1709 -1594 518 1839 257 -1718 -1629 700 2576 1151 -1762 -2005 310 2178
6704 2178 1201 -1100 -2066 -214 1757 811 -1205 -1874 -215 1636 490 -877 -1488 -430 1027 695
6720 695 -1231 -1240 427 1344 493 -1229 -1107 397 982 358 -1015 -781 377 1230 -253 -1524 -1027 1028
6738 1028 1708 293 -1619 -1654 837 2074 796 -1799 -1381 513 1830 736 -1605 -1745 639 2516
6754 2516 1364 -1696 -2292 132 2284 1475 -460 -1792 -489 1536 1619 -532 -1273 250 1436 1068
6770 1068 -460 -1093 3 1384 1222 -219 -864 266 673 9 -731 -237 1058 925 -31 -1186 -1049
6787 -1049 1312 1848 231 -1948 -1675 500 1885 540 -1786 -2174 265 2429 780 -2196 -2400 -71
6803 -71 2163 1154 -1272 -2750 -1068 1694 1459 -568 -2534 -1078 967 1093 -205 -1448 -1066 113
6819 113 766 -135 -789 -741 224 434 -700 -508 78 759 -350 -943 -450 943 1502 -299 -1898 -1188 1553
6838 1553 2091 304 -1889 -1997 940 2754 1355 -1431 -1944 236 2630 2029 -1017 -2252 -243 2702
6854 2702 2403 -143 -2215 -757 1960 2198 530 -1249 -846 835 1870 693 -515 -96 938 837
6870 837 -73 106 372 663 340 -804 -518 742 1083 -169 -1381 -1134 893 1565 -141 -2179 -1949 380
6888 380 2358 583 -2172 -2831 -375 1913 1405 -1788 -3473 -1350 1743 1717 -1352 -2751 -1671 1102
6904 1102 1351 -698 -2672 -1918 812 1188 -412 -1402 -1445 112 524 -190 -579 -228 132 -107 -648 -523
6922 -523 638 843 124 -1216 -777 712 1563 228 -1200 -1082 855 2661 880 -1557 -1523 1031 3319
6939 3319 2107 -881 -2148 176 2675 2520 -394 -1465 -436 2264 2162 287 -1558 -433 1634
6954 1634 2260 735 -1078 -474 1121 1796 571 -660 -303 614 962 -18 -263 29 821 326 -455 -606
6972 -606 573 1426 320 -1385 -1619 -111 1561 466 -1593 -2021 -323 1576 691 -1766 -2485 -713
6988 -713 1540 866 -1703 -2879 -1249 1169 1074 -1453 -2792 -1549 780 1114 -943 -1970 -1197 396
7004 396 644 -731 -1421 -1361 435 1004 -351 -1140 -823 440 499 -197 -613 -82 905 567 -690 -928 279
7023 279 1620 1239 -523 -1038 -72 1615 1603 -105 -933 408 2252 1475 -500 -1008 199 1996 2063 215
7041 215 -1682 -118 2036 2204 -196 -1249 -313 1392 1934 192 -1056 -500 1482 1537 -67 -1501 -606
7058 -606 1174 1201 243 -1144 -595 779 1066 -112 -1133 -432 589 475 -509 -984 -250 629 362 -901
7076 -901 -1471 -354 634 413 -1353 -1450 -831 829 321 -1400 -1890 -563 1139 688 -1398 -2413 -1180
7093 -1180 1161 1211 -897 -2312 -1444 819 1620 -393 -1960 -964 609 1401 118 -1682 -1510 782 1434
7110 1434 66 -1099 -1104 236 1183 486 -450 -406 366 842 100 52 409 1406 775 -77 -222 547 1724 1165
7130 1165 -269 -1022 508 2067 1112 -426 -1477 244 2100 1853 -485 -2135 -574 1968 2113 3
7146 3 -1967 -1551 1508 2468 841 -1289 -1489 664 1393 542 -1154 -1362 336 1250 666 -843 -796 -276
7164 -276 609 608 -449 -382 -211 -330 -413 -778 -69 639 142 -1045 -1467 -3 1302 656 -1230 -2163 -421
7183 -421 2034 899 -1195 -2629 -820 1667 1904 -593 -2461 -1726 1134 2485 418 -2179 -1860 545
7199 545 1904 959 -1276 -1500 -91 1405 936 -420 -1061 -256 1059 601 -360 -142 166 208 120 -98 220
7218 220 412 340 -736 -834 779 1544 1035 -903 -1396 404 1873 1684 -1092 -2322 -416 1986 2308 -367
7236 -367 -1825 -974 1508 2676 599 -1912 -1672 1389 2178 466 -1728 -1837 -8 1569 980 -938
7252 -938 -1634 -495 721 539 -457 -711 -164 296 -32 -595 -337 528 527 -673 -639 -16 397 -63 -1079 -923
7272 -923 64 1605 1044 -1557 -2632 -301 2028 2278 -926 -2436 -903 942 2094 284 -1985 -1379
7288 -1379 1268 1983 434 -1254 -1642 578 2039 837 -437 -1492 -321 1123 947 198 -232 -116
7304 -116 704 37 -126 -320 491 576 -444 -1086 -104 635 670 -561 -1044 -32 811 803 -597 -1939 -539
7323 -539 1336 1033 -535 -1942 -1288 1157 1908 -488 -1927 -1314 927 1733 803 -1499 -1306 -36 1597
7340 1597 523 -1154 -1130 236 1214 463 -1122 -757 -125 1456 1063 -345 -1168 -98 999 13 -386
7357 -386 -254 698 659 180 -846 -427 1135 914 -28 -950 -490 655 719 -172 -1066 -206 944 1308 -18
7376 -18 -1756 -589 965 1891 113 -1377 -1083 660 1270 268 -1368 -574 902 1312 337 -1565 -1347
7393 -1347 160 1355 714 -1112 -1632 -177 1011 522 -618 -935 122 1299 145 -742 -1243 128
7409 128 1138 229 -1002 -1051 82 528 -27 -749 -812 299 522 -72 -1147 -702 944 500 34 -1246
7427 -1246 -702 484 1478 -167 -1394 -866 1326 2000 321 -1031 -1396 653 2167 1192 -1120 -923 618
7444 618 1552 1048 -1111 -1168 559 1763 1764 -416 -877 100 1240 1346 398 -343 3 556 496 -28 -29 687
7464 687 799 211 -404 -469 374 647 -347 -832 -359 1151 795 -859 -1445 -527 1079 1645 -103 -2153 -1873
7483 -1873 364 1789 532 -1495 -1831 134 1681 433 -1344 -1993 -99 1475 904 -1051 -1960 -912
7499 -912 913 1198 -45 -1200 -1020 321 332 -361 -680 -353 0 -208 -266 -72 164 363 -454 -690 -157
$$ [...]
8191A14
##END NTUPLES=NMR FID
##END=
