##TITLE=1H_IAMT-142
 CDCl3,8 sc, 
 3.02.2021
##JCAMPDX= 6.0         $$ Bruker NMR JCAMP-DX V2.0
##DATA TYPE= NMR FID
##DATA CLASS= NTUPLES
##ORIGIN= UXNMR, Bruker Analytische Messtechnik GmbH
##OWNER= root
$$ XWIN-NMR		Version 3.5
$$ Wed Feb  3 11:17:23 2021 Russian Standard Time (UT+4h)  she@DPX200
##.OBSERVE FREQUENCY= 200.1315066352
##.OBSERVE NUCLEUS= ^1H
##.DELAY= (6, 6)
##.ACQUISITION MODE= SIMULTANEOUS
##.ACQUISITION SCHEME= undefined
##.AVERAGES= 8
##.DIGITISER RES= 18
##SPECTROMETER/DATA SYSTEM= spect
##.PULSE SEQUENCE= zg30
##.SOLVENT NAME= CDCl3
##.SHIFT REFERENCE= (INTERNAL, CDCl3, 0, 15.7039)
##AUDIT TRAIL= $$ (NUMBER, WHEN, WHO, WHERE, WHAT)
$$ ##TITLE= Audit trail, XWIN-NMR		Version 3.5
$$ ##JCAMPDX= 5.01
$$ ##ORIGIN= Bruker BioSpin GmbH
$$ ##OWNER= she
$$ F:/spectra/data/she/nmr/H-F/1/audita.txt
$$ ##AUDIT TRAIL=  $$ (NUMBER, WHEN, WHO, WHERE, WHAT)
(   1,<2021-02-03 11:15:47.04 +0400>,<she>,<DPX200>,
      <created by zg, POWCHK disabled, PULCHK disabled
       configuration hash MD5:
       00 E9 B6 7A A2 85 ED C7 34 08 36 98 17 FE 4E 26
       data hash MD5: 16K
       B5 87 8C 08 28 0E 25 E9 B2 96 CC 12 B1 9F FD 5A>)
$$ ##END=
$$ 
$$ hash MD5
$$ EB D6 E4 56 49 38 7C 73 45 9D 16 74 38 15 82 37
##$RELAX= 
##$RELAX= 
##$RELAX= 
##$RELAX= 
##$RELAX= 
##$RELAX= 
$$ Bruker specific parameters
$$ --------------------------
##$DU= <F:/spectra>
##$EXPNO= 1
##$NAME= <H-F>
##$PROCNO= 1
##$TYPE= <nmr>
##$USER= <she>
##$AMP= (0..31)
100 100 100 100 100 100 100 100 100 100 100 100 100 100 100 100 100 100 
100 100 100 100 100 100 100 100 100 100 100 100 100 100 
##$AQSEQ= 0
##$AQ_mod= 1
##$AUNM= <au_zg>
##$AUTOPOS= <>
##$BF1= 200.13
##$BF2= 200.13
##$BF3= 200.13
##$BF4= 200.13
##$BF5= 200.13
##$BF6= 200.13
##$BF7= 200.13
##$BF8= 200.13
##$BYTORDA= 1
##$CFDGTYP= 0
##$CFRGTYP= 5
##$CHEMSTR= <none>
##$CNST= (0..31)
1 1 145 1 1 1 1 1 1 1 1 1 1 1 1 1 1 1 1 1 1 1 1 1 1 1 1 1 1 1 1 1 
##$CPDPRG= <>
##$CPDPRG1= <>
##$CPDPRG2= <>
##$CPDPRG3= <>
##$CPDPRG4= <mlev>
##$CPDPRG5= <mlev>
##$CPDPRG6= <mlev>
##$CPDPRG7= <mlev>
##$CPDPRG8= <mlev>
##$CPDPRGB= <>
##$CPDPRGT= <>
##$D= (0..31)
0 1.2 0 0 0 0 0 0 0 0.06 0 0.03 0 0 0 0 0.0002 0 0 0 0 0 0 0 0 0 0 0 0 
0 0 0 
##$DATE= 1612336546
##$DBL= (0..7)
120 120 120 120 120 120 120 120 
##$DBP= (0..7)
150 150 150 150 150 150 150 150 
##$DBP07= 0
##$DBPNAM0= <>
##$DBPNAM1= <>
##$DBPNAM2= <>
##$DBPNAM3= <>
##$DBPNAM4= <>
##$DBPNAM5= <>
##$DBPNAM6= <>
##$DBPNAM7= <>
##$DBPOAL= (0..7)
0.5 0.5 0.5 0.5 0.5 0.5 0.5 0.5 
##$DBPOFFS= (0..7)
0 0 0 0 0 0 0 0 
##$DE= 6
##$DECBNUC= <off>
##$DECIM= 24
##$DECNUC= <off>
##$DECSTAT= 4
##$DIGMOD= 1
##$DIGTYP= 9
##$DL= (0..7)
0 120 120 120 120 120 120 120 
##$DP= (0..7)
150 150 150 150 150 150 150 150 
##$DP07= 0
##$DPNAME0= <>
##$DPNAME1= <>
##$DPNAME2= <>
##$DPNAME3= <>
##$DPNAME4= <>
##$DPNAME5= <>
##$DPNAME6= <>
##$DPNAME7= <>
##$DPOAL= (0..7)
0.5 0.5 0.5 0.5 0.5 0.5 0.5 0.5 
##$DPOFFS= (0..7)
0 0 0 0 0 0 0 0 
##$DQDMODE= 0
##$DR= 18
##$DS= 0
##$DSLIST= <SSSSSSSSSSSSSSS>
$$ [...]
##$SUBNAM2= <"">
##$SUBNAM3= <"">
##$SUBNAM4= <"">
##$SUBNAM5= <"">
##$SUBNAM6= <"">
##$SUBNAM7= <"">
##$SUBNAM8= <"">
##$SUBNAM9= <"">
##$SW= 26.024554658588
##$SWIBOX= (0..15)
0 0 2 0 0 0 0 0 0 0 0 0 0 0 0 0 
##$SW_h= 5208.33333333333
##$TD= 16384
##$TD0= 1
##$TE= 0
##$TE2= 300
##$TE3= 300
##$TEG= 300
##$TL= (0..7)
0 120 120 120 120 120 120 120 
##$TP= (0..7)
150 150 150 150 150 150 150 150 
##$TP07= 0
##$TPNAME0= <>
##$TPNAME1= <>
##$TPNAME2= <>
##$TPNAME3= <>
##$TPNAME4= <>
##$TPNAME5= <>
##$TPNAME6= <>
##$TPNAME7= <>
##$TPOAL= (0..7)
0.5 0.5 0.5 0.5 0.5 0.5 0.5 0.5 
##$TPOFFS= (0..7)
0 0 0 0 0 0 0 0 
##$TUNHIN= 0
##$TUNHOUT= 0
##$TUNXOUT= 0
##$USERA1= <user>
##$USERA2= <user>
##$USERA3= <user>
##$USERA4= <user>
##$USERA5= <user>
##$V9= 5
##$VALIST= <valist>
##$VCLIST= <CCCCCCCCCCCCCCC>
##$VD= 0
##$VDLIST= <DDDDDDDDDDDDDDD>
##$VPLIST= <PPPPPPPPPPPPPPP>
##$VTLIST= <TTTTTTTTTTTTTTT>
##$WBST= 1024
##$WBSW= 4
##$XGAIN= (0..3)
0 0 0 0 
##$XL= 0
##$YL= 0
##$YMAX_a= 816999
##$YMIN_a= -837270
##$ZGOPTNS= <>
##$ZL1= 120
##$ZL2= 120
##$ZL3= 120
##$ZL4= 120
##$ABSF1= 10
##$ABSF2= 0
##$ABSG= 5
##$ABSL= 3
##$ALPHA= 0
##$AQORDER= 0
##$ASSFAC= 0
##$ASSFACI= 0
##$ASSFACX= 0
##$ASSWID= 0
##$AUNMP= <proc_1d>
##$AZFE= 0.1
##$AZFW= 0.1
##$BCFW= 1
##$BC_mod= 2
##$BYTORDP= 1
##$COROFFS= 0
##$CY= 11.3945322036743
##$DATMOD= 1
##$DC= 2
##$DFILT= <>
##$DTYPP= 0
##$F1P= 15.9154993809931
##$F2P= -4.1035820241983
##$FCOR= 0.5
##$FTSIZE= 0
##$FT_mod= 4
##$GAMMA= 1
##$GB= 0.15
##$INTBC= 1
##$INTSCL= 1
##$ISEN= 128
##$LB= 0.24
##$LEV0= 0
##$LPBIN= 0
##$MAXI= 10000
##$MC2= 0
##$MEAN= 0
##$ME_mod= 0
##$MI= 1.114404
##$NCOEF= 0
##$NC_proc= 0
##$NLEV= 6
##$NOISF1= 3.799351
##$NOISF2= 2.8
##$NSP= 1
##$NTH_PI= 0
##$NZP= 0
##$OFFSET= 15.70392
##$PC= 1
##$PHC0= -10581.04
##$PHC1= 14.40095
##$PH_mod= 1
##$PKNL= yes
##$PPARMOD= 0
##$PSCAL= 0
##$PSIGN= 0
##$REVERSE= no
##$SF= 200.130013532006
##$SI= 16384
##$SIGF1= 3
##$SIGF2= 2
##$SINO= 400
##$SIOLD= 16384
##$SREGLST= <1H.CDCl3>
##$SSB= 0
##$STSI= 0
##$STSR= 0
##$SW_p= 3612.71676300578
##$SYMM= 0
##$S_DEV= 0
##$TDeff= 0
##$TDoff= 0
##$TI= <>
##$TILT= no
##$TM1= 0
##$TM2= 0
##$TOPLEV= 0
##$USERP1= <user>
##$USERP2= <user>
##$USERP3= <user>
##$USERP4= <user>
##$USERP5= <user>
##$WDW= 1
##$XDIM= 8192
##$YMAX_p= 0
##$YMIN_p= 0
$$ End of Bruker specific parameters
$$ ---------------------------------
##NTUPLES= NMR FID
##VAR_NAME=  TIME,          FID/REAL,        FID/IMAG
##SYMBOL=    X,             R,               I
##VAR_TYPE=  INDEPENDENT,   DEPENDENT,       DEPENDENT
##VAR_FORM=  AFFN,          ASDF,            ASDF
##VAR_DIM=   8192,          8192,            8192
##UNITS=     SECONDS,       ARBITRARY UNITS, ARBITRARY UNITS
##FACTOR=    0.000192,      1,               1
##FIRST=     0,             0,               0
##LAST=      1.572672,      0,               0
##MIN=       0,             -837270,         0
##MAX=       1.572672,      816999,          0
$$ Real data points
##PAGE= N=1
##DATA TABLE= (X++(R..R)), XYDATA
0 0 0 0 0 -8 8 0 8 -16 16 -17 32 -40 41 -56 65 -80 96 -113 134 -157 185 -215 246 -286 331 -374 425 -488
28 -488 552 -618 698 -785 878 -979 1095 -1219 1352 -1506 1669 -1849 2049 -2267 2508 -2780
44 -2780 3083 -3418 3801 -4241 4745 -5330 6030 -6876 7917 -9247 11010 -13457 17109
57 17109 -23138 34860 -66073 315038 816999 -154110 -696293 -133834 567968 225733 -358913
68 -358913 -277964 161584 233379 18359 -185243 -166943 9078 272572 305565 -119752 -484257
79 -484257 -110471 438864 279697 -315298 -375728 164740 380558 -59575 -314359 -5423
89 -5423 267631 147918 -98671 -200638 -121823 46070 213805 156798 -186623 -305402 83468
100 83468 357262 74526 -287030 -147647 240643 195098 -209691 -272344 49315 231411
110 231411 122630 -78541 -182074 -93465 132523 264908 38373 -328696 -208192 268340
120 268340 265979 -229909 -359158 141012 453327 27946 -432174 -166744 319279 253288
130 253288 -142298 -261383 -38243 132053 72794 -19693 -64032 -66260 79162 184069 -22721
141 -22721 -258459 -97011 256757 210929 -225509 -321714 100306 312102 17720 -221045
151 -221045 -56084 173912 91552 -118864 -102981 22947 40136 30390 18548 -65098 -96333
162 -96333 38142 181741 71889 -175627 -131141 142490 146618 -114520 -184066 32358 178729
173 178729 36635 -132266 -61355 80764 93732 29124 -57101 -96938 -19363 83921 65979
184 65979 -75693 -130443 51095 191430 27559 -167797 -79682 138501 142384 -78719 -174783
195 -174783 -15353 114819 63427 -40806 -81655 -6617 108114 95230 -51136 -149015 -34812
206 -34812 161431 104908 -150194 -181111 64458 207378 43244 -164503 -83838 135944 124470
217 124470 -68330 -142648 -36495 94164 91242 -33900 -114574 -57366 92421 158372 -32
228 -32 -168368 -70546 129956 111131 -98618 -174923 19375 181236 56795 -132996 -110871
239 -110871 66603 156747 38306 -122432 -114067 18179 103017 44940 -95375 -102567 58613
250 58613 141834 19332 -131304 -83847 106291 137137 -48722 -165633 -68450 94170 122719
261 122719 -13664 -115523 -38470 90746 99271 -27169 -126557 -37811 109786 78970 -85310
272 -85310 -146482 -2080 163258 100747 -92314 -124442 18787 121235 51511 -93066 -105942
283 -105942 23025 99708 30968 -88681 -84223 70262 146566 18179 -126420 -93953 63996
294 63996 124901 -6566 -128235 -61027 77442 99348 -9091 -89119 -16844 90641 68897
305 68897 -44909 -108499 -36713 89306 82615 -47784 -102573 -9143 103789 79184 -47288
316 -47288 -81778 9557 69748 22059 -66285 -74283 24520 86168 27051 -55937 -55174 29868 88661
329 88661 25979 -69397 -65862 14052 60624 6255 -66036 -30105 55149 59142 -5661 -51698
341 -51698 -21765 43916 42019 -24265 -62232 -32838 32012 48242 -8333 -38321 -644 40327
353 40327 33133 -19503 -48711 -6713 32472 8126 -33401 -37553 6623 43448 22113 -13616
365 -13616 -16601 -156 19888 8739 -29236 -30670 754 16491 5189 -16345 -10879 22881 29405
378 29405 3345 -16961 -18370 1158 9448 -12688 -20147 -3639 7744 13957 7796 -2462 4697
391 4697 11375 5230 -6957 -20342 -11935 5981 -18 -6780 2114 8213 14435 10595 -2060 769
405 769 4164 -4440 -10886 -13230 -5349 6945 2628 1493 9909 9027 9808 8374 -5555 -8184 -1544
420 -1544 -3305 -6841 -11062 -3930 13804 13721 4369 3747 3106 8285 8236 -11099 -18346 -5412 2441 3591
436 3591 -2379 -4823 9281 18845 12498 333 -12404 -6421 8699 -1117 -16798 -14891 -2377 15840
450 15840 17559 -2511 -8496 5912 18391 9471 -19672 -28453 -1652 13440 1907 -12418 -14134
463 -14134 10114 31086 13871 -14990 -20031 262 19622 2392 -32314 -29256 6776 32030
475 32030 16416 -23804 -20815 25517 35644 -3939 -38215 -27494 14550 26139 -9072 -34345
487 -34345 -16367 28029 46462 3690 -40484 -19579 27951 33132 -16453 -56982 -22148 42163
499 42163 37775 -18183 -42076 2105 54168 33055 -31410 -48454 -8378 36712 28848 -30663
511 -30663 -54481 1534 61180 41984 -31656 -52889 15224 63541 14107 -60182 -55593 22277
523 22277 66097 11030 -55736 -34778 38651 68498 14519 -58512 -49427 27925 60167 -1385
535 -1385 -72724 -41892 60898 77191 -17823 -73585 -13374 71792 58115 -40039 -82656 -15650
547 -15650 58081 47627 -29227 -63138 -873 69988 48190 -35655 -68937 821 75480 31068
559 31068 -72591 -77930 25577 88005 28246 -62813 -48894 36985 66327 7495 -58371 -46621
571 -46621 26601 53538 -3668 -61747 -36573 49111 78384 -56 -74815 -40835 49587 65107
583 65107 -18900 -81339 -28956 52789 48044 -22256 -55123 -1598 65109 42793 -41540 -73620
595 -73620 -8638 67475 41407 -53894 -73357 10235 73799 36830 -43780 -49178 25586 58815
607 58815 -1576 -65564 -43791 37320 62456 -5073 -64844 -31294 48619 71167 -124 -66319
619 -66319 -31602 42185 38669 -29833 -57203 1935 59438 26640 -39644 -43347 19579 62960
631 62960 20964 -49277 -47861 9192 39856 9506 -29083 -18313 23961 33289 -1559 -26768
643 -26768 -10548 26185 27317 -14779 -43491 -20453 23578 40556 4479 -30060 -10412 28519
655 28519 26131 -14944 -31361 2054 27568 2137 -31059 -21406 12561 36474 22755 -13129
667 -13129 -29654 -4466 30304 22084 -28419 -44093 9936 46214 4464 -51494 -20235 61557
679 61557 56139 -35754 -65652 5570 54731 12125 -46897 -33275 20434 34593 5980 -21407
691 -21407 -20636 14274 42687 10945 -48399 -49282 22955 62693 -4033 -74402 -23559 69409 53013
704 53013 -42819 -63325 20563 63913 -368 -58133 -30273 21923 31712 4911 -20738 -19469
716 -19469 8025 34933 19405 -32534 -42628 13849 43710 -1799 -49773 -25200 33257 40642
728 40642 -1592 -22728 -12802 3069 20093 17303 -23795 -48125 44 63111 24958 -71264
740 -71264 -52808 70117 91381 -29543 -98272 -12426 77704 32082 -57320 -45442 23521 41675
752 41675 9951 -20434 -25061 837 42890 45074 -31296 -92005 -14989 99263 56629 -79709
764 -79709 -82453 55806 101854 -19386 -92333 -1182 81933 24505 -62364 -50730 14902 40303
776 40303 24993 1748 -28452 -35692 18317 62419 11716 -63368 -36123 50745 43026 -49823
788 -49823 -60470 35503 75013 6558 -51804 -31222 13109 28385 23836 -1610 -47301 -42536
800 -42536 32462 60832 -13777 -62924 9788 81890 15236 -89977 -51082 66268 70018 -31228
812 -31228 -73851 -14982 37683 28977 6706 -6042 -21070 -7935 27720 12305 -46967 -36021
824 -36021 48921 62853 -40195 -90314 6263 93041 35508 -56945 -42700 21327 21072 -19370
836 -19370 -13698 14201 4644 -6968 8410 2309 -27904 -4996 54778 38426 -56468 -74716 20425
849 20425 70868 1879 -51650 -6267 42001 7849 -32434 -5574 28649 12895 -11201 -10667
861 -10667 -17595 -22992 12371 52474 18464 -49469 -34020 43010 42809 -30611 -40583 27068 40304
874 40304 -29291 -54721 9553 52081 16831 -17496 -8592 -1214 -5420 5620 20700 -1854 -29272
887 -29272 -7735 26319 3262 -28292 2903 49281 20582 -44241 -36317 25597 33785 -13203
899 -13203 -23005 5068 8274 -10730 -1479 19704 8698 -10181 3366 12132 -19276 -31283 11373
912 11373 41592 3036 -43471 -16969 35171 26588 -17882 -18126 12645 13227 -13917 -21130 -3413
925 -3413 6277 10009 13991 -3356 -27661 -8084 34950 29410 -25452 -41321 8076 34300 -7386
938 -7386 -40040 -4153 38142 22264 -21779 -26914 3002 20656 11737 -4632 -21096 -21883 6263
951 6263 27691 4597 -28921 -10532 36999 28948 -29784 -42130 10087 40209 6011 -35052
963 -35052 -24937 12125 23942 10042 -6634 -14480 -1286 19208 13168 -19872 -32989 3886
975 3886 40407 14662 -38211 -31799 26726 46949 3402 -35637 -18417 18386 20756 -5350 -25292
988 -25292 -14515 17907 32559 2539 -33735 -20294 32041 45801 -7327 -52268 -23086 35519
1000 35519 35551 -16656 -39303 1239 41101 23094 -22938 -33727 2724 39146 22885 -29931
1012 -29931 -48732 -1539 48769 31372 -30484 -41461 13675 49352 11496 -41985 -33246 23448
1024 23448 41817 -4540 -46038 -26038 30712 48420 5377 -42397 -28653 23902 41419 -3145
1036 -3145 -48334 -23824 34649 36395 -17989 -45290 -2215 47667 32937 -24530 -48239 -9872
1048 -9872 37363 29492 -22100 -42706 -4538 39785 27566 -23921 -38317 8159 46297 15711
1060 15711 -43529 -45063 15024 49296 9970 -41284 -32130 20595 44924 8076 -36551 -26937
1072 -26937 21113 36554 -7093 -46448 -21513 36456 42879 -10637 -45715 -12403 40935 36795
1084 36795 -19832 -45182 -6811 35406 20445 -24258 -33183 8443 42107 19416 -28009 -34958
1096 -34958 10999 41904 11178 -37865 -31916 16341 37861 5597 -31362 -16410 26593 32638
1108 32638 -7406 -36533 -13992 27982 27169 -14262 -35489 -7056 31667 28751 -12979 -30781
1120 -30781 -34 31987 15674 -26425 -31046 9047 33144 8130 -27264 -22177 17871 36278
1132 36278 4726 -29985 -19615 17510 26414 -6312 -32822 -11260 27222 25783 -11091 -30411
1144 -30411 -2697 32959 20903 -21962 -33528 -21 28654 12720 -23856 -25088 10677 33579
1156 33579 8991 -27694 -22613 17688 31299 -3811 -37089 -19658 22137 31021 -5553 -32638
1168 -32638 -9438 29070 26419 -14866 -35712 -6835 29312 19678 -21919 -36358 1848 39633
1180 39633 21733 -27215 -33602 11046 39785 8665 -36757 -29730 17265 36765 2963 -35335
1192 -35335 -21947 27069 41011 -1489 -41109 -21489 28515 36137 -12298 -47618 -13685 39718
1204 39718 36474 -18669 -44080 -273 44225 24090 -29714 -41469 2186 40012 20655 -30235
1216 -30235 -36134 9848 47532 21409 -35716 -38756 16809 47453 6488 -46799 -32662 29015
1228 29015 47530 -2017 -43350 -18090 34760 40445 -8012 -45376 -19246 30207 37710 -10830
1240 -10830 -48873 -14552 44544 42597 -20848 -50346 -2190 49605 25547 -36974 -46726 9278
1252 9278 47398 17122 -35286 -34431 15082 44594 15463 -35476 -39227 11691 46378 8891 -47554
1265 -47554 -35518 30858 51178 -5784 -50822 -17408 39737 36168 -18635 -44970 -11587 31873
1277 31873 28145 -12995 -37786 -9126 34310 32022 -16533 -44262 -6096 42848 25021 -35851
1289 -35851 -44372 11426 48333 12247 -36478 -27272 19566 34027 3731 -30093 -23785 10944
1301 10944 30213 5568 -32354 -25296 23343 43018 -53 -44563 -19973 36383 35652 -20258
1313 -20258 -43976 -2001 36465 17217 -22099 -22837 8556 27417 12275 -18753 -26797 1569
1325 1569 31332 15448 -28444 -33281 13927 41972 7007 -35109 -18219 28162 27807 -15660 -31846
1338 -31846 32 26424 12289 -16106 -18922 2048 21159 18150 -6394 -24935 -7883 23718
1350 23718 17745 -18895 -27491 9510 32604 3871 -29606 -12695 25700 25574 -10265 -27282 -6805
1363 -6805 14912 12819 -3606 -13239 -7584 9528 18414 715 -21120 -10811 22260 21982 -19422
1376 -19422 -36406 1189 35842 15301 -25672 -25548 12851 29417 2596 -23546 -14468 11753
1388 11753 19897 -3803 -26945 -14154 21287 30512 -3184 -35066 -14634 29838 29197 -16270 -36163
1401 -36163 -1518 29872 10953 -23095 -20557 13199 29090 6301 -24455 -22712 9291 27940
1413 27940 7818 -26172 -25991 11085 32224 5110 -27596 -15270 23896 26500 -13285 -33129
1425 -33129 -3620 26813 16556 -15206 -24426 -2560 20621 18328 -4434 -19218 -8629 15871
1437 15871 17686 -8946 -25314 -5328 26424 19555 -18914 -30077 7371 36204 13895 -25578
1449 -25578 -26159 9052 26454 4253 -23004 -15213 13406 24424 2992 -21513 -14064 15025 24982
1462 24982 -930 -28522 -16774 18283 26830 -3685 -27209 -6966 25359 20320 -12990 -24111
1474 -24111 -2 21658 8989 -14976 -17011 1007 19574 11059 -9604 -17007 -154 18202
1486 18202 10329 -13379 -20838 1890 21114 6828 -17712 -15036 11504 19863 454 -15349 -8331
1499 -8331 6139 8957 -1180 -11137 -10776 4911 13787 3697 -14069 -10989 11183 18722 -2059
1512 -2059 -20545 -8865 11877 9760 -7610 -10447 3469 9955 1727 -3887 -3253 -1380 2269 6258
1526 6258 -45 -12953 -10537 8397 14492 -1070 -12665 -1671 9791 3721 -7186 -3792 3923
1539 3923 2535 -3960 -3025 -1408 -1415 3588 11779 5208 -13028 -12329 9232 15232 -4826 -15126 0
1554 0 10948 -186 -9653 1202 12133 5138 -4728 -4783 -2757 -2312 2858 8789 1911 -11714 -8465
1569 -8465 9889 12195 -2961 -6525 6145 7117 -8529 -11283 4565 10719 -414 -4935 1373 -248
1583 -248 -5815 2908 15087 5972 -14887 -12512 7224 10287 -5915 -7865 7729 10908 -5798 -12933
1597 -12933 2298 12662 4358 -4950 -5649 -5395 -4746 3856 10961 1392 -9387 -1642 9060 109
1611 109 -10429 187 13654 3765 -16318 -13360 6836 12823 964 -4445 560 720 -4335 -2211
1625 -2211 4511 2620 -3596 -1755 -493 -6206 -5649 9036 13903 -2109 -13505 -3915 7895 1107
1639 1107 -6956 323 6575 -1838 -9938 -3058 7688 6976 316 -758 -1927 -7243 -4622 6687 8269
1654 8269 -5064 -9600 2994 8322 -4176 -7898 7277 14027 -2300 -15877 -7100 7590 8158
1667 8158 16 -3304 -2047 -1221 2250 4382 418 -4304 767 8045 -216 -14988 -7793 14910 17850
1682 17850 -5096 -17377 -1902 14963 7964 -6840 -7679 1255 5553 1708 -5499 -7930 2015 15076
1696 15076 10568 -10213 -18087 1020 20199 9869 -15411 -17399 5787 17345 376 -15443
1708 -15443 -5283 14502 13622 -5385 -16620 -8582 11386 17792 -186 -20432 -11857 14107 19799
1721 19799 -3116 -20403 -3872 19210 10999 -15528 -20327 3438 21251 9423 -14958 -18634
1733 -18634 1885 19991 12260 -11019 -18769 -40 17668 7274 -18640 -17334 10559 23989
1745 23989 844 -24858 -14307 15569 23469 -460 -21969 -14361 11945 19186 -1735 -19246
1757 -19246 -8439 16473 19726 -6919 -25297 -7162 24080 19951 -14817 -29304 -2557 25611
1769 25611 15961 -14080 -20668 3294 22494 9304 -17969 -20046 6903 25234 6526 -23634
1781 -23634 -21244 12069 29343 6542 -23665 -17749 14199 22855 -2733 -23778 -8830 18833
1793 18833 18826 -7706 -22735 -5163 22006 20829 -8286 -26152 -6834 21582 17178 -12437 -22464
1806 -22464 1369 23410 10487 -16708 -17959 9050 24246 4839 -21970 -18373 9425 22567
1818 22567 4417 -18601 -14175 11120 20816 35 -20800 -9079 17226 17265 -10105 -24396 -3658
1831 -3658 21557 16087 -10659 -20886 -453 19659 10690 -13427 -17703 3821 18357 4037 -17848
1844 -17848 -14893 10746 22340 1848 -21122 -13637 13275 18899 -4074 -20716 -7809 14966
1856 14966 13624 -8191 -18398 -814 19652 12280 -13500 -20715 1292 20257 9375 -15776
1868 -15776 -18063 5637 20561 4959 -17108 -12636 11519 18694 -2693 -21489 -10519 14906
1880 14906 18612 -4610 -21356 -7397 18161 17883 -8062 -21148 -2211 19617 11005 -15174 -20044
1893 -20044 4069 22787 9315 -17155 -18199 7679 23620 5979 -19367 -16919 9716 21480
1905 21480 659 -21651 -12013 17520 22964 -4918 -24739 -7167 20838 18970 -9986 -24150
1917 -24150 -4782 20647 16973 -10605 -22150 -6 24464 13662 -16941 -23368 4932 26719
1929 26719 9158 -22440 -21216 10996 27451 4904 -22780 -15784 13979 22877 -452 -23862
1941 -23862 -14320 15713 23755 -3085 -26754 -11234 22530 24356 -9704 -28482 -5157 24173
1953 24173 16228 -15411 -24756 1280 23379 12051 -15908 -19785 3557 22144 10337 -17292
1965 -17292 -22470 3503 24795 8765 -22197 -20266 12298 26273 788 -24095 -12469 15357
1977 15357 18759 -4607 -21019 -9180 13080 17553 -2129 -18990 -9598 14689 19988 -4288 -24522
1990 -24522 -8898 20468 17981 -12904 -24354 1590 23713 10469 -15738 -16774 5239 18199
2002 18199 6761 -13525 -16914 2197 19334 9543 -15521 -18101 7770 24103 4135 -22601
2014 -22601 -13762 16082 20029 -6889 -21635 -3382 17830 12311 -7334 -13592 -2046 11656 11387
2027 11387 -4216 -15917 -5489 15031 13369 -10244 -18112 3585 20673 6346 -16585 -11598
2039 -11598 10714 14364 -2769 -12490 -3998 6415 6725 1383 -4319 -6466 1285 11115 5143 -12092
2053 -12092 -12360 8988 16343 -3839 -18107 -2704 16343 8731 -10075 -10417 4239 9005 533
2066 533 -5925 -4430 -537 4686 5799 -2583 -10356 -1516 13534 8756 -12721 -15063 6940 17078
2080 17078 -2222 -17393 -4375 13239 8280 -8068 -9604 2490 9115 3045 -5859 -9044 -2162
2093 -2162 8495 8313 -6204 -13810 374 16119 6157 -14990 -10973 11096 13513 -7305 -15956
2106 -15956 389 12992 4335 -7310 -5738 1139 4750 4921 526 -7195 -6929 5593 10574 -2996
2120 -2996 -14025 -1056 15851 7533 -13631 -11487 9416 14111 -2987 -11865 -2566 6174 4182
2133 4182 368 -1243 -3704 -1299 7265 6784 -7128 -11537 4600 16032 692 -17417 -7586 14920
2147 14920 14279 -6767 -14132 580 11953 4852 -6268 -7170 -109 6435 6261 -3270 -11351 -2322
2161 -2322 14303 11356 -10179 -17275 2940 18190 4272 -15093 -10367 9262 12302 -2900 -10797
2174 -10797 -2323 8149 7429 -1874 -9697 -7097 5055 12050 1565 -13669 -8581 10526 13555 -4959
2188 -4959 -14282 -384 12434 4555 -9621 -9079 2901 8415 3488 -4757 -7685 -2222 7453 8280
2202 8280 -3036 -12417 -3933 10799 7730 -9361 -11610 4957 13250 744 -11818 -5932 6819
2215 6819 8308 -737 -7403 -6359 1383 7605 4144 -5974 -7761 2848 10960 1968 -11639 -7434
2229 -7434 8477 11340 -3772 -12741 -2627 9987 7825 -3994 -7627 -1448 6007 5736 -1976 -8221
2243 -8221 -2978 7686 7744 -4595 -10683 -92 11326 6665 -7231 -9502 2562 10168 2359 -7594
2257 -7594 -5243 4349 7073 1136 -5274 -4028 2662 7434 2461 -6261 -6764 3344 8273 1359 -7197
2272 -7197 -4328 5786 7693 -1128 -7712 -2754 6082 5690 -2830 -7318 -2014 5563 5391 -1400 -5956
2287 -5956 -1738 5331 4922 -3005 -7285 -105 6561 3419 -5907 -7431 1678 8146 3261 -6405 -6367 2098
2303 2098 6569 471 -6499 -4000 3774 4943 -1745 -6487 -2300 5549 6546 -2225 -8172 -3042 5771
2318 5771 5090 -3456 -6262 423 5848 1923 -5392 -4507 3562 6596 103 -6756 -4902 2512 5976
2333 5976 1642 -4322 -4530 1993 5719 836 -5715 -2751 5359 5111 -4239 -8631 -410 8589 5632
2348 5632 -4601 -7557 267 6900 3294 -3846 -4488 1345 4929 1192 -5344 -5105 4051 9915 2063
2363 2063 -9336 -7230 6405 10594 -546 -9480 -3738 6905 5926 -3537 -6656 1480 8175 3893
2377 3893 -5778 -8289 398 8902 6169 -4718 -9909 -1202 9616 6128 -6608 -7719 4101 10083
2391 10083 -354 -10690 -5727 7704 10418 -1067 -10455 -5893 6434 10913 798 -9092 -6156
2404 -6156 5871 8541 -2819 -10937 -2850 11291 8841 -7908 -13293 309 13931 7341 -8518
2417 -8518 -11912 -448 10033 5425 -7011 -9125 2336 11234 3009 -11340 -10108 6760 14318
2430 14318 775 -14528 -9926 7951 12966 -1008 -11649 -4537 8062 7865 -3785 -9916 -2721
2443 -2721 8921 8453 -5064 -12925 -3352 11783 11022 -5288 -12984 -1718 10667 6314 -7319 -9762
2457 -9762 2709 10844 2495 -9561 -8148 5085 12005 3266 -9291 -9508 3096 11482 3087 -9767
2471 -9767 -7792 5895 10329 -1229 -10418 -3062 9644 9072 -4190 -11692 -3023 9461 8880 -3411
2485 -3411 -9724 -2311 8450 6801 -3983 -8339 589 9866 4307 -8243 -8956 4288 11223 3093
2499 3093 -8126 -6981 3482 8527 2247 -6030 -5227 3346 6758 -422 -7488 -3331 6758 8315
2513 8315 -2221 -9367 -3326 7306 7126 -3028 -8232 -1438 5702 3675 -3656 -4831 1460 6133
2527 6133 2316 -5254 -6614 1022 7519 2501 -6253 -6452 1914 6426 1036 -5124 -2875 3986 4382
2542 4382 -2592 -6525 -1207 5473 4239 -3066 -6238 -1605 4506 4411 -1656 -5153 -585 4452 1874
2557 1874 -4668 -4042 2729 5642 353 -5826 -4127 3390 5641 229 -5200 -3311 2696 3664 -949
2572 -949 -3969 -885 4258 3283 -2762 -5800 -84 6339 3503 -4428 -5640 691 5369 2443 -3039
2587 -3039 -3120 2044 4997 488 -5030 -3111 4181 5964 -428 -6371 -3328 4439 6534 24 -5764
2602 -5764 -2078 4758 4306 -2599 -5322 446 5539 3029 -3793 -5511 363 6636 4214 -3671 -6208
2617 -6208 245 6061 2701 -4296 -4767 2242 6128 1002 -5961 -4083 4492 7428 -1 -7136 -4242
2632 -4242 4182 5966 -662 -6284 -3200 4380 5359 -2007 -6576 -1383 5915 4714 -3965 -7312 -1197
2647 -1197 7074 5263 -4240 -7368 150 7113 3134 -5569 -5603 2361 6301 754 -6347 -4459 3531
2662 3531 6314 827 -6338 -4605 3190 5631 278 -5476 -3672 2869 5299 -855 -6006 -2139 5497
2677 5497 5179 -2576 -6352 -1238 4938 3783 -1955 -4692 -1376 3546 3544 -1434 -4090 -1142 3993 3292
2693 3292 -2602 -5552 -186 5919 3382 -3940 -5188 1497 5486 1676 -3860 -3210 1271 3665 1541
2708 1541 -3017 -3190 1969 5369 1250 -4316 -3554 2905 5720 130 -5301 -2318 3612 3457 -1572 -3145
2724 -3145 -155 2829 1795 -437 -1739 -867 1922 2849 -277 -4029 -1494 3483 3195 -2208 -3350 840
2740 840 3435 342 -2341 -1102 1217 961 -491 -285 -99 -1293 -125 2653 940 -3256 -2717 2811
2756 2811 3763 -2229 -4771 592 3760 407 -3257 -1027 1706 1242 -400 -1196 -958 -863 801 1999
2772 1999 -612 -3252 -641 3739 1861 -3634 -3743 2686 3597 -1674 -3954 16 2594 718 -1758
2787 -1758 -910 256 530 1069 664 -1487 -2398 951 2921 -416 -3835 -902 3740 2043 -3353 -2148
2803 -2148 2806 2845 -1438 -2282 604 1529 -237 -33 815 -1112 -1539 1614 3163 -1162 -3531 964 4529
2820 4529 378 -4363 -1168 4140 2306 -2896 -2616 2227 2888 -374 -1316 -43 -186 254 1743 1281
2836 1281 -2531 -2036 3325 3860 -2981 -4854 2396 6144 -447 -6185 -1487 5257 2961 -3362 -3551 1467
2852 1467 3270 341 -1376 -1249 -376 1284 2654 -370 -4748 -1634 5672 4066 -4683 -6285 2834
2867 2834 7409 -401 -7090 -2144 4917 3429 -2810 -4230 119 2967 2276 -888 -3382 -2742 2601
2882 2601 4864 -514 -6756 -2740 6674 5117 -4964 -7643 2101 7384 272 -6624 -3705 3056 4275
2897 4275 125 -3732 -3528 879 4912 2729 -4530 -6068 2154 8006 809 -8575 -5068 6802 7166
2912 7166 -3648 -8632 -393 7304 3621 -3667 -5289 -87 4453 4305 -1398 -6179 -2026 6748 5924
2927 5924 -4429 -8534 1022 9941 3870 -8125 -7354 4950 9228 39 -7518 -3212 4484 5837
2941 5837 323 -4922 -4022 3055 7335 1091 -8149 -5354 6679 9383 -2399 -10306 -1529 9261
2955 9261 5919 -5471 -7768 1375 7681 2504 -4895 -5253 1134 6217 3509 -4128 -6628 167 8333
2970 8333 3933 -6914 -7935 3493 8960 215 -8444 -3977 5974 6662 -1977 -7337 -2181 5054 5330
2985 5330 -1595 -6611 -2760 4867 6039 -1701 -7604 -2218 6957 5192 -4822 -7732 1312 7779 2449
3000 2449 -6287 -5684 2391 6122 1374 -4997 -5065 1685 6155 1240 -5843 -4934 3566 6845 -20 -7523
3016 -7523 -3689 5701 6281 -2748 -7396 -1138 5829 3997 -3383 -5404 220 5286 3370 -3286 -6164
3031 -6164 197 6568 3335 -5490 -6580 2219 7268 1505 -6370 -3970 4634 6151 -1384 -6359 -1872
3046 -1872 5157 4684 -2403 -5744 -1504 5053 4831 -2476 -6005 -442 6056 3771 -4202 -5474 1720
3061 1720 6788 1805 -5538 -4728 3203 6676 710 -5791 -3339 3622 5577 -308 -5843 -2642 4588
3076 4588 5523 -1697 -6488 -1526 5717 5085 -3484 -6737 -643 6009 3996 -3590 -5789 272 6527
3091 6527 3081 -5367 -5575 2380 7100 1706 -7164 -5885 3665 7589 538 -7018 -4188 4970 6626
3106 6626 -1808 -7278 -2299 5992 5335 -3266 -8016 -1644 7347 5999 -4735 -8418 -358 7480 3956
3121 3956 -5808 -6854 2055 7561 1778 -7094 -5566 3710 7982 393 -7542 -5227 3973 7589 -40
3136 -40 -7473 -4019 5277 6760 -2250 -8075 -1709 6948 5344 -3802 -7755 -731 7254 4758 -4190
3151 -4190 -7440 -540 7286 4377 -4807 -6918 1721 7621 2528 -6730 -6060 3666 8654 1335 -7632
3166 -7632 -4974 4449 7396 460 -6843 -3816 4737 6358 -1017 -7170 -2165 6493 6381 -3253 -8083
3181 -8083 -974 7512 5257 -4175 -6701 823 7012 2837 -4492 -5074 1781 6055 1576 -5474 -4834
3196 -4834 3049 7300 1322 -6424 -4779 3529 6631 -139 -6164 -2685 4166 4493 -2207 -5796 -1198
3211 -1198 5203 4006 -3031 -5916 -889 5444 4036 -3081 -5649 -273 4776 2308 -4054 -4749 1949
3226 1949 5418 183 -5322 -3296 2905 4929 -92 -5208 -3348 2574 4255 -348 -4755 -1856 3251
3241 3251 3162 -1771 -5000 -403 4924 2913 -3522 -5084 649 4742 1575 -3074 -3220 1209 3146 669
3257 669 -3026 -2441 2156 4018 -177 -4441 -2313 3062 4111 -660 -3942 -1387 3019 2944 -1768 -3315
3273 -3315 364 3496 1917 -2286 -3091 963 3626 1786 -2483 -3380 767 3959 1455 -2874 -2373 1827
3289 1827 3302 -558 -3221 -942 3231 2937 -938 -3943 -914 3104 2699 -821 -2762 -813 2792
3304 2792 2520 -1676 -2809 524 3713 1276 -3165 -3268 1697 3826 1120 -3098 -2600 1302 2936 766
3320 766 -2474 -1811 1508 2702 -234 -2694 -1539 2404 3280 -916 -4087 -1431 2999 3195 -1309 -3668
3336 -3668 -187 2464 1529 -1829 -2641 304 2643 1393 -2516 -2665 -9 2780 1285 -2367 -3089 446
3352 446 3002 1000 -2600 -2128 1629 2466 -763 -3241 -1340 1819 2009 -523 -2473 -1964 1468 2591
3368 2591 26 -2375 -1310 1637 2273 -542 -2642 2 2675 1829 -1798 -2763 335 2396 1416 -1091
3384 -1091 -1909 -52 1469 1398 -677 -1615 -15 2050 1227 -1301 -2305 544 2750 1173 -2178 -1933
3400 -1933 645 2378 1148 -1188 -1277 859 1616 716 -1037 -1467 834 2078 697 -1843 -1595 1455
3416 1455 2792 59 -2228 -1018 1401 1625 -326 -1284 -412 948 1089 -284 -1234 -1014 908 1859 323
3433 323 -2320 -1361 1732 2237 -654 -2401 -417 1953 856 -1563 -1412 415 1174 183 -868 -907 -115
3450 -115 1059 971 -307 -1622 -975 1427 1244 -1139 -2145 -169 1658 500 -1832 -1323 1211 1531 -518
3467 -518 -1171 -1073 259 1593 707 -1040 -1645 -14 1492 -27 -1373 -1071 954 1843 -448 -2050 -436
3484 -436 2009 1328 -1193 -1557 -216 899 908 -242 -1062 -675 1445 1215 -447 -1738 41 2102 1299
3501 1299 -1498 -1555 915 2157 299 -1118 -718 952 817 -333 -571 31 297 994 699 -628 -1133
3518 -1133 650 2076 432 -1851 -964 1967 1517 -832 -1530 245 1544 462 -877 -629 696 630
3534 630 136 -273 -696 -276 514 1291 -389 -1817 -43 2077 921 -1734 -1099 1783 2140 -838 -2100
3551 -2100 -288 1723 653 -1027 -1308 20 1260 669 -597 -1377 -600 1272 1372 -932 -2442 -53
3567 -53 2849 560 -2606 -1822 1937 2218 -955 -2555 -543 1621 1193 -737 -1745 -570 1236 1427
3583 1427 -493 -2412 -1165 1884 2277 -1223 -3101 -248 3062 1296 -2845 -2474 1481 2612 -274
3598 -274 -2419 -901 1238 2047 282 -1810 -1732 732 2599 548 -2776 -2028 2247 3539 -638 -3765
3614 -3765 -1240 3586 2684 -1848 -3128 437 3211 1256 -1692 -1953 -29 2316 1865 -1326 -3385 -312
3630 -312 3818 2118 -2964 -3543 1791 4587 615 -4319 -2323 2796 3646 -680 -3217 -1133 2338 2847
3646 2847 -438 -2823 -1683 2244 3454 -652 -4454 -1330 4226 3500 -2753 -4701 649 4825 1715
3661 1715 -3566 -3269 1745 3668 837 -3071 -2284 1351 3264 929 -2734 -3277 1236 4264 569 -4582
3677 -4582 -2536 2995 4291 -1742 -4670 -910 3704 2069 -2051 -3423 -179 2685 1631 -1492 -3047
3692 -3047 -615 2973 2278 -2264 -3646 -164 4274 1519 -4165 -3750 1936 4139 -240 -3796 -1749
3707 -1749 2195 2458 -692 -2744 -1642 1596 2799 321 -3263 -1476 2414 3147 -709 -3956 -515
3722 -515 3644 2156 -2082 -3190 925 2604 822 -2236 -1282 950 2578 1350 -2288 -1964 1052 3124
3738 3124 248 -2781 -1702 1721 3524 -454 -3201 -1125 3259 2447 -2009 -2276 360 2933 212
3753 212 -2407 -1759 402 1854 1626 -1007 -1627 776 2646 907 -2897 -2224 1843 2542 -189 -1992
3769 -1992 -1587 2307 2391 -923 -1907 152 2227 1153 -1475 -1920 411 1349 1475 -985 -1582 -875 2936
3786 2936 1488 -1900 -1891 1550 2445 -85 -1592 -1058 125 1952 -139 -1690 -1292 1422 1877 713 -1939
3803 -1939 -934 2365 2351 -878 -2895 558 2232 2370 -2223 -2884 198 2377 1599 -1737 -1919 -233
3819 -233 2724 1345 -2419 -2098 988 2401 1634 -2401 -2300 1404 2463 -224 -3284 -2241 2123 2400
3835 2400 264 -1763 -841 2018 1753 263 -2276 -1581 2413 2867 -446 -1990 -493 2736 1561 -1688
3851 -1688 -2489 60 2758 1272 -1704 -1985 718 2691 1114 -2167 -1749 930 3012 1028 -2093 -2276
3867 -2276 1274 2844 255 -2461 -1310 1975 2323 -260 -1898 -794 1613 1932 -627 -2656 -609
3882 -609 2369 2070 -890 -2363 -483 1984 1854 -1417 -2247 402 2166 688 -1815 -1783 742 1983
3898 1983 439 -1850 -1785 866 2118 430 -1973 -1743 807 1676 307 -1977 -1390 1314 1810 -170
3914 -170 -2352 -847 1558 1609 -425 -1640 -853 1351 1114 -796 -2003 -369 1689 983 -1011 -2145
3930 -2145 202 2048 891 -1352 -1844 569 1868 825 -1079 -1357 306 1360 143 -1154 -951 757
3946 757 1491 107 -1601 -685 1072 1746 -186 -1412 -355 1050 901 -485 -762 -396 872 767 -395
3963 -395 -1292 242 1251 625 -747 -1095 -55 1176 718 -505 -717 256 1059 116 -959 -89 802 1100
3981 1100 -189 -500 -685 630 1300 114 -518 -641 393 593 -138 -746 202 887 636 -357 -994 219
3999 219 1157 422 -607 -841 -175 401 588 -307 -625 117 870 172 -574 -872 832 1190 -300 -1119 -851
4018 -851 569 811 -370 -547 -172 343 394 -455 -762 -512 433 978 -453 -1388 -244 1313 865 -697
4036 -697 -1398 210 845 225 -749 -850 56 788 -5 -781 -896 358 1075 251 -1011 -1215 310 1492
4054 1492 353 -1318 -735 750 1181 -657 -1165 116 970 338 -247 -1021 -512 739 725 -237 -1302 -714
4072 -714 1258 1236 -556 -1437 -184 1630 1006 -1516 -1299 804 2005 433 -1237 -1176 749 1648 861
4089 861 -595 -1254 517 1659 475 -1318 -982 1507 2017 -613 -1657 -740 1381 1704 -843 -2077
4105 -2077 -506 1837 1320 -57 -715 -609 2111 1403 -1237 -1785 -379 2126 1189 -2023 -2617 313 2170
4122 2170 1049 -1566 -1450 681 1984 663 -1824 -1987 834 2317 973 -2095 -2621 1231 3204 311
4138 311 -3081 -1595 1785 2479 -594 -3051 -917 2561 1155 -1005 -2293 152 2211 587 -2234
4153 -2234 -1702 -462 3006 1523 -1304 -1748 -254 3002 451 -2725 -2956 1727 2523 393 -2545 -910
4169 -910 2262 1551 -1008 -2200 -1344 1301 2188 -88 -2622 -63 2420 1999 -805 -2246 -34 2835
4185 2835 1244 -2119 -2085 431 3125 1147 -1154 -1347 651 2268 1276 -2006 -1801 1330 3049 681
4201 681 -2626 -1236 1950 3135 57 -2709 -1151 1929 1549 -1030 -1709 89 1940 1229 -1622 -1816
4217 -1816 540 1606 1502 -881 -2302 -250 3298 869 -2370 -1620 961 2908 -164 -2549 -1056
4232 -1056 2152 2572 -774 -1923 -155 1113 1433 -682 -2136 -767 1816 1363 -967 -2591 -443 2961
4248 2961 1576 -2425 -2512 1589 2734 437 -2723 -1660 1516 1963 -59 -2326 -1461 1020 1887 55
4264 55 -2468 -971 1682 1869 -1097 -3145 -621 2470 1892 -1606 -2346 794 2575 964 -2098 -1646
4280 -1646 1065 2178 8 -1638 -1845 727 2249 538 -2008 -1801 1420 2641 65 -2917 -1808
4295 -1808 1990 2892 -961 -2660 -235 2678 2142 -1056 -2330 -433 2186 2241 -1024 -2735 37 2999
4311 2999 1082 -1708 -2374 738 3124 585 -2599 -2631 1541 3020 43 -2477 -1255 2131 2078 -626
4327 -626 -2197 -896 1948 1703 -88 -2526 -493 2292 2509 -1237 -2416 -428 2908 1506 -1449 -2593
4343 -2593 0 2915 860 -2057 -1795 761 2936 525 -1590 -1946 1157 1999 471 -1609 -1687 1577
4359 1577 2879 -476 -2210 -1790 1806 2276 -1315 -2678 -799 2509 1831 -390 -2733 -130 1900 1950
4375 1950 -335 -1645 92 2648 2360 -1874 -3040 33 3508 908 -2193 -1569 1348 1895 132 -3408
4391 -3408 -1284 1282 2228 -877 -1413 -744 1372 1907 -278 -3132 -381 1478 1604 -1377 -3139 -37
4407 -37 2505 1402 -1567 -2032 579 1383 497 -1077 -843 454 861 530 -1320 -1401 876 1997 436
4424 436 -1513 -1485 1404 2381 -245 -2117 -1114 1127 932 -1101 -1691 473 1469 1344 -686 -1122 116
4441 116 1595 1022 -738 -1451 587 1646 913 -1352 -1284 826 2038 66 -1749 -708 1596 1214 -832
4458 -832 -1240 -28 1485 754 -586 -1438 -519 1356 1166 -754 -1654 285 1882 678 -1676 -1373 714
4475 714 1437 -402 -1496 -750 970 754 -554 -1170 -500 548 856 11 -1178 -840 997 1344 -471
4492 -471 -1587 -218 1302 578 -1495 -1422 470 1551 132 -1163 -939 315 1366 -105 -951 -1034 403
4509 403 1212 477 -1233 -1143 829 1662 -455 -1641 -647 1302 1015 -809 -1235 334 1099 489 -621 -1105
4527 -1105 212 1289 378 -939 -892 203 1488 546 -921 -963 293 1478 224 -1189 -446 942 1043
4544 1043 -239 -971 -539 1015 993 -125 -1098 -259 1139 816 -320 -955 -40 1097 227 -666 -760 156
4562 156 804 393 -881 -594 484 728 272 -429 -279 315 376 383 -671 -474 409 489 -252 -560 -317 475
4582 475 469 -228 -797 -233 309 346 -293 -367 5 332 67 34 -113 -117 248 258 -110 -106 7 151 64 116 -155 -403
4606 -403 -46 -378 -54 63 -141 -418 -207 -118 184 -366 -134 -59 424 -250 -443 -229 161 52 -137 -445 18
4627 18 -184 120 -101 -737 113 426 395 -255 -351 -79 490 217 -278 -658 -215 879 294 -612 -472 90 501
4648 501 166 -333 -351 623 606 220 -899 -524 654 832 -132 -697 -499 567 858 -229 -642 9 425
4667 425 711 10 -524 186 572 619 -374 -750 177 1229 745 -416 -633 297 1221 -28 -864 -773 499
4686 499 1008 -75 -1541 -397 555 960 240 -873 -405 515 720 -249 -1143 17 847 815 -544 -1356
4704 -1356 142 866 555 -742 -894 406 1168 283 -1068 -801 256 903 -51 -1062 -506 284 695 -102
4722 -102 -1235 -542 1108 1017 -557 -960 13 675 373 -560 -1100 -134 947 663 -858 -1030 286 1025
4740 1025 -8 -1049 -725 420 808 84 -1067 -904 859 1123 -153 -1222 -161 922 625 -496
4756 -496 -984 0 1123 829 -675 -1094 -27 1309 215 -783 -958 480 1071 459 -690 -700 559 1269
4774 1269 187 -1033 -429 749 1038 -110 -980 -205 1209 1173 -337 -1267 -62 1657 955 -1039 -1252
4791 -1252 183 1283 692 -718 -963 544 1354 649 -924 -1009 543 1286 105 -1092 -994 529 1692
4808 1692 120 -1309 -848 937 1145 -465 -1658 -525 1152 1074 -501 -1664 -389 1942 1193 -941
4824 -941 -1891 87 1439 773 -1179 -1286 505 1240 107 -1573 -1427 552 1539 464 -1432 -1294 803
4841 803 1724 107 -1865 -983 1381 1304 -793 -1379 -132 1725 732 -805 -1576 -97 1464 1063 -685
4858 -685 -1592 -253 1395 887 -1051 -1480 254 1670 686 -1654 -1411 887 1795 94 -1524 -866 1087
4875 1087 1485 160 -1414 -837 1243 1654 -110 -2170 -273 2103 1561 -984 -1983 -341 2031 1065
4891 1065 -1294 -1713 768 1847 306 -1202 -1066 756 1533 650 -1334 -1472 816 1643 528 -1764
4907 -1764 -1420 1624 1518 -370 -1780 -287 1009 935 -843 -1603 -105 1228 951 -1040 -1513 -205 1279
4924 1279 863 -1062 -1788 -22 1942 918 -1770 -1297 1279 1888 339 -1759 -924 1012 1289 -324
4940 -324 -1842 -664 690 1104 -315 -1504 -561 1337 1392 -883 -1986 -122 1658 938 -1714 -1684 719
4957 719 1677 261 -1310 -853 543 1292 -343 -1627 -1086 538 1511 96 -1574 -876 1010 1369 -749
4974 -749 -1775 -544 1537 717 -1329 -1330 193 1633 243 -1006 -696 414 1341 501 -588 -991 333
4991 333 1654 564 -1542 -1212 1179 1538 -188 -1389 -516 1664 1006 -984 -1497 -176 1585 1174 -620
5008 -620 -1479 -45 1058 1470 -846 -1467 191 2066 424 -1301 -951 963 2056 274 -1457 -806
5024 -806 1150 1426 -166 -1344 -512 929 1152 -423 -1601 -749 1032 1175 -198 -1517 -176 1554
5040 1554 1179 -1069 -1514 387 1302 192 -1096 -1057 167 1300 256 -986 -816 470 1166 163 -973
5057 -973 -1167 599 1272 -67 -1563 -725 1423 810 -863 -1047 -69 787 721 -583 -1158 -123 855 746
5075 746 -1046 -998 186 740 151 -470 -1177 177 1129 355 -1153 -828 620 938 -112 -1169 -314 588
5093 588 653 -257 -1168 -352 635 1233 -256 -1147 -144 797 780 -367 -791 -176 723 581 -439 -940 401
5112 401 1072 342 -595 -297 402 828 136 -573 -283 309 568 -25 -663 -336 802 795 166 -727 -295 544
5132 544 521 -289 -792 -99 820 233 -379 -210 327 481 111 -354 -415 -42 558 154 -549 -651 235 405 -169
5153 -169 -541 -611 201 343 -296 -664 -231 430 285 -133 -407 126 149 296 -255 -434 -425 342 208 -644 -547 49
5175 49 501 -101 -598 -243 -17 462 -172 -307 -70 420 343 148 29 -256 -166 384 -13 -552 -134 295 229
5196 229 100 -317 65 453 157 -186 -198 -93 259 162 -258 -158 138 161 219 -122 -42 79 204 381 -141 -415
5218 -415 298 373 375 -230 -18 203 449 -82 -233 -58 -192 148 -211 -99 76 198 -35 -60 -111 -252 387 312
5240 312 51 64 -141 218 146 -287 -100 -55 -35 359 212 -7 199 12 286 100 96 58 262 151 -55 -202
5262 -202 -50 191 67 -198 41 262 222 48 -43 -154 78 101 0 -226 -297 -7 -10 0 -118 -252 0 82 100
5285 100 -20 -332 -70 293 10 -227 -299 -66 259 -134 -72 -276 -137 142 100 -478 -502 7 59 -69 -163 -161 161
5308 161 238 278 -382 -86 184 207 -149 -120 -148 428 386 -110 -474 -458 148 574 -201 -81 -13 387 221 -161 -312
5331 -312 -169 460 -65 -165 -169 397 437 271 -527 -570 51 159 309 -436 -264 545 363 132 -540 -137 285
5352 285 687 -308 -308 -126 282 174 -441 -373 150 346 357 -115 -254 -25 627 428 -560 -670 149 668 391
5373 391 -320 -307 199 472 136 -452 -242 -137 488 93 -181 -365 417 739 -32 -369 -388 470 344 -479 -363
5394 -363 -147 409 517 -623 -278 -289 654 199 -295 -295 39 534 238 -731 -612 214 568 77 -243 -285 281
5415 281 398 83 -739 -548 434 270 -226 -540 -183 673 599 -114 -856 -143 578 533 -456 -1025 316 841
5435 841 403 -778 -419 270 798 100 -511 -457 485 275 -64 -479 -293 358 836 262 -844 -384 902
5454 902 869 -324 -825 186 1027 370 -711 -550 277 769 145 -415 -411 350 968 167 -722 -424 320 979
5474 979 -5 -674 -600 714 592 -79 -1008 -184 748 435 -152 -788 -22 560 451 -692 -690 -55 606 333
5494 333 -890 -691 114 751 206 -1006 -411 391 664 -126 -761 -189 541 879 -42 -686 -256 582 843
5513 843 -747 -1130 -276 1000 853 -690 -892 -167 950 514 -785 -719 561 1073 -124 -955 -705 435
5531 435 655 59 -717 -518 747 786 -402 -874 -233 537 274 -139 -797 -225 1014 485 -640 -876 72
5550 72 1015 302 -627 -577 335 538 189 -624 -635 429 829 -122 -641 -403 539 991 -204 -841 -532 429
5570 429 775 -176 -759 184 557 748 -476 -841 182 861 520 -449 -529 306 798 203 -373 -323 607 819
5590 819 132 -881 -468 666 800 68 -631 195 905 761 -551 -766 90 279 323 -452 -351 360 295 458
5610 458 -573 -628 -152 521 281 -590 -463 36 579 125 -311 -655 142 570 -102 -870 -83 314 340 76
5630 76 -472 -271 380 497 -140 -693 -124 780 -1 -554 -401 83 291 210 -493 -282 -118 420 160 -365 -667
5651 -667 -25 351 -60 -748 -419 57 247 77 -608 -310 544 531 -890 -858 249 -98 -67 -203 -150 -196 417
5672 417 135 -378 51 28 234 203 -678 -594 157 610 155 -540 -356 624 451 116 124 -178 754 561 588 -368
5694 -368 160 522 759 -68 -1203 45 570 354 -378 -409 359 399 714 -942 -610 36 509 -266 -308 -110
5714 -110 753 1013 692 54 -671 186 343 -26 -117 -69 687 548 253 -440 322 475 316 -6 -763 19 -241
5735 -241 -5 -158 87 185 266 326 -589 -816 -135 1023 -282 -585 169 667 327 -675 -2395 -831 1570
5754 1570 -189 488 -516 -3 902 -723 -93 -682 -446 917 447 177 -15 -236 134 -135 -1086 -110
5772 -110 116 429 -495 -496 -56 96 -386 368 410 -189 178 -252 -778 -191 -70 106 -325 -932 -456 -477 254
5793 254 -515 -578 98 649 -293 422 781 -655 113 -511 531 141 198 -329 -574 -322 260 66 102 417
5813 417 -449 -496 124 484 161 -221 162 773 -411 -812 539 -128 84 600 -629 40 -446 67 404
5832 404 -846 -409 522 24 -175 -312 404 680 514 16 107 -734 1403 136 -56 -228 -571 187 917
5851 917 2 -549 -49 197 -33 -777 -633 247 140 740 -851 422 -303 681 71 -424 -362 581 133 -579
5871 -579 94 -726 907 204 -1122 -601 -5 -317 -541 -626 77 156 -305 161 414 -876 772 -100 279
5890 279 195 -759 951 -129 -874 -348 -907 486 308 340 -352 -268 478 406 -175 373 230 756 114 -535
5910 -535 708 729 -764 549 -408 -301 658 927 -864 -536 509 -737 -185 -415 -399 1142 670 777
5928 777 -722 -454 -49 782 885 -1043 461 356 716 121 -630 798 361 1195 -551 330 -228 789
5946 789 110 -225 859 2326 323 -706 -808 -319 822 392 288 -1088 -240 573 1038 690 -75 -615
5964 -615 371 1142 -20 -380 -1406 432 162 -475 -31 -361 516 8 -18 -769 525 593 1018 -467 -244
5983 -244 428 449 130 -223 -479 309 856 421 -271 -279 515 305 -591 -710 -261 529 266 -71 -718 -302 439
6004 439 334 438 -446 457 474 365 -397 -423 362 290 236 -577 -323 284 677 44 -822 -454 546 581 -88
6025 -88 -433 -5 516 533 -11 -565 110 762 420 -258 -522 -32 893 225 -487 -328 483 500 159 -444 -190
6046 -190 401 846 274 -628 -196 474 557 -66 -714 -281 577 549 -146 -605 147 693 350 -673 -328 223
6066 223 941 194 -581 -294 218 322 427 -368 -525 456 641 -172 -761 -504 557 436 -246 -408 -283 364
6086 364 334 -416 -360 -216 202 346 -162 -413 -220 342 527 -468 -937 241 687 31 -682 -239 128 695
6106 695 -57 -594 -365 481 330 -335 -323 -83 333 643 62 -273 -124 459 303 -492 -561 -69 553 120 -545
6127 -545 -180 469 438 -80 -237 -410 343 663 264 -521 -490 562 383 -209 -279 149 479 445 -512 -464 52
6148 52 634 349 -368 -235 398 424 175 -354 -218 255 603 219 -611 -410 381 952 -255 -168 -408 384 273
6169 273 -310 -708 -83 281 342 -383 -286 -253 311 487 -265 -236 137 307 222 -498 -298 215 572 245 -613 -293
6191 -293 286 121 59 -259 -314 105 214 -92 -409 -414 342 674 -202 -766 -301 411 423 -314 -497 264 277 12
6213 12 -248 -156 187 401 402 -237 -154 250 538 204 -308 -425 197 149 -211 -503 -295 468 330 -265 -581 411
6235 411 167 367 -424 -488 -207 506 4 -30 -485 143 763 147 -418 -395 111 220 86 -250 -345 371 482
6256 482 78 -300 61 479 256 -231 -56 114 198 144 -186 -318 157 713 396 -315 -370 136 358 31 -686
6277 -686 -138 261 116 100 -443 -333 547 454 -214 -269 -343 272 74 -267 -465 141 567 421 -423 -743 187
6298 187 235 62 -237 -299 159 489 54 -528 -572 -7 495 -34 -208 -136 234 318 -156 -583 -165 359 310 -419
6320 -419 -215 45 589 178 -683 -474 18 291 80 -301 -673 288 478 -51 -406 -73 154 544 -99 -311
6340 -311 -438 459 286 -371 -914 97 423 -69 -380 -526 161 331 372 -482 -330 85 256 171 -401 -382 271
6361 271 293 -4 -456 -320 424 537 50 -697 -113 299 357 -325 -301 41 452 100 -171 -174 -50 117 169 -30
6383 -30 -201 245 481 330 -279 -345 262 689 -75 -781 -332 707 344 -312 -314 -221 209 23 -49 -439 238 301
6405 301 76 -256 -398 329 246 419 -547 -400 175 466 161 -462 -6 622 65 -371 -303 -122 362 229 -205
6426 -205 -715 153 377 384 -489 -423 96 569 162 -515 -160 203 640 -92 -556 96 362 -24 -198 -191 -39 -106
6448 -106 10 147 -531 -65 404 472 -646 -395 494 309 360 -311 -272 422 292 -249 -396 -230 370 235 -66
6469 -66 -649 -69 238 394 245 -485 -167 472 484 -275 -290 325 404 301 -318 -456 199 338 236 -98 178
6490 178 79 592 86 16 -167 311 299 -183 -195 170 330 300 -429 -418 79 604 54 -95 82 143 152 99 -405
6513 -405 -106 184 289 -89 -280 -227 353 188 40 -405 -118 467 571 -75 -232 347 381 53 13 -257 58
6534 58 14 266 -21 -485 -227 100 125 -388 -277 128 484 67 -12 -214 38 160 -51 -174 -71 129 174 -238
6556 -238 -43 -566 335 -161 -132 -475 60 381 -13 -373 -457 -24 227 408 -351 -469 -163 2 -54 -303 -368
6577 -368 -24 -113 -30 -237 -131 -89 331 217 46 -315 58 203 -235 -395 211 317 -173 -90 46 19 257 -16
6599 -16 -362 -199 187 297 169 -109 -114 207 467 333 -13 -1 352 148 38 -164 -462 247 189 -305 -298 83
6621 83 496 -51 -93 -122 31 652 -114 -512 -313 466 292 234 -288 -192 373 275 -160 -211 53 14 154 219 -243
6644 -243 -282 25 49 -377 -319 -195 289 3 -323 -102 -99 241 170 -270 -339 11 117 287 -451 216 1 324
6666 324 -232 -256 -174 419 292 -14 -440 -67 390 -37 -66 -52 30 258 327 123 -394 -150 257 217 -442 -77
6688 -77 431 158 -10 -66 -157 253 110 -268 -321 -83 368 129 -69 -311 303 66 139 -63 69 -75 562 12
6710 12 -91 -146 162 349 -58 -157 -292 5 234 -16 -338 0 -143 1 94 -245 284 -60 354 51 -244
6731 -244 -220 328 134 -164 -190 -28 223 139 49 -69 471 229 223 -539 -180 461 331 -83 -306 -155 108 26
6753 26 16 -429 -183 374 120 -145 84 -17 466 257 45 -292 61 111 -13 -274 -350 -44 125 -43 -41 -163
6775 -163 993 122 -628 -423 -494 -10 -90 -302 -143 9 401 -114 -203 223 -114 97 206 -405 -516 546
6795 546 438 -349 189 -125 -497 47 -540 -328 -373 328 191 -149 182 157 171 -183 210 -332 8 615 185
6816 185 -768 129 342 243 -140 123 -418 229 98 23 -48 -208 -136 136 151 208 248 -212 178 576 -491 87
6838 87 143 252 -640 200 -1595 266 332 -307 -454 3 338 616 90 -46 1040 81 255 -405 339 241
6858 241 215 -1136 -198 -33 324 -116 -618 -23 231 -356 -90 -281 -253 -232 585 -720 -805 -161 -455 551
6878 551 480 -116 -234 337 -542 -391 -570 748 788 299 -72 -447 19 1006 -571 -422 -203 316 299 390 -395
6899 -395 314 936 491 896 103 -153 67 209 388 100 -274 17 -422 8 -314 -48 367 -402 -374 -30
6919 -30 784 -17 194 -183 137 502 -139 -265 -394 -364 220 182 259 -339 157 472 640 286 -122 49 356
6940 356 131 469 -206 369 966 -201 -444 -35 157 150 426 -600 -59 531 22 228 -386 -372 387 581
6960 581 21 -495 300 743 331 -370 -662 215 376 -26 -337 242 31 172 162 -81 -249 56 579 -120
6980 -120 -265 119 390 395 -35 -272 -89 584 501 -511 -332 205 -94 -89 -401 -528 244 -38 -9 -274 -618 -51
7002 -51 577 185 -478 -621 541 357 -62 -523 -295 414 456 -226 -583 -410 304 211 -292 -423 -402 331 524
7023 524 -78 -630 -251 490 -63 -346 -276 -40 305 337 -113 -441 239 295 -270 -97 -292 288 291 -56 -189 -344
7045 -344 -254 634 -237 -623 -40 262 189 -309 -375 -60 480 122 25 -275 132 357 -94 -527 22 243 491
7066 491 -8 -141 -408 42 543 -4 -157 -175 621 515 17 -417 -143 41 183 -144 -368 -125 298 28
7086 28 47 -430 95 626 358 -75 -406 101 279 204 -464 -337 315 596 -165 -497 98 225 113 -368 -168
7107 -168 -114 224 184 -112 -498 15 420 32 94 -345 -192 257 66 -365 -180 223 350 -40 -436 -389 54
7128 54 -210 -191 -200 -465 470 503 -192 23 -377 -297 137 -154 -507 202 468 239 -142 -266 140 379 -47 -287
7150 -287 -222 -15 382 58 -164 -124 -61 307 300 2 -330 170 585 187 -303 -391 335 643 -244 -378 -204 482
7172 482 310 -367 -489 15 252 236 -348 -400 -214 401 215 -553 -428 432 713 221 -360 97 559 158 202
7193 202 -149 -136 545 112 -26 -289 -64 282 328 -436 -637 -145 576 351 -135 -574 -3 217 338 65 -313
7214 -313 97 163 -3 -317 -159 -153 221 88 -348 -13 499 549 42 -532 -88 247 -46 -129 -443 -96 287 346
7236 346 13 -168 -140 318 356 -155 -350 112 219 97 -172 -266 11 666 -129 -407 -33 373 133 -58 -216
7257 -216 -185 243 -10 5 -188 47 192 144 -258 -55 160 390 -54 -76 -155 415 116 94 -135 -300 234 232 22
7280 22 -270 124 118 -20 14 -250 -516 227 318 -89 -112 200 363 152 -40 -294 517 174 150 -137 -240 483
7302 483 519 -466 -218 57 357 89 -37 81 -140 -28 39 -175 -108 -277 752 107 -237 -212 153 239 -476
7323 -476 -51 86 230 -119 436 248 -6 144 35 -173 -274 164 -7 529 -476 172 30 231 39 -113
7343 -113 -28 -287 470 -166 -173 415 543 -198 -26 -307 -43 149 -233 38 256 -334 -175 -33 -316 -148 101
7364 101 -103 24 -60 -449 311 -97 -354 80 164 -278 337 52 -99 258 449 -94 -267 -50 -4 -339 -72
7385 -72 112 -390 587 487 -423 -216 39 164 120 306 -303 417 397 -73 -43 -105 400 415 57 191 625 393
7407 393 283 -32 -603 63 646 -193 -249 -139 157 -51 170 -286 79 -573 769 26 140 104 -341 -39
7427 -39 166 -222 -867 9 162 -177 -202 -173 -239 -111 -37 -272 -54 -157 289 -217 327 -270 48 -18 396 -164
7449 -164 -30 194 648 197 -594 -355 110 42 -670 -20 132 383 28 -180 -316 -207 -230 2 -631 933
7469 933 -56 312 185 -714 94 160 710 -132 -171 -122 322 -107 383 171 -115 -104 100 -21 -201 339 -27
7490 -27 -35 -322 -304 101 155 -36 -324 -535 -165 164 214 165 241 349 -258 -167 135 245 424 -160 -505 -372 466
7513 466 244 264 -627 -782 240 18 630 -243 -127 566 251 -181 35 133 588 167 -184 -461 34 447
7533 447 433 271 -190 -61 673 -101 -206 -134 219 508 -29 -265 -401 522 332 146 -176 -328 -62 299 374
7554 374 -462 69 -143 468 -252 -328 -245 504 102 -668 -684 -79 427 227 -151 -94 466 358 -92 -319 299
7575 299 39 -4 294 105 -549 82 281 157 -308 -385 601 258 -372 -813 -123 83 608 80 -270 -107 141
7596 141 204 -68 -102 264 693 517 -473 -757 302 636 118 -652 -674 228 792 -102 -339 83 -95 169 -257
7617 -257 -73 -141 562 1055 -78 -261 87 626 501 -262 -560 -9 349 153 -22 -315 178 706 136 -188
7637 -188 -371 345 611 345 -528 -140 822 373 -128 -881 -348 682 640 -273 -522 -254 684 138 255 -680
7657 -680 -106 582 176 -455 -541 255 518 78 -660 -395 167 450 306 -619 -358 358 397 -160 -526 -349 378
7678 378 482 -223 -374 -181 288 377 -285 -753 -6 406 520 -417 -973 34 308 151 -519 -293 68 649
7698 649 52 -607 -273 107 687 -205 -826 -259 321 673 131 -753 -143 302 691 225 -746 -421 700 782
7718 782 -362 -328 73 387 573 -366 -487 156 538 341 -215 -410 105 475 227 -604 -582 235 327 -108 -662
7739 -662 -304 473 394 27 -352 -74 532 527 -45 -486 -196 303 221 51 -554 -9 324 490 -479 -275 209
7760 209 619 86 -245 -299 383 771 125 -425 -123 199 415 140 -150 -87 113 410 104 -532 -172 551 174
7781 174 -88 -730 298 257 219 -419 -299 142 241 384 -294 -66 -127 337 4 -516 -128 318 337 29 -522
7802 -522 -189 381 317 -276 -567 -96 7 289 12 -204 -168 429 -86 -260 -335 58 213 121 -538 -165 122
7823 122 403 72 -312 -52 -47 272 -107 -414 -188 50 -82 205 -73 -223 81 -9 112 -27 170 381 204
7844 204 5 -401 -98 162 197 -462 -200 120 127 -10 -104 6 165 338 -46 -131 -346 293 267 150 -389 -152
7866 -152 361 346 -68 -201 -193 266 237 -222 -625 -73 214 55 -408 -354 167 -16 207 33 -227 -162 369 32
7888 32 -378 -423 -131 -88 -76 -239 -44 -10 89 338 -363 190 107 318 -96 12 -226 54 110 50 -89 65 635
7911 635 234 69 167 200 170 24 -182 -33 3 340 -86 118 53 -259 63 83 -40 -81 -163 269 153 -175 16
7934 16 50 21 -176 -353 -276 212 -37 16 -88 -321 -87 -58 45 15 -349 -79 -41 361 99 -179 -9 76 14
7957 14 -64 -60 143 15 39 -135 -93 112 175 270 -99 33 380 149 89 -120 -195 21 184 27 -160 -199 -32 154
7981 154 39 -222 -284 26 136 222 -272 -83 197 329 -144 -299 77 87 206 -193 -136 47 545 8 -319
8002 -319 15 32 383 39 -90 42 368 449 91 -100 -431 200 284 159 -464 59 9 180 6 -226 71
8023 71 171 214 -437 -297 72 54 52 -206 -112 -238 96 157 -151 -227 97 560 248 -96 -145 343 243 -264 -89
8046 -89 -368 -34 -26 -259 -177 -472 51 283 52 -393 -50 -7 247 162 -354 -28 218 107 -140 -156 148 568
8068 568 467 63 -46 -232 443 356 -458 -415 237 243 -90 -327 -27 -4 589 140 -428 119 380 261 -55 -435
8090 -435 16 171 230 -130 -179 -367 148 342 -377 -341 203 656 212 -258 -345 -104 508 -45 -429 -300 113
8111 113 648 86 -426 -182 252 738 280 -151 -10 168 568 -151 -299 -67 507 238 -496 -616 80 487
8131 487 376 -419 -644 1 546 323 -617 -558 -75 741 259 -555 -507 439 564 271 -885 -312 557 541 46
8152 46 -465 -189 359 562 -330 -577 -274 644 445 -415 -322 11 517 98 -406 -731 35 237 -5 -403 -455
8173 -455 219 316 178 -682 -490 274 596 -42 -783 -343 213 495 -131 -818 -125 417 468 -63
8191f3
$$ Imaginary data points
##PAGE= N=2
##DATA TABLE= (X++(I..I)), XYDATA
0 0 0 0 0 -1 8 -8 8 -16 24 -24 32 -44 55 -64 80 -96 115 -138 167 -193 227 -268 308 -353 409 -471 535
27 535 -608 695 -783 880 -991 1113 -1244 1389 -1552 1723 -1916 2129 -2359 2611 -2895 3203
43 3203 -3545 3931 -4359 4839 -5386 6017 -6742 7596 -8617 9863 -11418 13429 -16150
56 -16150 20036 -26097 36907 -61945 236461 -234687 -837270 32801 608694 190392 -458094
67 -458094 -262441 242333 292159 -90637 -205085 -78089 105541 249154 158882 -250227
77 -250227 -407672 -2204 462878 222435 -387788 -350589 264456 376478 -105629 -329190
87 -329190 14600 295814 85764 -225874 -191194 -14634 122350 201881 58681 -227523
97 -227523 -220543 136154 337850 16596 -346498 -128399 267839 145014 -232399 -227225 123553
108 123553 282784 51591 -179175 -151268 -9306 157399 200310 -69971 -326756 -121257
118 -121257 288171 242621 -232646 -320026 204784 425384 -75579 -448418 -102185 366788
128 366788 228802 -242955 -286967 57134 197168 67823 -49818 -76297 -19888 86462
138 86462 108580 -57207 -225496 -51688 274860 154902 -262132 -257022 169946 328267 -14211
149 -14211 -274035 -47423 207079 59568 -150958 -95822 55896 84440 16792 -21749 -36941
160 -36941 -49462 55823 161576 9558 -196087 -98754 147529 137068 -118891 -175532 84239
171 84239 200992 -2986 -146620 -43052 100249 91640 -29720 -95831 -62139 11396 90393
182 90393 58538 -85449 -92768 83716 157822 -8689 -179048 -69064 159330 110876 -128388
193 -128388 -159842 28616 145411 60331 -78113 -74484 30668 90269 47991 -81374 -142874
204 -142874 9712 162212 56455 -156006 -143508 106798 217162 -7842 -195525 -58846
214 -58846 141976 96435 -102532 -152850 12157 131182 59297 -60720 -101480 -17579 121154
225 121154 114526 -60227 -166973 -48028 140542 98012 -125288 -146997 73334 179344 24058
236 24058 -153055 -94768 108292 141420 -28095 -145734 -89091 61044 123426 15994 -101981
247 -101981 -62418 76916 127123 -12996 -149198 -52087 125374 99277 -81171 -158444 -17714
258 -17714 148623 107967 -54268 -111160 -16025 102464 79459 -70429 -120574 -1386 111235
269 111235 60675 -95182 -119284 57589 170573 51368 -123848 -121104 48093 132740 11313
280 11313 -115497 -76711 54033 110110 15911 -98328 -49278 91713 113760 -24601 -146533
291 -146533 -70051 103345 111306 -40371 -122438 -30346 108743 96679 -44964 -94080 574
302 574 82501 42458 -73413 -103701 8975 105120 59486 -61305 -95435 19413 117306 42988
314 42988 -80868 -82186 15759 73111 6956 -78180 -44504 52718 81205 10056 -72457 -47813
326 -47813 49950 69780 -9967 -82490 -59140 38094 70211 -7309 -59896 -11158 59338 52052
338 52052 -30696 -66703 -7502 44023 23651 -33587 -60589 -7733 57493 41917 -16187 -36780
350 -36780 -2002 41437 17346 -41330 -43501 3299 33722 12221 -34150 -24203 31339 43680
362 43680 10033 -23445 -27400 3549 19018 -4598 -26068 -19119 10615 31852 7432 -16743
374 -16743 1435 21827 18196 -6146 -31140 -17246 11061 8490 -5420 -9001 3361 22277 16469
387 16469 -803 -2073 -1723 879 1800 -14813 -19076 1749 12039 9061 2925 1636 13373 12382
401 12382 -2478 -6037 -6405 -5178 -1808 -10076 -8648 9054 11654 7412 6980 3890 5387 3782 -7097
416 -7097 -10175 -9680 -6055 3849 -1953 -5775 9537 16096 9835 2058 -7596 -4271 3179 -5335 -14321
431 -14321 -13860 -3222 12933 9461 -3781 1727 9468 9596 4681 -13715 -20144 -4318 3713 -1622
445 -1622 -10419 -10028 10798 21854 8767 -5526 -11870 -1811 13155 -3125 -28111 -19692 6082
458 6082 19059 7691 -13430 -6085 18412 21336 1728 -24341 -25555 5545 18112 -5558 -24915
471 -24915 -15517 20100 39072 6423 -28469 -14124 22312 26205 -15968 -46042 -14004 28503
483 28503 24659 -7764 -26523 -3377 39434 35049 -15039 -43261 -17300 31432 28442 -28077 -46776
496 -46776 1719 51179 36469 -25129 -41574 14571 50529 10847 -43893 -46244 7765 47642
508 47642 18107 -33772 -37049 18637 64986 26094 -50675 -47777 23439 54611 -1256 -65883
520 -65883 -38543 47309 64491 -4128 -56089 -22775 50323 56892 -17153 -69166 -34249 39122
532 39122 56849 -14263 -71794 -14916 73294 61170 -35400 -78771 -1135 77107 32827 -62573
544 -62573 -74028 7828 74454 37103 -45184 -53886 17528 66608 26776 -57066 -66131 18621
556 18621 70258 10710 -75139 -57903 52750 91720 1103 -77431 -38692 47553 59563 -17365
568 -17365 -71552 -29548 41575 49596 -11921 -58387 -14198 63034 58180 -26856 -80805 -27298
580 -27298 62778 54077 -40797 -77102 -5229 68533 44477 -35932 -52600 15237 59567 18859
592 18859 -56367 -65671 16454 75020 22810 -61626 -55898 33345 82030 18657 -62354 -43350
604 -43350 31103 51841 -13233 -67018 -21527 57269 54901 -18273 -61792 -13484 62995 56334
616 56334 -28222 -71989 -20010 51084 37702 -35928 -46892 21565 61621 15869 -47752 -37589
628 -37589 31943 55169 -3625 -59558 -38902 26658 48785 4467 -31606 -10181 28284 26958
640 26958 -11189 -32817 -6160 27675 14989 -23120 -37368 -4272 39635 35296 -8679 -32716
652 -32716 -8762 27357 19579 -25376 -32502 7958 26497 -927 -27081 -12072 26370 33712 4934
665 4934 -26236 -29836 876 29751 9738 -33347 -33476 18006 47361 952 -49647 -9794 59841
678 59841 35737 -52142 -64476 15671 60817 3019 -53409 -22448 34463 36657 -2944 -29856
690 -29856 -13715 19193 27894 -5736 -50112 -35073 38376 58893 -14503 -66667 -7942 74091
702 74091 42190 -58788 -61918 31712 61002 -12534 -62837 -17944 42897 37021 -6756 -24427
714 -24427 -11251 13872 29623 3844 -39527 -31865 21929 43264 -5483 -49011 -9583 47526
726 47526 35959 -15039 -32290 -9716 13716 16500 3230 -22132 -32857 13623 60738 13362
738 13362 -66272 -34045 73315 73841 -50693 -101934 6373 90582 23319 -65675 -38616 39623
750 39623 48733 -4139 -32172 -16129 10517 35123 20659 -44314 -70769 12074 98404 39577
762 39577 -89593 -72362 71120 95048 -38720 -96613 6539 84430 11384 -76134 -40195
773 -40195 42859 50986 10242 -20354 -32115 -19575 25149 49477 -3288 -67893 -28736 57383
785 57383 39054 -50322 -48191 44739 69845 -13953 -69190 -22711 32336 29809 5468 -19593
797 -19593 -41620 -19848 42839 54557 -19698 -61358 10856 71167 -2815 -90009 -33152 78419
809 78419 63559 -49848 -77096 9139 59745 26925 -12297 -20361 -19053 -2590 22199 7980
821 7980 -36720 -23241 51242 50315 -47307 -76561 25939 95567 17880 -78181 -45945 36417
833 36417 32018 -18063 -14170 16862 10447 -8517 1133 5449 -14645 -1661 42801 18709 -62102
846 -62102 -59242 40183 77570 -3803 -60087 -4608 48630 6752 -35788 -5379 29797 8937
858 8937 -21949 -16974 -4110 -3154 20278 42759 3810 -53102 -26578 45456 39190 -35287 -43480
871 -43480 27357 38653 -30007 -46305 24124 57050 7098 -35545 -17581 6656 958 3358
883 3358 14144 -5241 -27041 -3301 27124 7751 -23362 1667 40263 6810 -52024 -31827
895 -31827 34586 35668 -18719 -29984 7823 16145 -6836 -2698 17135 4478 -16661 -5810 5546
908 5546 -14294 -22154 16203 38901 -4553 -44395 -9249 41226 22765 -25791 -24628 12465 13910
921 13910 -16892 -19043 6649 15702 9844 4041 -8064 -20946 -2011 31435 19793 -34087 -39115
934 -39115 16347 37484 -6592 -34940 3836 42030 14490 -31720 -25604 11485 23052 4028
946 4028 -13972 -19168 -7381 15577 27756 2788 -27778 -6587 33969 18219 -35398 -36527 19272
959 19272 43714 -1757 -38143 -13996 25600 28396 2441 -14985 -12578 3754 15289 5809 -20214
972 -20214 -23949 13596 39005 6007 -38895 -21246 35698 43242 -11904 -44534 -12775 25121
984 25121 19625 -11824 -24430 -3013 24770 24555 -7096 -33694 -11303 34949 32777 -22771 -52431
997 -52431 -9272 44890 32055 -25139 -37505 10622 41346 11338 -34074 -31349 12218 35683
1009 35683 7550 -37605 -37365 14894 53816 18305 -41478 -37551 21296 45675 -2265 -48036
1021 -48036 -22913 31818 36539 -14394 -45926 -10445 41460 39396 -14526 -47991 -19503 32333
1033 32333 35990 -15433 -47168 -10499 42279 31960 -26417 -42048 9285 48090 17685 -38992
1045 -38992 -45143 6364 44210 20054 -30997 -36950 9931 45030 17938 -33084 -33270 16800 41631
1058 41631 2260 -47775 -32054 31852 50567 -1029 -45564 -21813 32899 41953 -6610 -43032
1070 -43032 -19805 28478 32132 -14754 -42378 -5277 45015 34393 -22984 -45619 -1556 45143
1082 45143 24942 -32652 -42822 5372 41862 15596 -29577 -25566 19793 40476 5510 -36885
1094 -36885 -28744 19674 39254 -334 -41430 -23231 27982 38414 -4248 -34718 -10349 29527
1106 29527 25078 -18113 -38695 -3695 33426 20635 -21130 -32101 4943 36912 19339 -23698
1118 -23698 -31089 4656 30642 5945 -31071 -23962 17466 33443 28 -30794 -15466 24364
1130 24364 29457 -7421 -35849 -15515 22872 22883 -13425 -29754 -1408 30964 20367 -18796 -29711
1143 -29711 3662 31584 10155 -30209 -30260 10254 32362 6792 -25708 -18357 18945 30805 -1218
1156 -1218 -32881 -17657 22229 26588 -11471 -35693 -8359 32390 27449 -14006 -31598 -1636
1168 -1636 32221 18492 -24260 -33980 3736 33509 14105 -26555 -27926 13982 40521 11198
1180 11198 -33383 -29453 18389 37711 -2185 -40061 -20681 28006 35727 -6343 -37174 -11331
1192 -11331 33372 32169 -14755 -42931 -10647 36648 29801 -21687 -42113 230 46565 27728
1204 27728 -29223 -39907 10156 43947 12175 -39038 -35185 17365 42719 9935 -34765 -28608
1216 -28608 21758 45710 5051 -44494 -31720 26089 43629 -5884 -49683 -20494 39190 42289
1228 42289 -14069 -46839 -8638 40287 30154 -23565 -46007 -7868 39478 29570 -20816 -45102
1240 -45102 -1622 48125 30573 -34067 -49307 9800 50239 13197 -46584 -37296 24124 48610
1252 48610 4386 -41498 -26859 25051 41532 217 -43343 -29864 23741 43347 -1239 -48350
1264 -48350 -22806 41591 45357 -18352 -53030 -6518 46476 26902 -31934 -43546 2835 40723
1276 40723 21832 -22869 -33303 3525 37289 21054 -26932 -40152 4626 44309 15357 -40253
1288 -40253 -36215 25962 50327 1670 -43305 -19555 28601 31044 -8799 -34122 -15195 21389
1300 21389 28999 -1950 -30725 -14618 30480 35730 -11761 -45129 -10452 41475 28328 -29337
1312 -29337 -41018 10318 41597 11875 -28424 -20395 16202 26875 1772 -24800 -21206 10474
1324 10474 30530 7461 -30483 -24155 23264 39591 -3037 -39375 -13449 31186 22432 -22827
1336 -22827 -31583 8002 30929 7546 -21892 -14643 9791 21661 8588 -16010 -24187 -2029
1348 -2029 23457 12961 -21832 -23201 14876 31451 -2918 -31342 -7998 28125 18584 -20444
1360 -20444 -28614 941 20804 11152 -8925 -13726 -2091 12396 13566 -4558 -21219 -6452 22185
1373 22185 14602 -23154 -30373 11554 38344 7509 -32734 -20813 19688 28102 -5474 -27680
1385 -27680 -10636 17685 17719 -9595 -23226 -4328 26092 24029 -13370 -35702 -6169 32748 22748
1398 22748 -24388 -34169 7854 34466 7172 -25714 -15493 19297 26601 -3720 -28467 -16129
1410 -16129 16752 26704 -626 -28801 -17108 20434 31736 -1435 -30129 -10621 27102 21153
1422 21153 -20061 -30648 4765 31366 11270 -21315 -20240 7901 24385 11210 -12831 -20652
1434 -20652 -2592 17139 13508 -13078 -21877 3111 27632 12776 -22957 -25081 12993 35255
1446 35255 2179 -33782 -22777 18001 27630 -2043 -24067 -10796 18022 20884 -4762 -23855
1458 -23855 -9042 19177 19479 -10529 -28454 -7842 24721 23751 -11012 -28096 -1263 27303 13632
1471 13632 -20511 -23422 5995 22584 3529 -19483 -13981 8415 21008 6003 -15256 -15468 4077
1484 4077 17378 4382 -17694 -16504 8409 21466 2141 -19481 -10636 15233 17690 -6379 -19074
1497 -19074 -5322 10196 8237 -3799 -11199 -4663 7972 12722 495 -14191 -7906 12510 14826
1510 14826 -7281 -20730 -4796 16183 10236 -9004 -9395 6321 11251 -68 -7009 -2620 1668
1523 1668 2915 3813 -1740 -9983 -4768 12415 13972 -3866 -13141 -460 11791 2631 -8923 -4093
1537 -4093 5498 3419 -4009 -2369 2223 2352 3738 7674 -225 -14303 -8881 11295 14558 -6620
1551 -6620 -15116 2164 13768 684 -9264 1842 11675 2222 -9179 -6397 108 1336 3318 6384
1565 6384 -737 -10942 -5016 11839 11555 -5288 -9887 3064 5852 -8035 -9529 6934 12151 -1979
1579 -1979 -7597 412 2254 -3198 2121 10762 54 -16808 -10370 10391 11680 -5964 -8804 6615
1593 6615 9049 -7281 -12191 3773 13178 887 -10677 -6882 -1430 605 5709 9214 -1343 -10653
1607 -10653 -2122 8629 371 -9665 -72 11521 927 -16285 -8603 12839 14594 -1688 -8760
1620 -8760 -1079 1969 -3632 -1805 4635 2605 -4560 -2742 1392 -1708 -1180 9511 10516 -5730 -15394
1635 -15394 -2058 10688 3039 -6704 -613 6930 -1372 -8573 91 10592 5922 -3755 -4814 -2398
1649 -2398 -3788 -743 8187 7556 -5264 -8690 4729 9408 -2555 -6860 6083 10531 -5729 -16030
1663 -16030 -2661 12597 8753 -3114 -5265 -944 1532 2668 3543 -446 -4950 -66 5696 -1802
1677 -1802 -11440 -2430 16405 13890 -10018 -18323 1832 16269 5079 -10968 -8899 3638 6318
1690 6318 -151 -5704 -3941 4589 11774 3745 -13001 -15416 5697 19666 3914 -19667 -15131 10981
1704 10981 18344 -2771 -16424 -2045 15083 8769 -11465 -16823 -3519 14454 12119 -6103 -19475
1717 -19475 -6754 17835 16917 -9110 -21114 -904 17953 6677 -18547 -16439 9859 21484
1729 21484 2481 -18875 -14077 7897 19934 5908 -15523 -16517 5171 16880 3616 -18928
1741 -18928 -13390 15324 21658 -3606 -24736 -8391 20727 19387 -7854 -22933 -7921 16755
1753 16755 17599 -6086 -19701 -3154 19390 14587 -11880 -23023 196 25913 14154 -19650
1765 -19650 -26072 6011 29319 10970 -19767 -19128 9000 21502 2731 -20682 -15523 13195 23385
1778 23385 -432 -24994 -13597 19080 27062 -2338 -27703 -12921 18782 21023 -8623 -24539
1790 -24539 -2996 22206 14648 -13543 -21145 2112 23666 13393 -16728 -25347 342 24566
1802 24566 12613 -17113 -20376 7180 23343 4804 -20358 -14525 13405 21449 -2741 -25099
1814 -25099 -12894 16387 21648 -2365 -21580 -9994 15335 17762 -5911 -21885 -5197 19076
1826 19076 12797 -15090 -21905 3626 24036 10436 -16854 -19720 4599 20723 5522 -17597
1838 -17597 -15165 8241 18261 99 -18854 -9378 15224 19191 -4830 -22976 -8849 17538
1850 17538 16987 -8915 -20775 -2210 18366 11740 -11293 -15849 3843 19490 6218 -18021 -17468
1863 -17468 7517 21531 4292 -18707 -13797 11166 20423 64 -18708 -8912 14852 16272 -7519
1876 -7519 -20850 -3857 19308 15363 -9592 -20076 -1294 20667 13593 -13403 -19949 2704 21030
1889 21030 6884 -17804 -15555 10472 22656 2922 -20344 -14072 13026 21843 -1113 -22496
1901 -22496 -12066 15018 19579 -4278 -21642 -5817 20780 18167 -11638 -24755 -1459 23554
1913 23554 13503 -16270 -22539 2705 23951 11420 -16089 -19954 5772 23749 6317 -22262
1925 -22262 -19658 11075 25521 1692 -25298 -15802 17380 25705 -2923 -26247 -11509 18257
1937 18257 19895 -8046 -25047 -7277 20411 19739 -9575 -25956 -3765 25984 18142 -16849 -27679
1950 -27679 1392 27146 11136 -20591 -21826 8725 25129 5892 -20284 -16783 9682 21650
1962 21650 3263 -21396 -17440 10830 24674 2972 -23870 -14946 17926 24253 -5981 -26138
1974 -26138 -7342 20064 16079 -10487 -20579 -2149 18450 14138 -7597 -18560 -3660 17999
1986 17999 15625 -10010 -23022 -2384 23364 14178 -16842 -21601 8195 25587 5070 -20189
1998 -20189 -13764 10723 17952 852 -16666 -12043 8480 19317 4116 -17477 -13810 12574 21995
2011 21995 -1940 -24108 -9420 19628 17720 -11627 -21594 1942 20732 8532 -12566 -13766
2023 -13766 2652 13424 7041 -8920 -14113 -117 16130 9618 -13048 -15666 7304 20190 1168
2036 1168 -19505 -9397 13871 13293 -7065 -14196 -634 9931 5807 -2259 -5989 -4535 2566 8603
2050 8603 1434 -12461 -9067 10427 13780 -6964 -17691 885 17779 6010 -13669 -10371 6770
2063 6770 9813 -2042 -7825 -3224 2831 4906 3048 -3937 -8294 278 12085 4799 -13803 -12725
2077 -12725 9851 16467 -4502 -17506 -1274 15935 6626 -10528 -8924 5487 9334 297 -7885
2090 -7885 -6320 2047 9101 5772 -7347 -11178 3370 15576 3055 -15772 -9102 13201 12538 -9454
2104 -9454 -14637 4387 15306 2263 -10079 -5270 4515 5626 2391 -2363 -6342 -3526 6693 9012
2118 9012 -3878 -12006 1342 15846 4293 -15143 -9427 11895 13360 -6464 -13516 169 9385
2131 9385 3871 -2607 -2697 -1809 527 5784 3660 -7736 -9006 6045 13889 -2473 -17154 -4117
2145 -4117 17099 11714 -11176 -15222 3565 13590 1853 -9792 -6514 3228 7260 3037 -5372
2158 -5372 -9021 1001 13322 6568 -13155 -15122 6453 18033 427 -17076 -7526 12575 11438
2171 11438 -6080 -12107 -446 9358 4799 -5694 -9711 -2925 7879 9868 -2324 -13699 -5479
2184 -5479 12749 11618 -8066 -14495 1628 13643 2396 -11633 -6902 6609 9533 290 -7013
2197 -7013 -5950 1593 7833 5560 -5751 -11125 -488 11820 6146 -10125 -9604 7641 13087 -2220
2211 -2220 -12892 -3040 9660 7563 -3717 -8370 -2947 4970 7702 1698 -6468 -5964 4858 9723
2225 9723 -738 -11304 -4575 10474 9638 -5597 -12055 944 12342 5903 -7041 -8089 1079
2238 1079 7327 3953 -4148 -7335 -187 8346 5715 -5997 -9162 2725 11634 3420 -10088 -8722
2252 -8722 4938 10052 -30 -9059 -3710 6379 6776 -1418 -6543 -2718 4356 6163 -612 -7338
2266 -7338 -5034 4934 7706 -1089 -8101 -3413 6790 5988 -3733 -8346 -738 6736 4165 -5104 -7057
2281 -7057 487 6803 4165 -3857 -6217 -374 5241 3051 -4499 -6474 1181 7122 1795 -6731 -5399
2296 -5399 3906 7703 531 -7675 -5314 3735 6540 -1081 -6506 -1920 5178 4503 -2821 -5521 -333
2311 -333 6219 4438 -4317 -8096 -609 7088 4500 -4439 -5775 1602 6142 1244 -5519 -3059 4610
2326 4610 5744 -2040 -7383 -2334 5358 6083 -202 -5164 -2924 3464 5483 -458 -5511 -1647 5651
2341 5651 3767 -5069 -7059 2427 9439 3631 -6800 -6894 2614 7714 2033 -5417 -4052 2616 5119
2356 5119 86 -5056 -2729 5569 8016 -1312 -10188 -4531 8547 8941 -3552 -10470 -1741 8227 4810
2371 4810 -5066 -6276 3009 7675 1115 -7659 -6924 3078 9008 3049 -7545 -8974 1921 10441
2385 10441 4005 -8441 -7355 5183 8615 -2811 -10780 -2768 9557 8392 -4914 -11283 -3005
2398 -3005 8708 8825 -2811 -10533 -4460 7585 7237 -4508 -10025 -67 11302 5477 -9892 -11585
2412 -11585 4157 14446 3403 -11982 -10683 4266 11360 3011 -8453 -7580 4850 10089 -51
2425 -51 -11948 -6674 9422 12475 -3185 -14940 -5790 11693 12055 -3934 -12822 -2162 10049 6687
2439 6687 -6126 -9265 835 9796 5597 -7312 -10904 1425 13615 7690 -8549 -12400 1673
2452 1673 12618 4277 -9218 -8320 5484 11003 -37 -10287 -5262 8184 10614 -1015 -11218
2465 -11218 -6501 7076 11403 426 -10687 -5598 8114 9625 -3672 -10128 -886 10628 5924
2478 5924 -7316 -10723 294 11311 6333 -6250 -9507 550 9365 4776 -6171 -7731 2345
2491 2345 8935 1530 -9284 -6693 6608 10491 -607 -10707 -5534 5913 7769 -698 -7791 -4092
2505 -4092 4595 6089 -2263 -7375 -1449 7533 5538 -4298 -9587 -986 8775 5501 -5469 -8144 173
2520 173 6907 2400 -4893 -4301 2385 5414 339 -6121 -4767 3268 7366 773 -7132 -5011 3970
2535 3970 6841 -244 -6211 -2243 4441 3597 -3529 -5391 795 6320 2854 -4207 -5336 472 5508
2550 5508 3418 -3006 -5009 449 4714 1424 -4428 -2521 4106 5189 -1146 -5682 -1816 4920 5267
2565 5267 -1628 -5932 -1957 4073 3727 -1201 -3703 513 4428 2478 -3372 -4660 1520 6355 1828
2580 1828 -5615 -5092 2626 5946 1219 -4031 -2873 3127 4323 -575 -5030 -1672 4670 4981 -2113
2595 -2113 -6349 -1530 5757 5160 -2351 -6364 -1249 5435 3365 -4256 -4873 1742 5608 1602 -5071
2610 -5071 -4370 2282 6096 1845 -5490 -5626 1720 5978 1227 -5320 -4180 3514 5323 -885 -6417
2625 -6417 -2906 5283 5428 -2507 -8019 -2695 5901 5660 -2157 -6645 -1321 5228 4071 -3625 -6012
2640 -6012 96 6055 2707 -5497 -6396 1007 7150 3047 -5358 -6588 1965 7266 1714 -6559 -4715
2655 -4715 3794 6038 -1009 -6760 -2696 5292 5956 -1557 -6757 -2720 4390 5149 -1350 -5648 -1874
2670 -1874 4476 5056 -1690 -5700 -387 6006 3581 -4031 -5697 952 5850 2821 -3561 -4187 566
2685 566 4733 2943 -2104 -3904 475 4443 2323 -3373 -4571 1395 6281 2270 -5138 -4214 2991
2700 2991 5708 344 -4443 -2642 2439 3648 133 -3369 -2196 2510 4140 -344 -4891 -2245 4167
2715 4167 4677 -1514 -5621 -1143 4589 3035 -2583 -3627 810 3047 711 -1971 -2020 -147 1811 1712
2731 1712 -1203 -3785 -872 3744 2535 -3089 -3606 970 3165 -263 -3232 -919 1534 693 -1253
2746 -1253 -584 46 -511 549 1794 213 -3298 -2101 3149 3059 -3027 -4368 1188 4393 -131 -3637
2762 -3637 -1049 2425 1403 -1299 -1519 -426 -105 1138 1231 -1030 -2870 132 3769 1853 -4099 -2788
2778 -2788 3219 4019 -1728 -3869 875 3650 383 -2491 -451 1106 1019 577 226 -1047 -1204 1465
2794 1465 2480 -519 -3354 -353 4167 1297 -3260 -2090 3124 2843 -1922 -2613 1127 2107 -138 -677
2810 -677 887 -576 -1241 1476 2439 -1585 -3143 1101 4005 -142 -4255 -299 4737 1875 -3460 -2517
2826 -2517 2687 2859 -955 -2244 177 532 -128 763 437 -2124 -1226 2988 2881 -3495 -4384 2492 5522
2843 5522 -1700 -6465 -648 5752 2369 -4402 -3683 2397 3408 -803 -2568 -1063 431 1170 1743 -967
2859 -967 -3945 -862 5652 2853 -5641 -5705 3505 6841 -2150 -7174 -946 6020 2927 -4100 -3835 1206
2875 1206 3588 1181 -2298 -3146 -1101 3214 3698 -1605 -6429 -1173 7061 4018 -5882 -6229 3934
2890 3934 7317 -928 -7278 -2063 4965 4061 -1774 -4492 -1930 2778 4788 1244 -4865 -4342 3435
2905 3435 7203 -447 -8050 -2536 7917 6258 -5035 -7913 2162 8357 2427 -5516 -4995 1846
2919 1846 5264 3325 -2835 -5529 181 6689 4455 -5746 -7472 3006 9850 1410 -9154 -5635
2933 -5635 6755 8748 -2263 -8061 -1768 5984 5108 -2218 -5749 -2409 4126 5809 -1373 -7928 -2895
2948 -2895 7728 7518 -4675 -9887 55 9851 4388 -7795 -7490 3257 7803 526 -6767 -4371
2962 -4371 3178 5855 871 -5635 -5422 2288 7669 1522 -8090 -6544 5202 8147 -1720 -9252 -2436
2977 -2436 7270 5596 -4434 -7296 -431 6573 3762 -3789 -6261 -722 5827 4685 -3307 -7350 -472
2992 -472 7127 3663 -6379 -6676 3084 7956 581 -7399 -4150 4576 6200 -236 -6120 -3183 3528
3007 3528 5681 -264 -6141 -3322 4826 6378 -1829 -7241 -1706 6963 5347 -4382 -6936 776 6967
3022 6967 2604 -4624 -4513 1940 5624 2030 -4648 -4709 2207 6998 1685 -6115 -4863 3709 7153 -214
3038 -214 -6988 -2648 5780 5799 -3034 -6409 30 6243 3513 -3684 -5329 528 5592 3195 -3676 -5584
3054 -5584 733 6157 2280 -5289 -4600 2964 6575 -270 -6296 -3401 4430 5856 -1578 -6410 -2166
3069 -2166 4743 4981 -2342 -5605 -1140 5157 3933 -3501 -6299 -14 6257 3176 -4917 -6330 1459
3084 1459 6448 2265 -5252 -5229 2226 6127 916 -6294 -4626 3732 6883 -556 -7665 -4068 5360
3099 5360 6754 -1958 -8029 -3042 6232 5372 -3455 -6979 -481 6886 3998 -4775 -7257 902 7639
3114 7639 4058 -6508 -7442 2123 8305 2081 -7257 -5278 4014 7599 -79 -7526 -3783 5799 7097
3129 7097 -1531 -8328 -3169 6517 6811 -2058 -7632 -1977 6627 5766 -3668 -7515 442 8097 3715
3144 3715 -5985 -6737 1838 8203 3420 -5451 -6505 2240 7878 2688 -5871 -5152 3865 7442 511
3159 511 -7292 -4069 5678 7650 -1289 -8445 -3141 6698 6545 -2127 -7519 -1961 5794 5235 -2926 -6966
3175 -6966 -299 7079 4064 -5186 -7704 905 8014 3206 -5966 -6610 2139 7359 1505 -6028 -4260
3190 -4260 3402 5656 -893 -6132 -3504 4189 6240 -1041 -7309 -3260 4715 6000 -1603 -6543 -1534
3205 -1534 5203 3519 -3399 -5332 377 5711 2558 -4483 -5524 1148 5692 2330 -4511 -5116 1184
3220 1184 5330 1560 -4804 -3948 3057 4858 -776 -5670 -1842 4668 4234 -1355 -5169 -1973 3684
3235 3684 4039 -1400 -4080 -698 4248 2992 -2960 -4098 726 5531 2060 -4050 -3855 2241 5104
3250 5104 705 -3849 -2418 2400 3108 -274 -3282 -1447 2861 3136 -1380 -4366 -1110 3857 3675 -1403
3266 -1403 -4105 -503 3808 2499 -2151 -3385 1072 3400 720 -3090 -2205 1882 3603 407 -3441
3281 -3441 -2649 1904 3459 272 -3336 -2219 2362 2553 -1436 -3366 -248 3400 1969 -2177 -3481
3296 -3481 266 3357 1991 -2412 -3293 1 2782 1269 -2408 -2807 1145 3618 375 -3545 -2262
3311 -2262 2704 3458 -406 -3857 -1785 2301 2500 -620 -2948 -1352 1733 1857 -995 -2988 -808 2634
3327 2634 2191 -1478 -3836 -679 3356 2270 -2382 -3438 231 2952 926 -2150 -2239 1051 2570 678
3343 678 -2517 -2314 1231 3278 754 -3025 -2750 1153 3465 667 -2833 -1386 2387 2281 -1269 -2839
3359 -2839 -308 2769 1752 -1171 -2392 -449 2054 2465 -394 -2625 -631 2457 2047 -1155 -2356
3374 -2356 362 2988 1152 -2230 -2648 1214 2877 624 -2123 -1559 576 1944 906 -574 -1310 248
3390 248 2101 847 -1647 -1852 1404 2541 504 -2394 -1356 1333 2450 182 -1754 -949 960 1661
3406 1661 -88 -1649 -982 967 1849 -147 -2442 -886 1876 2241 -1001 -2784 -666 1721 1360 -1043
3422 -1043 -1482 46 1387 598 -834 -1348 -296 799 1225 -825 -2567 -999 2157 1779 -1302 -2735
3438 -2735 -106 2325 506 -1885 -1097 917 1126 -558 -1208 -1167 142 1175 804 -1238 -1676 -115 1920
3455 1920 882 -709 -2010 660 2150 138 -2048 -1166 1557 1617 -473 -1420 -458 1119 1275 274
3471 274 -920 -1210 871 2059 421 -1673 -502 1419 1500 -871 -1942 81 2107 1071 -1455 -1297
3487 -1297 513 1476 770 -433 -1006 -159 1280 995 -676 -1542 238 2333 896 -1617 -1055 1413 1987
3504 1987 -124 -1488 -582 1477 686 -597 -642 -113 727 513 -71 -732 -607 912 1292 -247 -1921 -562
3522 -562 1530 1301 -1511 -1352 267 1483 115 -1096 -642 655 620 -277 -775 -676 -15 911 668 -842
3540 -842 -1533 -75 1865 213 -1826 -1305 1863 1690 -1752 -2243 299 1959 164 -1762 -1143 826
3556 826 1163 304 -885 -1160 139 1190 630 -1086 -2137 570 2443 377 -2810 -1770 2223 2007
3572 2007 -1420 -2488 221 2122 1076 -1367 -1704 283 1402 986 -1055 -1932 -279 2021 1607 -1668
3588 -1668 -2457 952 3546 983 -3100 -1893 2388 2762 -724 -2692 -465 1953 1681 -431 -1813 -950
3604 -950 1390 2270 -104 -2681 -1352 2456 3226 -1156 -3765 -180 4023 1808 -2973 -2921 1302 3112
3620 3112 822 -2584 -1616 1199 2571 840 -2280 -2639 803 3854 1184 -3423 -3059 2409 4103 -795
3636 -795 -4304 -1841 3474 2868 -1949 -3883 -310 3054 1772 -1441 -2942 -915 2698 2724 -1686 -4116
3652 -4116 -860 4236 2583 -3665 -4516 1422 4657 578 -4436 -2932 2758 3816 -765 -3708 -1801
3667 -1801 1936 3267 -164 -3123 -2264 1613 3906 -522 -4909 -1837 4149 3572 -2610 -4968 243
3682 243 4084 1521 -2882 -2818 963 3482 1391 -2251 -2724 422 3285 1432 -2859 -3037 1588 4075
3698 4075 816 -4070 -2649 2960 3580 -1147 -4059 -867 3210 2220 -1606 -2333 -442 2401 2744 -837
3714 -837 -2705 -805 2812 2113 -1713 -3222 -102 3752 2063 -2914 -3185 1488 3211 32 -3012 -582
3730 -582 2609 1819 -149 -2347 -1603 1907 2103 -135 -2674 -1434 3333 2814 -1230 -3660 -453 3586
3746 3586 1107 -2687 -2148 1420 2492 288 -2336 -1689 909 2015 458 -1873 -2660 712 1922 -351
3762 -351 -3665 -1454 2427 1726 -286 -3696 -787 2626 1766 -1637 -2031 112 2445 1417 -1860 -1573
3778 -1573 -6 2509 965 -2087 -2790 475 3080 566 -2416 -2146 1605 2049 266 -2736 -1723 2306
3794 2306 2018 -553 -2919 -612 1782 961 -780 -2592 -1251 3083 1688 -2645 -3027 -1449 3107 1084
3810 1084 -2711 -1882 926 2817 244 -1569 -1733 966 1910 608 -1625 -2068 1488 1769 -106 -2201
3826 -2201 -1610 2032 2348 -724 -2904 -980 3021 1878 -248 -2434 -78 999 2136 -1154 -1980 -316
3842 -316 2075 1175 -2138 -2583 746 3235 510 -2265 -2036 963 2572 475 -2002 -1275 1119 1940
3858 1940 177 -2362 -1048 1640 2511 -22 -2810 -1371 1894 2509 -1036 -2877 -1039 2050 1616 -1420
3874 -1420 -2129 -505 1894 1379 -1694 -2568 40 2553 1128 -1498 -2371 -31 2520 1110 -1852 -2048
3890 -2048 1191 2323 7 -2169 -1415 1098 1924 -33 -1932 -1475 1080 1876 -36 -2105 -1268 1185
3906 1185 1902 -534 -2141 -647 1960 1958 -857 -2435 -175 1985 1622 -1034 -1962 -214 1636 1276 -945
3923 -945 -1567 47 2114 792 -1481 -1356 956 2146 104 -1881 -1283 1000 1821 66 -1252 -1108
3939 -1108 936 1524 96 -1138 -637 1188 1553 -9 -1875 -591 1721 1376 -747 -1626 38 1898
3955 1898 732 -798 -703 473 1078 721 -564 -623 268 1346 595 -780 -1087 592 1270 682 -1017 -670
3973 -670 738 926 105 -1232 -443 706 573 -173 -757 -210 657 637 -437 -1011 -642 373 793 -390
3991 -390 -668 -141 672 314 -808 -777 -166 897 102 -1196 -677 383 692 -55 -715 -573 18 723 -52
4010 -52 -723 -311 886 1088 -685 -1515 -195 1036 748 -357 -951 -222 713 232 -373 -495 -32 409 318
4029 318 -674 -931 378 1198 427 -1273 -1064 440 1300 -46 -704 -3 730 611 -333 -546 -181 445 1000
4048 1000 -4 -806 -856 781 1227 -45 -1520 -273 911 1104 -270 -1181 134 1383 342 -615 -705
4065 -705 341 1171 820 -296 -1046 -402 1438 1302 -716 -1524 599 1657 485 -1659 -1295 1041 1475
4082 1475 -336 -1639 -599 1072 1420 -183 -1198 -801 992 1365 183 -1656 -989 1350 1469 -867
4098 -867 -2221 -468 2031 1092 -930 -1550 -186 1430 875 -1118 -2134 -149 1380 771 -2108 -2090 551
4115 551 2701 1113 -2438 -2109 1544 2161 -390 -3108 -978 1014 1159 -390 -1891 -1200 1319 1357 -402
4132 -402 -2016 -1211 2043 2541 -612 -2948 -996 3667 2404 -1821 -2389 665 2787 1017 -2208 -1916
4148 -1916 1145 3416 569 -1696 -2415 827 2551 921 -1952 -1734 590 2576 340 -2581 -2009 2447
4164 2447 2666 -756 -2959 -461 2455 1721 -1364 -2158 -733 1635 2053 -659 -2778 -953 2853 2283
4180 2283 -1731 -2751 344 2933 1436 -2683 -1207 882 3052 383 -2348 -1412 639 2784 -141
4195 -141 -1255 -807 1907 2113 -521 -2253 -942 2531 2303 -1265 -3164 133 2538 1353 -1479 -1980
4211 -1980 978 1819 -199 -1909 -1934 708 1607 1138 -1685 -1512 768 2282 473 -2742 -1656 1992
4227 1992 2483 -724 -2686 -1119 2289 1281 -1533 -2208 -156 1689 2029 -1255 -1619 -65 1152 1244
4243 1244 -1477 -2138 14 2273 493 -2600 -1884 1407 2364 -17 -2705 -942 1890 1409 -84 -1934
4259 -1934 -379 1180 2303 -849 -2359 184 2174 1822 -1155 -2527 -179 2826 1471 -1768 -2456
4274 -2456 932 3715 498 -2032 -1626 957 1941 -14 -1826 -1169 893 2374 361 -2536 -1121 2159
4290 2159 2585 -861 -2339 -656 2596 1650 -1758 -2710 -261 2912 1398 -2365 -2733 849 2291 751
4306 751 -1724 -2325 557 2675 886 -2407 -2595 1650 2672 250 -2777 -2121 2011 2026 -1195 -3213
4322 -3213 -716 2364 1959 -1678 -2323 -239 2704 1321 -1194 -2228 284 3348 2003 -1605 -2577 585
4338 585 3021 632 -2771 -3011 1018 2973 629 -2541 -2098 1658 2214 283 -2650 -1330 1234 2320
4354 2320 140 -2402 -1813 2285 2244 -1323 -3510 -985 2351 1786 -898 -2442 159 2187 1561 -1689
4370 -1689 -2034 712 2312 101 -1902 -2094 736 1408 1053 -1208 -2238 1189 3011 486 -2762 -1196
4386 -1196 2512 2922 -938 -3034 136 2787 1235 -1753 -1230 -673 1836 2253 -900 -1698 -199 1907
4402 1907 1608 -997 -2118 561 3331 973 -1609 -1468 2017 1983 -63 -1540 -307 1131 1860 -331
4418 -331 -1369 -866 776 815 -369 -2053 -916 1262 1692 -514 -1892 125 1180 1388 -1743 -1719 643
4435 643 1447 829 -796 -1461 385 1233 471 -1315 -1241 362 1745 527 -1403 -967 1428 1472 -563 -2288
4453 -2288 -432 1743 946 -1282 -1360 313 1091 422 -872 -1206 -136 1232 669 -1042 -1628 499 1480
4470 1480 228 -1469 -1054 891 1266 -485 -1756 -509 1025 984 -894 -1071 -90 1077 881 -631 -1185
4487 -1185 -270 1268 1197 -661 -1241 193 1746 252 -1379 -935 713 1510 118 -1209 -799 921 1374
4504 1374 -97 -1173 -590 753 1149 57 -1016 -561 783 1311 -69 -1484 -142 1612 800 -1027
4520 -1027 -989 361 1359 348 -1358 -756 560 1330 355 -1110 -711 499 1221 43 -958 -830 681
4537 681 1282 -72 -1266 -307 1127 1008 -567 -1029 -123 776 409 -674 -1144 -39 1148 707 -392
4554 -392 -884 -73 662 329 -577 -847 285 1050 4 -1003 -492 765 599 -240 -731 -154 355 536 57
4573 57 -367 -133 682 654 -274 -497 -168 353 104 -447 -560 -150 291 -78 -437 -397 393 64 -36 -141 -169
4594 -169 62 -203 40 -361 -265 -211 97 25 127 -197 465 180 -259 48 119 82 -96 -79 159 155 -137 -523 144
4617 144 262 -298 -310 340 261 501 68 -421 -133 509 522 -83 -266 -84 803 300 -77 -380 79 893 610
4638 610 -168 -429 -19 662 195 -785 -425 486 571 179 -438 -207 585 634 122 -755 -456 797 842 -25 -885
4659 -885 -259 674 1034 -560 -913 190 697 887 -801 -816 164 717 297 -782 -632 294 1027 44 -941
4678 -941 -345 396 645 -320 -1105 -256 545 888 -480 -1091 -178 803 603 -492 -1098 -216 898 573 -723
4697 -723 -676 43 1161 424 -973 -1172 231 1241 71 -964 -652 535 1095 65 -836 -486 458 1015
4715 1015 -265 -896 -160 956 908 -504 -1103 -316 854 1088 -604 -1233 115 987 147 -373 -671 597
4733 597 1055 -103 -725 -622 695 1095 100 -1097 -577 775 1150 17 -1073 -462 1078 1208 -620
4750 -620 -1075 218 1375 716 -589 -880 217 1042 439 -747 -745 426 1450 246 -1000 -231 721 818
4768 818 -149 -1121 -738 985 1244 -120 -1237 -464 1209 965 -708 -1554 -368 1048 884 -1184 -1360
4785 -1360 127 1436 322 -1243 -1436 701 1061 124 -1054 -927 361 1291 -85 -1071 -691 778 1448
4802 1448 -169 -1596 -622 1154 1248 -57 -2036 -683 1151 863 -642 -1487 -318 1696 898 -1003
4818 -1003 -1679 134 1911 644 -1353 -1502 396 1472 272 -1553 -815 901 1277 39 -1651 -862
4834 -862 912 1300 -136 -1386 -931 1176 2092 -246 -1822 -275 1646 1125 -1090 -1801 287 1780
4850 1780 584 -1127 -1306 573 1620 877 -913 -1221 311 1670 794 -1181 -1495 857 1727 -66
4866 -66 -1695 -1237 1396 1481 -448 -1756 -560 1477 1539 -526 -1505 -360 1344 1635 -746 -2033 27
4883 27 1858 1038 -1323 -1783 608 1979 708 -1932 -1327 1049 1778 71 -1605 -728 978 1344 -188
4900 -188 -1110 -712 1064 1604 -259 -1908 -798 1882 1390 -861 -1537 191 1599 703 -1010 -1480 328
4917 328 1534 547 -881 -1486 85 1191 646 -1045 -1420 213 1938 278 -1898 -1023 1049 1843 -723
4934 -723 -1804 -358 1529 1049 -684 -1270 -227 1125 1141 -624 -1480 -165 1683 1153 -1111 -1752 426
4951 426 2506 461 -1855 -1127 1255 1753 -479 -1544 -673 1024 1029 -164 -1259 -350 1036 1258 -174
4968 -174 -1528 -532 1639 1346 -635 -1576 158 1740 1060 -1354 -945 822 1730 224 -1384 -655 949
4985 949 1419 -96 -914 -1028 776 1472 274 -1406 -1117 1272 1407 -535 -1861 -387 1710 909 -1002
5002 -1002 -1605 343 1284 319 -1043 -993 -43 1397 772 -991 -1314 809 1581 153 -1678 -1253 1221
5019 1221 1561 -323 -1869 -325 1509 1003 -682 -1553 -277 1355 791 -737 -1514 -440 1420 681
5035 681 -1003 -1626 122 1787 485 -1642 -1432 320 1401 71 -1372 -629 713 1035 -214 -1337
5051 -1337 -704 731 1071 -267 -1202 -746 524 1055 -382 -1477 -535 909 944 -832 -1184 -11 1202
5068 1202 788 -881 -832 514 1303 377 -754 -1042 550 1173 180 -1082 -901 656 1086 77 -1100
5085 -1100 -1058 1072 1384 -447 -1131 -381 1104 490 -410 -1164 150 795 556 -338 -984 246 1051 745
5103 745 -418 -739 132 1236 429 -605 -656 489 938 104 -837 -228 685 592 -23 -640 -171 579 753
5122 753 43 -672 -162 528 466 -230 -463 -2 646 294 -602 -1085 -84 645 250 -825 -191 493 213 114
5142 114 -602 -599 -111 796 -103 -505 -490 471 395 -183 -723 -89 199 134 -356 -503 -121 457 224 -645 -720 38
5164 38 477 -247 -279 -181 195 326 72 -356 -355 244 446 173 -336 -116 431 475 113 -492 -201 429 109 -60
5186 -60 -124 -197 161 508 65 -359 -421 283 226 -213 -40 90 656 420 -208 -341 122 602 -41 -14 -36 530
5208 530 116 11 -234 -95 259 234 -71 92 -157 282 303 -147 -449 -101 31 40 -170 -152 54 281 224 64
5230 64 -122 148 18 359 -123 -218 64 155 222 -4 -164 -165 293 92 -62 -92 -81 -112 -259 -241 -224 -217 296 93
5254 93 -144 -193 -3 189 94 33 -91 -80 196 -54 -288 -312 153 -77 177 -255 -148 94 39 -241 -118 -302
5276 -302 -204 187 89 -188 -105 37 92 -58 -234 -443 167 275 -17 -363 84 253 76 16 -215 -250 -108 66
5298 66 -271 -46 -35 165 147 -128 -199 105 210 443 -428 -236 221 195 374 84 -358 80 396 235 16 -306
5320 -306 -72 269 516 -129 -327 128 750 -132 -369 -139 561 266 75 -302 -239 247 368 -34 -110 -134 260
5341 260 288 -21 -278 -463 520 259 -188 -660 179 504 307 -328 -418 -161 545 259 -194 -435 -12 267 459
5362 459 -195 -311 117 229 305 -801 -541 204 785 -42 -525 -330 520 74 95 -612 -423 90 263 -17
5382 -17 -673 -313 -106 272 -398 -596 -533 304 327 -337 -830 -237 508 -60 -348 -609 -86 538 145 -566 -455
5403 -455 221 450 211 -469 -97 396 680 -287 -325 -249 747 558 -181 -798 -73 485 777 -353 -350 105 555
5424 555 531 -260 -445 -121 503 421 -510 -455 514 825 -165 -519 -73 486 485 -101 -529 11 584 482 -209 -236
5446 -236 -135 596 613 -325 -693 -323 748 441 -558 -1095 264 928 177 -697 -607 544 687 86 -566 -333
5466 -333 556 605 -63 -764 -451 440 777 -288 -663 -154 658 624 -638 -537 -96 704 588 -560 -380 194
5486 194 743 295 -495 -898 201 903 219 -781 -745 498 969 76 -886 -435 431 764 -282 -1132 54
5505 54 625 564 -848 -444 -156 772 595 -345 -845 454 863 248 -898 -1153 444 962 -140 -1272 -429
5524 -429 643 859 -207 -727 -205 1058 914 -186 -516 -253 820 405 -547 -866 40 742 411 -490
5542 -490 -596 527 905 403 -509 -669 231 770 200 -573 -507 655 761 -70 -572 -402 632 664 -228 -607
5562 -607 -409 211 846 5 -553 142 647 501 -482 -732 133 746 535 -880 -682 394 780 47 -767
5581 -767 -473 684 853 -127 -966 -469 265 642 -424 -982 -19 707 959 -182 -768 -284 721 290 -547
5600 -547 -665 261 603 296 -444 -380 164 309 -101 -565 -594 234 595 -87 -777 -241 566 935 -201 -699
5620 -699 26 194 28 -577 -450 -289 304 -33 14 -597 40 377 376 -255 -268 -104 680 254 -556 -662 440
5641 440 499 -215 -99 -97 269 209 161 -516 -365 201 625 -238 -309 -394 501 495 -262 -513 156 891 85 -347 -220
5664 -220 519 303 52 -269 -233 508 86 139 -176 -20 185 390 337 -418 -117 -439 676 -631 -604 89 1164
5685 1164 -91 -231 -264 133 -73 -45 547 -83 314 325 117 385 -236 -132 424 592 -1080 -882 799 451
5705 451 -295 -324 176 -210 44 -574 -453 173 190 107 106 -1306 528 179 625 548 -943 -511 505 645 -880
5726 -880 -693 -149 -353 -641 -803 -88 253 -93 -437 -595 -331 -308 -243 -164 -574 -593 599 1024 -98 -537 436
5747 436 664 744 -1378 -9 267 -89 -376 136 -593 85 630 307 169 -357 -432 709 -205 -415 157 -562
5767 -562 222 1198 39 21 372 11 -53 40 -245 -176 511 -293 -239 67 -193 -226 -291 -99 -166 636 -631 -120
5789 -120 -163 337 1527 697 15 -625 706 192 -336 -78 92 -367 -810 -596 -1005 719 -554 -174 113
5808 113 641 -781 -709 135 -445 151 -97 392 99 -436 -236 -557 671 23 -1171 -224 725 -186 -120 -370
5828 -370 -279 66 513 -167 157 44 299 -669 -691 -560 -239 169 403 466 -282 -336 -414 -1244 160 728 -503
5849 -503 -283 356 -1068 73 -313 509 -450 202 -174 432 35 -455 419 311 -117 981 -721 788
5867 788 317 6 -966 -107 134 429 474 237 751 590 246 -464 -692 -514 408 -452 -214 -334 -283 262 178
5888 178 166 76 -805 638 -51 502 105 195 673 475 -711 -1008 344 -2 -655 -471 -418 1301 -320 -1542
5908 -1542 -326 -1079 -288 -700 339 -390 -994 473 565 -537 -871 596 708 421 -675 -291 131 -52
5926 -52 900 -669 329 104 101 -932 39 -764 350 211 -3 -108 -853 284 426 1834 -374 537 345
5945 345 683 -734 -976 -340 455 -516 -1184 -165 94 117 -307 -886 -763 60 590 -724 -661 -34 -524 -212
5965 -212 -883 -831 68 471 13 -624 -98 38 598 554 6 -674 1085 1112 -444 -543 -433 151 259 39 -1358
5986 -1358 -722 -229 -12 377 -921 -503 -26 146 -936 -1001 -374 66 -85 -500 109 -74 154 92 -295 251
6006 251 426 401 -98 -782 -133 249 545 -18 -436 -174 452 449 -585 -437 -164 501 484 -342 -536 -261 610
6027 610 470 -219 -551 157 597 22 -451 -581 89 721 97 -318 -461 722 582 -101 -574 -46 57 459
6047 459 -73 -556 -341 467 375 -243 -410 -179 542 124 -320 -537 -105 745 56 -800 -528 220 576 254
6067 254 -573 -550 147 455 -157 -570 -346 229 550 -124 -704 -312 797 -89 -484 -629 161 316 294 -262
6087 -262 -549 157 281 571 -126 -273 69 535 -67 -360 -321 320 332 102 -578 -203 444 567 -84 -697 109
6108 109 723 705 -357 -383 -327 597 286 -418 -558 270 457 131 -334 -241 328 556 157 -525 -226 310 267
6129 267 39 -128 -283 460 668 128 -550 -328 663 450 -196 -649 236 851 694 -429 -628 389 610
6148 610 234 -405 -414 363 227 82 14 -638 93 397 77 -467 -535 423 706 -379 -562 -130 390 322 -374
6169 -374 -476 -260 301 206 -230 -346 197 310 152 -177 -415 255 699 68 -859 -464 429 610 -15 -510
6189 -510 -158 291 151 -90 -363 -258 357 509 -250 -526 -214 298 283 -80 -663 -145 413 174 -320 -111
6209 -111 278 545 127 -407 -477 511 584 80 -603 -297 303 134 11 -391 -99 573 576 -174 -588 144 636
6230 636 344 -253 -471 208 370 52 -364 -236 134 196 309 -273 -153 260 463 257 -582 -273 286 608
6250 608 -161 -561 1 409 92 -104 -379 120 316 436 -100 -357 368 549 351 -325 -447 -90 317 344
6270 344 -291 -215 301 422 112 -215 -11 310 286 -267 -523 -21 202 623 -348 -603 -166 437 83 -172 -363
6291 -363 -120 581 311 -638 -313 154 515 -14 -423 -394 348 259 14 -445 -229 558 575 -222 -508 -435 401
6312 401 243 -686 -522 -93 292 172 -521 -519 139 622 272 -429 -228 136 534 54 -695 -150 360 302 -220
6333 -220 -361 -182 656 578 -191 -276 -110 488 428 -370 -417 225 740 458 -826 -332 162 438 279 -270 -172
6354 -172 591 535 176 -364 -278 347 213 288 -77 -59 551 386 -242 -512 67 595 366 -415 -222 -28 702
6375 702 -64 -166 52 277 42 -38 -335 -363 479 521 110 -597 -374 341 650 112 -676 138 535 78 -585
6396 -585 -289 -51 9 541 -67 -288 497 201 -79 -218 -368 61 434 -105 -521 -139 258 387 -324 -458
6416 -458 65 398 433 -210 -322 16 361 -146 -261 -239 66 263 34 -223 -296 571 468 -104 -893 -208 442
6437 442 282 -155 -547 -190 335 236 -435 80 14 164 31 -158 -274 -104 367 374 -432 -457 330 433 54 -355
6459 -355 60 416 445 -51 -323 -207 315 306 -19 56 -190 246 168 -20 -524 133 550 365 -601 -296 386 717
6481 717 150 -255 -180 391 48 -204 -317 5 72 125 -75 -162 84 -53 352 -250 -458 -289 444 145 -238
6502 -238 -316 197 498 -172 -365 -289 19 174 56 -211 11 288 191 -51 -95 -248 346 57 -419 -201 -105 253
6524 253 -75 -206 -401 81 465 -194 -138 -594 -21 369 170 -421 -282 -131 411 -55 -657 -390 168 393
6544 393 -155 -632 89 153 188 -271 -230 10 73 357 -265 -268 326 381 290 122 -285 82 402 263 -136 -200 32
6567 32 215 -163 -180 -52 416 275 -105 -124 166 198 31 26 -115 107 169 132 -132 -107 -99 353 151 -6 -155 426
6591 426 319 240 -32 -429 239 76 16 -167 -35 180 59 -286 -257 161 240 88 -216 -174 -330 339 99 -142
6613 -142 -439 5 264 92 -243 -287 -120 148 20 -358 -144 319 148 -22 -367 -247 286 373 -125 -539 39
6634 39 97 269 -87 -155 -145 104 158 28 -554 -113 320 -20 -31 -349 272 256 193 -69 -68 10 -130 121 -211 -41
6658 -41 -59 218 109 -360 -28 344 240 -273 -446 -117 290 345 -108 -230 116 646 234 -119 -359 49 406
6679 406 56 -363 -197 329 404 44 -317 -186 225 301 -8 -357 -24 248 102 -88 -64 1 293 284 -134 -333
6701 -333 291 204 217 -442 -306 19 251 126 -336 78 484 258 -84 -208 -190 323 368 97 -329 -22 145
6722 145 281 -260 -198 274 268 -72 -253 -218 -259 -107 -31 -169 -54 84 491 152 -447 2 119 139 31 -238
6744 -238 -166 415 -5 -178 -178 -81 157 133 -316 1 93 116 -185 -226 -291 52 359 -177 -424 95 201 475 -147
6767 -147 -386 -325 258 457 41 -216 14 -32 -92 101 -207 -179 186 -95 -340 -285 338 -87 271 -606 -208 727
6789 727 21 -104 -501 -301 318 264 -56 -384 136 468 27 -532 -482 -95 281 382 -434 -500 477 463 -163
6810 -163 103 -629 -48 674 403 -120 -190 66 161 -408 -549 510 427 116 -470 -486 349 237 -410 -529 -541
6831 -541 695 71 -401 -231 -443 342 438 -94 -1389 -12 569 -592 -139 -631 -1150 90 90 -138 -257
6850 -257 -853 515 182 697 336 -646 893 295 -575 -176 403 628 -511 -295 -1263 529 232 470 -556
6869 -556 109 586 -372 -164 -179 81 -816 737 -127 -1172 -456 106 -416 -118 215 -400 350 144 123 -29
6889 -29 717 -44 -195 -681 -263 425 349 -201 215 -200 133 494 -415 -405 -415 559 260 -277 -422 168 486
6910 486 -231 -326 205 -133 532 -266 152 -469 219 -54 -229 -250 -294 224 -353 612 -252 -343 -289 127 -29 -111
6932 -111 -75 331 392 -192 -670 333 268 120 -632 377 212 101 -268 -667 -321 710 -19 -241 -587 -43
6952 -43 -464 96 -21 -120 24 61 99 -156 139 -288 314 222 -439 -133 545 -68 -279 -200 -422 293 127 193
6974 193 -356 -425 185 314 -283 -723 -323 233 353 -248 -320 -180 272 32 -47 -451 -84 715 -150 -360 -172
6995 -172 -30 87 113 -269 -272 75 216 213 -641 -298 216 562 25 -263 -347 357 34 -142 -101 -138 583 413 -222
7018 -222 -285 -67 42 99 -515 -469 -34 429 55 -321 -376 199 519 97 -248 -100 494 542 -40 -500 -35 130
7040 130 317 -35 -380 -225 540 230 -499 -325 40 430 357 -401 -327 74 392 268 -594 -290 -137 503 147
7061 147 -260 -216 562 450 -205 -492 -275 94 259 -127 -211 -211 144 422 -37 -267 -7 250 -17 -165 -251 -129
7083 -129 285 460 -500 -473 -7 258 508 -198 -439 267 335 121 -500 -390 219 539 34 -562 4 465 233
7104 233 -292 -233 -338 302 226 -316 -316 218 215 206 -257 -277 -146 581 -30 -386 -568 391 386 -180 -177 17 160 330
7128 330 -398 -101 -275 111 105 92 -325 -248 323 150 -294 -208 -79 415 165 -167 -380 149 163 -111 -188 110
7150 110 152 -66 143 76 -198 87 472 55 -409 -150 388 298 -319 -840 -342 715 154 -324 -333 138 356
7171 356 389 -144 -420 -30 369 30 -151 -510 226 567 -132 -669 -305 445 451 -272 -558 -70 706 448 -276
7192 -276 -559 -92 474 311 -183 -369 -79 521 -20 -473 -434 -73 336 251 -461 -246 232 477 -226 -470 -386
7213 -386 215 281 -41 -239 -103 379 347 86 -384 -181 186 287 -136 -537 102 432 -1 -323 -448 63 409
7234 409 -22 -107 -184 52 358 -24 -114 -100 391 390 -108 -46 -222 315 469 -382 -464 -3 170 53 -133 -328 87
7257 87 277 -82 -17 -113 -10 15 3 -58 -248 -116 285 158 -387 -52 166 466 315 233 462 82 263 -92
7279 -92 52 73 222 0 -63 395 -20 -52 -10 -272 -264 153 136 -164 -408 -157 91 548 -98 -45 -188 32 357
7302 357 -66 -66 12 508 -55 -73 -341 108 104 84 -119 -44 -29 -19 -95 -544 108 4 117 -43 56 -105 -313 218
7326 218 -232 -354 -296 236 -19 61 -94 -384 498 237 -133 -264 -172 -21 274 -858 -3 338 182 -97 -365
7347 -365 68 -7 146 -37 -416 -256 -177 -395 -53 211 154 -134 572 215 -36 16 -60 251 -518 -239 182 -109
7369 -109 -45 -44 -420 -106 204 -198 101 10 256 -11 -32 -515 -329 43 -229 79 1 -37 -61 -157 -358 -390 35
7392 35 191 -168 113 -235 428 239 168 -322 -116 197 167 110 159 192 153 -111 -41 -215 -8 -395 604 -200 -258
7415 -258 504 335 75 -312 333 -96 -577 -331 -124 241 -297 22 116 208 -55 14 417 -198 -599 164 250
7436 250 -208 -138 -222 18 588 -247 -168 297 456 -775 -219 89 368 448 -209 -257 -565 478 359 285 -284
7457 -284 100 470 -397 -581 -79 404 561 182 142 324 -113 567 668 269 -24 470 357 -351 -79 293
7477 293 61 -128 382 -696 -61 264 440 -298 86 289 277 -120 -230 -465 292 348 -41 174 -532 104
7497 104 388 513 28 -148 277 148 232 -59 -9 815 -85 -327 -534 -581 209 292 378 54 4 958 290 -55
7519 -55 -444 -18 560 694 -520 109 87 350 720 18 3 -6 46 193 -117 82 167 667 210 -586 -338 278
7541 278 772 -221 -199 -377 -74 327 -205 -343 -290 431 86 -45 -162 -339 539 272 -126 144 1 598 403
7562 403 105 -550 -369 30 68 -65 -138 276 15 -77 112 -551 322 697 557 -595 -178 270 751 52 -91
7583 -91 -39 516 323 -402 -511 -267 525 259 -148 -378 109 682 364 -258 -572 -28 151 160 -413 -600 -51
7604 -51 424 40 -273 27 403 253 -23 -213 11 583 630 -338 -697 -188 441 253 -328 -589 364 518 331
7625 331 -802 -137 162 478 139 -559 -300 583 515 -2 -503 -161 240 482 -381 -392 -162 399 231 -328
7645 -328 -361 -220 380 121 -81 -307 -16 908 299 -627 -421 229 416 145 -579 -529 53 428 -183 -283 -489
7666 -489 444 594 -223 -811 -431 606 308 -244 -887 -226 961 414 -271 -419 -114 698 211 -595 -614 141
7686 141 292 282 -663 -502 -33 490 106 -702 -589 240 385 -154 -790 -231 440 673 -202 -250 -291 578 687
7707 687 -239 -503 81 586 321 -303 -722 51 509 377 -356 -576 364 687 367 -361 -451 325 598 47
7727 47 -274 -450 66 819 64 -470 -199 938 420 -354 -909 49 781 304 -159 -283 -175 373 412 -429
7747 -429 -301 121 593 -132 -542 -458 394 514 122 -553 -47 378 508 3 -466 -146 180 582 -84 -96 46
7768 46 281 334 99 -432 -109 196 494 -31 -227 265 422 297 -465 -404 200 409 -340 -455 -614 289 526
7789 526 39 -455 45 168 426 -188 -293 -321 64 305 -286 -819 -401 309 146 -538 -313 224 339 256 -422
7810 -422 -224 246 251 40 -361 10 -157 266 -37 -315 180 276 629 86 -538 -266 405 207 -246 -438 104
7831 104 404 62 -192 76 109 123 100 -83 -300 -208 346 -95 -196 -240 87 100 459 -343 13 215 496 -133
7853 -133 -286 80 209 218 189 -97 -186 126 107 294 -251 -177 163 71 -293 -271 -158 559 -85 -263 -244 319 91
7876 91 176 -241 -40 14 179 -11 -410 -224 212 529 -120 -300 -89 66 301 -77 -261 41 67 153 18 -108
7898 -108 274 128 292 -83 -177 117 -212 -59 -73 -302 -284 -19 246 10 -435 -116 221 -87 -136 -209 237 172
7920 172 -16 -152 -98 105 -36 3 -151 -347 120 401 76 -132 -254 634 -6 -24 -144 -174 -91 -382 72 -76
7942 -76 -175 36 203 48 129 -74 -179 171 -26 -215 -227 160 147 70 -383 -197 23 218 -91 -75 -122 81 64
7965 64 -68 -366 97 486 129 25 -386 -224 196 136 -232 -284 -278 274 426 -155 -248 -210 208 50 12 -252 -388
7988 -388 249 -115 -99 -298 99 549 -4 -289 -150 21 -182 77 -294 -227 211 62 -311 -308 -266 -28 125 -41
8010 -41 -351 -60 225 364 -101 -265 -157 165 216 -285 -87 -140 -122 29 -166 -46 64 172 260 -74 -111 190
8032 190 331 27 -313 -332 144 331 -89 -511 -298 182 213 -272 -160 -22 312 -46 72 -234 -126 235 294
8053 294 -107 -543 -296 -127 221 -279 -372 -80 156 276 -207 -396 119 296 148 -47 -281 -136 362 -21
8073 -21 -413 -326 331 195 -26 -324 -220 215 166 -132 -388 101 -8 332 -105 -196 287 541 323 41 -91
8094 -91 -81 296 649 -313 -595 95 578 8 -346 -247 402 373 -209 -652 -379 167 454 -221 -275 -55 188 183
8116 183 -202 -256 -105 458 215 -93 -767 60 480 423 -163 -307 307 654 180 -244 -546 -29 448 299 -682
8137 -682 -270 322 647 63 -544 -362 266 600 -463 -672 -214 464 265 -38 -702 12 606 190 -214 -454
8157 -454 83 558 345 -618 -352 -81 707 30 -666 -348 381 457 -213 -581 -329 313 741 -336 -562 -289
$$ [...]
8191b32
##END NTUPLES=NMR FID
##END=
