##TITLE=1H_IAMT-139
 Py(d5)s, 24 sc, 
 30.10.2020
##JCAMPDX= 6.0         $$ Bruker NMR JCAMP-DX V2.0
##DATA TYPE= NMR FID
##DATA CLASS= NTUPLES
##ORIGIN= UXNMR, Bruker Analytische Messtechnik GmbH
##OWNER= root
$$ XWIN-NMR		Version 3.5
$$ Fri Oct 30 10:55:45 2020 Russian Standard Time (UT+4h)  she@DPX200
##.OBSERVE FREQUENCY= 200.1315066352
##.OBSERVE NUCLEUS= ^1H
##.DELAY= (6, 6)
##.ACQUISITION MODE= SIMULTANEOUS
##.ACQUISITION SCHEME= undefined
##.AVERAGES= 24
##.DIGITISER RES= 18
##SPECTROMETER/DATA SYSTEM= spect
##.PULSE SEQUENCE= zg30
##.SOLVENT NAME= CDCl3
##.SHIFT REFERENCE= (INTERNAL, CDCl3, 0, 15.7039)
##AUDIT TRAIL= $$ (NUMBER, WHEN, WHO, WHERE, WHAT)
$$ ##TITLE= Audit trail, XWIN-NMR		Version 3.5
$$ ##JCAMPDX= 5.01
$$ ##ORIGIN= Bruker BioSpin GmbH
$$ ##OWNER= she
$$ F:/spectra/data/she/nmr/H-F/1/audita.txt
$$ ##AUDIT TRAIL=  $$ (NUMBER, WHEN, WHO, WHERE, WHAT)
(   1,<2020-10-30 10:54:54.98 +0400>,<she>,<DPX200>,
      <continue with go, POWCHK disabled, PULCHK disabled
       configuration hash MD5:
       00 E9 B6 7A A2 85 ED C7 34 08 36 98 17 FE 4E 26
       data hash MD5: 16K
       99 A9 AD CD 8C C4 E0 82 71 E7 90 02 BB 41 90 C9>)
$$ ##END=
$$ 
$$ hash MD5
$$ 34 25 01 61 2C 53 A3 EC C2 19 1D B8 38 CE A2 18
##$RELAX= 
##$RELAX= 
##$RELAX= 
##$RELAX= 
##$RELAX= 
##$RELAX= 
$$ Bruker specific parameters
$$ --------------------------
##$DU= <F:/spectra>
##$EXPNO= 1
##$NAME= <H-F>
##$PROCNO= 1
##$TYPE= <nmr>
##$USER= <she>
##$AMP= (0..31)
100 100 100 100 100 100 100 100 100 100 100 100 100 100 100 100 100 100 
100 100 100 100 100 100 100 100 100 100 100 100 100 100 
##$AQSEQ= 0
##$AQ_mod= 1
##$AUNM= <au_zg>
##$AUTOPOS= <>
##$BF1= 200.13
##$BF2= 200.13
##$BF3= 200.13
##$BF4= 200.13
##$BF5= 200.13
##$BF6= 200.13
##$BF7= 200.13
##$BF8= 200.13
##$BYTORDA= 1
##$CFDGTYP= 0
##$CFRGTYP= 5
##$CHEMSTR= <none>
##$CNST= (0..31)
1 1 145 1 1 1 1 1 1 1 1 1 1 1 1 1 1 1 1 1 1 1 1 1 1 1 1 1 1 1 1 1 
##$CPDPRG= <>
##$CPDPRG1= <>
##$CPDPRG2= <>
##$CPDPRG3= <>
##$CPDPRG4= <mlev>
##$CPDPRG5= <mlev>
##$CPDPRG6= <mlev>
##$CPDPRG7= <mlev>
##$CPDPRG8= <mlev>
##$CPDPRGB= <>
##$CPDPRGT= <>
##$D= (0..31)
0 1.2 0 0 0 0 0 0 0 0.06 0 0.03 0 0 0 0 0.0002 0 0 0 0 0 0 0 0 0 0 0 0 
0 0 0 
##$DATE= 1604040730
##$DBL= (0..7)
120 120 120 120 120 120 120 120 
##$DBP= (0..7)
150 150 150 150 150 150 150 150 
##$DBP07= 0
##$DBPNAM0= <>
##$DBPNAM1= <>
##$DBPNAM2= <>
##$DBPNAM3= <>
##$DBPNAM4= <>
##$DBPNAM5= <>
##$DBPNAM6= <>
##$DBPNAM7= <>
##$DBPOAL= (0..7)
0.5 0.5 0.5 0.5 0.5 0.5 0.5 0.5 
##$DBPOFFS= (0..7)
0 0 0 0 0 0 0 0 
##$DE= 6
##$DECBNUC= <off>
##$DECIM= 24
##$DECNUC= <off>
##$DECSTAT= 4
##$DIGMOD= 1
##$DIGTYP= 9
##$DL= (0..7)
0 120 120 120 120 120 120 120 
##$DP= (0..7)
150 150 150 150 150 150 150 150 
##$DP07= 0
##$DPNAME0= <>
##$DPNAME1= <>
##$DPNAME2= <>
##$DPNAME3= <>
##$DPNAME4= <>
##$DPNAME5= <>
##$DPNAME6= <>
##$DPNAME7= <>
##$DPOAL= (0..7)
0.5 0.5 0.5 0.5 0.5 0.5 0.5 0.5 
##$DPOFFS= (0..7)
0 0 0 0 0 0 0 0 
##$DQDMODE= 0
##$DR= 18
##$DS= 0
$$ [...]
##$SUBNAM2= <"">
##$SUBNAM3= <"">
##$SUBNAM4= <"">
##$SUBNAM5= <"">
##$SUBNAM6= <"">
##$SUBNAM7= <"">
##$SUBNAM8= <"">
##$SUBNAM9= <"">
##$SW= 26.024554658588
##$SWIBOX= (0..15)
0 0 2 0 0 0 0 0 0 0 0 0 0 0 0 0 
##$SW_h= 5208.33333333333
##$TD= 16384
##$TD0= 1
##$TE= 0
##$TE2= 300
##$TE3= 300
##$TEG= 300
##$TL= (0..7)
0 120 120 120 120 120 120 120 
##$TP= (0..7)
150 150 150 150 150 150 150 150 
##$TP07= 0
##$TPNAME0= <>
##$TPNAME1= <>
##$TPNAME2= <>
##$TPNAME3= <>
##$TPNAME4= <>
##$TPNAME5= <>
##$TPNAME6= <>
##$TPNAME7= <>
##$TPOAL= (0..7)
0.5 0.5 0.5 0.5 0.5 0.5 0.5 0.5 
##$TPOFFS= (0..7)
0 0 0 0 0 0 0 0 
##$TUNHIN= 0
##$TUNHOUT= 0
##$TUNXOUT= 0
##$USERA1= <user>
##$USERA2= <user>
##$USERA3= <user>
##$USERA4= <user>
##$USERA5= <user>
##$V9= 5
##$VALIST= <valist>
##$VCLIST= <CCCCCCCCCCCCCCC>
##$VD= 0
##$VDLIST= <DDDDDDDDDDDDDDD>
##$VPLIST= <PPPPPPPPPPPPPPP>
##$VTLIST= <TTTTTTTTTTTTTTT>
##$WBST= 1024
##$WBSW= 4
##$XGAIN= (0..3)
0 0 0 0 
##$XL= 0
##$YL= 0
##$YMAX_a= 47876
##$YMIN_a= -73009
##$ZGOPTNS= <>
##$ZL1= 120
##$ZL2= 120
##$ZL3= 120
##$ZL4= 120
##$ABSF1= 10
##$ABSF2= 0
##$ABSG= 5
##$ABSL= 3
##$ALPHA= 0
##$AQORDER= 0
##$ASSFAC= 0
##$ASSFACI= 0
##$ASSFACX= 0
##$ASSWID= 0
##$AUNMP= <proc_1d>
##$AZFE= 0.1
##$AZFW= 0.1
##$BCFW= 1
##$BC_mod= 2
##$BYTORDP= 1
##$COROFFS= 0
##$CY= 11.3945322036743
##$DATMOD= 1
##$DC= 2
##$DFILT= <>
##$DTYPP= 0
##$F1P= 15.9154993809931
##$F2P= -4.1035820241983
##$FCOR= 0.5
##$FTSIZE= 0
##$FT_mod= 4
##$GAMMA= 1
##$GB= 0.15
##$INTBC= 1
##$INTSCL= 1
##$ISEN= 128
##$LB= 0.24
##$LEV0= 0
##$LPBIN= 0
##$MAXI= 10000
##$MC2= 0
##$MEAN= 0
##$ME_mod= 0
##$MI= 1.114404
##$NCOEF= 0
##$NC_proc= 0
##$NLEV= 6
##$NOISF1= 3.799351
##$NOISF2= 2.8
##$NSP= 1
##$NTH_PI= 0
##$NZP= 0
##$OFFSET= 15.70392
##$PC= 1
##$PHC0= -11033.84
##$PHC1= 20.60088
##$PH_mod= 1
##$PKNL= yes
##$PPARMOD= 0
##$PSCAL= 0
##$PSIGN= 0
##$REVERSE= no
##$SF= 200.130013532006
##$SI= 16384
##$SIGF1= 3
##$SIGF2= 2
##$SINO= 400
##$SIOLD= 16384
##$SREGLST= <1H.CDCl3>
##$SSB= 0
##$STSI= 0
##$STSR= 0
##$SW_p= 3612.71676300578
##$SYMM= 0
##$S_DEV= 0
##$TDeff= 0
##$TDoff= 0
##$TI= <>
##$TILT= no
##$TM1= 0
##$TM2= 0
##$TOPLEV= 0
##$USERP1= <user>
##$USERP2= <user>
##$USERP3= <user>
##$USERP4= <user>
##$USERP5= <user>
##$WDW= 1
##$XDIM= 8192
##$YMAX_p= 0
##$YMIN_p= 0
$$ End of Bruker specific parameters
$$ ---------------------------------
##NTUPLES= NMR FID
##VAR_NAME=  TIME,          FID/REAL,        FID/IMAG
##SYMBOL=    X,             R,               I
##VAR_TYPE=  INDEPENDENT,   DEPENDENT,       DEPENDENT
##VAR_FORM=  AFFN,          ASDF,            ASDF
##VAR_DIM=   8192,          8192,            8192
##UNITS=     SECONDS,       ARBITRARY UNITS, ARBITRARY UNITS
##FACTOR=    0.000192,      1,               1
##FIRST=     0,             0,               0
##LAST=      1.572672,      0,               0
##MIN=       0,             -73009,          0
##MAX=       1.572672,      47876,           0
$$ Real data points
##PAGE= N=1
##DATA TABLE= (X++(R..R)), XYDATA
$$ [...]
3109b231J883K793l187j094L475o94l224K259K244l402m40L582j439k864K848
3124E09J620l623J93L403j965k452L328Q33l661R40L047k427k024L519K65l517
3140b012J389K953l041j334L790m60l358J906K341l154r02L850j038l215K460
3155A75J814l467k3L613j677k712K953J114l422N56L430k244k340L272O76l679
3171a961J268K879k450j819L491j78l334J709K648k989j188L642o96l294K352
3186H0K089l299m84L489j239l026K973J450l471O4L424j781k580L172R17l507
3202a729P35L109k287j783L237L01l481J319K785k903j386L689l47l326J940K091
3218A964k880p90L550j017l121K570J827l374r8L473j590k696K690J480l646O87
$$ plain form
3109 -2231 -348 2445 -742 -1836 1639 945 -2279 -20 2224 -1178 -1618 1964 525 -2339 509
3124 509 2129 -1494 -1301 2102 137 -2315 1013 1846 -1815 -875 2172 -255 -2279 1240 1505 -2012
3140 -2012 -623 2330 -711 -2045 1745 1285 -2073 -167 2174 -980 -1882 1968 930 -2285 175
3155 175 1989 -1478 -1501 2112 435 -2277 676 1790 -1632 -1076 2354 110 -2230 1042 1718 -1961
3171 -1961 -693 2186 -264 -2083 1408 1230 -2104 -395 2253 -736 -1924 1718 1022 -2272 80
3186 80 2169 -1130 -1614 1875 636 -2390 583 2033 -1438 -1374 2050 269 -2311 861 1778 -1729
3202 -1729 -994 2115 -172 -1955 1282 1583 -1898 -579 2206 -697 -2083 1606 1259 -2067 -127 1964
3218 1964 -916 -1706 1844 827 -2294 276 2103 -1271 -1369 2104 514 -2182 508 1988 -1658 -971
3234i71L315k113k512L327L88l362J225K880k463j732L369ql404J822K517l040
3250g62j056L478o02l202K231K005l278m20L429j247k855K634J629l450J70L334
3266B038j754k456L058J020l545O78L048k157j975L310L72l613J521K532k583
3281e06j384L333k04l376J964K302l091p36L442r27l088K349J936l241n8L350
3297B065j528k757K885J084l306M70L165k029k110L081O40l466J116K883k589
3312c96j610L316M0l304J525K643k849j190L293n13l033K105K080l155m91L320
3328A781j137k770K570J512l350J46L191j640k429K911R52l343N87K987j951k162
3344b145L472J82l362J254K642k434j413L313k58l278J664K398k890p89L368q57
$$ plain form
3234 -971 2344 231 -2281 1046 1434 -1928 -703 2177 -286 -2018 1351 1343 -2061 -239 2278 -762
3250 -762 -1818 1660 1058 -2144 87 2092 -1186 -1606 1823 576 -2279 355 1984 -1466 -1296 2038
3266 2038 284 -2172 886 1906 -1639 -961 2087 -70 -2045 1265 1637 -1976 -455 2077 -506
3281 -506 -1890 1443 1239 -2137 -173 2129 -962 -1698 1744 817 -2271 78 2014 -1227 -1285 2065
3297 2065 537 -2220 665 1749 -1557 -1087 2078 49 -2061 1020 1660 -1806 -690 2193 -396
3312 -396 -2006 1310 1350 -1954 -429 2214 -635 -1825 1468 955 -2078 27 2107 -1048 -1539 1781
3328 1781 644 -2126 444 1956 -1394 -1248 1943 303 -2126 785 1737 -1606 -1019 1968 17 -2145
3344 -2145 1327 1509 -1853 -599 2043 -391 -1804 1509 1251 -2027 -363 2035 -855 -1644 1724 867
3360H67k982K276J787l048l43L356j516k493K770J026l227N89K947j942k192L053
3376I28O57l206R06K812k294j836L366n4l268J585K581k822j022L147n32k911
3392a963K035J960l066m88L272j097k737K536J395l149L2L037j504k325K863Q41
3408A642l230P98K882k224j815K983L45l086J016K599k300j391L246k57l096J713
3424a75K254k933p68L282q02k856K220J690l104j31L126j297k584K671J232l244
3440a419L64K969j871k035K826O69l119R39K810k480j551L096N5l116J460K595
3456B192k843j141L160o05k846K022K030k934n29L156r16k766K331J500l110M8
3472a251L053j399k377K604J084l291N76K882j986j894L036M01l174J129K650
$$ plain form
3360 867 -2115 161 1948 -1100 -1443 1913 397 -2096 674 1700 -1527 -938 2009 67 -2125 928
3376 928 1585 -1621 -715 2097 -197 -2033 1333 1279 -1989 -404 2177 -645 -1667 1480 948 -1963
3392 -1963 72 2032 -1034 -1522 1750 653 -2084 452 1847 -1302 -1270 1767 263 -2062 801 1642
3408 1642 -1588 -790 2092 -132 -1947 1036 1381 -1705 -689 1910 -390 -1781 1465 1208 -1888 -175
3424 -175 2079 -854 -1622 1660 858 -1998 222 1912 -1192 -1323 1803 506 -2078 593 1825 -1419
3440 -1419 -1055 1914 43 -1992 834 1503 -1616 -677 2133 -347 -1898 1198 1253 -1863 -403 2192
3456 2192 -651 -1792 1368 763 -2083 -61 1969 -965 -1494 1662 746 -2020 311 1811 -1299 -1251
3472 -1251 1802 403 -1974 630 1714 -1577 -1001 1881 -105 -1999 1037 1438 -1736 -607 2043
3487B043k517j256K973k34k872J620K243k736q35L044p24k828K151J848l013k07
3503a300L112j403k418K445J187k903J95K950j750k043K756O90l046Q07K634k104
3519a91j814L146J38l090J514K205k494j089L076l27k967J887J858k681p11L223
3535A683r67k520K181J295k772k08L021j549j986K439R36l123M85K844j794j858
3551a893K780N31l127J113K462k187j267K761j15k985J534K269k575p95K937o82
3567G61k688K029J578k782j99L004j296k364K302J272k933L29K852j725k097K830
3583H73O30l063P95K526k092j516K898K37k863J211K186k351j064K915k11k852
3599a741J689J923k681o95L062r02k482K013J407k805%K902j325k205K344J109
$$ plain form
3487 2043 -474 -1730 1243 1009 -1863 -243 2000 -736 -1571 1473 749 -2079 72 1920 -1093 -1300
3503 -1300 1812 409 -2009 436 1623 -1280 -1085 1865 115 -1928 828 1518 -1528 -721 1913 -191
3519 -191 -2005 1141 1279 -1811 -297 1908 -586 -1675 1401 1074 -1893 -6 1852 -829 -1540 1683
3535 1683 716 -1804 377 1672 -1100 -1308 1713 164 -1822 617 1553 -1570 -1085 1759 -35 -1893
3551 -1893 887 1418 -1709 -596 1866 -321 -1588 1173 1058 -1927 -393 1876 -699 -1494 1443 761
3567 761 -1927 102 1680 -1102 -1301 1703 407 -1957 345 1617 -1316 -987 1865 140 -1957 873
3583 873 1503 -1560 -765 1761 -331 -1847 1051 1288 -1575 -364 1822 -529 -1593 1322 1111 -1741
3599 -1741 -52 1871 -810 -1505 1557 655 -1827 186 1593 -1212 -1212 1690 365 -1840 504 1613
3615A613l113N65K801j798j797K658N59l134J008K429k123j340K886j86k932J617
3631b87K144k564p69K809n55k689J979J836k866l88K812j109k276K306J380l001
3647a238K62K664j601k063K631Q23k908O85K413j909j533K817J11k731J203K098
3663A724k232j063K912k86k708J472J943k536n57K893q34k510K045J381k718j86
3679a260K940j338j992K237R58k917M74K585j631j832K587N96l011J029K434k045
3695a86j394K737j53k598J434K109k525r33K836n81k518J816J708k663l91K758
3711A456r88k325K311J232k908J02K728j538j840K429Q07k990P31K521j849j579
3727a700K730J71k803J145K146k163j051K739k03k695J663J690k545n25K723o09
$$ plain form
3615 1613 -1500 -935 1866 68 -1729 929 1488 -1646 -638 1791 -332 -1672 1214 1028 -1904 -287
3631 -287 1857 -707 -1476 1333 778 -1911 68 1904 -962 -1350 1462 353 -1923 383 1763 -1238
3647 -1238 -976 1688 87 -1976 655 1478 -1430 -745 1668 -241 -1774 1043 1154 -1577 -374 1724
3663 1724 -508 -1571 1341 1055 -1653 -181 1762 -774 -1331 1562 728 -1782 263 1644 -1074 -1260
3679 -1260 1680 342 -1650 587 1545 -1372 -898 1687 56 -1776 811 1407 -1604 -575 1859 -186
3695 -186 -1580 1157 1004 -1594 -160 1949 -576 -1509 1327 746 -1772 44 1752 -911 -1302 1456
3711 1456 468 -1857 454 1686 -1222 -1120 1608 70 -1770 659 1466 -1524 -793 1728 -121 -1700
3727 -1700 1030 1201 -1602 -457 1689 -474 -1525 1214 1011 -1684 -21 1669 -876 -1401 1322 713
3743G13k503J927J464k722J23K524j164k144K279J011k782N06K410j689j678K553
3759H28L91k696R74K343k130j267K626n8k582J284K069k327r43K874n37k386J688
3776A51J603k605m14K719r62k201K088J231k728M9K626j435j897K395Q76k852
3792a356O02K474j886j426K533K21k572R89K142k164j046K649k24k529J421J822
3808A650k354n96K653o51k415J863J416k490j90K690j281k004K123J001k626L28
3824h83K505j537j744K367N80k717R50K134j935j381K735j7k526J327J878k255
3840e19q33K628m19k473J737J628k578l73K718j017k158J996J269k625M6K474
3856A501j165k011K323P74k688N72K322j736j482K423L57k525Q66K216k074j183
$$ plain form
3743 713 -1790 137 1601 -1121 -998 1526 362 -1782 497 1508 -1274 -768 1642 -47 -1725 828
3759 828 1219 -1477 -503 1840 -290 -1557 1069 1011 -1571 -287 1782 -545 -1488 1386 849 -1537 151
3776 151 1754 -851 -1265 1454 492 -1709 379 1610 -1118 -1069 1557 122 -1775 620 1496 -1356
3792 -1356 -754 1720 -166 -1592 941 1162 -1410 -421 1721 -443 -1489 1160 936 -1593 -172 1650
3808 1650 -704 -1300 1353 702 -1713 150 1566 -924 -1114 1576 295 -1709 414 1415 -1211 -883
3824 -883 1622 85 -1659 708 1288 -1429 -479 1655 -280 -1661 1074 1057 -1469 -142 1736 -519
3840 -519 -1352 1276 857 -1616 121 1749 -829 -1202 1516 499 -1659 337 1606 -1019 -973 1501
3856 1501 336 -1675 648 1422 -1266 -694 1628 -108 -1590 833 1190 -1335 -469 1747 -327 -1510
3872a510K656l15k400J458J781k289o27K536o64k216J788J278k362k37K620j005
3888D92k177K114R18k678M11K451j478j602K154N55k416O28K341j988j277K579
3904A027R4k534J198J880k003r65K548m44k362J566J534k298m85K734r46k220
3920a676K010J246k506j1K456j240j753K192O94k564N69K195j559j540K394L87
3936A294k727R79K141k049r90K526j93k424J310J818k251o22K493o12k119J557
3952A31J364k409j34K577j138k000K065R62k491L39K185j412j584K150P11k552
3968a236P46K145j900j317K374J23k548J290J910k082q85K536m62k339J593J543
3984A491k271l90K527q51k034J817J124k398N1K464j215j708K070P44k597L11
$$ plain form
3872 -1510 1146 831 -1569 -111 1670 -619 -1246 1290 626 -1590 198 1476 -886 -1123 1497 492
3888 492 -1685 429 1347 -1331 -920 1531 53 -1549 605 1160 -1256 -628 1713 -275 -1552 1027
3904 1027 1121 -1413 -215 1665 -338 -1303 1245 801 -1561 5 1539 -759 -1244 1490 544 -1676
3920 -1676 334 1580 -926 -937 1519 279 -1474 718 1412 -1152 -583 1612 53 -1487 907 1294
3936 1294 -1433 -454 1687 -362 -1352 1174 981 -1443 -133 1685 -566 -1188 1305 693 -1426 131
3952 131 1495 -914 -1048 1529 391 -1609 456 1418 -1073 -734 1451 39 -1545 605 1316 -1236
3968 -1236 -490 1655 -245 -1562 812 935 -1613 -323 1587 -495 -1380 1156 694 -1645 -52 1491
3984 1491 -780 -1170 1357 506 -1528 289 1413 -985 -934 1530 315 -1393 677 1421 -1176 -865
4000h65K466j648j323K247K45k507J077J934j894j113K493n8k479J355J658k062
4016d74p43K544o74k184J696J416k289l22K441r06j997J870R73k382K19K327j386
4033A29j566K072N84k526O36K256j662j384K499n6k332J073J753k032r13K471
4049A002k31k230J238J752k213n14K381p55k040J841J145k342j22K617j189j991
4065a651K195P59k575M55K293j575j458K173M11k499J001J989j751j145K366j
4081I87k396J207J695j972p63K504n87k265J646J367k239k63K423r86j771J734
4097C21J059k425J72K350j302j656K000O78k374M98K105j650j245K207K14k273
4113a321R14J885j919q56K318k64k219J381J412j931n20K218o36j949J680J090
$$ plain form
4000 -865 1601 -47 -1370 877 1122 -1385 -308 1626 -268 -1381 1112 1054 -1425 -70 1588 -474
4016 -474 -1217 1327 653 -1531 165 1581 -708 -1030 1411 505 -1492 378 1351 -1031 -812 1515 129
4033 129 -1437 635 1219 -1307 -671 1585 -77 -1461 1038 982 -1350 -277 1476 -556 -1469 1002
4049 1002 771 -1459 -221 1531 -682 -1196 1185 430 -1610 231 1376 -966 -1088 1529 340 -1651
4065 -1651 544 1303 -1272 -817 1476 -99 -1557 616 1027 -1472 -471 1518 -233 -1378 988 987
4081 987 -1409 -202 1493 -479 -1242 1262 675 -1590 56 1423 -816 -1079 1344 358 -1413 321
4097 321 1380 -1045 -873 1477 175 -1481 519 1197 -1177 -679 1426 -224 -1469 738 952 -1321
4113 -1321 -407 1478 -441 -1297 1021 757 -1462 -81 1331 -600 -1120 1098 462 -1487 193 1283
4129A283k207j08K438j209j768J920Q00k346K79K334j431j484K215M42k571Q37
4145e76J992j792r19K280o4k466J344J742k071p19K408m90k201J677J316k263
4161h02l23K414r78j886J865J100k335J11K255j283j685K125O03k416O86K010
4177A461j618j251K409L2k524J138J791j923q23K272k60k079J229J484j994n49
4193a205K419p10j956J603J069k223K0K392j204j777K042P21k390M09K091j275
4209B6j461K114K94k289P92K003j775j033K257o7k379J153J813j918p71K336l95
4226G00k307J639J423k268k87K372r39j777J765R78k326J07K352j209j680J884
4242D27P99k378M74K109j526j405K275K40k340R71J789j829q42K288k15k247J212
$$ plain form
4129 1283 -924 -1032 1406 197 -1571 349 1149 -1197 -918 1416 -15 -1499 716 1158 -1413 -576
4145 -576 1416 -376 -1295 985 921 -1545 -201 1541 -530 -1249 1159 669 -1532 145 1461 -802
4161 -802 -1125 1289 311 -1575 290 1390 -945 -834 1421 138 -1547 578 1181 -1235 -549 1461
4177 1461 -157 -1408 1001 1033 -1491 -353 1438 -485 -1308 964 704 -1375 -146 1338 -656 -1205
4193 -1205 1214 504 -1452 151 1220 -1003 -983 1409 205 -1572 470 1191 -1199 -790 1301 26
4209 26 -1435 679 973 -1316 -524 1479 -296 -1329 928 861 -1518 -365 1448 -470 -1241 1095 700
4226 700 -1607 32 1455 -813 -1100 1272 333 -1444 321 1299 -1027 -920 1432 223 -1457 427
4242 427 1226 -1152 -678 1431 -95 -1500 775 1015 -1325 -354 1435 -394 -1236 1052 837 -1410 -198
4259a98J714k214n09K367o03k064J574J343k254j27K222r42j810J836Q57k241
4275a049K90K210j260j777K196L25k231O27K141j816j063K334m4k220J073J760
4291A496k028q19K290k46k254J497J499k200m29K456q40j920J777J001k347J85
4307h82K290j345j536K061N90k342M37K100j516j121K005L13k393Q58J812j507
4323a76j115K391j96k254J185J612j937p03K341n85k076J692J293k317p1K219
4339A303j069j718J943Q49k411L32K259j386j583K009O22k379P50K071j748j168
4355a324K247l4k251J032J696j996o44K410l75k082J320J359k115m12K216p34
4371C13j777J707J235k414N5K214j219j653K106O29k283M86K072j500j401K179
$$ plain form
4259 -198 1516 -698 -1207 1160 557 -1507 67 1410 -844 -971 1251 309 -1501 335 1192 -1049
4275 -1049 -759 1451 191 -1586 610 935 -1296 -669 1472 -344 -1407 927 883 -1337 -264 1496
4291 1496 -532 -1351 939 693 -1561 -64 1435 -765 -1194 1262 422 -1498 279 1280 -1067 -882
4307 -882 1408 63 -1473 588 1178 -1164 -727 1373 -143 -1264 741 1054 -1339 -481 1331 -176
4323 -176 -1291 1100 904 -1350 -165 1447 -490 -1193 1148 563 -1513 179 1472 -845 -916 1303
4339 1303 234 -1484 459 1308 -1103 -771 1488 102 -1481 528 1150 -1229 -479 1592 -156 -1324
4355 -1324 923 889 -1362 -330 1366 -630 -1274 1136 761 -1321 -1 1358 -757 -1169 1047 313
4371 313 -1464 243 1478 -936 -881 1333 114 -1539 567 1196 -1087 -601 1471 -29 -1430 749
4387G49K53k338J028J795j769j004K188j02k198J165J689k054o08K441o11k133
4403a509J666J127k100j16K253r61j864J918R16k476L88K207j386j524K093N42
4419A174k286N57K074j706j279K348Q7k331J125J711j924q49K421l78k221J648
4435A71J322k200l86K370q16j961J732J216k388N5K164j025j656K004N91k224
4451a031L95K098j520j286K045L69k456Q91K032j850q84K160k4k219J248J541
4467A509k015n76K294n33k070J513J300k304l2K157r15j690J768R09k278K18K199
4484A454j335j534K121L92k221P03J962j622j243K235L7k216R98J790j868r06
4500a253K376k35k269J501J211j876m50K246o75j949J732J010k204j79K364j133
$$ plain form
4387 749 1002 -1336 -308 1487 -282 -1286 902 800 -1398 -233 1456 -598 -1206 1235 624 -1509
4403 -1509 157 1284 -816 -932 1321 360 -1504 414 1330 -1146 -758 1449 63 -1461 632 1174
4419 1174 -1112 -555 1519 -187 -1466 882 969 -1362 -237 1474 -450 -1299 1122 744 -1477 171
4435 171 1493 -707 -1093 1277 461 -1500 232 1448 -940 -885 1279 254 -1402 602 1193 -1031
4451 -1031 -636 1462 -58 -1344 701 1070 -1386 -495 1537 -313 -1197 963 939 -1280 -32 1509
4467 1509 -506 -1082 1212 679 -1391 122 1422 -882 -914 1243 328 -1362 406 1315 -963 -745 1454
4484 1454 119 -1415 706 1098 -1123 -420 1542 -80 -1323 912 949 -1267 -269 1521 -347 -1253
4500 -1253 1123 888 -1381 120 1331 -545 -995 1251 576 -1373 359 1369 -835 -1014 1350 217
4516B17j616J975N54k281M08K103j375j299K158J88k300Q16J873j748r34K183
4532I22q8k138J083J592j888n64K328o41k076J593J299k153k34K225r78j694J793
4549C81R04k156K45K091j332j560J988N72k191N11J887j484j132K137J63k355
4565a331J040J817j930q18K319l14k019J272J390k078m07K321p46j880J560J203
4581A399k207j02K249j102j662J930P84k398M28K087j271j420J853M11k274R08
4597c87J822j533j106K190j85k079J084J573j998m38K218n82j931J425J200k057
4613g84j43K250j037j737J848P93k185J27K220j138j643J957O42k162L96J946
4629A350j475j414K293K01k142R72J665j860o81K081k69k083J276J491k013n02
$$ plain form
4516 217 -1399 576 1130 -1151 -743 1360 -15 -1314 844 1032 -1268 -452 1421 -327 -1261 922
4532 922 834 -1304 -221 1371 -517 -1081 1247 606 -1470 123 1422 -731 -965 1260 282 -1412 381
4549 381 1285 -871 -626 1465 133 -1427 561 1133 -1058 -547 1340 -144 -1276 861 1024 -1331
4565 -1331 -291 1526 -404 -1222 1097 783 -1236 36 1426 -652 -1059 1262 516 -1364 196 1399
4581 1399 -808 -910 1339 237 -1425 505 1289 -1109 -681 1406 135 -1285 568 979 -1295 -387
4597 -387 1435 -98 -1204 986 801 -1278 -194 1379 -619 -1057 1161 579 -1352 73 1273 -784
4613 -784 -927 1323 286 -1451 397 1190 -995 -868 1352 214 -1429 528 1170 -992 -596 1350
4629 1350 -125 -1539 754 955 -1187 -215 1450 -410 -1091 990 721 -1362 -86 1405 -608 -1110
4645a110K247o05j957J647J086k241N3K156r99j562J778O76k324N20J896j295
4661c4j219J933L53k296Q35J787j551j027K048j9k068J063J639j873p08K194m06
4678F51k009J382J350k098k46K005p06j739J678J004k181P0K076j168j453K029
4694F45N70k206L76J932j499j165K194J66k358R43J686j680p75K157k44j948J060
4711a46J452j963o15K355p03j785J518J177k201MK063r89j484J666P30k175N01
4728e95J888j287j375K018L58k152P22J920j692j035K086J9k224J232J339j735
4744e13p42K223l97j924J467J132j961k49K109p55j833J659J081k057J5J998j081
4761A72j627K073M96k177N30J845j550j055K019J52k120Q57J731j663p87K067
$$ plain form
4645 -1110 1137 532 -1425 222 1308 -933 -880 1276 277 -1285 493 1169 -1155 -635 1261 -34
4661 -34 -1253 680 1033 -1263 -428 1359 -192 -1219 829 810 -1258 -195 1444 -429 -1137 1057 651
4678 651 -1358 24 1374 -724 -970 1035 329 -1410 268 1272 -909 -839 1237 69 -1384 645
4694 645 1215 -991 -615 1317 -182 -1347 847 1013 -1345 -402 1284 -396 -1171 986 742 -1206 -146
4711 -146 1306 -657 -1272 1083 380 -1405 113 1290 -911 -907 1156 167 -1317 349 1079 -1096 -595
4728 -595 1293 6 -1369 649 1007 -1145 -423 1497 -195 -1230 856 875 -1349 -117 1222 -513
4744 -513 -1255 968 571 -1353 114 1246 -715 -964 1145 390 -1443 216 1297 -760 -745 1253 172
4761 172 -1455 618 1114 -1063 -533 1312 -238 -1293 726 878 -1242 -385 1346 -317 -1104 963
4777I63k48k019J302J300j892m46K172o76j892J540J050j994n6K089q60j626J725
4794D32P54k211K92K068j372j307J855M65k143O60J797j523j043K025k2k052J091
4811b34J625j822o65K044l74j982J411J257j884l15K050q29j643J579J038k126
4827h70o7K124j091j448J772O79k101M78J792j410j094J997J71k147Q07J786j763
4844c85q38K200j15k190J137J378j786n76K207n69j853J461J210k082q3K059j030
4861A45j581J680Q34k034K52J869j090j322J806L12j961N71J940j622j023K087
4877H63j06k048R75J626j671p11K141m12j942J303J275j952l06J960n76j712J605
4894C12R23k038l4J983j095j316J802M66j983L16J940j281j213J881J78k034P72
$$ plain form
4777 963 715 -1304 -2 1298 -594 -1040 1132 456 -1436 104 1154 -840 -896 1193 333 -1293 432
4794 432 1186 -1025 -733 1335 -37 -1344 511 976 -1167 -507 1290 -233 -1276 749 727 -1325 -234
4811 -234 1391 -431 -1096 948 574 -1408 3 1260 -624 -939 1111 282 -1361 218 1256 -870
4827 -870 -937 1187 96 -1352 420 1099 -1002 -524 1268 -142 -1236 761 932 -1215 -408 1378 -385
4844 -385 -1223 977 862 -1328 -191 1187 -599 -1175 1032 463 -1390 71 1281 -801 -884 1175 145
4861 145 -1436 244 1078 -956 -704 1165 75 -1247 559 871 -1090 -519 1421 -201 -1224 863
4877 863 757 -1291 -316 1310 -361 -1072 1069 657 -1285 18 1293 -659 -965 995 419 -1293 312
4894 312 1235 -803 -837 1146 51 -1265 537 1003 -980 -664 1276 -5 -1218 663 841 -1193 -421
4911d21J596j574q20K119j59j970J029J499j727o60K101n17j740J314J051j877
4927g56r7K016q35j649J665O49j957K12J970j042j358J768L39k068O37J751j438
4944a93j078J989J03j949R10J451j659o35J807q8j907J202J270j882k19J944o83
4961C83j736J512R25j859N4J963j027j608J837N77k028M86J883j366j242J958
4977G12J95j982O44J563j432q41K009j83j995J224J229j690l23J847m84j725J356
4994A24J119j997OJ784p91j546J633P33j877J67J875j145j473J898M85j956N77
5011c84J616j371j027J855O7j818Q39J435j607o70J923j62j961J311J184j810
5027e80m11J982o04j626J449R86k002MJ791q10j402J701N02j938L56J823j166
$$ plain form
4911 -421 1175 -399 -1219 900 741 -1229 -200 1299 -428 -1088 1013 496 -1244 70 1121 -756
4927 -756 -853 1163 328 -1321 344 993 -964 -752 1218 176 -1182 586 925 -1143 -506 1245 -193
4944 -193 -1271 718 821 -1128 -218 1233 -426 -1061 746 658 -1249 -47 1223 -659 -878 1066 383
4961 383 -1353 159 1084 -775 -721 1242 215 -1393 444 1021 -1007 -521 1362 -4 -1246 712
4977 712 907 -1075 -431 1132 -300 -1141 868 685 -1310 -86 1143 -547 -870 977 493 -1232 124
4994 124 1243 -754 -748 1036 245 -1301 332 1065 -812 -645 1230 85 -1388 510 995 -961 -384
5011 -384 1232 -139 -1166 689 756 -1062 -223 1212 -395 -1065 858 696 -1265 46 1230 -580
5027 -580 -991 991 387 -1239 210 1196 -806 -802 989 179 -1223 478 980 -958 -602 1221 55
5044E5j148J709K93j979O87J636j387r97J962k06j787R21J400j535o82J994m86
5061D50j681J260J012j712j69J854p02j470J394Q63j856lJ913j031j365J787L31
5078H75j851M70J721j321r84J649L77k041Q68J518j570p84J894q6j871J184J146
5095A194j741m37J923m81j647J494Q88j958m6J914q23j396J604L88j692K02J827
5112A213j195j065J639K23j689L58J594j281q76J809q2j721R25J295j555n70J910
5129I32l94j524R94J150j774j91J889q01j487J432R03j739p3J835j061j268J660
5146D83M21j733L13J624j227j022J917J6j740O02J520j502o60J822j51j736J073
5163B0J195j661m77J790m12j623J346Q79j651j34J727p64j314J419O73j827J87
$$ plain form
5044 55 -1093 616 909 -1070 -383 1253 -134 -1131 831 625 -1162 -241 1159 -376 -1058 936 450
5061 450 -1231 29 1041 -671 -840 1014 312 -1158 236 1099 -757 -760 1153 122 -1243 544 875
5078 875 -976 -506 1215 -106 -1090 559 936 -1105 -237 1281 -289 -1073 821 735 -1136 48 1194
5095 1194 -547 -984 939 458 -1189 305 1193 -765 -811 1103 280 -1116 488 876 -816 -614 1213
5112 1213 18 -1047 592 815 -874 -516 1078 -203 -1079 730 648 -1073 -148 1147 -408 -978 932
5129 932 538 -986 8 1158 -616 -807 1082 281 -1206 226 1129 -610 -683 1152 91 -1177 483
5146 483 904 -829 -516 1108 -119 -1141 776 792 -948 -346 1174 -328 -988 834 683 -1053 20
5163 20 1215 -446 -923 867 455 -1168 178 1057 -594 -728 999 235 -1079 340 1013 -814 -627
5180f27J801r80j278J616K59j727O20J433j235q74J788j91j715R32J327j496m70
5197h17J697l55j590J140J060j642k95J726n00j538J294P57j710R1J697r64j118
5214a067J443N05j763L63J561j189j001J721K19j822O50J477j307p36J713k68
5230D99j582R66J311j722l28J744m69j559J263Q88j586k90J930q30j357J566M77
5247I21j582J77J504j035r95J638K03j674N06J432j363o67J628M8j766Q91J277
5264A143j381n93J669k97j683J160R96j571k41J710o75j268J295Q01j921J72J716
5281A032r00j296J513M63j624K91J531j095r71J498K54j583N28J461j312p61J754
5298G83j56j709J043J073j639l49J857m22j491J137R11j749n7J659o06j392J336
$$ plain form
5180 -627 1174 194 -1084 532 791 -936 -316 1117 -118 -992 796 605 -1110 -178 1149 -347 -817
5197 -817 880 525 -1065 75 1135 -507 -802 924 424 -1114 180 937 -773 -682 1015 51 -1067
5214 -1067 376 881 -882 -519 1042 -147 -1148 573 792 -1030 -380 1097 -210 -946 767 499
5230 499 -1083 -117 1194 -528 -856 888 419 -1140 123 1011 -575 -865 1065 235 -1122 444 921
5247 921 -661 -484 1020 -15 -1010 628 831 -843 -337 1095 -268 -935 693 741 -1025 -134 1143
5264 1143 -238 -831 838 541 -1142 18 1014 -557 -798 912 237 -1031 264 1065 -856 -684 1032
5281 1032 132 -1164 349 812 -812 -521 1010 -85 -1056 442 696 -887 -359 1102 -210 -971 783
5298 783 627 -1082 -39 1034 -605 -954 903 481 -1010 127 1038 -711 -768 891 285 -1107 229
5315B29P15j743J43J666r46j154J509L96j765M74J548j158r03J637k3j589Q85
5332g9J213j479m78J674l80j484R67J073j448l47J692n85j462J228Q30j588M3
5349f10J559p56j280J492L71j620L17J532q96j088J544J0j496N97J418j382o22
5366i10J750l32j403P17J147j316m63J541k53j469R98Q77j382j61J574o43j293
5383a021J318O13j653K04J577q93j137J398K99j585L63J542j195q05J625P1j574
5400h53M97J391j327n52J567j04j603Q74J239j558l63J633m94j380J304P41j566
5417e54j29J642q30j259J321O93j582P9J630r67j055J525K03j625O34J306j136
5434a04p89J419J08j580Q98J012j358m69J734l88j560J204P21j331j71J482m84
$$ plain form
5315 229 944 -799 -656 1010 64 -1090 419 815 -950 -476 1072 -86 -989 648 625 -964 -79
5332 -79 1134 -345 -823 851 471 -1013 -46 1027 -421 -768 924 339 -1123 105 935 -653 -610
5349 -610 949 193 -1087 405 776 -844 -527 1005 109 -979 565 575 -921 -324 1094 -288 -910
5366 -910 840 508 -895 -178 969 -347 -810 731 478 -991 7 884 -498 -659 915 272 -1021
5383 -1021 297 910 -743 -539 1038 145 -992 406 705 -880 -517 1025 -170 -975 650 721 -853
5400 -853 -356 1035 -292 -844 723 619 -984 -110 1129 -429 -792 841 347 -1033 271 1012 -554
5417 -554 -683 959 129 -1130 191 884 -698 -619 1011 44 -1011 514 717 -908 -274 1032 -104
5434 -104 -893 526 634 -946 -48 964 -394 -863 871 483 -1077 127 848 -483 -654 828 344
5451C44j367J293N00j468J26J403p72j090J417K99j486M67J311j048p80J338K12
5468F99j647O97J232j249o20J610k50j477J094Q51j381l74J604m08j364J069Q03
5485H89j557j0J554p08j109J148O33j626K36J460r47q79J430L02j668N55J304
5502A007j162p39J495N2j621Q41J158j411l19J475l24j378Q92R80j473j01J447
5519H19m23j404J196N93j604K35J471q13j030J262L26j353J88J465r63q42J409
5536E32Q7j519P05J173j219o40J457j32j345Q91J014j397m11J644n31j364J100
5553D5P70j310q8J466p85j125J297N13j462J55J403r57q12J365K15j471K69J384
5571H72j071o02J349J03j541P36J114j279o65J757l44j421J021P85j279j88J441
$$ plain form
5451 344 -1023 270 770 -698 -572 831 59 -1031 386 685 -801 -334 977 -71 -851 487 699
5468 699 -948 -251 981 -268 -888 722 472 -1005 89 940 -441 -815 789 381 -983 86 889
5485 889 -668 -678 876 168 -941 207 840 -786 -550 910 -37 -916 514 816 -852 -297 1007
5502 1007 -155 -894 601 653 -968 -127 1031 -380 -699 776 452 -926 -34 946 -527 -628 819
5519 819 396 -1008 188 781 -823 -588 883 70 -960 302 628 -725 -537 928 -35 -877 532
5536 532 619 -900 -195 978 -241 -881 576 444 -901 -10 1004 -393 -804 840 309 -1055 45
5553 45 815 -495 -583 883 98 -1027 270 783 -679 -524 879 -78 -890 475 690 -781 -512 872
5571 872 -199 -801 548 651 -890 -154 960 -319 -984 773 429 -992 29 814 -465 -653 788
5588G88n78j195J175N86j398J04J405o45j151J280L38j474L75J365j049r20J574
5605E80L0j425N59J260j164p67J501m6j527J032Q71j412l17J566l68j299R45Q93
5623I12j463j8J318n94j118J257N78j623K31J460q74j039J443K52j459L99J364
5640A026j239n74J438k5j421P44J068j304n38J380j44j385J032Q52j389k78J567
5657H10o30j166J168O18j425R7J568q95j142J351L90j408L41J282j073q95J589
5674E80J39j397M73J044j058o87J487k9j490Q19J001j274l70J349j33j336R74
5691I2O56j298q1J351o26r58J145M50j312J44J406r24r55J280K51j315M16J122
5709H44r13o80J400j18j349P67R18j101o27J594k10j442P67J046j336j79J413
$$ plain form
5588 788 210 -985 190 776 -622 -518 887 242 -909 371 709 -765 -390 975 -74 -994 580
5605 580 610 -815 -256 1004 -160 -927 574 528 -999 33 904 -508 -825 741 373 -926 19 912
5623 912 -551 -569 749 155 -963 294 872 -751 -520 940 66 -973 470 722 -737 -338 1026
5640 1026 -213 -787 651 626 -795 -51 1017 -287 -825 555 411 -974 58 910 -479 -757 810
5657 810 180 -986 182 800 -625 -528 1040 145 -997 354 744 -664 -323 959 -114 -1009 580
5674 580 719 -678 -205 839 -219 -906 581 552 -938 -119 882 -392 -762 587 454 -882 92
5691 92 748 -550 -631 720 94 -864 281 731 -581 -437 969 45 -910 370 621 -694 -278 844
5709 844 -69 -749 651 533 -816 -49 869 -232 -859 735 525 -917 -150 896 -440 -619 794
5726G94l87j374J003P57j440R3J454p95j096J389M13j353J79J239r47q12J343
5743D60L38j663O05J095j083m95J329j10j325P67R84j321l74J620m90j217R28
5760D8Q61j398k07J434n64j019J103M22j364K03J333p40j041J236K55j327M80
5777b85J236j141o65J315Q0j444P05J132j207n87J482j66j199O70J001j417j74
5794f64J361l44j250J018P12j366K1J355o76j089J203N13j365J25J334p68j020
5811i00J309K32j274L54J174j011o76J320l9j270O42J049j204m57J450k59j291
5828h51Q21Q52j100l30J417n61j224J195O19j491K01J279p38j004J223L85j414
5845g21K78J344r91p39J304J21j478P40J105j193n72J432j97j270P79Q56j078
$$ plain form
5726 794 407 -967 36 793 -647 -554 900 105 -991 398 811 -542 -363 876 -71 -883 460
5743 460 798 -865 -260 835 -248 -743 586 476 -849 -82 902 -419 -793 827 337 -880 48
5760 48 909 -489 -696 738 174 -845 258 680 -684 -481 852 112 -929 307 562 -765 -285
5777 -285 951 -190 -855 460 540 -904 -199 933 -274 -861 621 455 -744 -74 927 -490 -664
5794 -664 697 353 -897 121 833 -533 -512 843 167 -922 281 794 -571 -446 888 120 -900
5811 -900 409 641 -633 -279 895 -116 -792 528 489 -781 -139 910 -294 -751 699 440 -851
5828 -851 -30 822 -278 -608 809 248 -976 219 838 -653 -452 827 89 -915 308 693 -721
5845 -721 -443 901 -90 -829 475 596 -882 -142 963 -230 -802 630 433 -837 -58 798 -280
5862b80m12J469m57j269J060O50j329N8J206n85r50J138L90j401K05J411q34q66
5880g96J274J70j439M82J074j007n81J414r7j381P92R31j164l68J314k71j268
5897i21Q65R30j362j65J393n07j147J246M39j374K19J221p22j095J276L29j315
5914f90K28J320q54r37J380L19j466M88J115j078n67J273l7j331P58J030j387
5931d36k17J434m91j201R45Q38j369j61J480o70j102J198M80j357J68J219q06
5948d8p82J243J65j344M58J149j037o76J430r6j244P22R26j132m36J391k17j255
5966g83Q54P57j239j18J416o09j072J033O29j368N2J281o69r18J078M31j424M45
5984b24J088r24p67J243J15j434O00J142j019o43J428k56j242Q03J031j280l63
$$ plain form
5862 -280 -692 777 320 -949 111 761 -568 -510 696 111 -839 299 689 -712 -507 904 70 -796
5880 -796 478 648 -791 -309 765 -242 -823 591 494 -887 -95 836 -328 -696 618 347 -921
5897 -921 -56 874 -488 -653 740 233 -914 332 771 -603 -384 837 115 -980 296 625 -690
5914 -690 -462 858 4 -933 447 766 -700 -212 903 -175 -742 531 494 -837 -79 951 -436
5931 -436 -653 781 290 -911 34 872 -497 -658 822 152 -950 248 728 -629 -461 758 -48
5948 -48 -830 413 578 -766 -308 841 -196 -872 558 462 -782 -60 866 -266 -702 689 472 -783
5966 -783 71 828 -411 -529 887 278 -794 239 868 -500 -448 833 164 -754 324 755 -669 -224
5984 -224 864 -60 -827 416 531 -903 -303 839 -180 -823 605 349 -893 -90 941 -339 -702
6001g02J384k72j263J042O74j261j69J312o57r36J069O32j466J76J167q07p38
6018h15J231L73j633N21J145q69p79J388J5j398O28J136j146l53J165k76j175
6035h42Q29R54j345j74J314n18r82Q51O72j449J14J379o41r01J061K62j241L51
6053c06J148q31q58J227J82j169L78J030r13p68J414k22j136P43R59j127m38J379
6071F92l34j223R95O17j342M3J317o38j094J126N05j328K14J199o54q79J209K26
6089F51j408M80J212r92n87J096k1j267N79J052j034m82J456m29j207R88O91j230
6107d52j95J336m17j134J012O67j344J7J283p46r16J211L52j290K78J150q59p48
6125g95J199J28j330N44J032r90m16J187j02j222O76R25j232k81J440l90j285
$$ plain form
6001 -702 682 410 -853 189 863 -398 -567 745 88 -848 221 853 -613 -437 730 -77 -815
6018 -815 416 789 -844 -323 822 -47 -826 562 577 -821 -193 943 -203 -556 609 333 -842
6035 -842 -13 941 -404 -578 736 218 -764 87 759 -690 -576 803 162 -739 322 584 -657 -306
6053 -306 842 11 -847 380 562 -607 -229 801 -112 -880 534 312 -824 -81 878 -249 -687 692
6071 692 358 -865 130 747 -595 -552 765 127 -967 159 664 -664 -450 749 95 -784 425 651
6089 651 -757 -277 935 -57 -644 452 431 -836 -257 795 -239 -721 735 306 -901 87 778 -452
6107 -452 -647 689 272 -862 150 817 -527 -510 773 27 -889 322 674 -616 -338 812 -47 -795
6125 -795 404 532 -798 -254 778 -212 -628 559 457 -765 -89 836 -396 -677 763 373 -912
6142i12Q81P52j221p5J362o62r87J064M90j297P8J358p49r55J314J66j454O29
6160b18J092j070o44J365M5j305O59R75j088n35J267j46j210Q84P77j273j47J225
6178F53m07j228J213J060j973K36J217o98r50J186L86j265J60J226q41p13J165
6195D27J65j407N78J028r13n85J289j11j285O71J003j152l85J430l66j192P24
6212h1Q82j411N1J381n57q21P79N96j460J10J335o94q57J058L98j411M50J138
6230H86r49o37J226O4j297N94R50j063n03J321j85j146P36P90j212k00J335l70
6248C40j158R30N84j123j01J203n86r26J159L59j317L12J056p42q12J277J75j322
6266f92L58J136j021n11J291j24j195O73Q81j038m02J271m32r29Q40O84j124j19
$$ plain form
6142 -912 -31 721 -500 -575 787 125 -862 202 692 -605 -527 831 82 -873 441 607 -847 -218
6160 -218 874 -196 -840 525 570 -735 -76 899 -189 -724 543 397 -813 71 848 -425 -572 653
6178 653 246 -982 231 1291 -682 -446 771 73 -877 309 695 -570 -410 816 -25 -738 427
6195 427 592 -815 -237 791 -122 -707 582 471 -814 -143 860 -292 -677 753 387 -805 -81
6212 -81 801 -610 -559 822 265 -556 223 819 -641 -531 804 110 -747 311 709 -702 -252 886
6230 886 -63 -700 526 590 -707 -113 837 -226 -729 592 407 -739 -3 787 -425 -625 710 340
6248 340 -818 112 696 -427 -528 675 89 -837 322 681 -636 -324 732 -10 -822 455 630 -692
6266 -692 -334 802 -219 -730 561 437 -758 -85 796 -242 -644 627 195 -734 106 790 -334 -453
6284d53J140m49j056Q96O17j237J51J184o66r01J212O6j236L58J161q13p02J232
6302E04K2j223L91J146j035n21J332j24j162P25P35j096l13J184j92j136Q38O27
6320G02j179M7J194o97q91J088M82j417K96J253q83q06J320nj271O35R47r96n07
6339f88J243j15j227O29R19j050l07J262l54j123R04O26j134j36J331n76j149
6356i45J138N35j376J80J189p12p72J054L05j280L42J057p33p51J215P3j176M51
6374b06R93j034m61J340k39j066O73Q20j217k17J273l99j045R70N70j207p0J138
6392F16n82q44J095L37j122J79J134q02o36J005K00j182L84J077q88o57J191N
6410E10j196M95Q94j072j82J246k95j200Q04P71j228j57J360n30q88Q19N08j227
$$ plain form
6284 -453 687 238 -818 78 695 -542 -391 793 127 -774 438 504 -732 -374 787 -26 -728 504
6302 504 526 -697 -306 840 -195 -716 616 492 -670 55 790 -306 -619 565 373 -763 75 702
6320 702 -477 -430 764 67 -824 264 746 -671 -375 878 -5 -811 509 504 -767 -132 815 -181 -688
6339 -688 555 440 -787 -158 761 -289 -596 666 312 -811 93 719 -415 -551 780 204 -945
6356 -945 193 728 -648 -468 721 9 -763 291 596 -684 -342 715 -18 -769 446 519 -657 -206
6374 -206 787 -247 -708 632 393 -673 0 820 -397 -614 659 260 -785 185 755 -452 -522 616
6392 616 34 -810 285 622 -500 -321 813 11 -625 380 580 -602 -218 859 -29 -686 505 510
6410 510 -686 -191 703 -369 -551 695 400 -800 4 775 -453 -610 750 220 -668 151 659 -568
6428e68L2J208o71p93J208J99j175K60J180r92o03J173R0j180M21J067j092m82
6446g18J274q9j248Q03O81r96l22J257l43j069Q69N87j193j9J190m47j047J013
6464A83N63j376K47J236q27p37J111R4j109L55R80q68n12J110k0j077M20J069
6482H42j163k70J216k98j111Q63O22j004k99J255m30r86J079L89j161L6J207o57
6500A30q48R51M65j200K69R85p28p27J196K2j132N33Q91r17n46J146q9j151Q08
6519E8O75j146j92J283m14j032Q94O27j197j16J234n06q82Q96N08j205J20J124
6537G29o12q75J057L88j227L24R32q30o58J309J5j258O67P50j079k54J256k81
6555C53j002N80P44j029j13J214n30r11Q43M42j080J12J007m70r12J038K94j232
$$ plain form
6428 -568 -536 672 1 -792 416 615 -560 -300 880 -112 -715 458 548 -632 -211 856 -236 -718
6446 -718 556 467 -781 22 703 -293 -615 642 299 -770 99 686 -507 -526 664 217 -830 183
6464 183 746 -630 -383 853 26 -711 400 494 -615 -260 720 -148 -660 450 430 -647 -227 842
6482 842 -321 -591 625 327 -784 79 701 -303 -602 653 223 -763 316 705 -456 -420 787 130
6500 130 -718 233 698 -502 -233 752 24 -703 493 515 -617 -84 807 -110 -656 490 401 -750 58
6519 58 733 -413 -605 678 264 -768 126 753 -444 -560 674 168 -714 182 690 -515 -395 729
6537 729 117 -758 299 687 -540 -216 716 -114 -772 537 552 -706 -39 711 -368 -622 634 353
6555 353 -649 -69 675 -354 -467 747 217 -694 149 591 -489 -377 630 160 -752 286 580 -652
6573f52L15J135q10o41J168j07j030M32R39r51m71J255j03j228P09Q06j130k07
6591e71J206k94j192R09N57j046j43J174m31p93P91M17j067P6J052n47p87J032
6609C43K36j220L93J021r48m83J144j03j056O26P58r93l69J264l95r89Q43O70
6627G42j142j49J164l55r85Q47N98j197L1R98n00p03R00L25j140L77R16o98o81
6646f52J028K25j216N65P69q93m69J104j87r13O62O11r59k84J252l86r26P56N77
6665F64r80j05J096n97p46R07L93j123J08J001m60q02R93K22j194L56J061q41
6683d7n62J082oj127N19Q21r97k38J140k60j012O35P27j052k08J225n11r41J010
6702A98M25j056P9J033n67q11J026K01j028J98R17p27o27J089R4j043M73Q53p58
$$ plain form
6573 -652 -337 798 -12 -653 515 408 -622 -190 749 -202 -673 582 479 -749 -40 766 -364 -571
6591 -571 635 341 -851 58 615 -431 -574 600 169 -624 167 584 -483 -407 645 98 -689 343
6609 343 579 -641 -248 773 -175 -658 486 383 -673 -47 711 -282 -651 613 218 -771 72 742
6627 742 -400 -549 615 260 -725 122 720 -477 -446 552 52 -651 249 574 -566 -189 727 29 -652
6646 -652 376 601 -615 -50 719 -174 -643 461 274 -639 23 634 -325 -609 643 257 -669 87 664
6665 664 -316 -421 675 78 -668 239 632 -491 -383 618 158 -644 349 571 -623 -267 794 -47
6683 -47 -609 473 467 -660 -141 680 -317 -555 585 325 -687 -52 675 -377 -585 640 129 -812 198
6702 198 623 -433 -354 679 112 -699 327 528 -500 -302 615 -112 -739 350 444 -599 -126 727 -31
6721c1n41R87n9r83N89O83r89j14J005l11q39P22N00j022p4J010l10p92Q67K88
6741E86r84M5R76o99n31R70J70j011K42Q40o74n72J030O6j019L87R05r65l72J050
6761D40j16r80N29P74r16k20R97l21q77P95N85j050m9J020n14o87Q53L44j014
6780d07J12Q57n64o57J018K25j052M01P83r13l93J038Qj008N28P90r82k93R71
6799D62k43q09O14O73r70k56J021k39r07Q57M46j083J24Q65n06o05Q44J25r36
6818e23K67R33o26n64R18R8j045K89R65r06l85J050j18r67N58O70p96k69R51j98
6838C02r23O92N78j044L2R31m50p10P91M09j127K21R18o18n85Q69K61r88K97R41
6858G97r45m27R34O6r86M98P00q77l55J143k26j033P02N98r25p1R28l32p46P43
$$ plain form
6721 -31 -572 415 356 -627 -38 645 -344 -458 547 236 -603 119 619 -403 -477 533 223 -569 298 586
6741 586 -398 -353 623 -76 -607 363 533 -478 -236 604 -70 -642 388 454 -565 -178 727 -238 -610 440
6761 440 324 -656 -127 647 -269 -489 508 187 -690 105 690 -360 -409 611 97 -590 263 607 -407
6780 -407 -295 562 -2 -659 359 584 -468 -67 716 -197 -590 448 456 -552 -24 766 -216 -509 462
6799 462 219 -590 24 697 -273 -529 492 253 -654 203 649 -434 -310 555 49 -556 288 413 -523
6818 -523 -256 677 51 -513 405 503 -542 -253 712 -194 -579 471 353 -614 -56 614 -182 -451 500 302
6838 302 -621 71 649 -395 -363 568 118 -592 199 608 -519 -298 620 2 -583 286 547 -441 -144 797
6858 797 -148 -575 359 425 -561 -63 637 -240 -595 548 322 -711 -9 589 -336 -407 521 189 -557 186
6878A86L18q45j37J096o75p39J124O7q84J59R83p24o01J030J0q87L34Q52q36m00
6898e69J010m8j089O38N92p93j33P78k28p83P04O45j040o8R79m99p95Q42M35r64
6918c86R3J007o43n93Q76L6q98K72Q66o80m19Q20Q1j052M61P47r14k18R70p4r73
6939f21N16P40j011m4R88l76p92P04M36r55O3Q38m63n47P94K25r29J28Q40n60
6959b6n94R57P5r82M46O57o54l89J023j90q90N64N90q06k95J107k83q75N68N38
6979E41r29RR57m92n68O71L00q29%Q68n64n21R22Q6r13L00P53p04l64P71J00r00
7001e06M62N60p59k12R32j83q97N73O36r29nP22j64q24Q23K35q82M7Q72l05p32
7022e36P23L44q99J29Q28n85n41R82M7r76L46Q11p90m44R99r9q62N38O57r75k52
$$ plain form
6878 186 504 -341 -478 618 -57 -796 328 395 -489 -330 653 -71 -672 358 368 -519 -185 667 -169 -569
6898 -569 441 393 -696 -58 534 -259 -392 386 158 -625 79 724 -316 -384 595 96 -699 143 578 -386
6918 -386 -293 714 71 -522 354 390 -508 -236 630 -50 -469 351 432 -620 -159 588 -326 -544 426 352 -621
6939 -621 -105 635 -376 -420 568 192 -600 104 540 -415 -352 486 23 -524 270 495 -434 -306 534 -26
6959 -26 -620 337 412 -570 -124 533 -121 -510 513 323 -567 -3 587 -219 -514 593 310 -565 3 541
6979 541 -388 -379 578 86 -482 189 489 -340 -340 528 -36 -557 365 451 -462 -162 591 -113 -477 294 394 -506
7001 -506 -44 516 -243 -455 477 294 -603 -30 606 -323 -328 394 230 -594 229 464 -418 -371 501 196 -536
7022 -536 187 531 -368 -239 589 4 -537 445 492 -484 -138 673 -117 -561 438 339 -523 15 672 -303 -555
7043e55R82k28p64N87O54r31j77R49l00p96P16M22r56K1R25n25p22J005R3q93
7063d93L53O48o16n23R49J47j026M37O50o46l97R37j67q74O46N58r09q7Q57l13
7083A31o49O27M02q22n9J006o41n49P56K60r01K35Q05o80m77Q58J2p61L20O53
7103E26p21k57R16j52q26N17O04o89k00P20j45p76O09M25q68rQ05m40o17O55L59
7124D36q27R5P82m36n79Q44J14r44K80Q98p37l67Q14Jp97K87P96p65k99R23k63
7145B56p93N48M89q03j24Q77j73p04M82N06q43j41R32l64o52O74L03r40K57Q56
7165F43n55n91Q21n8p15L54P69p63m46R01j51p44M67O08p45k68J018k60q68N35
7185d8N83q25j40R43m58o51O64L29q90J19P75k31p09P50J79q62K46P34o07l10
$$ plain form
7043 -555 427 199 -565 22 676 -255 -432 517 217 -579 137 559 -397 -376 549 24 -698 307 400 -493
7063 -493 -140 508 -108 -631 318 465 -561 -124 526 -120 -517 420 253 -621 25 583 -326 -413 444 131
7083 131 -518 109 511 -311 -370 636 -5 -554 202 462 -439 -204 601 -79 -556 302 314 -447 -127 526
7103 526 -195 -452 464 312 -514 3 607 -82 -282 438 293 -483 126 551 -317 -326 479 39 -578 77 436
7124 436 -391 -296 486 50 -529 315 429 -515 -235 663 -74 -441 373 374 -423 -136 660 -105 -404 519 256
7145 256 -537 11 500 -303 -427 450 277 -427 55 561 -282 -423 509 145 -507 167 470 -470 -213 643
7165 643 88 -503 318 260 -455 -101 668 -95 -541 360 209 -535 -68 540 -205 -473 545 285 -583 -48
7185 -48 535 -290 -430 513 55 -596 68 397 -493 -374 401 170 -539 211 390 -472 -226 508 -99 -409
7205d09P43K2q77N53O61q19m25J027j76p94N53M10p17j60Q55l03o62O66K74o78
7225b56lP60l87o34O46K85p73J34Q59o96m05P85L6q34L69P13p57k29Q08q8p60
7246d27L53N65p71j94Q03k17n89M90N34p77j76P19k68n71O85K91q91J76Q50n59
7266B6n09O53K98q27J93Q24o32l85O88L8q86K80Q21p58k36Q71o1q80M40N17p43
7287b68j34Q27l05n90N64L32q25Q6Q24l80o79P36K28q37K20P39n80m79Q56J16
7307D51q34J99P16n85m80R10q2q72M92O38q38r0Q22k75p27N60L94o25j87Q35k88
7328A34o65O58L25p82J1O91k65n76O42K67q51K08O92n21l87Q70j87p65L54P24
7348E77p09l03Q27r2p48M40N17q29j59Q56j29p45N25L67o33l6Q16m81o80Q02K17
$$ plain form
7205 -409 334 356 -521 32 693 -126 -551 476 300 -494 59 469 -248 -408 447 144 -518 148 422 -256
7225 -256 -259 501 114 -520 126 411 -362 -228 631 -65 -470 315 351 -483 -114 599 -158 -387 421 333 -427
7246 -427 -74 491 -280 -474 329 112 -477 13 547 -230 -406 313 45 -526 159 450 -441 -265 585 26
7266 26 -483 170 468 -359 -166 658 26 -359 329 367 -519 -239 582 -176 -412 459 398 -482 -42 475 -268
7287 -268 -402 425 120 -470 94 426 -399 -313 511 131 -548 188 416 -421 -201 538 -42 -521 335 451
7307 451 -383 -184 532 -53 -533 377 295 -577 -85 553 -285 -375 447 172 -555 5 399 -226 -413 422 134
7328 134 -531 127 452 -330 -319 372 107 -469 173 440 -411 -203 489 -32 -419 451 264 -501 -147 577
7348 577 -132 -435 392 300 -448 -8 509 -320 -479 377 248 -497 28 395 -238 -274 542 61 -619 183 400
7369D00p54J1P82l66n63P35K43q22J45P51o47m02Q07O3q62M07O85q32k81R70k00
7390B70p16L84N90p62q1P26k27o96O39M43j058J82Q08l42o81P20K73q26K25N95
7410D66l96m34O90M7p95M53N53p69k56P69j3p44M39M03o82k03Q72j08q65O24M60
7431E11p02j58Q52l54p31P36L27p00p3Q11m78n84O85J99q20K95P30n65m40Q75
7451D16n5q21L53N19o54k60R60j58p46M41M52p46j30Q18k24p33P05M09q77K4P13
7472D06l86n64O92K62p78J39P47o39l92Q27N6q54L91O02n38m55Q58j30p28M68
7492a6N17p32j35P24k17o77O48L02p36o5P39j09p16N57L03p69K8R01m94m62O74
7513B65J30p95J83P65n45m51P05J27p40L13O35p49k72Q53p0q76M94O11q31o2P65
$$ plain form
7369 400 -354 -343 439 73 -490 245 488 -334 -189 562 -85 -487 320 383 -479 -72 613 -219 -500 470 270
7390 270 -446 -62 528 -234 -315 411 184 -512 127 570 -488 -306 502 160 -521 199 472 -354 -129 466
7410 466 70 -364 326 373 -422 31 584 -185 -441 328 315 -429 10 413 -269 -472 400 292 -573 51 511
7431 511 -191 -349 503 149 -582 154 481 -219 -292 519 41 -543 142 341 -479 -184 546 -19 -459 416
7451 416 361 -460 -107 412 -242 -502 458 300 -446 -5 447 -299 -429 389 165 -568 137 546 -331 -307 406
7472 406 20 -544 148 410 -368 -229 518 -121 -513 314 370 -484 -93 509 -29 -484 374 244 -484 -16
7492 -16 501 -231 -366 358 141 -536 112 414 -322 -387 352 243 -473 84 387 -382 -354 547 53 -409 265
7513 265 395 -400 -217 548 3 -448 257 384 -356 -43 592 -157 -429 424 354 -522 -28 583 -248 -310 455
7534D55j91q04P32K64q52J68O70m03o49Q44J59p21J94N29n14l96P80N8p21K67
7554a31O91p35l23R00k19o79N21N43o88l21Q83l02o64N66M15o88k8P29l04n48
7574c82M48M04q29J07P33n40l42O91P8p59K17O71n22m18P37Q9q45L38O64o57l22
7595d39P31o1o95N07M49p58k7P89l31p33P66L05p48j9P65m00n65O60K46p96L0
7616c24Q97o06l92P58O4r73L41O66n87j91Q09r4q84N47M68p18m16J016j96p29
7636e44P21L49p61q1P16l59m42N10M43q57m2Q92m87n41O78J75p82L69N80n49l96
7657d08O97N0p58L78N21n81l17Q18j66p23M51N04o57k70Q44k84o56O13M30q64
7677c78K1P77l48o76Q11J94p60oP44m15l28O10J33p42K91O60p74k89P02N9q16
$$ plain form
7534 455 264 -540 192 456 -396 -228 442 39 -610 234 393 -328 -134 395 -119 -515 265 323 -398 -131
7554 -131 560 -175 -498 402 183 -496 25 568 -120 -441 442 140 -524 42 457 -231 -259 470 166 -382
7574 -382 66 470 -359 -252 481 -59 -401 290 368 -391 -174 497 -25 -443 294 383 -462 -124 540 -117 -439
7595 -439 292 231 -464 43 492 -266 -293 496 165 -568 198 503 -245 -264 501 101 -464 196 442 -354 -324
7616 -324 573 -33 -425 333 397 -576 -235 431 -156 -347 462 368 -516 31 499 -219 -635 381 185 -544
7636 -544 177 526 -235 -316 400 41 -401 109 552 -305 -347 545 58 -483 195 370 -412 -43 537 -12 -408
7657 -408 289 339 -419 -41 480 -101 -418 400 234 -489 -38 466 -191 -461 383 99 -557 56 486 -378
7677 -378 -357 420 72 -604 207 401 -359 -365 379 -36 -364 246 379 -363 -72 588 -186 -475 227 286 -530
7698e30K65P81p40j51P48j10p90N85N42r54p2Q86k56o32N32L20p25J8P60m03o37
7719e63P27L01q73J56Q34o55k00N24J60p57K67N27n46l34Q16q5p90L68N79n72
7739a16k04O65j98o29N37M05q02kQ17l35n73N29L62r21R8Q76m99m71O90J37p65
7760c99K54O68o58l48R16o7q35L22P21o69l99Q79j74o84M61M96p08j47Q29k90
7780A68n83M70M33q35P2P31l28n45O50K25r50L36O17n98l22Q20L1q49L38O18o09
7801a10k66O93L4p63M00N12o08k25P35k66o91O05L07n25j46Q66l50p00P14K96
7821E12q31J33O11l61n64O89K48q95L27N91n65k80O42j9o95L95N32n66k93P91
7841D02j16o77M06N01p75J0P49l36o69N55M18p15oP10m14n32P15J23o81J13P63
$$ plain form
7698 -530 -265 516 -224 -375 373 263 -527 58 600 -354 -426 460 204 -428 104 424 -301 -283 477 74 -563
7719 -563 164 465 -408 -252 582 -73 -273 251 411 -346 -79 448 -98 -432 384 299 -491 -123 456 -116
7739 -116 -320 345 147 -482 55 460 -342 -344 473 138 -435 94 456 -465 -367 509 10 -461 229 366 -399
7760 -399 -145 523 -135 -483 433 366 -469 -147 574 -95 -494 385 211 -473 -12 484 -224 -371 458 168
7780 168 -415 55 488 -347 -275 456 128 -417 233 458 -492 -156 461 -137 -459 361 392 -457 -119 499 -110
7801 -110 -376 317 351 -412 -12 500 -108 -333 402 136 -555 50 357 -168 -314 552 202 -498 216 512
7821 512 -319 -186 425 64 -500 189 437 -458 -131 460 -105 -385 257 238 -457 -62 470 -96 -389 402
7841 402 286 -391 15 516 -259 -249 500 164 -505 50 468 -247 -253 457 43 -489 226 349 -332 -219 544
7862E44o17m25P89j8q06M74N74p55j39O39R0p29L38N96p49j39P80j86o71M68L02
7883C60o65P2O80l38o29N91L45p21J17O34n78l88P90J17o28R7O66n26m42P29M5
7904C28q51L92O69p97j20P98j09r35O18L95o01j34Q09l51n95M87M96r17Q8Q85
7924E55n05m33N43K42q23K73N67m44m16P27lp26L18N41n14l49Q07j39o78M23M61
7945D27n92k36P74l28o05O19M45p60j08P59l01o17O65K09p31J90O48m83o05Q75
7965B45P0p42L01M78l46n29Q29o0p18M44M12m99l82P71Qp78N56M65p41j29P43
7986C98k35n78M77M08p54M0O65l23n48P02J55q56J60P61m95m48O74J31o58J14
8006b10P90o10k92O61n0o59L79N36p41k09Q29l31o04N09L42n53j52Q14l76n22
$$ plain form
7862 544 -73 -498 291 273 -533 -59 515 -240 -379 260 350 -379 -41 555 -194 -333 447 261 -410 58 360
7883 360 -305 -233 447 109 -520 71 416 -305 -188 446 -132 -520 270 387 -241 -144 522 -4 -446 283 328
7904 328 -523 -131 538 -259 -379 419 310 -625 -7 388 -213 -347 462 111 -484 3 499 -418 -330 555
7924 555 50 -383 160 402 -421 -148 419 -25 -441 286 283 -443 -125 416 -98 -447 360 221 -457 -34 427
7945 427 -165 -401 373 45 -560 59 504 -256 -364 395 94 -523 142 351 -380 -190 458 -25 -630 245
7965 245 315 -427 -126 352 6 -523 306 246 -472 -28 384 -115 -497 274 282 -496 60 525 -216 -345 398
7986 398 163 -415 62 470 -284 -244 421 98 -450 252 407 -449 -289 472 -23 -471 203 334 -324 -210
8006 -210 580 -30 -322 339 289 -370 9 545 -196 -405 424 93 -511 -2 340 -213 -365 449 73 -449
8026d49N60K58o22p2O29k45n05P40o9o13J98P53o20l73P95l5p79M14N48p39k44
8047d70P00k6p38N18L70n05k23O77k08n41N19L18o36lP46n28m09O18K53q15K06
8068a77P02n94l67Q25K9q55M01M26m70k70N73l0o72M79N22o70k22O74j22o97O47
8089A32J95n68n4O08q5p39O99K92q53J34O20m37m34O35J82p65K36O48n45k83N33
8110A51J20n95L29M07n16k98O86r4p31O15L16o38o6N83o7o34M81L18o96J48O21
8131D40l72m53M68K59n95P5N62l67m75P47K3o16K17M80l50l91O26p4n74K86N70
8152D86o90o7O41j71n83L59N11o88J7O58m55n52O85L26p76J6O56m12m40P05P8
8173C04n84J10O28m74l12N39R8o50J74O68n79k68O62o2n46K40L61o23
$$ plain form
8026 -449 111 369 -253 -325 304 59 -446 294 225 -388 -190 563 -57 -430 365 330 -449 -35 513 -226 -470
8047 -470 230 204 -534 -16 354 -151 -374 303 95 -446 73 391 -245 -248 498 -30 -439 179 432 -383 -177
8068 -177 525 -69 -436 389 418 -437 -36 390 -80 -350 223 193 -479 0 522 -148 -370 304 182 -515 132
8089 132 327 -241 -295 313 228 -511 188 480 -373 -239 381 -56 -490 145 327 -438 -202 446 -99 -382 151
8110 151 271 -324 5 412 -104 -402 284 190 -541 74 390 -248 -314 269 202 -432 49 367 -329 -181 440
8131 440 68 -385 83 342 -253 -178 384 17 -458 289 312 -304 -87 393 43 -348 278 204 -370 -84 486
8152 486 -204 -271 370 199 -384 -25 486 -202 -185 473 18 -534 151 477 -299 -283 373 -39 -479 226 304
8173 304 -280 -170 458 -16 -328 211 309 -341 -167 501 -78 -346 316 254 -292 -52 309 -314
8191c14
$$ Imaginary data points
##PAGE= N=2
##DATA TABLE= (X++(I..I)), XYDATA
0@%%%%%%%%%%%%%%%%%J0l4M8m8M8m8M8n5P9r6R6j03J27j45J56j80K00k24K48k74
37a47L10l41L77m20M67n18N70o27O96p74Q60r60J080j220J383j584J834k160K608
56A434l247M249o074J0417l8406m1382O2040k225j9398L5195L2920l3654q115
69f246J9325k3831l0749K2808L911k5271K3298L9432k3460j7098K8741j1915n0416
82e1471J1392L4341j7225k784M7065P852k7390J4050J3065l7910j3661K5061j2638
95a0253k0645L6414K4678k8071M97K7233k7395l6083K3304J5077k4297J3821L9410
108C3690q891j3527K6083k730l7445M421J6642k8000p170M0571K829k9470J7557
121A4560J7591l9987k0299K9593l702k5578K5154K6798k0437j408K7896j6064
$$ plain form
0 0 0 0 0 0 0 0 0 0 0 0 0 0 0 0 0 0 0 10 -24 24 -24 24 -24 24 -31 48 -48 48 -55 72 -73 83 -97 103 -121 127 -147
37 -147 163 -178 199 -221 246 -272 298 -329 367 -407 453 -507 573 -647 736 -848 986 -1174 1434
56 1434 -1813 2436 -3638 6779 -31627 -73009 -10969 -13194 -32592 2603 35523 1869 -6246
69 -6246 13079 -10752 -41501 -18693 -14782 -40053 -16755 22677 -783 -17881 10860 -1055 -51471
82 -51471 -40079 -5738 -22963 -25747 21318 29170 1780 15830 28895 -9015 -22676 2385 -10253
95 -10253 -30898 5516 30194 2123 2620 29853 2458 -33625 -10321 4756 -19541 -5720 33690
108 33690 24799 11272 37355 34625 -2820 1601 18243 -9757 -16927 23644 26473 -2997 14560
121 14560 32151 -7836 -28135 1458 -2244 -27822 -2668 24130 3693 2285 30181 14117
133A4117l0145J6077N774l1651P340L5928j2474j9679K5284K118l9711l62K4698
146b686j8186j3404L3733J0994k1587J4847K1901k6490j6632K2395p015k6270
158b8400K1626K5458k0548m633K6234j3269l1845J3167J1842k5351K361L2995
170I637l753j2719K6367R146k9819p40J9308k0270j4782L0543J0522k2709J0993
183A1724K1573k5251k0375K0294l138k7178J4380K5210j4680k087L0043l678k6506
196C31J0670R998k7318k943K9294m568j7517K1155J0290l0128n642J9330j7366
209d414k1333K2177J1809j9911J0056K6414j4979j7442J8347j204k6888R536K2721
222A4889j5155p607K5504k691k7015Q205J2094k5483q726K4842k521j6241K1045
$$ plain form
133 14117 -16028 49 5823 -25828 -18488 17440 4966 -14713 10571 12689 -27022 -27384 -2686
146 -2686 -20872 -34276 -543 10451 -11136 3711 25612 -878 -17510 4885 -2130 -28400
158 -28400 -6774 18684 -1864 -6497 19737 6468 -25377 -12210 -368 -25719 -23358 9637
170 9637 5884 -6835 19532 28678 -1141 -1881 17427 -2843 -17625 12918 23440 731 11724
183 11724 33297 8046 -12329 7965 4827 -22351 -7971 17239 2559 472 30515 26837 331
196 331 11001 20999 -6319 -9262 20032 15464 -2053 19102 29392 -736 -6378 12952 -4414
209 -4414 -25747 -3570 8239 -11672 -1616 24798 9819 -7623 10724 9520 -17368 -7832 14889
222 14889 -266 -7873 17631 14940 -12075 -3870 8224 -17259 -25985 -1143 -3664 -19905 1140
235A140J6547k1890l505K0403j2906j9227K1001J2362k0040N901K4075j4560j8331
248i030J7832J351k7414M521K1353j2978p480K6575L952k1645Q536J4394k1207
261a240q128K4754j69j7544J7016J6014k1678p071J9359j1482k3767J3663J1692
274A1419j9012K996K5382p670j6591J5733M008k3952K926K1110j0911j0238K2969
287A8169M663k1946M854J4222k0926j4904J7913p28j8861J3549J8150j6318o422
300h585J9206p168k0911J3317J3121j8029O42K4073o224j6748J5374O296k4901
313a0537k571J7589j1555j2620K1273Q098j9288N438J7152j6185j2247K0160K562
326G269j8670J1950J9197j4365p109K0285m364k2835Q221J1925j8526l018K2788
$$ plain form
235 1140 17687 -4203 -7708 12695 -211 -19438 1563 13925 -6115 -214 23861 9301 -9030
248 -9030 8802 10153 -17261 -12740 8613 -4365 -11845 14730 18682 -2963 5573 19967 -1240
261 -1240 -9368 15386 15217 -2327 14689 30703 9025 1954 21313 9831 -13936 -273 11419
274 11419 -7593 -4597 20785 13115 -3476 12257 16265 -7687 -4761 16349 5438 -4800 18169
287 18169 22832 886 5740 19962 -964 -15868 2045 1317 -17544 -3995 14155 -2163 -8585
300 -8585 10621 3453 -17458 -4141 8980 -9049 -8407 15666 9442 -7306 8068 14364 -10537
313 -10537 -13108 4481 -7074 -19694 1579 9677 -9611 -4173 12979 -3206 -15453 4707 7269
326 7269 -11401 549 19746 5381 -1728 18557 14193 -8642 -421 11504 -7022 -10040 12748
339A2748l346j6425J3998R052k1036j759J9747p927j3367J8824R852j7606L615
352F370J7669j4133j5770J4411J535j9794P133J8035j2756q939J7860j672k0493
365a0544Q164J3636j5893m701K1163p84j5134J2795J0523j9924o114J5614q890
378h9j5859J5042R730j7923J051J7247j1286j4919J5155M673j8587N314J9105
391H654r605q057J9282J624k0321M611J2634j6143p736J9398j31j6893J0438J2139
405I894j7283n655J7769n148j5844J4102J2381j4681J842J9969p636j5665J2885
418F930N012j9068K314J7981r678j1470J6291L198j8886M171J4174j3747r201
431a1979J8054K507j4525J0840J4431j4705p455J5701m318j7094J0612J1324j5732
$$ plain form
339 12748 9402 -7023 6975 16027 -5009 -6768 12979 5052 -8315 10509 20361 2755 6370
352 6370 24039 9906 -5864 8547 10082 -9712 -2579 15456 2700 -6239 11621 9949 -10544
365 -10544 -2380 11256 -4637 -9338 11825 11041 -4093 8702 19225 -699 -6813 8801 -89
378 -89 -15948 -906 8824 -9099 -8048 9199 -2087 -17006 -1851 2822 -15765 -10451 8654
391 8654 -951 -9008 10274 11898 -8423 -3812 8822 -7321 -15057 4341 4210 -12683 -2245 9894
405 9894 -7389 -13044 4725 -423 -16267 -2165 10216 -4465 -2623 17346 9710 -5955 6930
418 6930 11942 -7126 -4812 13169 3491 -7979 8312 11510 -7376 -3205 10969 -2778 -11979
431 -11979 6075 8582 -5943 4897 19328 4623 -2832 12869 8551 -8543 2069 13393 -2339
444b339k910J6998o414j5667J1390O219j8131m16J6964o703r855J6679O265j7430
458e350J958J3847j2383j0762J5882K303j6708O089J3684j3593q160J5029k604
471g68j7532Q082J2608j2872j904J9236k773j5067J0580Q555j6456j670J6978
484F997o409j2967J3487P097j6431Q72J4649j0948j2407J4322M742j4490O824
497d662J6469j0508q560J5626N93j6309P080J3019j3178n832J6599j672j5232
510f567Q871Q797j6721m802J5653m192j2193J3360R301j4985k41J5310p787j2015
524h211J3070N038j5894K607J4886r489r842J3186N50j7915L330J2250j1226n864
538a3524J6395O57j4842P868J1084j3311m578J5147l216j3934J0268R683j3635
$$ plain form
444 -2339 -5249 11749 5335 -10332 1058 7277 -10854 -11270 5694 -1009 -10864 5815 12080 -5350
458 -5350 -3392 10455 -1928 -12690 3192 5495 -11213 -5124 8560 -5033 -13193 1836 -768
471 -768 -18300 -10218 2390 -10482 -12386 6850 4077 -10990 -410 8145 -8311 -9981 6997
484 6997 588 -12379 1108 8205 -8226 -7354 7295 -3653 -16060 -1738 3004 -11486 -4662
497 -4662 11807 1299 -7261 8365 8958 -7351 -271 12748 -430 -6262 10337 8665 -6567
510 -6567 2304 11101 -5620 -10422 5231 1039 -11154 2206 11507 -3478 -3719 11591 3804 -8211
524 -8211 4859 9897 -5997 -3390 11496 2007 -7835 5351 5901 -12014 -8684 3566 -7660 -13524
538 -13524 2871 3528 -11314 -3446 7638 -5673 -10251 4896 1680 -12254 -1986 7697 -5938
551e938j798J4070p506j4366J0224O059j4294J935J5449p221r781J3540M453j4864
565a0038L822J3403j0299p942J5126K581j4081O297J1026j3600p606J3918j628
578I79j3683R115J0679j2801k776J5643l353j2534J0704P573j4442P3J5782n535
592E424j0630J2125M102j6473O11J2735r226r100J3341K744j4346N037J2821j0327
606a162p085J3852l70j4038P411J1726j1195l977J3896m005j4678P586P771j3794
620h062k356J3712n051j1681J1146O762j3560L65J2921p498r609J2893N180j2703
634g541L625J2051r924q872J1993Q96j4244N164J0571j0763n080J4348m75j2848
648a1099P425Q925j2185k635J5025k095j0557J0190P428j3485j454J3084o407
$$ plain form
551 -5938 -7736 6334 -1172 -15538 -5314 745 -13549 -11614 3835 -3386 -13167 373 4826 -10038
565 -10038 -6216 7187 -3112 -11054 4072 6653 -7428 -1131 9895 -3705 -11311 2607 979
578 979 -12704 -3589 7090 -5711 -8487 7156 3803 -8731 1973 9546 -4896 -4823 10959 5424
592 5424 -5206 6919 11021 -5452 -4841 7894 -1332 -10432 2909 5653 -8693 -3656 9165 -1162
606 -1162 -8247 5605 5235 -8803 -1392 10334 -861 -4838 9058 5053 -9625 -2039 5732 -8062
620 -8062 -10418 3294 -1757 -13438 -2292 4470 -9090 -8725 4196 -3302 -12911 -18 5162 -7541
634 -7541 -3916 8135 -1789 -10661 1332 2228 -12016 -6852 3719 -7044 -12124 2224 1749 -11099
648 -11099 -3674 5251 -6934 -9569 5456 3361 -7196 2994 10422 -3063 -4517 8567 2160
661B160j0931J0663M614j3582K204J3482p633q782J2108K176j3723M668J2813
674A0237q623n928J3531J12j3556N773R766j1983n356J2639k757j2651Q333Q520
688H057j2560k443J2664n218j1226J0471O948j2047P53J3060o592r630J0675L609
702F521j3856J755J0748q921p509J2137J708j2850M330R589j0267n251J3239J35
716A508j1237P603R423j0769l144J2958l108j1764P918O546j2156p79J2895m920
730I74r917R471M356j2748J725J2609o193p367J2122L363j2041M177J1107r081
744B557o956J1797k4j2588N762R916j0454m906J1856k345j2194P485Q355j1004
758b743j715J2944l403j0104R616O083j2338p61J1524o583r476J0515L849j2858
$$ plain form
661 2160 -8771 1892 6506 -7076 -4872 8610 977 -7805 4303 6479 -7244 -2576 10237
674 10237 1614 -4314 9217 9329 -4227 1546 11312 -671 -6027 6612 3855 -8796 -463 8057
688 8057 -4503 -6946 5718 500 -10726 -255 6693 -5354 -4601 8459 1867 -7763 2912 6521
702 6521 -7335 -5580 5168 -3753 -11262 875 2583 -10267 -5937 3652 -6615 -11866 1373 1508
716 1508 -9729 -2126 7297 -3472 -6616 6342 3234 -8530 -612 5934 -6222 -7001 5894 974
730 974 -8943 528 4884 -7864 -6139 6470 277 -7090 5032 8395 -3646 531 11638 2557
744 2557 -4399 7398 7374 -5214 548 10464 10 -4896 6960 4615 -7579 -94 8261 -2743
758 -2743 -4458 8486 5083 -5021 4595 10678 -1660 -2421 9103 2520 -6956 3559 7408 -5450
772e450J660J0359q581p860J1288J875j1954M559J0370q648m806J2378l13j1675
786f798N782P944j0627l140J2252k796j0950P602N964j1944j333J1866m660r167
800a0005R733N368j1081J882J1818o125p949J0293K664j1747L319J0720q145o301
814e556J0853l7j1990M721R129r576m237J2062q52j0220P527Q332j0213k412J1649
829I180l717r843Q773N903j1243m72J0643o020r340R503L348j2001J645J0899
843G258p093o540J1354K102j1484L799R407q929n109J1507k54j1178N518P566
857G924j0498l889J1226l006j0768P367O409j0685n68J2150m200r000R011M729
871F202j1252J207J1349o041p632R742K524j1799K504R560q048o648J0366Q84
$$ plain form
772 -5450 -3790 6569 -2012 -9872 1416 3291 -8663 -4104 6266 -2382 -7188 5190 4877 -6798
786 -6798 -1016 6928 -3699 -6839 5413 2617 -8333 -731 5233 -6711 -8044 3822 -838 -10005
800 -10005 -272 5096 -5985 -4103 7715 1590 -6359 3934 6598 -5149 -1830 8890 745 -5556
814 -5556 5297 5260 -6730 -2009 7120 -2456 -6693 5369 4517 -5703 1824 10156 -57 -2469 9180
829 9180 5463 -4380 4393 10296 -947 -1419 9224 3204 -6136 3367 6715 -5286 -3641 7258
843 7258 165 -6375 4979 7081 -4403 -604 8803 -126 -5235 6272 6018 -5160 358 7924
857 7924 -2574 -6463 4763 1757 -9011 -1644 4765 -5920 -6488 5662 1462 -7538 1473 6202
871 6202 -5050 -3843 7506 1465 -6167 3575 6099 -5700 -3196 6364 -1684 -8332 2034 2918
885B918j0695N295R263q675l970J1091j000j0217O969P882r715k167J0988l200
899D767r895P670N232j0959j053J0519m916p843R358M316j0664J548J0079o475
913A684o323J0434K140j0714L572Q946q196n257J0289o45j1196M666P252r450
927b798k986J1179k278r788O753O402j0023q69J1107l767q741Q365M669j0759
941c534M45J0192o288q210Q841K315j0920K829R703p333o047J0044J083j0368
955g248M772R079q172m174J0751m79j0041O083P063r841k979R917l035r079P527
970A44N613j0121p40J0167m465p585R064M181j0109J520J0092n665o306R556J855
985G201j0704K529Q207p573n122J0249j29j0367M717P400q378l186J0662j526
$$ plain form
885 2918 -7777 -2482 6781 -1894 -5864 5227 4227 -5990 979 8861 -854 -3021 7967 4767
899 4767 -5128 2542 7774 -3185 -4238 6281 1365 -6478 2880 7196 -3468 -1920 8159 1684
913 1684 -4639 5795 7935 -2779 793 9739 1543 -3714 6575 5930 -5266 -600 6652 -2798
927 -2798 -5784 5395 3117 -6671 82 6484 -3539 -4408 6699 2932 -5809 2556 7225 -3534
941 -3534 -3089 7103 815 -7395 1446 3761 -7159 -4330 5373 -1960 -8007 2037 3120 -7248
955 -7248 -2476 6603 -1569 -5743 5008 4529 -5512 571 7634 -2207 -5186 4731 1696 -7383 144
970 144 5757 -4364 -5104 5063 598 -6987 2077 6258 -3851 -2331 7761 2096 -4210 5346 7201
985 7201 -3503 -974 7233 -340 -5462 4787 4658 -5709 -992 6408 -1970 -5156 5506 3980
999C980r445O609O421q946j064J0463l900r015P224M093j0250M04R578n554p708
1014g110Q541K707j0221K462R321o789n846R767J414r583M479Q170q230m628R716
1029D170r81r797N689O543r287k962R961k631q554P153N426r597n44J0199l707
1044A081p078Q556L817j0227R97R271n670o518R092J653j0291K541Q350p139m709
1059f274R570R4r885M806P678p381k654J0202j553r234N896O176r020j368R512
1074F565l485q618O975M354r511QR262n165p295Q472L306r195K413Q993o394n814
1090e129R124J239r546L715P602p999m653R461q61r248M974O230q963k674R790
1105C062j948q071P042N322r328p29R819l701p464P750L384r807P11R036n490
$$ plain form
999 3980 -5465 1144 7565 -1381 -2445 8018 4118 -4897 2327 6420 -3830 -3426 6152 598 -7110
1014 -7110 1431 4138 -6083 -3621 5700 -1089 -6935 2832 4246 -5337 -858 7312 -918 -5546 4170
1029 4170 3189 -6608 -919 5624 -3663 -6625 3336 705 -7849 -696 4730 -4867 -5411 4788 1081
1044 1081 -5997 2559 6376 -3851 -2854 6417 747 -5771 3321 4974 -5317 -2776 5574 -1565 -6274
1059 -6274 3296 3390 -6495 -1689 5989 -1392 -4046 6156 4603 -4631 1265 7441 -1579 -2947 6565
1074 6565 3080 -5538 1437 5791 -3720 -3712 5550 385 -6910 1562 4868 -4327 -1914 7079 685 -5129
1090 -5129 3995 5234 -4312 -597 7005 -994 -5647 3814 2953 -6295 -1321 4909 -4054 -6728 3062
1105 3062 1114 -6957 85 5407 -3921 -4650 5169 1468 -5996 1754 5138 -4669 -3958 5078 -412
1120d12o384Q369J528r788K425Q645o486m512R768J73r301M618P645p563k989
1135d264R488j678q920N671O003q533j807R031l489q265P009M647q742K85R077
1150E513m390o864Q233L343r203J871Q464o108n685Q739J423r462L090P116p622
1165a542m491R160l37q743M885O490q024k470R539j742q065O302N015q873q74
1180c770R171l440p458O872L190r498M24Q714n048o146Q091K142r295K611Q401
1195D961o071m537Q823M78r005M140P329p581l297Q856j689q865N479N839q301
1210c441j763R014k803p765O934M731q407N3Q899m224o642P962L379r129J418
1225a784Q026o058n735Q255J430r098K772P259o703m150R054J36q591M601O369
$$ plain form
1120 -412 -6796 1573 3101 -6687 -4262 4383 -2103 -6615 3153 3326 -5975 -1357 6288 -1275 -4264
1135 -4264 5224 3546 -5374 297 6300 -2233 -4040 4991 1502 -6763 246 4893 -3849 -3564 5513
1150 5513 1123 -5741 2492 5835 -3368 -1497 6967 859 -4826 3913 5336 -4126 -1036 6080 -1542
1165 -1542 -6033 3127 2790 -5953 -1068 5422 -2602 -5072 4467 2725 -5340 962 5977 -2896 -3770
1180 -3770 5401 1961 -5497 1375 4565 -4933 -4509 4205 -843 -6989 1102 3244 -6051 -3440 4961
1195 4961 -1110 -5647 3176 3654 -5351 -1211 6118 -1463 -4760 4096 2407 -6458 -979 4860 -3441
1210 -3441 -5204 3810 1007 -6758 176 4907 -3500 -3447 5452 1228 -5414 2548 5927 -3202 -1784
1225 -1784 6242 184 -5551 2704 4134 -4964 -2192 5067 -1636 -5786 3268 3404 -5187 -586 5783
1240E783p511k464R325j590p927N712M904q760j282Q742l464p442O691L545q847
1255d585O81Q542m506o093P576K446q817K441Q075n800m750Q284L57q934L710
1270a373O844p261l785Q629j290q362N130N976p858j687Q936k606p378O671M843
1285E429q455k18Q761m103o858P498K940q892J040P760n529n484Q139J634q890
1300e228K926P348o423l860Q790K27q188M358O369p467k702Q782j562q064N270
1315E76M881q130j269Q559l024p161O361L739q415N55Q621m213n860P451K303
1330D974q474J950P501n653n009P732O23q510L174O700o746l559Q222r98p932
1345f005M888N948p296j771Q528k212p292N939M659q241n24Q127l930o569O800
$$ plain form
1240 5783 -1728 -4192 5133 3543 -4384 1328 6232 -2528 -3810 4932 1468 -5974 717 4262 -4585
1255 -4585 -3904 4638 132 -5961 1615 4061 -4756 -2315 5760 -40 -4790 3494 3851 -5083 -1373
1270 -1373 5471 -1790 -5575 3054 1764 -6598 -1468 4508 -3350 -5037 3899 1293 -6085 586 5429
1285 5429 -3026 -3244 5517 1414 -5444 2054 4994 -3898 -2858 4902 -627 -6111 2028 3662 -5228
1300 -5228 -2302 5046 -1377 -5237 3553 3780 -4408 -50 6319 -1148 -3850 4932 3370 -4694 576
1315 576 5457 -2673 -3942 4617 1593 -5568 793 4532 -3883 -3328 5293 1080 -4780 2671 4974
1330 4974 -3500 -1550 5951 298 -4711 3021 3644 -4866 -1692 5008 -1738 -5297 2925 1927 -6005
1345 -6005 -1117 4831 -2465 -4236 4292 2080 -5212 727 5386 -2855 -3379 4748 818 -5751 1049
1360A049L139q440Q68P721n193n256P804J785q222K717P356o057l937Q515Q7q177
1376d241L926N959p291k628Q550j561p677M984M767p916q81Q491k893o675O330
1391A244L825q033N90Q168m212n881P055K138q346J795P301n651n026P537N98
1406C102q195L328O638o335l412Q116o16p578M512N909p177j940Q141k298p143
1421d948N624M416p912q15P718l773o184O523L300q073O97P704m464n147P646
1436B312J915q079K281O768n778l782P825K26q024L532N673o822k712Q197j350
1451B182p692N014N012p201r61Q298k662o635N950L644p838M74P861m078o038
1466d670O680K145q119J792P215n455m651P288Q51p813L363O686o228l349P845
$$ plain form
1360 1049 4188 -4252 -3384 4337 -856 -6112 1692 3477 -4745 -2028 5328 -729 -4666 3849 3936 -4241
1376 -4241 -315 5644 -1647 -4275 4275 2714 -4963 21 4788 -3128 -4009 4482 1589 -5086 1244
1391 1244 5069 -2964 -2374 5794 1582 -4299 2756 4894 -3452 -1657 5644 -7 -5033 2504 3102
1406 3102 -5093 -1765 4873 -1462 -4874 3242 2626 -4952 -440 5469 -1708 -3648 4493 2195 -4948
1421 -4948 676 5092 -2820 -3635 4083 310 -5874 649 3949 -4124 -3427 4277 -187 -5334 2312
1436 2312 4227 -3852 -1571 5197 -581 -4363 3462 3688 -4336 -804 4869 -1953 -4665 3532 2182
1451 2182 -5510 -496 4516 -2685 -3646 4652 1990 -4645 1305 4949 -2889 -2415 5446 1368 -4670
1466 -4670 2010 4155 -3964 -2172 5043 -412 -5063 2225 3076 -4737 -1374 5312 -916 -4265 3580
1481C580l60p488M523N466p119k145P684k089p056N457M316p722r69P761l223
1496F16o079O456L244p722P29P362m377m978P332J690p905J954O600n509l950
1511d537P451K49p903L148N794o235k439P733r61p038M444M863o796j164P951
1526D560k382o622N604L618p460J37P382m044n849O158K492p626J727P017m942
1541b30m710P139J183p428L068O329n840l625P610m34p212M034N234o884k305
1556d071P458j816o608N152M295p418o73P603k781n924O238L050p691P25P161
1571D700m102m954O818J676p973J909O413n333l770P130L43p643L277N818n778
1586a469k535P558j006p006M246M938o413j307P494k656o356N196L540p082j31
$$ plain form
1481 3580 3220 -4268 255 5721 -1398 -3543 4141 2052 -5004 453 4769 -2953 -3922 3839 616
1496 616 -5463 993 4237 -3485 -2756 4606 229 -4749 2583 4273 -3632 -1678 4922 -587 -4537
1511 -4537 2914 3163 -4740 -1592 4202 -2033 -4472 3261 2300 -4738 -294 4569 -2227 -3391 4560
1526 4560 2178 -4444 1160 4778 -2682 -2545 4837 793 -5056 1102 3594 -4032 -2305 4712 -230
1541 -230 -4940 2199 3382 -4046 -978 5351 -489 -4114 3496 3062 -4150 -116 5118 -1766 -4071
1556 -4071 3387 1571 -5037 115 4410 -3008 -3681 3922 1141 -4783 1455 4505 -3186 -2461 4700
1571 4700 598 -4356 2462 4138 -3835 -1926 4487 -846 -4616 2514 2857 -4786 -1509 4309 -1469
1586 -1469 -4004 3554 2548 -4458 -212 4726 -1687 -2994 4500 1844 -4512 684 4224 -2858 -2989
1601b989P219l636n629O034K505p174J590O633m458m483O745J269o987K503O016
1616E158n667l561P022k11p036L846M955o483k191P307j475o427M903M209o901
1631b552p99P457k476n745N688K948p429L77O987l809n174O468J588p628J726
1646b373O400m779l783O895K87p079L053N922n569k550P164q21o925M025M743
1661D610o362j458P000k271o307M990L781o797l03P112l412n411O076K720o854
1676b886J136O434m300m549O457J285p053K303N803n289l520O627k6o576L342
1691h12M972n980k217P188j072o243M433M069o568q93P086k333n711N234K864
1706D017o893J97O501l443m930O119J568p007J662O292m392l732O528N59o852
$$ plain form
1601 -2989 4230 594 -5035 999 3504 -3670 -2080 4553 95 -4388 2357 3626 -3361 -858 5158
1616 5158 -509 -4070 2952 2741 -4295 -449 4506 -1977 -4168 3139 1664 -4763 140 4349 -2552
1631 -2552 -3351 4106 1630 -4115 1573 4521 -2908 -2531 4456 647 -4527 1941 3529 -4099 -2373
1646 -2373 4027 -752 -4535 2360 2647 -4432 -1379 4543 -1026 -3576 3588 2767 -4158 -133 4610
1661 4610 -1752 -3210 3790 1519 -4788 202 3983 -2814 -3117 3995 583 -4828 1248 3968 -2886
1676 -2886 -1750 4684 384 -4165 2292 3577 -3476 -1173 4630 -659 -4179 2448 2422 -4154 -812
1691 -812 4160 -1820 -4037 3151 2079 -4164 269 4338 -2230 -3123 3963 1630 -4081 1153 4017
1706 4017 -2876 -2679 3822 379 -4551 1568 3136 -3871 -2209 4083 -309 -4041 2487 3046 -3806
1721c806K768N717n412k697O670q22o546L802M612o102j638O904k101o075M912
1736A86L629o251k91O725l086n109N619K668o717P37O308m094m445O247J153o572
1752c293J903N519n183l278O698J87o614L265M832n531k193O876r17o133M188
1767C26M002o277j081O738k366n523M824K867o521K28O393l283m752N653J900
1782C128o469J477O182m445l647O045P80o527K495N316n052k853O337n73o265
1797d071L469M509n744j642O423j608n622M661L619o116m77O477k835m997N408
1812A454K398o345N80N921l909m289N841J396o614J985N478m746l262O413L96
1827B697o330K955M804n205k158O466j045n908L857L792o006r75O470k146n448
$$ plain form
1721 -3806 -1038 4679 -733 -3430 3240 2418 -4128 -326 4286 -1816 -3454 3450 1349 -4726 186
1736 186 3815 -2436 -2727 3998 912 -4197 1422 4090 -2627 -1890 4418 324 -4121 2126 3279 -3293
1752 -3293 -1390 4129 -1054 -4332 2366 2553 -4061 -796 4036 -1495 -3688 3188 2271 -3862 326
1767 326 4328 -1949 -3030 3708 1342 -4181 643 3510 -3011 -2783 3610 327 -4425 1228 3128
1782 3128 -3341 -1864 4318 -127 -3774 2271 3051 -3476 -981 4335 -717 -3570 2767 2194 -4071
1797 -4071 -602 3907 -1837 -3479 2944 1336 -4286 375 3994 -2122 -2599 3878 1043 -3954 1454
1812 1454 3852 -2493 -1913 4008 99 -4190 1651 3047 -3567 -1582 3896 -850 -4112 2301 2697
1827 2697 -3633 -678 4126 -1079 -3237 3229 2184 -3724 133 3925 -2081 -3056 3414 1268 -4180
1842d180M650K910o174J87O144k835m513N338J821o325J281N898l993l698N588
1857B099Q75o379K258N207m823k843N897l55n850L154M542n304j669O086j330
1872A565n375M126L647n920m47N912k416n010M822K400o004N08N578l441m066
1887d121N529J580o242J562N341m209l103N985L50n933K628M685n155k160N993
1902B730p30n625L535L712n621r69O080j758n278M482L012n987L5O084k798m375
1918c471N023J840o091J102N576l815l702N373P27n996K089N084m399k813N684
1933B211j45n660K971M480n048j764N879j327n203L985L334n516p98N675k279
1948G95m808M699K500n727K47N411l217l857N326J538n780J360N119l954k958
$$ plain form
1842 -4180 470 3380 -2794 -2607 3537 702 -3811 1527 3348 -2977 -1696 4202 209 -3489 2099
1857 2099 2974 -3405 -1147 4060 -763 -3606 2291 1936 -3914 -760 3782 -1522 -3191 2895 1565
1872 1565 -3810 316 3963 -1957 -2404 3508 1092 -3918 904 3304 -2700 -2192 3386 -55 -4121
1887 -4121 1408 2988 -3254 -1692 3649 -560 -3663 2322 2672 -3261 -633 4052 -1103 -3263 2730
1902 2730 2000 -3625 -90 3622 -1999 -2968 3112 1354 -3924 558 3570 -2417 -2382 3702 904 -3471
1918 -3471 1552 3392 -2699 -1597 3979 164 -3538 1835 2562 -3434 -1345 3739 -660 -3473 2211
1933 2211 2066 -3594 -623 3857 -1191 -2955 2924 1597 -3606 379 3713 -1803 -2601 3074 795
1948 795 -4013 686 3186 -2541 -2294 3117 -100 -3957 1369 2907 -2873 -1513 3606 -348 -3306
1963c306N470M58n675K330M287m602k123N701n64n624L261L749n058j250N942
1978B996j539m978M162K787n588L6N743k608m313M490J903n669J050N272l549
1993A95l769N093R43n581K042M718m206k737N528j20n408K922M251n000j849N699
2009B721j179m974L676L226n184r63N530k080m509M368K546n631K97N204k810
2024B38l733M954J474n630J154M841l713k850N243M40n474K030M228m185k104
2039c087N400m15n247K869L762m737j157N513j370m944L695K941n072k61N431
2054C321k409m320M276J975n299Q35N049l270l626M979J017n300J682M696l993
2069c87k642N204N8n169K612L911m596j838N322j050m646L429L128n100q59N402
$$ plain form
1963 -3306 2164 2622 -3053 -723 3564 -1038 -3161 2540 1976 -3648 -387 3362 -1696 -2946 2996
1978 2996 1457 -3521 641 3428 -2160 -2124 3619 1011 -3302 1188 3091 -2578 -1528 3744 195
1993 195 -3574 1519 2462 -3119 -1077 3641 -565 -3302 2226 2106 -3302 -380 3871 -1129 -2978 2721
2009 2721 1542 -3432 244 3470 -1714 -2677 2853 773 -3736 632 3178 -2453 -2156 3048 238
2024 238 -3495 1459 2933 -2697 -1543 3298 -415 -3265 1978 2418 -3056 -1026 3202 -983 -3087
2039 -3087 2313 1898 -3349 -480 3282 -1455 -2612 2901 1531 -3413 282 3223 -1849 -2110 3321
2054 3321 912 -3408 868 2843 -2456 -1621 3428 158 -3468 1511 2528 -2772 -1090 3606 -387
2069 -387 -3029 2175 2233 -2936 -324 3587 -1009 -2847 2475 1425 -3221 208 3336 -1764 -2623 2779
2085B779j879m305M198K391n220L3N143k671l664M538J613n488J042M740l491
2100b41k922M896M79n256J968M168m009j976N281m79n065K720L506m340j194N280
2116B816j318m842L600K788m752k97N020k327m064M098J939m857N13M835k945
2131B07l496M557J181m990J492M455l790k574M930J27m842K297L938m322k024
2146b854N037n40m761L153L151m657q21M961j511m103L665K401n072j2M931k330
2162F38l661M466J313n221Q88M607l193k855M761O10n196J863M227m001j904M916
2178B258m53m909K771L637m416j158M890j348m475L355K734m557m16M728k141
2193E00l916L980K063m786N49M678k847l364M511J095m831J307M232l472k617
$$ plain form
2085 2779 900 -3405 793 3184 -2036 -2003 3140 469 -3195 1343 2956 -2532 -1490 3250 -241
2100 -241 -3163 1733 2212 -3044 -1076 3092 -917 -2893 2388 1909 -3156 -436 3070 -1270 -2464 2816
2116 2816 1498 -3344 256 3044 -1708 -2005 3015 688 -3376 722 2661 -2196 -1683 3152 207
2131 207 -3289 1268 2449 -2541 -1049 3406 -384 -2958 1972 2099 -2743 -446 3492 -830 -2854
2146 -2854 2183 1643 -3118 35 3186 -1471 -2292 2669 1158 -2945 720 3121 -1951 -1963 2968 638
2162 638 -3023 1443 2756 -2465 -1577 3030 -163 -3018 1743 2353 -2843 -980 3247 -754 -2658 2258
2178 2258 1805 -3104 -333 3304 -1112 -2270 2620 1272 -3203 152 2886 -1671 -2087 2641 500
2193 500 -3416 564 2627 -2159 -1610 3068 221 -3143 1368 2463 -2368 -1061 3171 -301 -2918
2208b918M670L39m811K238L648m206j758M889n08m506L047K888m410r42M871j435
2224A096l903L461K220m626k1M560k192l438M033J259m861Q07M568k938k874M389
2240A540O51m849J723M135l638k115M646k64m667K511L352m014j322M686j145
2255A230m328L289K703m466n06M625j872l712L817J945m643M07M519k697l298
2270b987M246J146m718J181M005l335k440M531K28m518J935L594l772j767M668
2285A997m39m389K776K901m153r21M680j373l935L299K241m545j06M548k037l461
2301b917L828J433m590Q54M170k800k677M128O11m374J469L925l501k189M458
2316A828p4m473K252L330l715j344M433r18m284L060K771m308m59M402j650l617
$$ plain form
2208 -2918 1752 2091 -2720 -482 3166 -1040 -2798 2091 1583 -2923 124 3012 -1398 -2340 2531 1096
2224 1096 -2807 654 2874 -1752 -1773 2787 595 -2843 1190 2449 -2412 -1605 2963 25 -2849 1540
2240 1540 2191 -2658 -935 3200 -438 -2553 2093 1829 -2838 -327 3025 -989 -2311 2375 1230
2255 1230 -3098 191 2894 -1572 -2078 2547 675 -3037 780 2725 -1918 -1511 3008 311 -2987
2270 -2987 1259 2405 -2313 -1132 2873 -462 -2902 1629 1857 -2661 -726 2868 -904 -2671 1997
2285 1997 1558 -2831 -55 2846 -1307 -2228 2452 1079 -2856 443 2684 -1861 -1967 2581 544 -2917
2301 -2917 911 2344 -2246 -1392 2778 -22 -2699 1429 2040 -2334 -865 3060 -441 -2630 1828
2316 1828 1754 -2719 -467 2863 -852 -2196 2237 1319 -2965 95 2866 -1442 -1901 2501 851 -2766
2332b766L515J969m554K55M304k468l140L953J263m452R74L899l122k464M394
2347A560M24m389J847L388l711j641M529m89m277K648K919m054q10M291j202l883
2363b850L078K280m344j13M400j925l374L683J476m532P36M302k754k742L947
2378A268P70m496J563L780l407k081M271Lm343K206L337l708j499M372q03l948
2394b715K792K743m158n46M329j708l495L320K018m332K53M079k443l048L910
2409I99J170m347J039L858l040k390M232K91m116J743L233l540j660M403m42l986
2425b553K392K676l818r64M663j293l850K952K247m140k02M389j973l179L437
2440G84J477m338Q02M063k640k826L972O31m330J464L751l211k057M140j77l957
$$ plain form
2332 -2766 749 2718 -1836 -1581 2723 255 -2885 1068 2331 -2121 -1147 2752 -370 -2834 1560
2347 1560 1984 -2405 -558 2830 -881 -2522 2007 1518 -2759 -111 2808 -1246 -2056 2235 1033 -2850
2363 -2850 228 2508 -1836 -1949 2451 526 -2848 835 2311 -2221 -1485 2817 63 -2679 1268
2378 1268 2038 -2458 -895 2885 -522 -2603 1668 1671 -2672 -466 2871 -837 -2336 2036 1233 -2715
2394 -2715 77 2820 -1338 -1884 2445 737 -2758 562 2580 -1752 -1499 2580 137 -2911 999
2409 999 2169 -2178 -1139 2719 -321 -2711 1521 1812 -2304 -561 2672 -868 -2528 1875 1433 -2553
2425 -2553 -161 2515 -1303 -2267 2396 1103 -2747 205 2452 -1688 -1890 2499 526 -2653 784
2440 784 2261 -2077 -1275 2788 148 -2678 1294 1925 -2405 -941 2810 -401 -2458 1682 1505 -2452
2456b452J974L330l699j472M224p41l878K855K526l990o22M253j565l505L140
2471C78K092m183J10L987k159k988L829J146m224Q70L686k871k289M062N09m227
2487b272J583L285l330j565M229m41m110K343K828l842r81M433r98l799K708K312
2503B383m016q9M137j943l177L452J385m085N97L999k486k757L815P92m322J453
2519h62L616l064k002L857l1m066K068L206l554j474M242p25l815K571K607l869
2535a295o41M113j436l492L184J985l977j30L966k014k922L643J165m156Q30L727
2551B550k777k225L827M69m143J478L312l109j712M161k66m032K058K899l562
2566a072r13M187j087l743K726K320l970j80M032j610l238L027J657m001M95L905
$$ plain form
2456 -2452 -478 2852 -847 -2319 1905 1164 -2714 141 2667 -1323 -1945 2308 743 -2762 378
2471 378 2470 -1713 -1603 2384 225 -2763 1066 2212 -2012 -1142 2544 -327 -2616 1446 1955 -2272
2487 -2272 -689 2596 -734 -2299 1930 1489 -2621 -278 2550 -1292 -2273 2160 1162 -2637 71 2383
2503 2383 -1633 -1722 2415 472 -2705 747 2132 -1953 -1356 2643 157 -2600 1215 2007 -2315 -862
2519 -862 2754 -310 -2312 1545 1514 -2552 -484 2722 -832 -2306 1936 1211 -2604 -33 2574 -1295
2535 -1295 -1936 2177 741 -2751 433 2418 -1559 -1689 2277 263 -2659 984 2149 -2007 -1177 2550
2551 2550 -227 -2452 1375 1844 -2299 -821 2491 -618 -2330 1831 1565 -2467 -409 2490 -1072
2566 -1072 -1985 2202 1115 -2628 98 2418 -1552 -1732 2300 690 -2548 479 2136 -1865 -1370 2535
2582B535k338k756L607Q55l982J173L532k947k207L960K58m040K004L075l553
2597h24j407M045o32l684K701K460l905p82M089j341l278L127J967m127j03M001
2613B307j954k905L433J311m137O52L694k587k348L954N42m140J290L349k996
2628e35j618L926k79l917K030K902l568r76M104r36l688K728K219l871l12M124
2644B333j707l285L264J564l851M82L686k255k833L601R78m081J357L276k945
2659d16k166L934J72l838J878L201l488j487M004o35l644K465K555l657q35L871
2675A914r78l407L016J703l811j06L927j820k909L353J334m170P21L740k495k323
2691b311L819K93l950J411L360l061j730L961l57l778J995K840l360j022L837
$$ plain form
2582 2535 197 -2559 1048 1903 -2079 -906 2626 -321 -2528 1432 1690 -2350 -346 2729 -824
2597 -824 -2231 1814 1182 -2502 199 2659 -1246 -2028 2061 720 -2558 569 2536 -1591 -1694 2307
2613 2307 353 -2552 881 2192 -1945 -1293 2401 -186 -2534 1420 1962 -2178 -888 2461 -535
2628 -535 -2153 1773 1494 -2423 -393 2509 -1059 -2035 2069 1133 -2555 173 2392 -1479 -1791 2333
2644 2333 626 -2659 605 2169 -1682 -1200 2486 231 -2602 999 1977 -2104 -747 2529 -416
2659 -416 -2582 1352 1524 -2314 -436 2765 -723 -2210 1794 1159 -2485 -20 2535 -1122 -1957 1914
2675 1914 936 -2471 545 2248 -1563 -1669 2258 438 -2471 882 2216 -1954 -1233 2507 12 -2311
2691 -2311 1508 1801 -2149 -738 2622 -439 -2169 1792 1435 -2343 -348 2492 -868 -1890 1947
2706A947q11l688K685K416l825k84L873j629l149K991J656l945N41L599k178k774
2722b575L588R57l894R18L377k656k192L872K04l791J714K992l334j332L848l37
2738A359l732K265K551l568q77L924r84l371K823J893l793j07L830j776k816L152
2754G73J341l974O91L588k498k396L665O39l937J245L267k759j895L868j47l912
2770b441K062K863l248j115L876r71l519K593K429l812k81L848j558l075K855
2785E06J787l957L83L756k161k770L463J037l938J005L399k764k112L776L78m013
2801b225J680L100l229j488L784l17l633K302K439l516q98L930j006l438K708
2816A93K050l872l9L856j694k941L236J202l829O11L639k308k457L598N73l943
$$ plain form
2706 1947 1136 -2552 133 2549 -1276 -1560 2313 684 -2465 526 2182 -1763 -1222 2377 199 -2575
2722 -2575 1013 1970 -1924 -1006 2371 -285 -2477 1395 1599 -2192 -478 2514 -820 -2152 1696 1359
2738 1359 -2373 -108 2443 -1125 -2002 1922 938 -2433 390 2283 -1510 -1617 2213 437 -2379 773
2754 773 2114 -1860 -1169 2419 -79 -2475 1190 1829 -2108 -863 2404 -355 -2250 1618 1471 -2441
2770 -2441 -379 2484 -764 -1879 1997 1026 -2493 100 2529 -1283 -1564 2284 726 -2349 506
2785 506 2293 -1664 -1281 2475 314 -2456 1007 2044 -1894 -889 2510 -254 -2366 1410 1788 -2225
2801 -2225 -545 2555 -674 -2162 1622 1305 -2328 -26 2413 -1103 -2001 1929 923 -2515 193
2816 193 2243 -1629 -1668 2188 494 -2447 789 1991 -1838 -1227 2412 104 -2353 1245 1818 -2125
2832b125J300L335k912j808L785J0l820J845K815l024j311L851p52l581K416K477
2848B501l593n89L910j428l268L040J747l718J61L594k079k755L373J040l696
2863a760P46L395k608k074L551N54l969J566L016l148j421L764l06l622K238K408
2879B330l442q46L903r35l492K702J948l669r8L780j667k956L247J375m054N26
2895a348L678k319k446L468Q02l887J189L241k766j819L693M7l779J783K850k976
2911e89j362L957q56l572K535K294l554n12L788j370l143K748J970l698j40L753
2927B249j985k833L471J112l861Q68L269k391k230L693L88l889J494L009k922
2942e58j557L682k67l477J987K560l417r34L917r40l352K589K071l659l52L840
$$ plain form
2832 -2125 -825 2510 -402 -2210 1575 1585 -2235 -390 2425 -599 -1910 1941 1189 -2392 24 2501
2848 2501 -1092 -1681 2229 801 -2467 573 2320 -1398 -1237 2357 278 -2477 896 1936 -1760
2863 -1760 -1014 2381 -227 -2301 1250 1804 -2165 -599 2417 -731 -2152 1612 1306 -2316 -78 2330
2879 2330 -1112 -1958 1945 1010 -2482 220 2168 -1501 -1599 2181 514 -2442 805 2180 -1874 -1348
2895 -1348 2330 11 -2435 1033 1835 -2052 -863 2378 -388 -2207 1486 1533 -2246 -463 2387 -589
2911 -589 -1951 2006 1150 -2422 113 2407 -1147 -1659 2129 759 -2384 364 2334 -1364 -1504 2249
2927 2249 264 -2569 902 2014 -1847 -979 2290 -101 -2331 1362 1750 -2139 -645 2364 -558
2942 -558 -2115 1567 1300 -2177 -190 2370 -1047 -1981 1936 996 -2356 233 2304 -1355 -1707 2133
2958B133j511l024L063J250l635M09L641k248k463L479O30l715J154L209k558
2973a86k006L548R3l644J844K844l093j440L812o36l551K404K449l532o25L719
2989B000j353l009K768J685l450k2L557j782k771L335J082l719O03L394k466k180
3005b328L547M88l881J441L107k813j714L751j32l515J807K586l338r70L820q41
3021A015l310K439K049l474l50L803j604k854K892J401l655K74L673k153k367
3036b221L233Q84l741J006L284k647j858L415P2l645J733K883l089j333L743o13
3052A106l362K275K343l554n74L673j123l176K917J758l699J02L488j965k554
3067b345L269J122l745O60L176k238k210L499N18l691J269K974k760j563L592
$$ plain form
2958 2133 622 -2402 661 1911 -1724 -1315 2326 78 -2385 1094 1724 -1991 -837 2372 -186
2973 -186 -2192 1356 1449 -2195 -351 2493 -600 -2040 1772 1136 -2415 -11 2438 -1094 -1719 2000
2989 2000 647 -2362 406 2091 -1359 -1381 2176 394 -2377 958 2040 -1679 -1076 2318 -148 -2328
3005 -2328 1219 1707 -2174 -733 2374 -439 -2153 1598 1466 -2049 -242 2344 -994 -1964 1856 1015
3021 1015 -2295 144 2193 -1281 -1631 2172 568 -2286 606 2007 -1648 -1374 2299 146 -2221
3036 -2221 1012 1896 -1845 -839 2445 -202 -2060 1355 1427 -2218 -485 2398 -691 -2024 1719 1106
3052 1106 -2256 19 2362 -1192 -1766 1907 784 -2392 525 2283 -1416 -1314 2174 209 -2345
3067 -2345 924 2046 -1699 -1039 2137 -101 -2311 1188 1706 -1985 -716 2258 -502 -2065 1527
3082A527j07l541J828K647l258q97L706q47l348K319K141l510j01L494j473k938
3098b358K867J428l568L68L532k082k399L223R53l769R30L198k473k044L416K76
3114A498l615J626K823k798j595L682n27l316K256K237l380n98L563j216k945
3129b305K794J795l685q3L523j712k673L136J130l590N17L338k091k300L445M10
3145A649l679J340K843k617j372L407j55l563J850K480l100q19L485q15l133K191
3161hK221l445l00L561j312k959K745J527l490M22L187k002k427L063J005l575
3177a787J020L078k501j963L311K65l466J669K636k942j256L498n02l292K204
3192b8K289l382n27L466j037k935K527J756l514j31L555j648k562K948J140l477
$$ plain form
3082 1527 1420 -2121 -293 2354 -904 -1801 1905 1058 -2290 29 2170 -1340 -1441 2053 580 -2358
3098 -2358 509 1937 -1631 -1263 2269 187 -2212 1011 1964 -1805 -875 2323 -150 -2194 1222 1498
3114 1498 -2117 -491 2332 -466 -2061 1621 1094 -2222 34 2271 -1109 -1707 1856 640 -2305
3129 -2305 489 2284 -1401 -1484 2039 327 -2346 790 1920 -1670 -1153 2185 94 -2206 1239 1649
3145 1649 -2030 -690 2153 -464 -1836 1571 1416 -2147 -297 2183 -917 -1736 1749 934 -2199 -8
3161 -8 2213 -1232 -1532 2029 717 -2242 503 2030 -1460 -1038 2149 147 -2280 783 1788 -1787
3177 -1787 -767 2311 -190 -2153 1158 1423 -2043 -374 2262 -680 -1936 1562 1060 -2232 -28
3192 -28 2261 -1121 -1648 1818 781 -2154 373 2129 -1385 -1516 2039 391 -2171 777 1917 -1560
3208a560L67L263k117k165L337N22l531J257K836k605j644L486j24l357J656K632
3224B253l020j061L591o87l355K377K059l304k32L317j344k960K935J412l400
3239a419K50L322j981k421L164P62l396Q88L094k505j948L516K40l439J426K603
3255B156k833j176L462m14l183J888K332l306o58L443r33k827K519J495l326r
3271a370L343j460k738K917J219l511N28L185j995k146L109N80l435J060K993
3286B279k654j594L398j63l238J670K502k939j029L377o53l194K338K095l395
3301a200k50L397j419k687K674J327l271L24L142j832k296K940R21l490Q34K988
3317B102k439j721L301Q1l130J276K752k819j206L317l53l077J735K296l129p10
$$ plain form
3208 -1560 -1193 2070 -47 -2212 1125 1647 -1884 -627 2209 -396 -2040 1446 1322 -2035 -379 2253
3224 2253 -767 -1828 1763 1076 -2279 98 2157 -1147 -1379 1938 594 -2366 569 1981 -1419
3239 -1419 -1169 2153 172 -2249 915 1677 -1719 -831 2263 -242 -2190 1326 1566 -1873 -447 2156
3255 2156 -677 -1853 1609 1195 -1988 -100 2232 -1074 -1732 1711 778 -2049 470 1965 -1361 -1370
3271 -1370 1973 513 -2225 692 1911 -1600 -1072 2113 118 -2028 1081 1661 -1774 -714 2279
3286 2279 -375 -1969 1429 1266 -1972 -302 2200 -739 -1768 1609 956 -2238 100 2195 -1200
3301 -1200 -1450 1947 528 -2159 515 1842 -1429 -1105 2037 205 -2091 849 1770 -1720 -886 2102
3317 2102 -337 -2058 1243 1324 -1806 -530 2222 -597 -1803 1514 1161 -1916 -181 2115 -1014 -1724
3333a724L535r96k983K471J724l231j49L216j320k641K762J213l388M50L118j969
3349H8k068L053N16l349J086K766k351j625L231p1l171J583K398k737j100L235
3365A484n12l081K208J982l131m35L238j161k731K513J364l127K05L195j868k335
3381b192K977R15l255P01K927k351j681L132L12l281J370K604k753j317L341l22
3397A127k950J676K247k948q00L450j060k705K292J660l285q2L316j362k453K602
3413G25R83l253O26K888j825k049K748O70l213J108K711k299j655L095L8l208
3429a910J610K456k716j143L228n68k931J962J944k931n03L132j048k607K432
3444D07J394l098J75K969j600k254K688J007l287P57K875k303j698L119L03l132
$$ plain form
3333 -1724 1811 815 -2168 303 2027 -1204 -1353 1863 543 -2098 664 1877 -1511 -1061 2057 88
3349 88 -1980 1073 1589 -1760 -674 2092 -259 -1884 1347 1276 -1895 -312 2086 -651 -1751 1484
3365 1484 972 -2109 99 2081 -1050 -1485 1753 592 -2139 374 1738 -1389 -1184 2011 143 -2192
3381 -2192 785 1700 -1555 -854 2073 -278 -1959 1173 1485 -1796 -426 2178 -575 -1892 1449 1127
3397 1127 -1823 -147 2100 -848 -1648 1802 742 -1963 329 1989 -1296 -1378 1938 576 -1877 725
3413 725 1708 -1545 -919 1969 144 -1905 843 1513 -1700 -592 2119 -180 -1835 1260 1298 -1910
3429 -1910 -300 2156 -560 -1703 1525 957 -1974 -12 1932 -999 -1502 1630 582 -2025 407
3444 407 1801 -1297 -1122 1847 247 -2007 681 1688 -1599 -842 2033 -270 -1968 1151 1454 -1678
3460a678J082K641k484j349L121j20l026J657K030k799n98L097p00k828K209J462
3476A717k923k05L285j398k423K514J090l040M96K862j828k122K863O10l208J012
3492f98K699k201j536K972m8l022J564K417k640j103L106n72k841J923J917k791
3508h54n08L027r71k660K336J357k962Q2L158j824k022K479Q92k979O06K728j955
3525g0j738K911L19k970J061K434k437j285L109k32k951J625K164k808p64L125
3541A493p96k721K186J601k769l77K927j148k326K381J152k901L24K803j674k058
3557a903K691O40l092R07K722k207j551K895R8l047J498K341k429j141K870l78
3573I14k614J707J857k723n06L045j153k428K222J515k989k5K966j625k090K560
$$ plain form
3460 -1678 -596 2045 -439 -1788 1333 1213 -1813 -156 1874 -925 -1523 1574 874 -1954 255 1717
3476 1717 -1206 -1411 1874 476 -1947 567 1657 -1383 -887 1975 147 -1975 888 1498 -1710 -698
3492 -698 2001 -200 -1736 1236 1188 -1834 -270 2147 -493 -1596 1510 938 -1903 20 1937 -854
3508 -854 -1362 1665 694 -1966 370 1727 -1235 -1153 2005 181 -1841 638 1530 -1449 -843 1885 -70
3525 -70 -1808 1103 1422 -1548 -487 1947 -490 -1775 1334 1102 -1849 -224 1940 -868 -1632 1493
3541 1493 697 -2024 162 1763 -1006 -1383 1544 396 -1930 451 1603 -1298 -974 1829 155 -1903
3557 -1903 788 1428 -1664 -757 1965 -242 -1793 1102 1200 -1847 -349 1992 -437 -1578 1292 914
3573 914 -1700 7 1864 -859 -1365 1680 527 -1901 321 1836 -1153 -1178 1788 163 -1927 633
3589F33J014l081N76K656j883j741K750L77k904J162K248k248j381L048j56k908
3605a838J585K089k573o83K833o21k586J771J696k770k41L029j197k469K324J303
3621A652l016L32K810j640j894K471N69k757P45K580k095j461K712J54k838J357
3637c19K159k346j087K860m06k660J776J836k593p46L053r27k418K180J358k772
3653a052m5K704j337k039K420R05k891N71K450j745j638K572O06l143J012K503
3669A853k224j197K864j25k939J415K032k419p25K963r05k336J792J593k655k42
3685a255K876j170k253K092J340k823J79K775j512k161K566Q30k965P30K471j868
3701a48j615K502L89k797J218K354k368j142K850l34k623J635J915k580n89K670
$$ plain form
3589 633 1647 -1434 -858 1798 -85 -1826 924 1301 -1603 -441 1807 -441 -1822 1226 1070 -1838
3605 -1838 -253 1836 -737 -1420 1413 792 -1794 -23 1673 -1097 -1338 1691 494 -1975 349 1652
3621 1652 -1364 -1032 1778 138 -1756 715 1284 -1473 -728 1852 -243 -1704 1008 1162 -1676 -319
3637 -319 1840 -506 -1593 1267 861 -1799 -23 1813 -780 -1526 1527 600 -1818 362 1720 -1052
3653 -1052 -1097 1607 270 -1769 651 1556 -1335 -764 1686 -59 -1697 875 1481 -1662 -650 1853
3669 1853 -371 -1568 1296 1171 -1768 -353 1679 -740 -1465 1498 593 -1743 49 1642 -1013 -1255
3685 -1255 1621 451 -1802 290 1630 -1193 -1014 1761 249 -1912 654 1484 -1481 -751 1720 -148
3701 -148 -1763 739 1128 -1669 -451 1903 -465 -1607 1243 909 -1714 -79 1836 -744 -1333 1337
3717A337p17k359K021J280k735o5K796j267j980K288R37k931M01K629j700j680
3733a745K640M66k916J019K243k173j100K720K0k850J431J894k295p65K693o46
3749F36k494J991J472k447k34K550r73k305K216J227k844K10K713j657j849K380
3765E92P35k716P00K507j946j422K475J47k699J235K129k241r59K600l05k407
3781a575J509J778k489n56K561o35k372J940J337k506j99K579j125k045K287Q69
3797A358k665N55K408j579j688K463L64k771Q72K326j901j402K643Pk437J159
3813b88K006k293q00K602n13k322J630J589k469k32K563r07k223K077J125k559
3829a014J18K465j364j854K432O49k589M70K329j829j418K620J28k525J082J983
$$ plain form
3717 1337 620 -1739 282 1562 -1173 -1238 1558 291 -1689 599 1536 -1395 -994 1635 -65 -1745
3733 -1745 895 1361 -1555 -536 1707 -466 -1566 1154 1174 -1676 -245 1649 -646 -1411 1282 636
3749 636 -1858 133 1605 -842 -1076 1474 501 -1804 412 1639 -1205 -995 1718 61 -1788 592
3765 592 1327 -1389 -689 1818 -128 -1550 925 1072 -1627 -392 1737 -504 -1463 1137 832 -1575
3781 -1575 -66 1712 -777 -1333 1228 593 -1779 161 1498 -1008 -1207 1372 247 -1798 489 1358
3797 1358 -1307 -752 1656 77 -1611 852 1216 -1555 -683 1643 -258 -1660 983 990 -1447 -288
3813 -288 1718 -575 -1375 1227 714 -1608 22 1611 -858 -1090 1473 566 -1657 420 1545 -1014
3829 -1014 -896 1569 205 -1649 783 1432 -1157 -687 1642 -187 -1605 1015 1143 -1382 -300 1683
3845A683k083j042K666l12k437J467J717k437m80K630p84k151J680J379k480k31
3861a215K679j259j824K073R10k595M24K312j500j576K246M50k543P63K265j824
3877b14j389K550pk358J020J936k011q62K581m52k463J747J459k290n52K789j038
3894D46k135K083J083k539j9K540j293j766K244P32k565N60K237j671j503K430
3910H64K90k454J087J968k106j152K658k85k319J468J634k415n83K577o96j977
3926a441J651J332k453j6K460j249j945K134P68k418L21K444j575j514K150O48
3942A297k771J015K070j831j195K414ok542J307J837k076q33K606n88k301J624
3958B7J548k404l22K571r30k134J919J235k478L7K379j331j692K168O99k449K99
$$ plain form
3845 1683 -400 -1442 1224 912 -1525 -58 1659 -778 -1258 1372 588 -1563 117 1496 -984 -1215
3861 -1215 1464 205 -1619 454 1364 -1231 -807 1505 5 -1571 675 1125 -1418 -655 1610 -214
3877 -214 -1603 947 940 -1418 -398 1538 -473 -1335 1246 794 -1669 78 1537 -753 -1305 1484 446
3894 446 -1689 394 1477 -1062 -1081 1459 166 -1600 644 1376 -1189 -629 1608 -63 -1566 864
3910 864 1154 -1300 -213 1755 -351 -1503 1155 870 -1449 19 1653 -762 -1345 1232 536 -1441
3926 -1441 210 1542 -911 -927 1533 284 -1661 473 1241 -1177 -856 1588 13 -1501 649 1297
3942 1297 -1474 -459 1611 -220 -1415 999 993 -1549 -242 1595 -481 -1314 1292 704 -1597 27
3958 27 1575 -829 -1151 1420 490 -1644 275 1510 -968 -931 1448 117 -1575 593 1292 -1157 -858
3975h58K507j580j611K374J96k402J013J974j973r88K395j10k258J157J793k253
3991f24n80K583n82k142J628J180k323j37K484j062j881J940Q79k394L26K299
4007A594j519j452K202M11k484Q13K088j756j277K317M9k445J206K009k194q15
4023a253K438m00k305J451J546k180m03K404q14k026J696J233k386Q6K439j225
4039C01j888K108P88k460N34K093j597j299K250L56k532Q92J940j863j113K465
4055I75N0k469J480J595k239o42K540n26k160J543J418k346k83K465q98j930J878
4072D51R75k295J74K376j399j740K132M89k519P73K224j765j209K232K53k430
4088a278J071J848k034q29K363k94k080J191J539k199m83K305o41k065J924J098
$$ plain form
3975 -858 1649 69 -1542 832 1028 -1374 -361 1613 -360 -1348 1047 937 -1321 -164 1629 -624
3991 -624 -1204 1379 797 -1345 283 1463 -860 -997 1487 425 -1456 484 1363 -1031 -705 1594
4007 1594 75 -1377 825 1236 -1248 -435 1653 -103 -1380 937 986 -1459 -253 1756 -438 -1253
4023 -1253 1185 785 -1520 -69 1477 -703 -1106 1298 484 -1542 154 1387 -999 -913 1526 301
4039 301 -1587 521 1309 -1151 -617 1476 -121 -1420 830 1186 -1346 -454 1486 -377 -1490 975
4055 975 1025 -1444 36 1631 -608 -1250 1290 764 -1396 147 1565 -781 -1064 1401 503 -1427 451
4072 451 1426 -869 -695 1681 282 -1458 674 1163 -1356 -583 1641 -124 -1333 899 1152 -1278
4088 -1278 -207 1641 -393 -1222 1141 847 -1233 -42 1497 -702 -1185 1120 479 -1586 338 1436
4104A436k379R6K296j387j608K147P41k387K47K268j506j344K091K70k329R27
4120d21J959j851j041K341k9k413J267J655j988n72K382n28k305J581J348k203
4136h18j95K500j008j922J813Q88k284L01K203j199j618J999O21k363O21J883
4152A422j448j234K201J29k388J094J856k039q52K295l32k134J461J501k109o33
4168a210K328o33j926J650J226k396RK391j225j685J979O78k328M03K257j473
4184D5j554K283M41k566Q12K161k031j023K420q6k329J162J820k083n29K232n22
4201F53k170J570J394k287l02K379q00j905J705J152k463L25K261j299j782K134
4217E65N62k192M64K066j609j281K207J35k181Q87J997k009q99K320k60k168J382
$$ plain form
4104 1436 -943 -847 1449 62 -1546 601 1342 -1045 -798 1470 -36 -1380 711 981 -1348 -421
4120 -421 1538 -313 -1354 987 958 -1455 -188 1467 -521 -1093 1289 761 -1544 37 1385 -818
4136 -818 -1013 1487 479 -1443 370 1258 -1026 -725 1478 279 -1339 660 1281 -1082 -461 1422
4152 1422 -26 -1260 941 1070 -1318 -224 1632 -407 -1259 1036 704 -1430 31 1532 -577 -1210
4168 -1210 1118 485 -1441 209 1435 -961 -952 1439 214 -1471 508 1186 -1142 -739 1518 45
4184 45 -1509 774 1215 -1351 -539 1622 -409 -1432 988 902 -1427 -265 1555 -528 -1057 1175 653
4201 653 -1517 53 1447 -840 -1142 1237 437 -1468 237 1389 -1074 -749 1512 213 -1569 565
4217 565 1127 -1065 -601 1465 -144 -1425 782 917 -1264 -377 1620 -389 -1288 1032 772 -1396 -14
4234a4J537k175n03K389p20k051J731J244k409j8K229j027j658J847R70k450L37
4251g41K199j469j456K201M75k373O26J979j783j007K255k4k279J119J737k121
4267f62o52K440o54k094J620J273k092k97K411r65j920J817R06k205K64K154j194
4284A50j784K100O21k300N42K144j668j252K247J58k291J000J821k011p90K341
4300A028k29k227J351J428j988n54K367n86k013J578J228k196l00K336q54j858
4316a489J949P92k302L89K091j340j552K093M86k267N61K013j726j019K162L2
4332H73k175R88J739k048n45K202m56j998J396J374k173k90K440j063j790J741
4348B15J075k379K22K205j138j760K082P10k495O57K036j586j199K125J95k282
$$ plain form
4234 -14 1523 -652 -1155 1234 514 -1537 194 1438 -971 -989 1240 213 -1445 402 1372 -1078 -741
4251 -741 1458 -11 -1467 734 1209 -1164 -538 1441 -342 -1349 906 882 -1397 -278 1459 -662
4267 -662 -1314 1126 472 -1622 -2 1271 -821 -1118 1293 328 -1592 225 1131 -1074 -810 1344 150
4284 150 -1634 466 1087 -1213 -671 1473 -195 -1447 800 958 -1333 -333 1488 -523 -1313 1028
4300 1028 799 -1428 -77 1351 -637 -1191 1176 590 -1423 155 1383 -813 -1113 1223 369 -1489
4316 -1489 460 1252 -1050 -661 1430 90 -1462 631 1117 -1150 -589 1424 -302 -1321 841 873
4332 873 -1302 -314 1425 -623 -1168 1034 578 -1420 -24 1350 -823 -1113 1327 264 -1526 215
4348 215 1290 -1089 -867 1338 200 -1560 522 1232 -1263 -606 1430 -156 -1355 770 965 -1317
4364a317Q13K015j913r62K332j31k259J399J487k131o17K463n84k023J555J225
4380A352k249k4K060p76j763J807R26k480K71K389j440j568K147M75k379O72K022
4397A442j710j092K204J39k363J073J818j934r08K438l11k273J519J326k164k73
4413a069K319q99j853J714J051k214K7K256j373j550K131N80k292M93K119j634
4429a94j296K191J84k110Q67J788j809r85K307r3k227J158J705k143n45K392o35
4446E55k105J830J141k249j4K250j151j712J938P49k386M45K118j366j465K198
4462G76L72k346Q13J744j597j118K252p2k228J109J783j950q33K344l98k076J381
4479d4J389k091k94K277p90j947J652J142k145n1K278j137j732K028O07k216M78
$$ plain form
4364 -1317 -504 1511 -402 -1364 968 837 -1422 -23 1464 -667 -1284 1179 595 -1428 127 1352
4380 1352 -897 -921 1139 363 -1400 407 1333 -1147 -876 1513 73 -1495 652 1127 -1252 -580 1442
4397 1442 -268 -1360 844 983 -1380 -307 1511 -423 -1331 1107 796 -1477 42 1368 -796 -1069
4413 -1069 1250 351 -1502 212 1263 -951 -924 1332 -41 -1591 540 1120 -1172 -679 1440 -194
4429 -194 -1490 701 885 -1225 -358 1430 -379 -1364 943 850 -1377 -219 1486 -657 -1202 1190 555
4446 555 -1550 280 1421 -828 -842 1408 257 -1455 483 1232 -1154 -709 1409 43 -1422 776
4462 776 1148 -1198 -385 1359 -238 -1356 896 824 -1404 -295 1488 -462 -1295 1049 651 -1425 -44
4479 -44 1345 -746 -1040 1237 447 -1500 152 1294 -851 -902 1376 239 -1493 535 1142 -1074 -596
4496e96K043j596j257K229J58k200Q11J838j849q31K247j22k284J319J344j920
4512f66n63K357n00k019J548J224k273q8K241q94j799J792P97k241K86K105j306
4529Aj261J882N45k402P07J973j732j057K207o0k187J170J626j836o85K347n06
4546G32k034J260J580k255k52K230q13k028J847J059k098j84K351j233j473J919
4562F08O28k291L99K037j479j265K108K83k361R99J742j769r51K162J0k156J077
4579b19J586k034m12K179m83k024J515J223k053k96K232p49j923J758R38k325
$$ plain form
4496 -596 1447 -149 -1406 823 981 -1219 -408 1430 -419 -1250 997 875 -1409 -90 1254 -666
4512 -666 -1229 1128 628 -1391 157 1381 -892 -980 1261 367 -1432 360 1157 -1084 -798 1307 1
4529 1 -1260 622 1167 -1235 -528 1445 -287 -1344 863 803 -1384 -214 1412 -424 -1109 1238 732
4546 732 -1302 -42 1538 -717 -969 1261 448 -1580 267 1326 -772 -956 1395 162 -1311 608
4562 608 1236 -1055 -656 1381 -98 -1363 745 1028 -1333 -334 1408 -361 -1312 850 860 -1296 -219
4579 -219 1367 -667 -1079 1100 617 -1407 108 1331 -722 -1018 1214 465 -1458 300 1238 -1087
$$ [...]
8191c41
##END NTUPLES=NMR FID
##END=
