##TITLE=1H_IAMT-132
 CDCl3, 8 sc, 
 30.8.2019
##JCAMPDX= 6.0         $$ Bruker NMR JCAMP-DX V2.0
##DATA TYPE= NMR FID
##DATA CLASS= NTUPLES
##ORIGIN= UXNMR, Bruker Analytische Messtechnik GmbH
##OWNER= root
$$ XWIN-NMR		Version 3.5
$$ Fri Aug 30 16:16:26 2019 Russian Standard Time (UT+4h)  she@DPX200
##.OBSERVE FREQUENCY= 200.13155
##.OBSERVE NUCLEUS= ^1H
##.DELAY= (6, 6)
##.ACQUISITION MODE= SIMULTANEOUS
##.ACQUISITION SCHEME= undefined
##.AVERAGES= 8
##.DIGITISER RES= 18
##SPECTROMETER/DATA SYSTEM= spect
##.PULSE SEQUENCE= zg30
##.SOLVENT NAME= CDCl3
##.SHIFT REFERENCE= (INTERNAL, CDCl3, 0, 15.7039)
##AUDIT TRAIL= $$ (NUMBER, WHEN, WHO, WHERE, WHAT)
$$ ##TITLE= Audit trail, XWIN-NMR		Version 3.5
$$ ##JCAMPDX= 5.01
$$ ##ORIGIN= Bruker BioSpin GmbH
$$ ##OWNER= she
$$ F:/spectra/data/she/nmr/H-F/1/audita.txt
$$ ##AUDIT TRAIL=  $$ (NUMBER, WHEN, WHO, WHERE, WHAT)
(   1,<2019-08-30 16:14:46.17 +0400>,<she>,<DPX200>,
      <created by zg, POWCHK disabled, PULCHK disabled
       configuration hash MD5:
       00 E9 B6 7A A2 85 ED C7 34 08 36 98 17 FE 4E 26
       data hash MD5: 16K
       51 59 65 D5 A8 C1 46 4E 20 74 95 44 AE 73 46 5E>)
$$ ##END=
$$ 
$$ hash MD5
$$ 93 3E 58 0A 94 CB 99 0E EA D3 FB 71 10 78 D2 C5
##$RELAX= 
##$RELAX= 
##$RELAX= 
##$RELAX= 
##$RELAX= 
##$RELAX= 
$$ Bruker specific parameters
$$ --------------------------
##$DU= <F:/spectra>
##$EXPNO= 1
##$NAME= <H-F>
##$PROCNO= 1
##$TYPE= <nmr>
##$USER= <she>
##$AMP= (0..31)
100 100 100 100 100 100 100 100 100 100 100 100 100 100 100 100 100 100 
100 100 100 100 100 100 100 100 100 100 100 100 100 100 
##$AQSEQ= 0
##$AQ_mod= 1
##$AUNM= <au_zg>
##$AUTOPOS= <>
##$BF1= 200.13
##$BF2= 200.13
##$BF3= 200.13
##$BF4= 200.13
##$BF5= 200.13
##$BF6= 200.13
##$BF7= 200.13
##$BF8= 200.13
##$BYTORDA= 1
##$CFDGTYP= 0
##$CFRGTYP= 5
##$CHEMSTR= <none>
##$CNST= (0..31)
1 1 145 1 1 1 1 1 1 1 1 1 1 1 1 1 1 1 1 1 1 1 1 1 1 1 1 1 1 1 1 1 
##$CPDPRG= <>
##$CPDPRG1= <>
##$CPDPRG2= <>
##$CPDPRG3= <>
##$CPDPRG4= <mlev>
##$CPDPRG5= <mlev>
##$CPDPRG6= <mlev>
##$CPDPRG7= <mlev>
##$CPDPRG8= <mlev>
##$CPDPRGB= <>
##$CPDPRGT= <>
##$D= (0..31)
0 1.2 0 0 0 0 0 0 0 0 0 0.03 0 0 0 0 0 0 0 0 0 0 0 0 0 0 0 0 0 0 0 0 
##$DATE= 1567167285
##$DBL= (0..7)
120 120 120 120 120 120 120 120 
##$DBP= (0..7)
150 150 150 150 150 150 150 150 
##$DBP07= 0
##$DBPNAM0= <>
##$DBPNAM1= <>
##$DBPNAM2= <>
##$DBPNAM3= <>
##$DBPNAM4= <>
##$DBPNAM5= <>
##$DBPNAM6= <>
##$DBPNAM7= <>
##$DBPOAL= (0..7)
0.5 0.5 0.5 0.5 0.5 0.5 0.5 0.5 
##$DBPOFFS= (0..7)
0 0 0 0 0 0 0 0 
##$DE= 6
##$DECBNUC= <off>
##$DECIM= 24
##$DECNUC= <off>
##$DECSTAT= 4
##$DIGMOD= 1
##$DIGTYP= 9
##$DL= (0..7)
0 120 120 120 120 120 120 120 
##$DP= (0..7)
150 150 150 150 150 150 150 150 
##$DP07= 0
##$DPNAME0= <>
##$DPNAME1= <>
##$DPNAME2= <>
##$DPNAME3= <>
##$DPNAME4= <>
##$DPNAME5= <>
##$DPNAME6= <>
##$DPNAME7= <>
##$DPOAL= (0..7)
0.5 0.5 0.5 0.5 0.5 0.5 0.5 0.5 
##$DPOFFS= (0..7)
0 0 0 0 0 0 0 0 
##$DQDMODE= 0
##$DR= 18
##$DS= 0
##$DSLIST= <SSSSSSSSSSSSSSS>
##$DSPFIRM= 0
$$ [...]
##$SUBNAM2= <"">
##$SUBNAM3= <"">
##$SUBNAM4= <"">
##$SUBNAM5= <"">
##$SUBNAM6= <"">
##$SUBNAM7= <"">
##$SUBNAM8= <"">
##$SUBNAM9= <"">
##$SW= 24.9336996594482
##$SWIBOX= (0..15)
0 0 2 0 0 0 0 0 0 0 0 0 0 0 0 0 
##$SW_h= 4990.01996007984
##$TD= 16384
##$TD0= 1
##$TE= 0
##$TE2= 300
##$TE3= 300
##$TEG= 300
##$TL= (0..7)
0 120 120 120 120 120 120 120 
##$TP= (0..7)
150 150 150 150 150 150 150 150 
##$TP07= 0
##$TPNAME0= <>
##$TPNAME1= <>
##$TPNAME2= <>
##$TPNAME3= <>
##$TPNAME4= <>
##$TPNAME5= <>
##$TPNAME6= <>
##$TPNAME7= <>
##$TPOAL= (0..7)
0.5 0.5 0.5 0.5 0.5 0.5 0.5 0.5 
##$TPOFFS= (0..7)
0 0 0 0 0 0 0 0 
##$TUNHIN= 0
##$TUNHOUT= 0
##$TUNXOUT= 0
##$USERA1= <user>
##$USERA2= <user>
##$USERA3= <user>
##$USERA4= <user>
##$USERA5= <user>
##$V9= 5
##$VALIST= <valist>
##$VCLIST= <CCCCCCCCCCCCCCC>
##$VD= 0
##$VDLIST= <DDDDDDDDDDDDDDD>
##$VPLIST= <PPPPPPPPPPPPPPP>
##$VTLIST= <TTTTTTTTTTTTTTT>
##$WBST= 1024
##$WBSW= 4
##$XGAIN= (0..3)
0 0 0 0 
##$XL= 0
##$YL= 0
##$YMAX_a= 359990
##$YMIN_a= -464663
##$ZGOPTNS= <>
##$ZL1= 120
##$ZL2= 120
##$ZL3= 120
##$ZL4= 120
##$ABSF1= 10
##$ABSF2= 0
##$ABSG= 5
##$ABSL= 3
##$ALPHA= 0
##$AQORDER= 0
##$ASSFAC= 0
##$ASSFACI= 0
##$ASSFACX= 0
##$ASSWID= 0
##$AUNMP= <proc_1d>
##$AZFE= 0.1
##$AZFW= 0.1
##$BCFW= 1
##$BC_mod= 2
##$BYTORDP= 1
##$COROFFS= 0
##$CY= 11.3945322036743
##$DATMOD= 1
##$DC= 2
##$DFILT= <>
##$DTYPP= 0
##$F1P= 20.1720416913024
##$F2P= 0.152960286110954
##$FCOR= 0.5
##$FTSIZE= 0
##$FT_mod= 4
##$GAMMA= 1
##$GB= 0.15
##$INTBC= 1
##$INTSCL= 1
##$ISEN= 128
##$LB= 0.24
##$LEV0= 0
##$LPBIN= 0
##$MAXI= 10000
##$MC2= 0
##$MEAN= 0
##$ME_mod= 0
##$MI= 1.114404
##$NCOEF= 0
##$NC_proc= 0
##$NLEV= 6
##$NOISF1= 3.799351
##$NOISF2= 2.8
##$NSP= 1
##$NTH_PI= 0
##$NZP= 0
##$OFFSET= 15.70392
##$PC= 1
##$PHC0= -9213.012
##$PHC1= 14.80096
##$PH_mod= 1
##$PKNL= yes
##$PPARMOD= 0
##$PSCAL= 0
##$PSIGN= 0
##$REVERSE= no
##$SF= 200.130013532006
##$SI= 16384
##$SIGF1= 3
##$SIGF2= 2
##$SINO= 400
##$SIOLD= 16384
##$SREGLST= <1H.CDCl3>
##$SSB= 0
##$STSI= 0
##$STSR= 0
##$SW_p= 3612.71676300578
##$SYMM= 0
##$S_DEV= 0
##$TDeff= 0
##$TDoff= 0
##$TI= <>
##$TILT= no
##$TM1= 0
##$TM2= 0
##$TOPLEV= 0
##$USERP1= <user>
##$USERP2= <user>
##$USERP3= <user>
##$USERP4= <user>
##$USERP5= <user>
##$WDW= 1
##$XDIM= 8192
##$YMAX_p= 0
##$YMIN_p= 0
$$ End of Bruker specific parameters
$$ ---------------------------------
##NTUPLES= NMR FID
##VAR_NAME=  TIME,          FID/REAL,        FID/IMAG
##SYMBOL=    X,             R,               I
##VAR_TYPE=  INDEPENDENT,   DEPENDENT,       DEPENDENT
##VAR_FORM=  AFFN,          ASDF,            ASDF
##VAR_DIM=   8192,          8192,            8192
##UNITS=     SECONDS,       ARBITRARY UNITS, ARBITRARY UNITS
##FACTOR=    0.0002004,     1,               1
##FIRST=     0,             0,               0
##LAST=      1.6414764,     0,               0
##MIN=       0,             -464663,         0
##MAX=       1.6414764,     359990,          0
$$ Real data points
##PAGE= N=1
##DATA TABLE= (X++(R..R)), XYDATA
0 0 0 0 0 0 8 -8 8 -8 16 -16 24 -32 39 -46 56 -65 80 -97 113 -129 156 -183 208 -241 281 -319 363 -412
28 -412 471 -530 596 -672 752 -842 940 -1046 1164 -1294 1435 -1590 1763 -1952 2159 -2390
44 -2390 2652 -2940 3265 -3637 4063 -4556 5138 -5835 6691 -7762 9160 -11058 13816 -18188
58 -18188 26220 -45858 194560 105616 -338556 -73025 206544 138105 -71712 54760 201339
69 201339 130011 -17105 -13236 -54034 -92431 90084 359990 217434 -188623 -231543 141191
80 141191 245951 -57754 -161653 171830 346764 57823 -225550 -118177 92206 130357
90 130357 127563 155783 41387 -119120 -34010 162485 79737 -129337 8349 338908 255399
101 255399 -182909 -290537 69513 291196 114797 -41629 55983 120713 9293 -47704
111 -47704 17624 30935 34387 178375 250259 -3822 -268033 -91867 268423 236324 -75911
122 -75911 -90167 182784 204484 -84908 -192121 29822 207117 158509 74193 25039 -71533
133 -71533 -95353 79814 206161 50950 -100464 69121 256739 53657 -252358 -131255
143 -131255 242712 291325 11829 -114503 13525 81527 12743 6260 66051 58923 55859 130158
155 130158 95010 -119041 -175734 104372 317763 118625 -155813 -66219 173325 122679 -97491
166 -97491 -78247 137800 199782 70154 -26853 -41438 -41527 31951 169400 157297 -33322 -91950
178 -91950 95163 178321 -30290 -168210 45031 280344 159480 -106816 -122521 51249
188 51249 114845 54942 33973 44403 25151 40592 84275 17633 -104396 -30484 201705 222290
200 222290 -41834 -184047 7289 193415 86255 -82660 -20283 136809 125503 -5106
210 -5106 -60933 -24576 37742 115749 143281 29893 -103759 -36977 143733 131248 -62523
221 -62523 -91352 117139 213347 28422 -143433 -53560 123687 139391 39424 -13555 -2621
232 -2621 27245 67705 68272 -11894 -54643 60501 181921 83618 -118868 -107769 106167 187262
244 187262 29846 -91091 -2666 117004 81785 -25345 -48584 15441 85516 108645 49267
255 49267 -58151 -74802 55506 153726 55755 -89448 -39520 127755 130889 -40145 -111213
266 -111213 20453 146108 98608 -20989 -55614 1953 70154 84916 26861 -43720 -18002
277 -18002 95890 124350 -8468 -111504 -10878 151586 126622 -40235 -92072 29189 123301
288 123301 63852 -38106 -42168 38666 99769 72743 -18969 -70857 -1133 115013 109113 -27027
300 -27027 -92595 17796 134232 73873 -68133 -71665 61775 128769 43892 -62016 -53043
311 -53043 42228 100283 56461 -34475 -56636 27763 108705 61007 -58706 -70732 53327 132231
323 132231 45152 -77406 -57497 67101 113319 26521 -61900 -34709 61808 98540 28093
334 28093 -57914 -43864 59118 112467 34564 -70460 -50056 70591 114900 16895 -78635
345 -78635 -32779 83711 102828 1304 -75218 -24653 79736 95355 3117 -71846 -27580
356 -27580 76549 95539 -1534 -79317 -24725 86480 93624 -14693 -83742 -16073 90313
367 90313 84593 -22223 -79323 -8969 87861 77029 -24969 -76806 -6686 88573 75723 -28927
379 -28927 -78384 -2801 92097 72219 -35503 -77641 5096 95427 65250 -41364 -74100 12168
391 12168 95075 58776 -44984 -71202 16408 94558 53552 -48910 -69236 21355 94513 46995
403 46995 -54633 -67058 26812 93769 39501 -59245 -63682 31148 91113 32586 -62787 -61324
415 -61324 34068 89112 26455 -66362 -59358 37875 88256 19951 -70810 -56050 42740 86077
427 86077 12828 -73250 -52065 46012 83305 7628 -74217 -48946 49474 82359 3415 -78073
439 -78073 -46317 55194 82519 -3672 -81084 -39816 61348 77636 -12523 -79690 -31248 62936
451 62936 70752 -16166 -77198 -29224 61921 69709 -17342 -79635 -28636 65777 68123 -26628 -83796
464 -83796 -19167 72149 59615 -37680 -80076 -11408 68088 49724 -36239 -72476 -13105 60986
476 60986 48374 -36829 -78192 -13650 71117 52783 -48619 -86758 -4165 77846 39922 -58069
488 -58069 -72608 11410 68177 23241 -55177 -62518 7298 63985 34270 -48787 -74849 -1782
500 -1782 73205 37528 -62014 -75720 22182 82406 12790 -80858 -60404 36501 69629 4412
512 4412 -61719 -49999 14375 51196 15316 -52353 -60390 16315 73914 14519 -87274 -74683
524 -74683 41035 86130 -5839 -89545 -45388 44547 45326 -27399 -63352 -25978 30852 43708
536 43708 -5182 -69741 -65219 21308 75919 6541 -89048 -58761 51140 61634 -45467 -95894
548 -95894 -11709 71655 36850 -48594 -69763 -23538 23778 32680 -2564 -51037 -44297 25851
560 25851 53137 -28565 -100732 -32397 84650 65562 -62993 -101750 -7262 59032 11169 -50297
572 -50297 -37204 8530 23201 3609 -35457 -66858 -34756 51533 69104 -33526 -111239 -36821
584 -36821 69945 31800 -79983 -71257 41933 68596 -26763 -91924 -50931 13037 32214 17696
596 17696 -18847 -60246 -45882 23474 33304 -52377 -86130 18389 98335 3990 -126376 -88687
608 -88687 45806 68423 -20874 -59271 -14097 10129 -12502 -27252 -31220 -36310 61 61264
620 61264 32681 -86804 -118052 7205 94276 6956 -94296 -36768 63210 22197 -85777
631 -85777 -82450 9704 48496 18921 -12587 -42696 -71499 -37128 40223 34408 -56613 -64211 40707
644 40707 62745 -69157 -141555 -22285 102321 48804 -67819 -69774 -8341 -5432 -31237 -15924
656 -15924 -1328 -14932 554 29966 -25050 -118280 -76511 74768 100866 -42138 -115827 -16967
668 -16967 55968 -23876 -95685 -24881 63561 37759 -31923 -52668 -56134 -53641 6371 70816
680 70816 20202 -83143 -61794 42679 24342 -100158 -94245 61692 114284 -20503 -123273
691 -123273 -63420 16479 4064 -17704 5917 2570 -34209 -25442 298 -47095 -91691 -3150
703 -3150 111042 47210 -117221 -124462 16790 59668 -38427 -70100 19739 55831 -24535 -82595
715 -82595 -54805 -23320 -7466 39217 53971 -37348 -117796 -48283 56327 11841 -87978 -35794
727 -35794 89117 53006 -103710 -131675 -7708 61747 15464 -19009 -7740 -28265 -58145
738 -58145 -24023 10188 -29439 -47818 38124 83024 -40461 -158769 -72384 83245 66291
749 66291 -56392 -62463 23012 15967 -68233 -74594 -6600 20309 11697 21656 -4735 -91680 -105311
762 -105311 13383 84924 -7592 -91531 -14411 67613 -18576 -131814 -71707 65501 71509
773 71509 -21203 -55803 -35980 -42038 -38222 12774 27061 -29109 -39400 29100 23861 -92095
785 -92095 -122006 19580 118709 23153 -98484 -64783 20772 -253 -58389 -28731 30553 21162
797 21162 -13455 -19554 -44010 -82570 -35438 71769 68270 -56637 -100725 -1172 47873 -43558
809 -43558 -97388 -692 86608 24458 -74741 -74487 -25000 -9762 2749 27777 1571 -56764
821 -56764 -41716 20612 -3884 -86337 -55523 72080 83905 -54102 -125383 -35522 47308 7559
833 7559 -43172 -12748 19237 -9070 -36188 -29563 -35995 -38900 19543 71036 3537 -103636 -77811
846 -77811 38022 48828 -47651 -64369 28061 58312 -30589 -90435 -43016 16677 21134 10835
858 10835 391 -38748 -62603 -14453 32939 -10137 -65320 -12275 67323 18988 -97045 -92923
870 -92923 20899 64469 -3790 -51647 -22404 282 -18297 -27399 -17731 -19461 -11295 26689 25477
883 25477 -52284 -95799 -18626 67649 26541 -64985 -51595 28457 26919 -49434 -66670 -4059
895 -4059 36471 15784 -15294 -34089 -46983 -26912 23876 29751 -31238 -56187 7036 46759
907 46759 -21228 -88765 -35633 57509 46984 -36770 -62840 -17760 10782 -1887 -14367 -16141
919 -16141 -16830 -1602 17820 -8470 -63080 -51437 31395 60046 -17103 -78282 -31150 36854
931 36854 14877 -47213 -42878 11619 28470 -4391 -35274 -39838 -23408 10263 30460 -2239
943 -2239 -51568 -37935 23408 28757 -36989 -61855 2199 53333 10728 -55698 -50096 4483 26249
956 26249 3452 -22064 -26084 -11203 10770 11399 -24179 -47799 -9483 44076 24940 -46566 -61600
969 -61600 3148 44541 3634 -46634 -30692 17260 23087 -12653 -38318 -27549 4226 26026
981 26026 10037 -33178 -47084 -4000 36406 8683 -46990 -40162 19918 38285 -14218 -54972
993 -54972 -26803 23950 26806 -11013 -37111 -24725 7377 20943 -1668 -35507 -30443 14667
1005 14667 35139 -6323 -51927 -30925 27224 35372 -15632 -46784 -16410 25840 20523 -18578
1017 -18578 -36822 -12848 21539 22916 -11896 -40330 -21401 23215 29827 -14090 -45358 -15108
1029 -15108 30982 23820 -25367 -42974 -5602 31161 16673 -24854 -37715 -6887 25272 17090
1041 17090 -20581 -37478 -8318 28148 18627 -25911 -41413 -3487 33899 15905 -30249 -38665
1053 -38665 1740 31937 10645 -29619 -33517 3662 30463 10296 -29266 -33436 4453 33064
1065 33064 11164 -31524 -33506 8739 34932 7870 -33467 -29548 13146 33651 4148 -33115
1077 -33115 -26200 14272 32125 3174 -32607 -25014 15378 32276 1556 -33891 -23507 17679
1089 17679 31734 -1046 -34347 -21115 19845 30295 -3613 -34365 -18880 20769 28768 -5793
1101 -5793 -34653 -17120 22354 28090 -7105 -34420 -15155 24238 28127 -9713 -34743 -12015
1113 -12015 26463 26707 -11377 -33701 -8798 27956 25105 -12818 -32966 -6100 29309 24843 -14245
1126 -14245 -32540 -4027 31469 23438 -16399 -31238 -300 32386 20420 -18270 -29569 2338
1138 2338 32518 18967 -18560 -28436 2735 32641 18706 -19854 -28977 5053 34221 16367
1150 16367 -23623 -28029 9091 34609 12369 -24833 -24992 10711 31632 10619 -22657 -23037 10190
1163 10190 32393 11555 -24838 -25035 13234 36111 9594 -28026 -21912 18768 33965 2984
1175 2984 -27160 -14738 20697 29956 2630 -23565 -15240 17015 31574 7503 -24174 -17650 20392
1188 20392 34733 1554 -30471 -12358 29646 32978 -5361 -28872 -6814 25943 25215 -2459
1200 -2459 -19972 -7219 20321 26624 -424 -26631 -11636 29128 35835 -6085 -34823 -6965
1212 -6965 34713 26837 -14074 -25038 6232 30312 15665 -13033 -19930 443 25520 26520 -2612
1225 -2612 -26961 -8472 30379 30006 -12682 -29878 8811 42828 17575 -26098 -23327 15865 33974
1238 33974 13591 -10013 -11692 3478 20260 19140 -4800 -20266 4653 39292 25834 -23849
1250 -23849 -33636 14555 46743 15317 -24145 -12282 22854 24276 -1907 -14312 -2296 15918
1262 15918 26386 16650 -12298 -26716 2987 39944 24607 -21364 -21973 25575 38905 -6118
1274 -6118 -35308 -2425 38579 29754 -4293 -15640 -4705 8541 18620 16454 -3040 -12442 13548
1287 13548 36540 6774 -36995 -17904 42297 49502 -5664 -33662 1126 31052 13368 -9997
1299 -9997 -1457 16232 19043 14738 3231 -17664 -17100 23074 50171 13579 -33688 -14496 36169
1312 36169 28856 -22209 -23673 27982 46705 7034 -24615 -12786 8052 15876 21700 18125 -5368
1325 -5368 -14628 13618 28754 -6103 -31843 10257 59115 29554 -35763 -35272 19560 36822 5647
1338 5647 -6897 11879 17421 3596 -703 -358 -8506 2257 38745 42420 -11957 -44928 -585
1351 -585 47975 21338 -24557 -4261 42719 29585 -21838 -28604 8009 27668 22643 18888 7584
1364 7584 -17129 -15457 21380 31027 -6867 -18200 30439 51643 -5868 -53831 -12510 48966
1376 48966 39445 -5858 -9578 12219 7013 -7495 2279 12658 4974 12433 34820 16308 -37664
1389 -37664 -37342 30142 60179 8165 -31355 4051 37840 4185 -33095 -6644 36216 33155
1401 33155 9000 1250 -7786 -20593 37 40399 32496 -12924 -14276 30706 29703 -28683 -39134
1414 -39134 26987 65555 20331 -27707 -13699 12980 6276 384 18134 20838 3316 5483 18949
1427 18949 -3742 -35432 -4360 58180 49582 -20406 -39706 12220 34256 -4751 -20866 19348
1439 19348 42943 13234 -14469 -10421 -5928 -3394 24117 44951 12563 -31740 -13273 32745
1451 32745 17889 -29069 -11113 51275 49810 -17162 -43043 -1796 28184 15423 8902 18886
1463 18886 9065 -10169 119 15365 -3313 -15454 24379 58567 14200 -48114 -29145 34339
1475 34339 38646 -6015 -9916 25862 26443 -10365 -20990 1361 12515 14493 28812 25295 -16180
1488 -16180 -36788 4649 42868 13610 -23598 4877 45814 16699 -39039 -29052 25525 39375
1500 39375 11585 -929 3543 -5307 -9915 10261 20349 -255 -4615 28001 33251 -18495 -47164
1513 -47164 2981 54419 30021 -19479 -12023 20867 12885 -14287 -7175 17530 20499 12904 14110
1526 14110 558 -26332 -15889 32440 43916 -2448 -26446 10666 34649 -2943 -34350 -210
1538 -210 43090 30186 -7299 -13987 -2685 -232 6631 21593 15438 -8076 -3701 22294 13088
1551 13088 -27009 -23099 31193 50509 2420 -33936 -8704 23190 11330 -7939 2555 17903
1563 17903 11654 2034 1543 -7649 -14325 9281 39987 21682 -23416 -23499 19146 29062 -8037 -20428
1577 -20428 15619 37134 8976 -20357 -12724 7617 14129 15808 14639 -1085 -13443 3121 22265
1590 22265 5072 -20526 -932 38032 27606 -20803 -30993 7877 31156 10846 -8554 -316
1602 -316 10726 5984 144 -988 -5018 -70 21065 25613 -5028 -29894 -5827 30676 20923 -15160
1616 -15160 -14320 18565 23602 -5186 -20092 -2176 16660 16590 8399 -1727 -11437 -5374 15043 19495
1630 19495 -4366 -15894 9338 29819 6259 -26149 -14295 22764 28100 260 -14748 -1985
1642 -1985 10785 8896 2459 -2510 -2915 7228 18817 8639 -16323 -17245 13360 30236 5774
1655 5774 -20990 -8123 19291 16448 -8657 -14129 4435 17645 11080 -2815 -11050 -6906 8282
1668 8282 18699 6321 -13815 -10002 14503 19902 -5457 -21383 -278 24700 15728 -10988 -16280
1681 -16280 2407 15687 9744 -3579 -7938 -621 12297 13267 -3234 -16400 -3026 21175 18440
1694 18440 -8920 -19578 2418 21654 10092 -11603 -11231 8154 17028 5728 -9002 -10435 2850
1707 2850 15798 11594 -6843 -14940 1150 18884 10595 -12491 -14505 8001 20213 4502 -15103
1720 -15103 -11115 8657 16364 3957 -10658 -9654 5214 14440 5560 -11429 -11872 6854 18487
1733 18487 4689 -15477 -12217 10179 18374 1017 -15238 -7960 11396 15177 -853 -13389 -6710
1746 -6710 10422 15292 561 -13960 -8044 10922 16130 -463 -15639 -6475 13523 15274 -3240
1759 -3240 -15652 -4135 13503 13057 -4166 -14370 -4201 12259 12472 -4322 -15082 -4036 12840
1772 12840 12313 -5651 -16168 -3286 14254 11345 -7436 -15259 -1919 14155 9657 -8394 -14792
1785 -14792 -1029 13839 8746 -8711 -14964 -519 14015 8288 -9501 -14628 1221 14598 7305
1798 7305 -10434 -13871 2294 14392 6031 -11078 -12827 3155 14061 5520 -11293 -12092 3624
1811 3624 14273 4724 -11871 -11986 4895 14421 3149 -13017 -11321 5447 13663 1797 -13608
1824 -13608 -10691 6190 13106 1047 -13697 -10385 6296 12944 -50 -14850 -10196 7792 13356
1837 13356 -1994 -15569 -8725 8658 11781 -3158 -15081 -7321 8559 10671 -3592 -14410 -7302
1850 -7302 9290 11333 -3740 -15806 -6749 10853 11496 -5489 -15498 -4230 11445 8793 -6892
1863 -6892 -14095 -3376 10013 8342 -5969 -13678 -4622 9262 9332 -5699 -15256 -3638 12556 8539
1877 8539 -10061 -16054 -856 12820 5703 -10714 -13207 -95 9392 3989 -8831 -12053 -1510
1890 -1510 10151 6260 -10379 -16185 -1074 13765 5625 -13132 -14417 3629 12079 -351 -13849
1903 -13849 -9452 4697 9458 461 -10346 -11082 -280 9811 4761 -10784 -13878 2485 13523
1916 13523 714 -17300 -11483 9300 13495 -3609 -15387 -6949 6051 6377 -1927 -8888 -6906
1929 -6906 1899 8515 271 -14264 -12958 7243 16170 -1790 -19964 -10073 10222 8640 -9205
1942 -9205 -13792 -282 8541 2169 -7779 -11065 -6973 3021 9159 1351 -14088 -12785 5848 10999
1956 10999 -7060 -18739 -2114 15954 5975 -15552 -16493 393 8343 1923 -4847 -6533 -4991
1969 -4991 -177 4088 -3659 -14174 -6034 13513 12511 -12763 -23378 -2270 16276 3697 -14165
1982 -14165 -8486 6633 5227 -7178 -10413 -5276 395 6163 7177 -5270 -18579 -9948 11170
1995 11170 9732 -12498 -15901 6623 14791 -7737 -23395 -8198 11844 8739 -4619 -7907 -6455
2008 -6455 -6570 -1619 4282 -2717 -11172 -1241 13592 1437 -23945 -19356 11364 19722 -4474 -18909
2022 -18909 -4547 7273 -2711 -11764 -4211 3543 2515 2402 189 -11983 -18810 -794 19113 7003
2036 7003 -18141 -13315 10433 7798 -17109 -18886 6978 18402 589 -13866 -10079 -4990 -3695
2049 -3695 2761 7568 -2772 -12164 -1179 8949 -7535 -23742 -4910 23628 13897 -18723 -22479
2062 -22479 499 7779 -5733 -8125 3599 5060 -4608 -6181 -5067 -12125 -10293 11117 20046 -5190
2076 -5190 -27048 -10390 13848 3540 -18042 -7731 17063 11466 -14733 -19681 -4560 2656 2033
2089 2033 6449 5127 -10874 -16855 731 8766 -8793 -16030 8464 23111 -3037 -30858 -16160
2102 -16160 12528 11079 -5923 -5279 4147 -2538 -12079 -6196 -441 -5043 -1689 13714 8814 -20387
2116 -20387 -28006 1738 20531 204 -17883 -1832 13976 -2763 -22923 -12611 8265 8879
2128 8879 1157 518 -5123 -17620 -12055 9242 11278 -9385 -11421 10584 11385 -18487 -28612 1657
2142 1657 23919 7331 -13665 -8389 374 -6234 -8982 2080 5673 -2639 -1112 7202 -4514 -24987
2156 -24987 -14151 18585 21290 -9638 -20923 329 9350 -9327 -17872 1680 15047 3778
2168 3778 -7702 -6734 -9312 -13004 802 16824 5599 -16688 -11570 9102 2981 -20923 -14205
2181 -14205 17013 20987 -7851 -22213 -7860 3298 -2390 -1762 6137 1949 -8365 -4729 2052
2194 2052 -7880 -16272 2406 23533 8279 -22512 -19941 6659 10192 -8219 -9417 8415 9876
2207 9876 -6592 -13051 -5901 -3104 -1721 9208 12072 -7222 -21143 -5676 12723 1009 -16303
2220 -16303 -2811 18447 7058 -19863 -19708 2753 10242 1018 -2046 421 -5565 -10228 -1448 3427
2234 3427 -6154 -8020 9226 14700 -8803 -26222 -7657 16309 9210 -10403 -7772 6176 1921
2247 1921 -10811 -9007 1142 2582 2205 5846 424 -15507 -15140 6417 15203 -3008 -14474 1298
2261 1298 12970 -3390 -19678 -7756 12291 10138 -3453 -6804 -4344 -5807 -3332 5050 3766
2274 3766 -6578 -4960 7790 4568 -15129 -16988 6263 18346 795 -15275 -7700 5441 830
2287 830 -7838 -3502 3376 2101 -387 -543 -6266 -12276 -2569 12826 8129 -11196 -13224 4403 9005
2302 9005 -6806 -13800 1235 12605 3630 -9079 -8644 -2249 500 3099 4304 -2512 -8302 -1082
2316 -1082 7254 -760 -13112 -5698 12595 11311 -8556 -15413 -1314 8616 1938 -5932 -2521 1819
2330 1819 751 -900 -2371 -5938 -4833 5330 10188 -2315 -14812 -6315 8927 6568 -8020 -9126
2344 -9126 4236 8467 -1985 -10231 -5546 2091 4246 2757 -1696 -6964 -5239 3625 5889 -4363
2358 -4363 -10009 559 10600 2721 -11950 -9992 5007 9590 -279 -7711 -3718 2160 2758 -212
2372 -212 -3521 -4563 638 6907 3399 -7700 -9787 2193 10418 1542 -9959 -5660 6098 6540
2386 6540 -3868 -8112 -1857 5088 4482 -1210 -6080 -5524 1634 6414 1738 -7326 -6285 4624 8068
2401 8068 -2548 -10570 -3708 7479 6378 -3966 -8445 -1897 4680 3852 -2270 -5614 -2596 4230
2415 4230 5652 -1778 -8497 -4027 6868 7054 -3397 -9206 -1272 7496 4336 -4944 -6494 521 6222
2430 6222 3493 -3959 -6051 -690 6129 4942 -3235 -7556 -1077 7085 4637 -4797 -7413 1069 7750
2445 7750 3071 -5923 -6702 1526 6727 2190 -5305 -5710 1198 6481 2724 -5365 -6371 1791 7841
2460 7841 2274 -6714 -6313 2699 7426 1166 -6835 -5001 3243 6738 499 -5722 -4281 3318 6482
2475 6482 1287 -6035 -4643 3862 7351 853 -6606 -3949 4815 6892 -330 -6853 -3212 4761 6185
2490 6185 -415 -6237 -2851 5057 6617 -482 -6327 -2947 5097 6574 -1081 -6746 -2371 5613 6085
2505 6085 -2209 -6774 -1480 6186 5070 -2558 -6736 -1247 5951 5147 -2579 -6550 -1026 6351 5077
2520 5077 -3308 -6765 -146 6779 4675 -4034 -6362 470 6828 3749 -3624 -5240 1227 6397 3761
2535 3761 -3583 -5589 968 7082 4354 -3923 -5497 1939 7747 3040 -4649 -5008 2805 7291 2426
2550 2426 -4607 -4263 2284 6488 2575 -4288 -4444 2161 7050 2807 -5147 -4866 3704 7726 1476 -6330
2566 -6330 -3872 4544 6409 203 -4675 -2331 3567 5220 808 -4555 -3707 3447 6924 1401 -6110
2581 -6110 -3947 4777 7082 -445 -6034 -1248 6387 5157 -1610 -5102 -567 4674 5357 619 -4373
2596 -4373 -2665 4177 6404 367 -6069 -1769 7425 6765 -3134 -6972 487 7636 4591 -3101 -3671
2611 -3671 1262 4481 2960 -819 -3274 -640 5438 6293 -1732 -7290 -1198 8177 6081 -4270 -5456
2626 -5456 3246 7456 632 -5329 -2458 3378 5263 2410 -1388 -4035 -1503 4985 5912 -1546 -5938
2641 -5938 1226 8860 3237 -7325 -5626 6200 9140 604 -5009 -1473 3188 2869 1496 48 -986
2656 -986 1283 5617 3658 -4933 -6949 3170 11095 3686 -7365 -4000 6112 5888 -3219 -4203 3095
2671 3095 6252 2555 -1139 -2415 -2752 774 6974 5833 -3291 -6015 3226 8087 -1004 -8541 353
2686 353 11138 6100 -5869 -6133 1308 4251 1810 1273 1418 -718 -104 3552 1351 -5543 -3266 9007
2702 9007 11212 -2752 -10841 -922 9557 3707 -4360 -582 7125 4177 -2681 -2943 -89 480 3759
2717 3759 7910 3409 -7048 -6143 5903 7940 -3123 -5960 6055 11195 -1326 -10332 -3019 7345
2731 7345 5760 798 1190 572 -3237 -1643 3760 2476 -3697 728 10529 5412 -10350 -10679 5734
2746 5734 12456 1237 -6339 1540 5742 -1266 -5569 364 4171 3344 3691 4775 -2475 -9674 -1824
2761 -1824 11238 8265 -5111 -4161 8038 6590 -7715 -8897 5652 12211 3507 -2770 -588 -1162
2775 -1162 -3461 1229 7769 3077 -3676 1089 7866 -1147 -12075 -3345 14040 11626 -4937 -8188
2789 -8188 1987 4481 -3165 -2339 5835 6014 206 -108 818 -5180 -6640 5821 14281 3182 -10152
2804 -10152 -4101 8003 2440 -7886 -1964 11532 9538 -4128 -7349 -1062 907 353 5954 8066
2818 8066 -682 -6867 992 6206 -2700 -7584 5617 16075 3347 -12207 -7705 6130 5812 -1376
2832 -1376 904 6748 1998 -4749 -2165 1120 -1797 -121 10457 9937 -5838 -13250 209 11088
2846 11088 2045 -6098 2179 10944 1569 -10149 -5454 4277 4810 2799 5056 2076 -6587 -6904 4296
2861 4296 7459 -2708 -3681 8582 9633 -6265 -13936 86 11964 5840 -2885 86 2753 -2562
2875 -2562 -4946 2022 4598 380 1603 7628 1750 -11306 -8368 8494 12904 -884 -7002 2626
2889 2626 6556 -3445 -8532 1473 8713 4609 39 404 -2275 -6852 -526 9445 6218 -4802
2903 -4802 -3198 6566 3558 -9378 -7589 7975 12825 251 -6719 -1735 2108 -1499 -720 4966
2917 4966 4096 -1579 -139 3593 -2495 -8678 224 13125 7864 -7274 -7633 3713 5259 -3302 -3703
2932 -3703 5762 7655 -106 -3843 -1626 -1697 -1348 5339 9390 264 -8041 -1917 6805 1249 -6957 -645
2948 -645 10997 6885 -6262 -7803 685 4772 1280 1382 3540 -208 -3289 40 2736 -2396 -3806
2963 -3806 5216 10224 -132 -10862 -4337 7200 5438 -3089 -1953 4765 2868 -3583 -3561 489 936
2978 936 2012 5108 3585 -4900 -6693 2819 7672 33 -5418 2075 8224 776 -7705 -3787 4921
2993 4921 5854 832 -730 -31 -1721 -1376 2576 2761 -1838 -1058 5594 4547 -4929 -7828 2339 9031
3009 9031 2351 -4648 -1846 3276 1370 -2752 -1422 1624 1752 1683 1675 -1161 -5321 -1806 5900 5250 -3198
3026 -3198 -5071 2714 5205 -1880 -5885 -55 5834 3317 -1915 -3062 -1236 275 1757 2954 -248
3041 -248 -2652 515 4489 698 -5373 -2825 5054 6336 -1398 -5587 -787 3951 1427 -1501 -468
3056 -468 1037 1412 1045 12 -2549 -2267 2462 5362 716 -5073 -2942 4072 3692 -2697 -4000 1566
3072 1566 4508 690 -3292 -2668 522 2117 2362 155 -2533 -1955 1922 3098 -1412 -4289 132 5222
3088 5222 2620 -4097 -4503 1533 4208 922 -2429 -1478 1153 2121 806 -1578 -2058 244 3451 2436
3104 2436 -2336 -3959 713 4654 1679 -3373 -2613 2385 3686 -104 -2728 -1374 1934 2733 537
3119 537 -2005 -2570 745 3182 1247 -2979 -2651 1853 3671 0 -4234 -2065 2683 3511 -452 -3420
3135 -3420 -1076 2188 2198 -389 -2495 -1690 1729 2900 -346 -3393 -1835 2255 2864 -900 -3644 -799
3151 -799 2928 2441 -1550 -3074 -567 2568 2331 -1456 -2905 -651 2408 2759 -925 -2860 -1065 2804
3167 2804 2457 -1654 -3507 8 3325 1972 -2220 -2981 149 2951 1776 -1816 -3018 -358 2796
3182 2796 1605 -2078 -3013 22 2916 1685 -2551 -3359 250 2835 1059 -2783 -2626 665 2706 810
3198 810 -2346 -2594 780 2745 769 -2885 -2479 846 2819 723 -2969 -2604 1503 2729 214 -2758
3214 -2758 -2151 1247 2585 153 -2708 -1763 1634 2771 399 -2658 -2089 1839 3007 -66 -3444 -1919
3230 -1919 2190 2729 -772 -3632 -1160 2217 2313 -999 -3049 -1261 2015 2140 -780 -2753 -1439 2059
3246 2059 2322 -1151 -3825 -1197 2317 2038 -1550 -2966 -714 2443 1006 -1865 -2295 -541 1666 1520
3262 1520 -1256 -3030 -880 2168 2180 -1570 -3319 -478 3275 1397 -2683 -2777 897 2691 704 -2205
3278 -2205 -1886 497 1790 1265 -1266 -2648 -340 2624 1355 -2595 -3582 1029 3270 593 -3473 -2225
3294 -2225 1070 1954 -480 -2215 -1538 688 1534 30 -2209 -2849 -73 2783 1431 -2903 -3379 1092
3310 1092 2911 -842 -3565 -1093 2754 1935 -1603 -2707 -801 442 1523 404 -1593 -2623 -427
3325 -427 2364 545 -3517 -2099 3154 3628 -1692 -4730 -519 3093 1535 -1406 -1268 200 704 53
3341 53 -68 -1578 -1633 1432 3709 49 -4569 -2568 2760 2713 -2297 -3182 985 2693 -642 -3486 -1828
3358 -1828 604 1398 1070 24 -2043 -3088 105 2798 -79 -3587 -723 4205 1431 -4906 -4393 2298
3374 2298 3883 -319 -2656 -688 468 -929 -564 374 -246 -735 1488 2387 -2962 -5392 -530 5116
3390 5116 2461 -3474 -2657 2796 1850 -3419 -3132 1551 2932 333 -922 -1183 -2490 -2519 1934 3778
3406 3778 -872 -3900 38 3588 -1246 -5989 -1168 5575 3191 -3076 -3932 -292 71 -1288 494
3421 494 2110 -537 -1706 452 742 -3779 -4128 2765 6331 -618 -6401 -1946 2967 424 -3255 -296
3437 -296 4061 1580 -2777 -2184 -559 -1690 -602 4015 3529 -3041 -5017 851 3194 -2249 -4147 2825
3453 2825 6153 -540 -6122 -3409 2076 1489 -438 1680 1566 -2646 -3086 544 850 -2978 -865 5217
3469 5217 3944 -5255 -7577 803 5069 -9 -3157 1230 3143 -2041 -5057 -823 1760 50 1182
3484 1182 3533 -150 -6389 -4422 3359 3866 -2638 -2523 4034 3262 -4945 -6449 1423 5106 1184 -893
3500 -893 621 -630 -4529 -2198 3680 2148 -2241 14 4279 -218 -7701 -3956 5427 6199 -1676
3515 -1676 -3690 934 629 -3688 -3013 2814 3319 -355 -263 1032 -3142 -5786 213 6908 2871 -4462
3531 -4462 -2785 2978 169 -5719 -2802 4992 4746 -2007 -3731 -917 -1390 -2582 1535 4648 709
3546 709 -4117 -954 2402 -2170 -5535 1027 7994 3033 -5799 -4556 1560 1219 -2441 424 4314
3561 4314 1643 -3122 -1784 -54 -2477 -2319 4162 6638 -1337 -7204 -1597 3758 9 -3982 1117
3576 1117 5644 932 -5656 -3508 679 453 -378 2767 2663 -3203 -4887 471 2825 -1823 -2862 3979
3592 3979 5717 -2335 -7742 -1958 4258 1836 -1788 446 2041 -1979 -4025 -196 1480 -760 114
3607 114 3870 2141 -5529 -6324 2057 5198 -371 -3176 1343 3635 -2169 -5319 -818 3578 1817
3622 1817 -137 1142 -827 -4220 -2513 3346 3080 -2033 -1710 2820 2176 -4765 -5123 2431 5524 590
3638 590 -2593 -158 265 -2482 -2117 1859 2070 -776 -320 1841 -925 -5446 -1880 4892 4082 -2405
3654 -2405 -3295 1502 1730 -2792 -2693 2150 3095 -80 -1558 -214 -1575 -2211 764 4184 934 -3420
3670 -3420 -1496 2626 393 -3820 -1146 4751 3512 -2238 -3537 80 1033 -808 273 1583 306
3685 306 -1736 -455 923 -1453 -2851 1875 4566 673 -4652 -2652 2035 1472 -1713 -1137 2222 1428
3701 1428 -1880 -1844 -221 -532 -442 1966 2195 -1602 -3559 192 2822 -393 -2892 122 3816 637
3717 637 -3575 -2296 1262 1829 218 -117 304 -921 -1073 566 887 -1233 -1521 1999 2516 -2044 -4087
3734 -4087 148 2906 1143 -1826 -783 1284 484 -1190 -626 501 190 409 1469 91 -2074 -1710
3750 -1710 1920 2397 -1448 -2187 774 2447 -395 -2779 -812 2003 1402 -469 -724 -731 -444 431 1029
3767 1029 122 -1116 -255 1505 624 -2212 -1836 1543 2522 -416 -2172 -505 1346 632 -787 -444 561
3784 561 551 744 331 -829 -1268 247 2252 687 -1732 -1489 1261 1457 -757 -1833 230 1779 689
3801 689 -999 -1124 -331 567 821 124 -660 -755 845 1246 -406 -1857 -484 1628 1423 -1288 -1889 369
3819 369 1406 630 -825 -1070 41 828 558 -789 -1223 -397 1014 1124 -680 -1647 -86 1798 601
3836 601 -1006 -1172 570 1500 -39 -960 -496 339 1088 247 -700 -734 285 1202 931 -691 -1210 261
3854 261 1735 503 -1456 -1223 775 1238 13 -1197 -858 1025 1006 -77 -922 -653 505 1392 197
3871 197 -1212 -825 557 1406 -216 -1231 -884 928 1200 -211 -1167 -497 721 885 -84 -1036 -476 967
3889 967 1078 -16 -953 -693 887 1432 -284 -1395 -392 990 661 -505 -1334 -121 1263 673 -421
3906 -421 -702 -63 813 1088 -365 -1043 -246 1205 1001 -475 -1039 -163 1211 307 -921 -1004 153 842
3924 842 394 -534 -758 -41 1153 732 -615 -1089 120 1148 495 -1222 -1225 370 1295 262 -932 -729
3942 -729 361 834 127 -793 -242 350 1142 756 -912 -1183 245 1512 523 -992 -892 1034 1621 -121
3960 -121 -1235 -340 673 877 -118 -650 -272 560 1132 405 -541 -782 771 1502 224 -1670 -775 1190
3978 1190 1048 -558 -922 174 995 417 -403 -469 -308 526 892 567 -1306 -709 624 1329 -167 -1527
3996 -1527 -389 1670 860 -982 -1104 847 1383 192 -695 -276 -309 70 705 196 -600 -664 1218 1149 -785
4015 -785 -1561 230 2118 1000 -1176 -936 777 942 -546 -559 226 470 430 423 -39 -1379 -555 1822 1468
4034 1468 -517 -1585 510 1446 -368 -1895 -279 1447 739 -961 -810 -46 -323 310 960 105 -1096
4051 -1096 -653 1343 492 -1791 -1372 1720 2479 -652 -2258 -383 1410 80 -740 567 1206 -74
4067 -74 -548 319 -184 -1114 365 2240 1113 -1744 -1776 1089 1623 -903 -1024 1320 2065 -749 -1702 -259
4085 -259 502 -213 822 1345 118 -1797 -884 1302 323 -1222 -651 2799 1419 -2409 -2566 1129 1901
4102 1901 -153 -795 657 860 -1465 -1047 741 657 -901 802 1875 -461 -3313 -957 2645 1927
4118 1927 -1374 -1050 1757 615 -1986 -1406 1533 1561 114 81 620 -1207 -2495 284 2679 855 -1632
4135 -1632 77 2040 -736 -3436 -782 3175 2078 -1283 -1307 528 -549 -1681 182 2159 687
4150 687 -1228 559 1304 -1941 -3013 962 3957 1004 -2545 -898 1573 -413 -2252 136 3105
4165 3105 1434 -1707 -884 345 -1172 -1262 2019 3104 -370 -2567 228 1832 -1399 -2330 1608 4154
4181 4154 413 -3039 -1149 1001 -114 -722 1605 2613 -892 -2390 625 681 -1647 -1018 3058 3182
4197 3182 -1686 -4014 -167 2045 -320 -1117 1564 2358 -1124 -2837 -450 836 -677 282 2797 1436
4213 1436 -3189 -2940 1209 2094 -954 -829 2700 2496 -2462 -3662 148 1990 599 -192 1815 800
4229 800 -2639 -2139 1159 1776 -933 298 3173 873 -3529 -2966 2282 3144 -531 -882 1283 709 -2300
4246 -2300 -1932 1621 1955 285 7 1716 -946 -3560 -993 3210 2183 -1487 -939 2067 -63 -3400
4262 -3400 -1995 2444 2366 -550 -1085 714 -765 -2569 3 3075 1435 -1312 -369 1701 -1130 -3507
4278 -3507 -386 4281 2000 -2003 -1466 807 183 -1936 -142 2588 1123 -1137 -512 335 -1170 -1981
4294 -1981 1197 4006 529 -2711 -856 1623 -323 -2329 537 3643 1271 -2444 -1467 503 -403
4309 -403 -865 1399 2702 -359 -2517 -379 1527 -981 -1924 1751 3302 -185 -3287 -1108 1562 116
4325 116 -1128 838 2006 -474 -2376 -624 506 -593 -563 2011 2430 -1965 -3303 360 1914 -338
4341 -338 -1182 1370 2246 -549 -2544 -230 1569 175 78 1422 742 -1954 -2006 688 1673 -520 -836
4358 -836 1679 1919 -2092 -3029 657 2012 415 -952 531 607 -1350 -1234 670 907 -334 -391 1283
4375 1283 353 -2303 -1414 1764 1991 -925 -1096 658 866 -1669 -1685 842 1666 -101 -537 175 -379 -1343
4393 -1343 -170 1788 1087 -1137 -923 1300 503 -1875 -999 1645 1936 -487 -1194 97 168 -774 -233
4410 -233 1242 503 -850 95 883 -513 -1626 -27 2189 1001 -1417 -1258 824 527 -1111 -542 1113
4427 1113 781 -405 -803 38 -363 -601 688 1308 -194 -1475 -191 1114 -41 -1176 66 1527
4443 1527 804 -1156 -696 361 184 -192 -90 597 -311 -520 210 496 -405 -781 597 1342 -167 -1585
4461 -1585 -334 1149 264 -647 -159 786 340 -791 -480 -42 378 29 707 473 -625 -771 669 672 15
4480 15 -888 79 934 -154 -1079 -276 535 257 -9 -152 17 -353 -31 107 163 -686 -47 587 532 -779
4500 -779 -849 276 864 123 -464 -350 280 300 -298 -105 127 43 123 547 -201 -421 -254 617 682 -467 -736
4521 -736 416 1041 -190 -724 278 426 418 -211 -309 269 36 140 384 -124 -485 36 378 -84 -555 -233
4541 -233 466 442 -171 -684 -189 760 268 -397 -513 83 149 474 -9 -221 -57 316 375 -45 -605 -233 533
4562 533 230 -168 -525 239 670 76 -345 -276 344 224 266 28 -305 -122 329 612 -238 -396 -119 412 512
4583 512 -474 -204 -90 600 114 -359 -355 16 557 134 -72 -285 103 210 14 -447 -374 71 683 -374 -373
4604 -373 -299 78 182 105 -513 -178 287 144 -59 -424 -371 72 504 31 -212 -448 140 267 152 -41 -16
4625 -16 487 317 -82 -426 -226 453 -31 130 8 52 75 134 168 -696 -387 332 241 -41 -498 -102 769 570
4647 570 -284 -262 37 160 -51 -25 -1 -85 331 247 -68 -533 -128 257 611 -370 -422 150 692 262 -196 -516
4669 -516 138 325 -222 60 -171 -281 106 380 106 -766 -26 378 180 -696 -130 771 664 -78 -443 48
4689 48 497 5 7 393 -2 -69 -68 378 186 -354 -23 992 268 -664 -732 627 387 -191 -429 403 526 -182
4711 -182 -359 80 -13 -270 96 687 -356 -595 150 788 213 -950 -157 580 231 -836 -678 188 198 -278
4731 -278 -318 265 -269 -518 51 295 -127 -337 563 803 -416 -1257 -412 1285 349 -595 -130 571 -83 -650
4751 -650 52 739 285 -260 550 508 -615 -967 258 1255 -146 -995 265 663 -275 -1100 -26 1136
4769 1136 594 -417 -254 587 -506 -805 644 1184 13 -422 204 816 -996 -1155 976 1549 -190
4786 -190 -1261 -81 322 -752 -726 587 1453 64 -716 131 94 -858 -562 1151 1220 -721 -1374 -44
4804 -44 595 -804 -685 1107 1572 -471 -918 27 345 -391 -293 1219 1085 -659 -1116 168 419 -818
4822 -818 -386 1730 1326 -1170 -1552 136 562 -469 94 1061 735 -1332 -1404 454 455 -220 51 1688 574
4841 574 -1831 -1248 765 668 -721 -303 1528 767 -1572 -1317 765 1017 -433 98 1390 -248 -1929
4858 -1929 -806 1123 641 -1048 403 1681 -101 -1993 -955 1507 1199 -24 -111 1089 -116 -1916
4874 -1916 -509 1536 1054 -451 362 1051 -777 -2281 -211 2120 770 -1181 91 1218 -750 -2022
4890 -2022 -307 1879 963 -650 -78 639 -1112 -1707 582 2340 467 -1349 -123 830 -659 -1621
4906 -1621 455 2401 819 -1513 -406 363 -756 -1191 735 1956 135 -1310 -260 536 -1147 -1351
4922 -1351 1416 2391 -232 -1945 -431 1044 -485 -1124 1073 2170 -280 -1712 -170 415 -759 -596
4938 -596 1811 1983 -780 -1974 -49 562 -626 -742 1498 1975 -836 -2166 30 733 -124 -247 1671
4955 1671 1462 -1172 -1964 122 1121 -272 -402 1807 1426 -1836 -1983 334 1588 -399 -434 1507 973
4972 973 -1393 -1664 653 1186 -64 -85 1400 294 -2020 -1572 972 1322 -483 -331 1184 423 -1817
4989 -1817 -1314 962 1357 62 46 887 99 -1885 -882 1368 1278 -484 -434 1172 -57 -1855 -909 2037
5007 2037 1162 -526 -566 888 -43 -1699 -313 1699 1104 -791 -335 536 -355 -1726 -93 1984 1099
5024 1099 -723 -523 806 -332 -1307 25 1814 1015 -749 -558 391 -404 -1539 498 1847 370
5040 370 -1106 -528 517 -386 -1389 536 1724 439 -1088 -620 849 -11 -822 699 1514 161 -1041
5057 -1041 -554 603 -727 -771 809 1344 -117 -1126 -21 840 -29 -871 729 1176 -174 -1347 -567
5074 -567 693 -70 -666 680 784 -642 -1237 148 642 -245 -294 824 796 -618 -1249 -104 985 20
5092 20 -471 755 782 -635 -1284 362 1040 -155 -188 764 720 -605 -1440 266 788 -197 -695 573 623
5111 623 -825 -1094 458 908 -114 -387 425 208 -851 -698 255 540 -362 -258 516 415 -871 -843 745
5130 745 727 -245 6 404 215 -471 -298 976 333 -255 -289 430 126 -562 -81 627 645 -121 -88 432 146
5151 146 -578 -438 297 274 -349 0 253 -11 -515 -382 531 402 -433 -163 306 157 -423 -264 306 295 -537
5172 -537 -229 247 -7 -193 -109 287 -35 -489 -90 510 -195 -546 263 594 61 -617 -325 456 84 44 2
5193 2 94 314 -501 -129 368 91 -413 130 280 227 -417 -104 313 105 -142 185 445 123 -284 235 356
5214 356 273 -184 211 293 171 -504 -71 205 197 -302 341 177 -113 -319 154 179 -106 -129 211 194 -292 -221 65
5237 65 287 -84 -69 40 53 -102 -255 25 41 133 -559 4 114 -167 -93 100 142 -193 -112 -42 293 -92 31
5260 31 121 68 -49 -51 108 -140 85 -189 109 74 13 186 204 -29 -38 -169 411 -336 -98 -97 -102 -72 -164 19 -104
5285 -104 59 91 9 156 6 148 -576 142 164 -145 -32 87 -300 69 89 -31 63 -83 -73 116 -118 -51
5307 -51 95 -89 -52 -205 155 58 52 7 -229 -187 268 -55 46 32 -26 -10 -185 123 12 292 -70 100 92 -75
5331 -75 77 79 157 22 -77 174 -67 -489 -138 -190 8 -300 -245 88 92 -505 -211 153 111 -312 -92 186 -115
5354 -115 -369 71 84 -64 -280 83 192 56 -91 -206 -15 -176 -116 -30 136 22 -240 -3 44 -21 -336 -98
5376 -98 157 -182 -239 95 546 60 -296 47 159 -430 -203 -202 208 137 -141 81 132 -282 -486 -32 337 -93
5398 -93 -312 184 167 -240 -639 292 357 64 -246 162 407 -269 -305 93 166 -40 -358 192 -17 -375 -357 444
5420 444 494 -192 -246 131 230 -340 -192 176 455 -311 -306 -108 262 -124 -167 687 507 -493 -187 256 390 -512
5442 -512 -339 528 323 -481 -519 7 210 -514 137 837 -59 -655 -255 111 -66 -524 240 458 471 -1077
5462 -1077 -618 132 280 -411 -66 772 77 -607 -406 403 332 -290 206 647 -68 -1028 -151 527 324 -558
5482 -558 35 693 -284 -1001 -402 696 167 -454 150 250 -294 -943 -107 971 28 -555 12 770 -407
5501 -407 -1095 -42 1135 233 -666 -155 684 -458 -928 133 885 151 -598 -237 196 -644 -1031 175
5519 175 1403 113 -707 45 332 -290 -918 574 984 10 -638 264 -64 -513 -575 299 880 -410 -808
5538 -808 491 393 -728 -675 792 1202 -168 -1041 -147 343 -715 -478 979 630 -301 -725 551 221
5556 221 -871 -184 1070 1033 -770 -1232 78 163 -568 -464 950 888 -792 -1105 -82 400 -676 -8
5574 -8 773 724 -1096 -1000 541 322 -366 -145 877 365 -1061 -975 482 488 -345 -2 902 381 -1128 -1139 498
5595 498 438 -548 20 1224 278 -1607 -1092 789 760 -413 -538 1248 -52 -1529 -822 734 434 -233
5613 -233 117 409 -217 -1444 -412 1089 611 -788 -223 765 -288 -1666 -381 932 803 -409 -566
5630 -566 430 -731 -1136 -69 1187 413 -466 226 729 -348 -1400 -48 1639 843 -1058 -188 515
5647 515 -503 -1259 222 1427 474 -615 -75 97 -1010 -805 421 1728 122 -821 -97 712 -428
5664 -428 -1323 420 1237 328 -1003 -310 206 -350 -556 778 1421 -278 -1098 -106 265 -739 -854 824
5682 824 1426 180 -850 -50 444 -41 -518 492 1131 -180 -1279 12 597 -677 -136 1375 1064
5699 1064 -1087 -1252 -175 786 -168 -349 1144 765 -850 -924 87 560 -310 32 889 430 -1003 -1046
5717 -1046 457 686 -235 -49 993 426 -1067 -1015 528 604 -29 -289 724 227 -1138 -703 838 345
5735 345 -169 -59 779 30 -1214 -657 697 623 -172 -101 437 121 -962 -667 771 830 -212 -136 266 -364
5755 -364 -967 -180 607 773 -269 44 648 -53 -903 -286 1095 751 -429 -538 480 -245 -857 -199 425
5774 425 443 -316 -148 451 -531 -859 -50 1209 400 -677 -177 154 -215 -571 -63 470 447 -432 -402 56
5794 56 -123 -392 515 813 -57 -695 -127 696 -300 -674 496 843 377 -476 -17 84 93 -644 36 435 313
5815 313 -305 96 353 20 -56 251 457 113 -538 51 471 -173 -287 390 413 -201 -405 -138 214 -157 -74
5836 -74 441 116 -527 -165 74 454 -194 -681 215 510 -193 -665 -101 31 189 -81 227 73 -316 -5
5856 -5 187 290 -379 49 254 -105 -327 -513 301 813 157 -459 16 276 -393 -125 269 254 106 46 36 -111
5878 -111 -295 -113 484 289 -323 -98 753 526 -234 -356 329 328 -99 -114 -72 70 135 298 375 -99 118 85
5900 85 459 37 -206 -216 280 305 -571 -566 -123 204 5 -308 255 71 -140 -146 49 275 -86 11 345 -22 -288
5923 -288 8 332 325 26 -51 7 160 -153 63 -141 -118 -130 203 119 107 -172 234 191 -460 -188 280 268 318 -325
5947 -325 3 516 194 180 80 45 56 -23 106 24 28 118 186 158 -126 -311 -37 112 145 -244 -251 -114 163 -154
5971 -154 -98 -7 -99 130 -126 -356 -274 218 241 260 -130 -92 47 370 68 -82 100 270 259 -310 147 13 154
5994 154 145 -203 -293 168 95 387 128 -93 127 90 436 -126 -265 300 193 -16 -161 -179 37 234 -92 -157
6016 -157 -131 126 176 171 84 -313 -86 432 239 -243 -344 201 122 -32 -107 -198 71 89 141 11 -317 -107 246
6039 246 -44 -169 -96 219 -14 206 3 -29 8 281 276 -248 -165 249 -1 85 180 326 152 -124 537 -75 -6
6062 -6 70 244 88 -259 309 85 140 152 -131 -106 452 148 289 -90 -264 -89 130 239 66 -282 201 537
6084 537 33 -576 59 422 146 -391 -365 107 138 63 195 -171 121 -44 37 11 -44 65 50 576 -150 -342
6106 -342 26 586 245 -23 -24 -91 122 -27 -69 -44 145 153 262 -36 -696 -493 492 400 -321 -363 302 671 -160
6129 -160 -516 91 398 140 -96 -9 506 -122 -152 445 218 -204 -322 415 622 -677 -473 427 481 -24 -436
6150 -436 -4 12 62 -315 4 603 70 -136 222 -95 -532 -75 502 562 -271 -433 392 587 -466 -218 303
6171 303 838 -133 -592 118 -77 155 33 322 94 -528 -146 410 100 -293 -249 644 483 -469 -531 -96 431
6192 431 -192 12 299 340 -215 -242 328 -169 -454 360 895 -68 -767 -85 393 411 -458 71 788 39 -583
6213 -583 -399 236 241 -176 339 564 -219 -585 -291 707 175 -163 478 840 32 -540 -141 475 362 -42 146
6234 146 485 -191 -583 -127 200 107 -319 323 515 -669 -944 332 1052 49 -260 132 778 -90 -587
6253 -587 -97 594 207 -16 189 436 -388 -372 377 739 -188 -556 47 483 -238 -853 146 1169 349 -285
6273 -285 -312 127 -259 -314 706 889 105 -553 298 -9 -663 -370 624 943 -167 -898 48 316 -645 -411
6293 -411 836 905 72 -538 4 -214 -342 -133 867 588 -757 -891 490 282 -360 -157 968 953 -298
6312 -298 -675 -125 271 -176 186 822 24 -544 -399 1 100 -453 2 1145 568 -1234 -1003 422 363 -432
6332 -432 -175 387 391 -422 -884 190 85 150 202 346 163 -1031 -451 904 271 -357 225 885 375 -948
6352 -948 -703 348 552 -183 9 648 -215 -814 -371 480 138 -553 115 871 -284 -988 -205 702 438
6371 438 26 -105 491 -151 -530 -306 213 316 -288 273 455 -539 -637 248 1055 158 -869 -209 421 -85
6391 -85 -878 77 824 570 -488 -352 -43 -462 -466 367 690 -204 -646 352 272 -356 -797 150 1179 22
6411 22 -721 -117 356 -36 -243 165 367 85 -845 61 -101 -552 -312 741 571 -361 -591 -157 498 -415
6431 -415 -505 513 673 -111 -614 -303 266 -93 65 459 358 -477 -595 42 33 -392 -173 655 475 -227 -586
6452 -586 -72 20 -195 -284 342 61 -384 -85 138 -89 -78 -7 529 -4 -891 -573 392 423 42 -406 311 414
6474 414 -193 -541 192 502 -126 310 291 -67 -462 181 671 353 25 2 531 142 -612 -597 514 486 -250
6495 -250 -119 5 48 -63 208 368 152 -228 -22 422 -240 -621 3 634 323 -298 -296 332 230 -298 -258
6516 -258 -173 176 -157 -334 -308 -77 -388 436 320 -71 -275 326 388 -13 -662 -134 460 284 -194 -462 -147
6537 -147 53 171 9 -132 -47 -345 -188 234 -220 -335 247 564 -94 -383 -335 167 94 64 -224 277 308 -59
6559 -59 -47 -184 167 -3 463 282 -281 -507 314 18 -12 -56 254 445 40 -486 -160 44 118 9 91 98 -213
6582 -213 -14 267 -130 -317 123 214 241 -327 -389 84 411 190 -269 -165 16 1 -81 -196 -541 27 408 106
6604 106 -130 -534 116 163 158 -310 -217 -13 101 201 -162 85 605 215 -42 -352 -146 447 95 123 -60 -525
6626 -525 140 186 18 -529 -124 318 470 14 -90 -294 389 263 -65 -134 -207 135 123 -72 -424 -408 230 168
6648 168 101 48 84 61 5 -156 -374 -232 124 166 48 -100 -51 348 -45 236 -159 79 170 145 -13 -229 -193
6671 -193 114 145 177 -319 -76 434 -236 -264 -54 -83 293 -138 -75 -336 110 100 111 -149 -200 -1 47 166 186
6694 186 -232 -147 -79 118 -26 -279 232 57 286 -143 -426 -30 141 -95 -198 -385 -40 248 -122 -306 -259
6715 -259 -8 37 -87 -108 70 72 266 -119 -371 -207 39 -12 -134 -420 -341 273 165 -115 -23 -357 376 306 1
6738 1 -299 104 4 60 -18 -116 -386 -58 151 27 -598 -128 163 -49 -158 -744 217 172 132 -369 -293 -22 181
6761 181 139 -233 82 -249 200 435 60 -161 -208 297 253 -240 -359 309 113 101 -193 -189 80 -52 112 -284
6783 -284 -375 17 253 28 -239 -163 75 596 350 -314 -347 215 -71 125 -216 -298 -200 -349 -70 -409 65 -249
6805 -249 177 -204 -220 -430 133 260 -219 -170 70 257 273 -402 -700 -67 173 -82 91 -135 193 -27 234
6826 234 318 -604 -306 103 330 -134 32 -167 262 277 -6 -155 62 149 -427 -288 34 -192 146 257 95
6847 95 -344 -479 105 480 -330 -232 -79 439 114 -337 25 358 499 79 63 -492 -151 -58 8 160 -212 -33
6869 -33 -87 85 -223 -717 17 384 41 -206 -56 127 -119 -27 66 202 9 -239 223 -100 -438 -154 618
6890 618 409 -329 -495 96 129 -303 -461 288 597 58 -225 -9 199 -49 52 166 43 -468 -173 383
6910 383 -85 -260 -136 439 552 -134 -647 -32 187 -26 7 97 71 -47 -256 -94 -126 -303 73 492 551 -723
6932 -723 -526 358 11 -472 -101 417 251 -301 -285 39 -142 -63 376 441 -270 -550 -27 684 -24 -386 -442
6953 -442 535 180 -738 -539 429 447 10 -90 179 -271 -471 -105 235 111 -211 256 271 -109 -568 -229 372
6974 372 168 -418 7 374 141 -735 -194 303 170 -433 378 243 -489 -217 78 545 -314 -682 -10 536
6994 536 -271 -828 173 558 131 -169 -218 180 -310 -193 -152 48 -87 -302 225 -176 -884 -552 427 714
7014 714 154 -578 -31 383 -129 -685 42 304 28 -273 41 -11 -227 -137 729 587 -482 -301 109 20 -376
7035 -376 -367 575 354 -259 -343 -232 199 21 -34 336 217 -36 -133 -109 -9 -307 -210 345 475 -758 -608 39
7057 39 641 -109 -189 5 169 -386 -63 -95 33 24 148 641 64 -579 -277 705 109 -261 -286 576 401 -478
7079 -478 -388 185 -114 107 -46 258 -173 -325 90 283 -5 -196 301 687 -85 -588 -414 817 441 -44
7099 -44 82 124 148 -770 -298 3 155 -2 69 -65 -414 -588 -179 628 240 -559 -6 213 71 -849 -328
7120 -328 373 355 169 67 487 -79 -376 252 335 -325 -224 210 72 -541 -584 84 456 270 -75 -385 325
7141 325 -6 -265 0 392 -106 -87 164 106 -239 -96 537 458 -15 -732 147 440 -503 -610 109 263 126
7162 126 -157 74 201 252 -42 434 283 -95 -253 24 154 -211 -96 311 438 95 -254 -152 202 45
7182 45 -9 -152 112 56 -152 80 139 -491 99 411 166 -368 -360 171 334 -144 -160 87 450 130 -152 -207 201
7205 201 -42 285 313 -346 -460 114 197 -18 -317 -276 495 399 -385 -585 -42 -74 75 -111 92 -61 8 -100
7227 -100 6 -140 -1 256 560 16 -189 133 486 115 -260 178 -8 378 -141 -160 121 304 187 60
7247 60 132 -190 -93 97 272 154 -492 -4 322 2 -46 3 252 214 -219 -205 -154 -91 206 -173 -153 -193 204 140
7271 140 245 -286 -121 88 462 163 -209 -112 136 -70 -127 -56 -118 256 66 -220 11 72 -2 275 314 88
7293 88 -130 220 210 31 -68 -73 370 -48 -189 -102 -10 239 -60 -354 -138 -37 59 236 106 -338 -21 57 135
7316 135 -328 -225 102 381 -25 130 -234 -97 211 196 19 -194 93 -57 12 -6 -400 101 135 399 -110
7337 -110 -353 325 257 -207 -136 -23 273 7 75 -95 -46 326 36 434 -42 -338 52 162 179 206 -166 96
7359 96 101 73 -143 -147 346 213 219 -168 171 2 356 294 17 -180 -137 48 -157 105 -28 194 -104 -2 -443
7382 -443 -279 174 332 62 -151 -56 299 210 214 -79 -358 131 105 134 -130 -79 385 118 -332 -59 43 254
7404 254 153 -310 -104 -218 2 132 22 -123 50 97 452 207 -140 20 477 175 -86 -41 142 27 66
7425 66 -119 -140 85 89 286 2 -87 12 60 396 -81 -233 276 161 21 -159 -460 -3 464 6 -68 103 90
7448 90 155 -271 -127 -407 39 378 -45 -111 -156 307 236 204 -251 -85 517 278 154 198 46 153 181 51 112
7471 112 -6 120 107 109 -233 -198 306 109 -210 -236 -171 18 381 -241 -165 258 80 -124 -89 -253 -197 32 728
7494 728 -83 -666 -94 366 174 -113 -134 262 -32 288 -340 -289 -316 -125 -58 159 -87 15 219 345 29
7515 29 -299 32 448 112 -10 -137 152 148 -242 -24 58 72 257 -19 121 -188 160 31 448 41 -333 98
7537 98 431 315 -294 -14 562 113 -12 -253 -131 184 193 -59 101 173 75 -106 36 -80 -17 41 35 160 -337
7560 -337 -367 131 254 -119 -67 162 45 -285 -198 -116 13 8 635 294 -234 -416 289 291 67 -297 235 299 88
7583 88 -392 -104 60 145 -152 -118 167 -45 -104 202 227 -32 -12 170 284 -104 -214 -46 351 64 -277 -187
7605 -187 95 -85 32 109 -39 -263 48 173 194 -183 -113 359 250 -359 -304 -90 43 -225 -377 38 284
7626 284 -15 -96 7 -101 14 351 306 -15 -75 -25 56 -95 -408 27 525 376 286 -227 -38 -226 -133 123
7648 123 173 513 -1 -174 -12 -218 -409 -35 295 445 -220 -405 181 397 57 -102 321 116 -160 -117 -117
7669 -117 -75 225 249 302 -174 -195 143 40 122 -532 -170 556 108 -330 -263 59 -8 -22 246 255 79 297 -86
7692 -86 38 -262 2 274 272 -322 -583 -124 123 480 -241 -146 320 148 -540 -249 59 193 248 433 89 -275
7714 -275 -441 403 453 -166 -162 51 370 -192 -374 -247 307 280 -76 110 1 101 -354 -311 74 -83 -10 520
7736 520 331 -318 -313 320 534 55 -218 74 41 -360 -306 -54 133 -79 -19 -148 -141 -307 -53 293 -115 -544
7758 -544 -390 277 70 -427 -477 281 573 -89 -160 38 -140 -126 110 167 36 118 101 365 -124 -516 -164 477
7780 477 463 -446 -395 -62 230 -253 194 259 431 -117 232 -91 -16 -219 297 368 -25 -190 -167 424 -170 -141
7802 -141 -109 603 290 -184 -523 -198 -24 218 103 63 37 -217 187 -16 85 -382 287 387 103 -533 -172
7823 -172 262 218 -291 -182 216 -15 177 6 -324 274 15 7 128 -115 -518 175 446 -213 -318 78 137
7844 137 260 -449 -511 280 115 155 -74 272 -186 -100 86 360 -359 127 322 459 -49 -404 -196 249 -14
7865 -14 -189 -252 282 -37 -90 116 -140 -126 283 76 -47 -52 -90 211 481 -258 -392 -5 321 -2 -334 -29
7887 -29 226 280 -187 -268 -383 -114 31 120 -229 -483 -391 54 64 -451 -519 417 211 -4 -155 -9 173 142 -73
7910 -73 -140 -376 -124 -52 -320 7 -186 -99 268 -41 -458 -235 -42 225 -358 31 -236 -28 66 -368 -424 224
7932 224 61 290 223 -307 -110 175 306 -72 -213 -267 139 74 -151 -456 -48 160 152 -430 -261 -89 223 -274
7954 -274 -90 -386 -181 -62 410 -243 -142 -56 318 88 -492 -314 104 -20 136 -570 -396 -75 -89 302 67
7975 67 -149 -30 288 243 -233 -344 127 -47 -135 -191 -137 48 351 82 -224 -245 -167 314 139 -72 -201 -4
7997 -4 356 -349 -140 -216 66 123 -91 -38 -172 394 254 -21 -102 30 50 182 -189 -453 -111 91 219 60
8019 60 -108 -305 -14 121 -560 -563 304 161 76 -122 20 96 228 17 181 -157 -91 237 -66 198 -225 -298
8041 -298 407 73 -40 -269 44 160 359 -5 -287 -121 322 -82 101 -290 94 -93 37 -336 -406 -153
8061 -153 -168 174 -320 -115 -331 323 -86 -142 102 57 184 90 -125 -403 37 133 154 -161 -82 -147 156 -62 1
8084 1 -409 -132 205 131 -543 105 91 376 39 -27 -192 -65 -1 -1 -433 -428 68 73 176 -242 -273 107 34 -83 -277
8109 -277 -196 2 1 -86 -109 137 117 144 77 -227 -215 73 197 94 -326 -103 -11 30 109 -141 108 114 13 20 -121
8134 -121 -262 -58 71 7 -266 45 -122 323 -258 -484 -184 -14 -28 -417 -349 -22 119 -20 -390 -538 1
8155 1 57 -144 -97 -190 120 146 392 -103 -256 -94 298 -143 -55 130 244 108 81 -250 -91 13 196 -214 -169
8178 -169 77 -147 278 -20 -225 -157 125 246 143 -446 -80 216 -101
8191a01
$$ Imaginary data points
##PAGE= N=2
##DATA TABLE= (X++(I..I)), XYDATA
0 0 0 0 0 0 0 0 -3 8 -8 8 -8 15 -16 16 -24 24 -32 38 -40 51 -61 67 -78 92 -106 119 -135 154 -174 193 -220
31 -220 248 -275 308 -342 381 -425 470 -521 578 -641 707 -780 868 -962 1066 -1187 1331 -1486
49 -1486 1675 -1900 2172 -2513 2951 -3540 4371 -5637 7786 -12116 24247 -125876 -464663
62 -464663 -116588 238005 113763 -137042 -35526 122659 16606 -148532 -109984 -45451
72 -45451 -34544 92046 239974 46062 -313454 -267451 140509 231602 -94411 -197803 116719
83 116719 240618 -89599 -329891 -119003 154913 142940 33600 5832 -73090 -172635 -63654
94 -63654 129201 57845 -135498 -22800 235625 102551 -297366 -302773 122873 310174 44630
105 44630 -161274 -42920 58386 -45183 -99192 1306 50533 28768 85329 95720 -123325
116 -123325 -289604 -53199 280836 182510 -163830 -168763 113763 126340 -155284 -210226 63640
127 63640 220698 81063 -71636 -92977 -101269 -71785 83446 166372 -1623 -147611 6101
138 6101 166052 -26745 -267220 -86165 272043 236099 -108205 -215717 -17074 90731
148 90731 5879 -22919 43601 42599 4924 33369 5730 -136474 -130076 135545 274123 20861
160 20861 -239906 -101934 160052 97622 -125724 -84671 138069 156503 -29865 -123744 -67765
171 -67765 -4899 56913 131304 79007 -97779 -127208 62597 135783 -57539 -160240 59781
182 59781 246600 66775 -199603 -150701 81141 135770 24980 -22393 4991 1315 1125 30487
194 30487 -9109 -82666 -603 179657 141947 -121412 -207654 28976 205341 61237 -118571
205 -118571 -36728 124414 83554 -66301 -89982 2030 74321 99400 73017 -35464 -120445
216 -120445 -24588 140239 103670 -84409 -91864 110103 168097 -37156 -174872 -30103 156609
227 156609 124212 -20971 -66270 -14389 30812 50234 35631 -24255 -42078 58641 136610
238 136610 20276 -146622 -85740 134242 173571 -17308 -125958 -4822 118531 57683
248 57683 -57070 -49805 41331 92848 68398 -5210 -75482 -48755 79543 140325 22383 -103944
260 -103944 -29265 128856 104105 -68473 -104503 53993 157294 64708 -66580 -64563 28787
271 28787 87201 66892 362 -44427 -304 93724 91639 -36076 -101376 22828 160631 94630
283 94630 -77908 -94142 54446 131915 40772 -60076 -32700 62004 96455 37704 -43563
294 -43563 -54930 32672 121283 80014 -52076 -83977 43946 138460 50548 -81874 -52031
305 -52031 90811 127600 13686 -77642 -29199 77760 105617 32620 -46858 -35417 56392
316 56392 110026 40550 -62804 -42562 84690 131101 20499 -84848 -29319 100219 115053
327 115053 5899 -65283 -7010 89906 95152 7390 -56617 -11826 87913 107886 12427 -70491
339 -70491 -18794 98787 111536 -2236 -75290 -860 109682 95717 -17860 -68352 11276
350 11276 106379 87918 -14946 -63069 8630 102493 89425 -16089 -66325 12959 111716 87102
362 87102 -27504 -67460 24477 116715 78926 -32614 -59768 32434 113301 71332 -32586
373 -32586 -54398 36521 113412 69725 -35068 -53784 40999 116543 65896 -40217 -51202 47925
385 47925 116996 58747 -44293 -46535 54669 115429 51080 -47052 -41715 58764 113076 45645
397 45645 -48829 -38204 62988 112005 39535 -52232 -34273 68014 109870 32432 -54300 -28692
409 -28692 72902 106727 26588 -55044 -23453 75828 104421 21645 -55897 -19335 80679 103050
421 103050 16671 -57041 -13707 85414 100817 11044 -56881 -7650 89240 97569 6434 -55759
433 -55759 -2480 91330 95316 2772 -56828 1255 96213 93970 -3968 -59050 7654 101063
445 101063 88001 -11612 -55695 16225 100857 79690 -15449 -52060 18883 98746 77890 -16120
457 -16120 -52878 19103 100861 75947 -23025 -54082 28840 106340 66635 -32806 -48559 38034
469 38034 102548 57476 -29806 -39658 36509 94361 56634 -26338 -41184 37389 102982 59372
481 59372 -38532 -48164 47814 110990 48484 -45440 -34017 60081 98127 31605 -39805 -20075
493 -20075 58041 91934 38603 -35197 -32835 49337 102150 45014 -45539 -34302 67222 105328
505 105328 17904 -61658 -14687 85184 91819 6865 -46851 -7143 62045 76021 23593 -31301
517 -31301 -16544 58441 90908 18928 -63141 -24157 89685 106350 -1939 -70264 -1236 89430
529 89430 68741 -14832 -34469 22490 71253 57111 -52 -40436 -9505 71095 96324 14036
541 14036 -64593 -14118 91598 82274 -28557 -59146 39755 109378 46821 -43323 -38366 31845
553 31845 71297 52731 7592 -23507 -1874 58289 67411 -10058 -58249 20861 117396 69750
565 69750 -58910 -70393 44731 102232 31911 -35148 -6711 47591 47869 12731 -16000 -19200
577 -19200 22558 83329 71547 -29412 -79162 12966 109430 54325 -56547 -32848 80049
588 80049 86862 -21406 -69215 3123 74549 66237 23051 -11316 -27894 457 59074 57645
600 57645 -19454 -39396 56498 110115 4359 -103518 -33454 106929 103164 -12511 -49015
611 -49015 15062 46725 14838 -3840 7267 16050 37608 66104 26234 -68139 -65429 64630
623 64630 128023 19587 -79575 -10183 89306 39152 -64565 -39174 66873 87293 22006
634 22006 -21978 -27572 -23280 16681 74631 53603 -33042 -36760 58583 70517 -48866 -91893
646 -91893 41433 144138 53718 -75806 -55805 34320 43090 4493 12244 31716 15667 12430
658 12430 27808 -10230 -66757 -8921 118783 107940 -47621 -104604 15729 93694 8397
669 8397 -61139 16594 96777 43592 -43878 -46119 -8974 12162 50665 80817 18359 -72425
681 -72425 -39147 66170 49318 -61473 -44217 98154 116766 -37730 -121985 -22490 77887
692 77887 49031 -519 12619 16216 -17550 -13603 18176 -4803 -32428 39787 116018 29758
704 29758 -117859 -89154 71548 104507 -12309 -51995 37844 67032 -22624 -71447 -13018
715 -13018 40806 42026 47248 37306 -40507 -90298 -3873 95411 42567 -58892 -12219 94635
727 94635 43358 -101615 -94413 55453 112803 27261 -33075 -13511 -9610 -27773 4684 41582
739 41582 8606 -17238 41457 64221 -47294 -127095 -13189 132932 83213 -62130 -64664
750 -64664 35567 34209 -47737 -42731 39430 59696 18923 1042 -15915 -65157 -50881 61209
762 61209 107141 -1692 -85500 -5077 75123 -7051 -101016 -19700 111261 83231 -40519
773 -40519 -70565 -16458 3748 3955 36701 41629 -15667 -32524 24780 24406 -65454 -70479 66459
786 66459 131984 5725 -114725 -53404 53475 32304 -34518 -7419 50182 26655 -26146
797 -26146 -30125 -24631 -33111 11430 86716 55485 -68999 -94025 19219 69919 -21499 -68978
809 -68978 26741 95492 9028 -91245 -60868 19749 35856 21219 22916 -3515 -49948 -29842
821 -29842 31720 15166 -52765 -20507 84246 68920 -72598 -117076 2543 87370 26448
832 26448 -41719 -10794 26434 -5637 -36193 -17174 -2129 -867 33002 54443 -16060 -99668
844 -99668 -49914 68070 64543 -41711 -57933 34278 54352 -39595 -84950 -12082 54589 35630
856 35630 -3852 -18631 -37047 -42229 5829 44939 229 -50238 -3689 59908 4588 -94806
868 -94806 -64717 57402 80876 -13767 -64987 -20173 15286 -5804 -19367 -3295 2225 1790
880 1790 19009 8264 -52254 -70424 13673 82447 21465 -72303 -47762 37991 30915 -46437
892 -46437 -52418 20133 50979 6351 -34536 -37159 -26355 -1905 33556 25296 -33607 -50627 10750
905 10750 42195 -24388 -76368 -11744 71079 37157 -56557 -67448 -1964 29043 3109 -18197
917 -18197 -14141 -8912 -899 7529 -15382 -51122 -28033 43752 50942 -33495 -81406 -18233 49442
930 49442 16201 -49069 -35944 22868 28879 -17497 -43892 -29028 -911 21393 21886 -14884 -51943
943 -51943 -27906 29835 25509 -38302 -53033 13353 51589 -4830 -66268 -41649 22757 32788
955 32788 -6794 -32796 -24937 -4259 9793 1442 -27772 -38107 477 39079 7604 -58116
967 -58116 -55739 15843 46192 -8136 -56060 -27899 22592 17335 -26259 -42520 -17765 13644
979 13644 19667 -7609 -42142 -40678 4793 33744 -2859 -52405 -34884 24696 29952 -28457 -58825
992 -58825 -16360 31772 19062 -27735 -43814 -17753 12865 14307 -14356 -39131 -24325 16922
1004 16922 24033 -21427 -55397 -21971 31872 25104 -31804 -52833 -11226 27236 9172 -32962
1016 -32962 -40104 -6799 20462 8247 -28307 -43874 -15227 22830 16547 -30100 -49863 -11527
1028 -11527 28613 9537 -40322 -45300 -99 28088 987 -40358 -39677 -1631 22186 2014
1040 2014 -34745 -39282 -4425 23610 3216 -39349 -41821 1233 28806 -369 -44111 -38941 6121
1053 6121 26557 -5494 -42482 -33366 6753 23399 -6818 -41481 -33448 7547 25091 -6241
1065 -6241 -43790 -33759 10382 25286 -10537 -45986 -29898 14028 22563 -15014 -45636 -26740
1077 -26740 14587 20461 -16055 -44688 -25428 14433 19422 -17918 -45220 -23830 16189 18487
1089 18487 -20773 -45468 -21067 17637 16150 -22963 -44735 -18382 18508 14503 -24404 -43398
1101 -43398 -16343 19240 13528 -25597 -43517 -14066 20821 12396 -27596 -42553 -11093 21946
1113 21946 10263 -29837 -41434 -8238 22766 8215 -31273 -40291 -6297 22862 6760 -33020
1125 -33020 -39740 -4482 23441 4244 -34828 -38690 -1395 23259 1173 -36873 -36474 740 21970
1138 21970 -1131 -36727 -34935 1132 21739 -2013 -37423 -35235 2835 22659 -4135 -40508
1150 -40508 -33190 7354 23116 -7986 -40949 -29537 8512 19769 -9522 -38233 -27288 8026
1162 8026 19174 -9141 -39539 -28455 10680 22486 -10777 -42754 -25709 15171 19640 -16908
1174 -16908 -40694 -18178 16045 14630 -18291 -37127 -18766 12747 15703 -13805 -37753 -22345
1186 -22345 14020 18076 -18615 -42456 -15915 22393 14777 -26943 -41703 -9712 19828 8583
1198 8583 -23486 -33223 -11302 12383 8613 -19897 -36626 -13878 20885 16054 -27200 -45739 -9320
1211 -9320 27766 9875 -32688 -35001 2232 20389 -2913 -30726 -26629 -575 17075 6561
1223 6561 -23194 -36025 -10903 22324 12378 -29198 -37676 4128 29853 -3085 -43194 -28668
1235 -28668 15002 23799 -7353 -29926 -21330 -472 9579 799 -19937 -26296 -1299 23481 2650
1248 2650 -40939 -38235 13418 35370 -5731 -43382 -22058 16119 11962 -19350 -26813 -6401 10407
1261 10407 8864 -7412 -28406 -29644 2347 29109 5953 -37396 -30336 16631 23857 -22672 -43534
1274 -43534 -2996 33592 11772 -28079 -31304 -7823 7194 8161 73 -15896 -19917 2808 17915
1287 17915 -10208 -43137 -16372 37548 30410 -30188 -49425 -4222 27196 2490 -24728 -11744
1299 -11744 8995 5548 -7060 -16035 -23333 -14136 19045 31319 -10119 -49495 -21585 29270 16994
1312 16994 -33317 -30156 22220 31560 -16716 -43935 -17503 12196 13361 5190 -2992 -19605 -22709
1325 -22709 3634 16541 -13724 -33008 6972 43557 4630 -55240 -39596 23549 35209 -7365
1337 -7365 -24293 -1166 7241 -9445 -14163 -6002 -5475 1555 23594 16642 -32381 -50654 1489
1350 1489 45564 10674 -37512 -15552 29858 11758 -38391 -34325 13212 29274 8220 -7287
1362 -7287 -13689 -24937 -16329 17285 22116 -14626 -25460 16070 29847 -24779 -58693 -6090 52475
1375 52475 27809 -28769 -29308 2754 3302 -12448 -3313 10389 2128 -630 11298 -4456 -42331
1388 -42331 -29021 35663 51589 -10633 -48295 -6415 30092 -3411 -37020 -4541 37208 22073
1400 22073 -15110 -21343 -14336 -13556 5188 33527 18302 -27425 -26449 17991 17898 -32633 -34124 31095
1414 31095 55708 -3706 -51574 -22886 16809 9699 -4418 7836 11033 -8767 -11387 3067
1426 3067 -8345 -27843 3014 50943 27922 -42797 -50067 12391 36109 -6935 -24992 14205
1438 14205 32308 -4795 -33113 -16107 3343 6853 19741 26963 -6768 -42464 -16353 30868
1450 30868 16279 -27981 -10463 43324 30474 -37962 -50837 6239 38860 14132 -5779 2097
1462 2097 -2178 -17077 -6525 12689 436 -10918 18089 38316 -7544 -57560 -24234 43047
1474 43047 38440 -16295 -22657 15308 16593 -20969 -25456 6823 20855 11616 10756 3835 -26438
1487 -26438 -33886 11383 43325 8627 -30019 -2734 34529 3416 -44716 -22339 36565 40508
1499 40508 -2406 -19886 -6576 -4244 -6275 10898 19570 -655 -9072 15428 17574 -25102 -39984
1512 -39984 14734 57081 18733 -35098 -21724 18991 12950 -15437 -6432 21010 18690 521
1524 521 -3843 -8509 -20167 -5133 35351 35142 -14570 -35118 6086 30429 -6071 -31678 5834
1537 5834 43974 19185 -25207 -24178 1618 9563 9403 15806 8400 -13031 -9103 15456 9021 -23109
1551 -23109 -13745 35387 41753 -12736 -43099 -5784 30765 14567 -10914 -59 16587 6969
1563 6969 -6559 -4500 -3509 -3077 14977 32818 9096 -30515 -21772 23604 30147 -8803 -19497
1576 -19497 16276 32563 -1165 -28048 -9631 18012 19280 9947 3843 -6779 -12729 4206 20810
1589 20810 4638 -16916 1614 33042 16570 -28567 -28180 17406 36390 6444 -16350 -3271
1601 -3271 11618 5291 -2730 -499 1912 5837 17918 15819 -11626 -26736 2695 35800 18658
1614 18658 -18338 -14063 20275 22119 -9325 -19130 5635 24091 14880 -192 -7339 -7640 1299
1627 1299 18138 17379 -5242 -13448 10751 26416 1160 -25117 -6491 29891 26721 -7217 -18908
1640 -18908 974 16140 9974 -159 -1964 1851 9196 14438 3369 -15599 -9751 19830 29157
1653 29157 360 -22954 -4090 23686 16317 -10166 -11639 10795 20916 7386 -7705 -8603 1774
1666 1774 14890 17772 3189 -12761 -4613 18572 18994 -6718 -16620 7521 28513 12634 -14422
1679 -14422 -13147 10465 21201 9023 -4912 -5108 5779 14952 10953 -4185 -11019 5062 24498
1692 24498 15312 -11784 -15870 9771 25856 8657 -12922 -6911 14329 18777 2963 -9959 -4704
1705 -4704 10680 18144 8700 -7915 -9965 8147 21541 8753 -12114 -8930 14387 22256 1977
1718 1977 -14617 -4193 16575 18869 1876 -10121 -3090 12401 16677 4302 -9244 -4596 14295
1731 14295 19962 2948 -13436 -4108 17807 19929 -270 -13037 -224 18257 16177 -1542 -10336
1744 -10336 1198 16920 15865 -915 -10992 -449 17327 17170 -1943 -12566 984 19556
1756 19556 15399 -5008 -11918 3915 18897 13023 -5419 -10572 4168 17886 12616 -4813 -10504
1769 -10504 3724 18420 12459 -6117 -11085 5244 19700 11593 -7379 -10326 6784 19491 9763
1782 9763 -7696 -8758 7651 18822 9452 -7795 -8446 8517 19019 8715 -8154 -8138 9573
1795 9573 19603 7671 -9098 -7151 10914 18877 5990 -9249 -5935 11262 17870 4908 -9552
1808 -9552 -5465 11777 17871 4284 -10052 -5046 12475 17492 2806 -10814 -3892 13147 16768
1821 16768 1235 -10796 -2983 13900 16261 824 -10808 -2301 13957 16116 117 -11196 -1985
1834 -1985 15206 15812 -1358 -11344 65 16564 14235 -2720 -10325 1430 16134 13039 -2655
1847 -2655 -9519 1716 15875 13719 -3093 -10612 1954 17515 13176 -4646 -10483 4448 17721
1860 17721 10609 -5852 -8378 5681 16398 9407 -4817 -8244 3795 15303 10926 -4618 -9485
1873 -9485 4641 17363 9473 -8687 -9746 7867 18125 6811 -9333 -6583 8233 14598 4963
1886 4963 -6581 -5589 7013 14772 6872 -8005 -8791 7909 18613 6827 -11050 -7486 11310
1899 11310 16732 1090 -10497 -1629 13086 13119 696 -7366 -3307 8528 14053 5444 -7504 -6707
1913 -6707 9487 16801 1486 -13210 -3120 16782 15766 -4009 -12733 280 13165 10085 -1110
1926 -1110 -5266 -417 7780 9876 984 -9547 -4160 14096 17626 -2382 -16362 -2523 17562
1939 17562 11928 -7357 -9205 6808 13622 3259 -6683 -5190 3046 10424 11273 1053 -10527 -5291
1953 -5291 11869 14344 -4250 -12919 5219 20283 6138 -15022 -9922 10678 15893 3635 -4379
1966 -4379 -2732 1474 5215 6586 196 -6588 1658 16524 11211 -12383 -17143 7409 22798 5687
1980 5687 -13088 -4959 11887 8303 -5756 -6723 3190 8471 8452 4985 -5352 -12839 -1193 17366
1994 17366 12385 -9629 -11395 10912 16481 -6810 -18469 1378 20771 11213 -6417 -7955 -855
2007 -855 1488 4407 7460 1715 -5384 2478 13590 1726 -18564 -8979 20338 22753 -5703 -18723
2021 -18723 115 13785 2084 -7497 1592 10074 5539 408 -1360 -7720 -8711 8025 21974 5909
2035 5909 -17949 -10543 14152 11163 -12422 -11904 14475 20569 -2440 -16886 -6293 4486 4654
2048 4654 6376 7782 -2357 -10119 568 10340 -2835 -14990 3770 26061 10529 -21635 -19634
2061 -19634 9208 16878 -851 -6115 6161 7056 -4220 -6024 -841 -1691 70 14627 16875 -8504
2075 -8504 -24948 -3228 21154 8551 -14153 -3839 18676 9505 -17263 -16539 5373 13343 5804
2088 5804 3619 1318 -10125 -11786 5436 13415 -3325 -10698 9831 19599 -7735 -28917 -7004
2101 -7004 22995 16095 -7730 -8155 3474 -204 -9063 -2207 6635 1946 1328 9914 3956 -19563
2115 -19563 -20045 11483 26220 1380 -18631 -1965 14301 -2131 -19199 -4321 17569 13053
2127 13053 -2467 -5289 -5533 -10688 -3403 15255 13463 -8195 -11119 9041 9433 -16468 -20062 11635
2141 11635 28577 4243 -19357 -10141 4833 404 -4169 5623 8681 -1769 -4321 2901 -4331
2154 -4331 -17284 -4181 24002 19208 -14442 -23202 2572 13757 -5627 -13072 6838 17619 801
2167 801 -13834 -8122 -2567 -2618 6959 16129 2502 -18404 -10893 11057 5958 -15017 -7397 20013
2181 20013 18175 -13516 -24065 -2261 11965 3992 -1215 4667 1365 -9213 -5743 3632 -1953
2194 -1953 -8702 6688 20860 1308 -26012 -16570 13900 15508 -6505 -9515 8110 8199 -9772
2207 -9772 -14078 -1297 4953 3316 6768 5624 -10889 -19655 -971 16737 3241 -14041 -1904
2220 -1904 16236 2567 -22452 -15865 10704 15623 -75 -6697 -2282 -4490 -7274 970 6101 -2291
2234 -2291 -5683 7237 9721 -11789 -22960 -438 22126 9066 -13402 -9723 6480 2727 -10281
2247 -10281 -6625 5800 6362 497 456 -3911 -13131 -8856 11099 15089 -5209 -16181 499 11633
2261 11633 -4340 -18037 -2741 16002 8932 -9003 -10824 -3469 -1058 -142 4852 2856 -7062 -5823
2275 -5823 5281 2129 -13699 -11943 10515 17671 -3616 -19331 -6907 8643 2708 -7405 -2890
2288 -2890 4960 2025 -3454 -3887 -5725 -7065 1918 12797 4758 -13955 -12739 6009 10194 -6740
2302 -6740 -12135 3502 12581 -213 -13089 -8531 1691 4244 2499 986 -4185 -8104 -1379 6309
2316 6309 -1279 -11217 -3174 12261 7355 -12644 -16015 1843 10932 1088 -8608 -4167 2223 -133
2330 -133 -3505 -3666 -4405 -2181 5002 6395 -6327 -14923 -4106 10506 5667 -9845 -9362 4440 7460
2345 7460 -5228 -11500 -3367 5365 4280 -919 -4704 -6853 -3254 3935 4468 -5030 -9326 1357 9371
2360 9371 -711 -13769 -8030 7765 8901 -3899 -10365 -3772 3137 1918 -2922 -5027 -3502 1092
2374 1092 4489 -337 -9769 -8586 3541 9104 -1718 -12104 -5630 6219 4458 -6706 -9162 -825
2388 -825 5403 1555 -5000 -7581 -3990 2235 4715 -1361 -8633 -5946 4519 5581 -5395 -11028 -1928
2403 -1928 8020 3389 -7795 -9353 -423 5410 1629 -4612 -6687 -1710 3635 2895 -4929 -9050 -2352
2418 -2352 6901 4454 -6790 -10121 -414 7316 1667 -7798 -7322 1166 5453 -242 -6967 -6500 309
2433 309 4746 1278 -6139 -8102 -492 5869 1493 -7729 -7883 1809 6278 -725 -8786 -6493 2336
2448 2336 5098 -1061 -7945 -5782 1764 4710 -745 -7858 -6137 2212 5651 -1323 -8888 -5952 3636
2463 3636 5825 -2245 -8682 -4651 3935 4485 -2885 -8148 -3946 3825 4558 -2716 -8036 -4222 3766
2478 3766 4496 -3171 -8238 -3716 4359 4650 -3955 -8833 -2907 4727 3622 -4650 -7947 -2641 4368
2493 4368 3065 -4506 -8282 -2602 4423 3345 -4523 -8438 -2048 4979 3040 -5594 -7858 -1193 5181
2508 5181 2364 -5915 -7791 -735 5131 1906 -5834 -7324 -638 5504 1962 -6166 -7388 328 5604
2523 5604 1215 -6728 -7127 934 5684 439 -6642 -5923 1217 5030 283 -6426 -6151 1060 5519 564
2539 564 -6837 -6141 1783 5723 -433 -7684 -5727 2339 4995 -1300 -7454 -5001 2360 4190 -1290
2554 -1290 -6909 -5081 1703 4822 -982 -7636 -5063 3627 5305 -2501 -8501 -4156 4156 4113 -3296
2569 -3296 -7242 -2607 3258 3163 -2359 -6083 -3553 3383 4549 -2139 -7900 -3719 4704 4637 -3771 -7902
2585 -7902 -1388 5632 2459 -5096 -6435 -337 4303 2236 -3310 -6011 -2526 3165 3566 -2959 -7303
2600 -7303 -1877 6041 3377 -6468 -8551 659 6413 1124 -6452 -5426 533 3127 -116 -3904 -4387
2615 -4387 -582 3985 2419 -4865 -8241 -384 6987 2843 -7181 -7148 2526 5620 -2096 -7335 -2355
2630 -2355 3664 3354 -1400 -4356 -4309 -896 4184 3714 -3472 -6720 578 6717 -434 -8997 -4627 6753
2646 6753 7072 -3403 -7810 -2179 3364 1787 -1484 -2178 -1662 -264 2319 496 -6378 -6241 3889
2661 3889 9020 -396 -10521 -4709 5939 4355 -5479 -5738 2487 4872 -733 -4942 -3934 -1629 1335
2676 1335 4758 1874 -5774 -6849 2265 6040 -3057 -8353 845 9800 2430 -9512 -7784 3015
2690 3015 5284 298 -1869 -754 -1768 -1779 1349 75 -4527 -1876 7834 6686 -6606 -12279 341
2705 341 9976 2573 -6698 -2429 5089 1566 -5881 -4602 935 1927 2242 3994 -1272 -9187 -5297 6296
2721 6296 7071 -4340 -6843 4115 7861 -4675 -11800 -1375 9145 4873 -3023 -2664 -1550 -3370
2735 -3370 -1543 3461 2340 -3586 -453 6628 1315 -11384 -8802 8517 12798 -1753 -9328 -939
2749 -939 4812 -1656 -5674 1089 5915 2015 -352 155 -4319 -8278 317 11172 5868 -7995 -6490
2764 -6490 5770 4411 -8561 -7782 7300 11625 -707 -8251 -3652 -399 -1126 1748 5920 1046
2778 1046 -5825 -1483 4546 -2295 -10257 -97 14383 8100 -10244 -11326 2312 6051 -2234 -2648
2792 -2648 4964 4425 -3221 -4297 -628 -2831 -2931 6461 11474 -1501 -13322 -4508 8799 4008 -7279
2807 -7279 -1753 10932 5900 -8568 -9589 1329 4529 2093 3464 4013 -4119 -8217 342 6142
2821 6142 -1290 -5709 5312 12454 -1737 -15224 -6541 9192 7725 -2605 -1562 4127 -547 -6489
2835 -6489 -2864 3024 896 607 6872 4800 -9398 -13000 2776 12853 2249 -7408 154 8177
2849 8177 -1248 -11344 -3905 8118 6864 197 -142 -991 -6970 -4943 6270 8051 -2582 -4963
2863 -4963 5714 6056 -8287 -12123 3691 14452 4430 -6781 -3413 2268 -1601 -3791 3092 6002
2877 6002 814 -750 3423 -879 -10260 -4975 11130 12235 -3861 -9894 1205 6226 -3399 -7200
2891 -7200 3576 10042 2164 -4759 -2910 -2037 -3518 1953 9462 4532 -6662 -5256 5312 2715
2905 2715 -7913 -4351 10192 11354 -3459 -10582 -1787 4535 825 195 4575 3178 -3155 -2345 1662
2920 1662 -1245 -5114 2902 12188 4480 -10308 -8471 5383 6752 -2511 -3092 5584 6077 -3107 -6207
2935 -6207 -871 1361 1215 5147 5920 -2279 -8973 -1280 7372 2183 -5965 -41 9459 3947 -8719
2950 -8719 -7927 3498 7293 1451 -792 1600 -1204 -3299 162 3286 -601 -2495 4808 7324 -3165
2965 -3165 -10868 -1821 9543 5957 -4081 -2649 4392 2583 -3841 -2977 2412 3762 2214 2568 604
2980 604 -5129 -4674 4675 8232 -553 -5822 1393 6789 -242 -7780 -2083 7673 5922 -1382 -2855
2995 -2855 -650 -148 -119 2968 2511 -1310 -1334 3846 2812 -5341 -5992 4675 9589 793 -6724 -2149
3011 -2149 4178 2088 -2222 -914 2968 2339 514 562 -1742 -3640 487 6727 4025 -4118 -4824 3015
3027 3015 5446 -1451 -4673 1973 7171 2388 -3511 -2976 886 2210 2704 1969 -135 -2221 284 4026
3043 4026 965 -4546 -1264 6361 5300 -3002 -5686 722 5414 1815 -1993 -819 2221 1845 541
3058 541 -701 -1456 -355 2984 4699 -580 -5103 -1355 5158 3673 -2893 -3739 2788 4906 -130 -3853
3074 -3853 -1449 2674 3523 1234 -747 -2122 -325 2871 3071 -1071 -3142 1140 5429 1643 -3751
3089 -3751 -3148 3436 5258 364 -2659 -722 2506 2655 414 -972 -738 1624 3993 1667 -2536 -2769
3105 -2769 1935 5051 1086 -3503 -1699 2975 3563 -913 -2811 -101 2619 2743 -400 -2152 -1197 1927
3121 1927 3178 862 -2510 -1795 2941 3958 -411 -3692 -541 4041 3208 -1442 -2872 219 3220
3136 3220 2467 -475 -2203 -160 3050 2759 -503 -2929 -456 3943 3176 -1263 -3273 405 4001 2316
3152 2316 -1668 -2498 1066 3514 1989 -1402 -2161 1052 3687 2435 -1194 -2496 509 3525 1943
3167 1943 -1785 -2683 949 3671 1514 -2392 -2219 1651 3600 1260 -2321 -2023 1510 3338 1185 -2292
3183 -2292 -2239 1262 3654 1007 -2601 -2085 2001 3811 574 -2629 -1505 2083 3495 347 -2084 -1202
3199 -1202 2644 3349 596 -2222 -1299 1993 3267 686 -2548 -1040 2790 3474 -265 -2490 -710 2922
3215 2922 2938 -112 -2413 -519 2754 3080 -204 -2658 -815 2487 2924 -679 -2824 -667 2919 2589
3231 2589 -1262 -2716 -214 3127 2118 -1299 -2629 364 2905 2282 -1153 -2356 -194 2841 2579
3246 2579 -1520 -2563 553 3539 2223 -2164 -2255 932 3262 1415 -1827 -1826 925 2640 1474 -940
3262 -940 -2005 538 3225 1949 -1499 -2503 937 3592 1289 -2456 -2019 1884 3014 494 -1909
3277 -1909 -1253 1316 2514 988 -1431 -1670 876 3007 1312 -2487 -2312 2166 3805 297 -3212 -1498
3293 -1498 2711 2525 -284 -2008 -30 1951 1929 -105 -1743 -1331 1402 3263 929 -3065 -2340 2124
3309 2124 3323 -489 -3547 -23 3564 1748 -2161 -1997 682 2119 1599 46 -1613 -1493 1080 2947
3325 2947 420 -2941 -817 3675 2894 -2400 -3897 618 4019 1373 -2181 -1138 1315 1194 -82
3340 -82 -214 -525 -149 2081 3146 -668 -4482 -1077 3993 3233 -2253 -2807 1882 3349 -1051 -3186 -319
3357 -319 2582 1943 286 -614 -1840 -1434 1407 3326 403 -2952 54 3821 1074 -4273 -2836 4105
3373 4105 4624 -371 -3386 -293 1554 361 -115 839 742 -435 1145 1342 -2159 -3639 1410 5858
3389 5858 2050 -4384 -2631 3364 2300 -2602 -2211 2939 3490 -629 -1809 -1195 -1240 -761 2756 3635 -1206
3406 -1206 -3676 97 3758 -849 -4735 350 6030 2426 -4601 -4033 1264 1809 -405 664 1928
3421 1928 -395 -1921 561 1254 -1970 -1759 4092 5648 -1630 -6959 -1248 4913 1520 -2749 -109
3436 -109 4186 1120 -3683 -2340 980 835 682 3360 1929 -3785 -4471 1853 4529 -1351 -3366 2574
3452 2574 5179 -1772 -6749 -1114 4733 2712 -899 130 887 -2400 -2849 1693 2242 -1214 -652 4364
3468 4364 2150 -6102 -6331 2869 6820 185 -3567 457 2659 -2500 -4706 476 3689 1220 185
3483 185 1523 -1146 -5434 -1820 5498 4481 -2423 -3236 3138 2465 -5042 -4856 3534 6772 595 -3040
3499 -3040 -960 -755 -2717 -486 4212 2449 -2479 -1350 2552 -658 -6180 -1907 7196 5575 -3325
3514 -3325 -5591 658 1572 -2549 -1665 3675 3676 -1444 -2063 -151 -1962 -3407 2010 6703 1599 -6060
3530 -6060 -3441 3076 1258 -4267 -1013 5962 4119 -3941 -5121 -312 1054 -585 1923 4275 -214
3545 -214 -4733 -1689 2636 -819 -3664 2252 7373 1160 -7362 -4385 3113 2809 -1563 102 3729
3560 3729 509 -3983 -2385 1330 -226 -503 3939 4429 -3313 -7490 -703 5434 1053 -3288 876
3575 876 4629 -628 -6260 -2896 2803 2664 -229 1428 888 -3739 -4405 1494 3984 -485 -2462 2703
3591 2703 3783 -3693 -7148 6 5997 2645 -2674 -697 1554 -2109 -3602 825 3204 422 -529
3606 -529 2469 671 -5339 -4373 3734 6131 -895 -4110 691 2406 -2211 -4797 1098 4758 1692
3621 1692 -1545 -743 -801 -3421 -1311 3738 3069 -2685 -2704 2102 1120 -4490 -3942 3800 5796 -907 -4533
3638 -4533 -1650 1135 -1353 -955 2431 2501 -1523 -1633 575 -1230 -4087 102 5339 3199 -4027 -4212
3654 -4212 1598 2418 -1744 -2257 2796 3345 -1167 -2909 -722 -413 -852 1771 3541 -228 -4265 -1586
3670 -1586 2971 702 -3266 -995 4373 2195 -3892 -4154 826 2308 -283 -287 1275 -33 -2458 -852
3686 -852 1056 -1053 -1883 1415 3473 -499 -5199 -2150 3326 2022 -1981 -1343 2017 1035 -2243 -2113
3702 -2113 549 1216 179 1083 776 -2273 -3154 687 2930 36 -2840 376 2925 -145 -3811 -1875
3718 -1875 2295 2142 -498 -935 -158 -870 -1155 501 915 -696 -777 1825 1292 -2423 -3749 543 3674
3735 3674 684 -2679 -1248 1311 620 -1791 -832 848 474 178 386 -661 -2089 -1023 2004 1923 -1866
3752 -1866 -2318 947 1683 -955 -2883 -323 2306 1012 -1529 -1357 -482 163 369 774 -80 -1279 -203
3769 -203 1259 427 -2387 -1426 1780 2270 -784 -2625 -396 1964 473 -994 -558 97 335 36 -160
3786 -160 -824 -715 748 2028 14 -2329 -1208 1203 1355 -921 -1714 564 1696 128 -1765 -1107
3802 -1107 270 553 453 -557 -847 -847 618 1026 -497 -1806 -113 1911 808 -1915 -1752 589 1641
3819 1641 247 -1267 -950 263 847 355 -966 -924 17 1022 691 -1118 -1672 264 1804 251 -1518
3836 -1518 -1008 639 1163 -285 -1148 -798 841 1023 337 -1055 -1089 476 1171 594 -1239 -1159 426 1354
3854 1354 -214 -1625 -795 1004 1097 -474 -1721 -639 963 691 -585 -1014 -631 582 990 -492 -1398
3871 -1398 -525 829 1020 -211 -1505 -571 1299 1062 -603 -938 -129 916 735 -638 -1087 -58 887
3888 887 818 -641 -1510 -164 1086 947 -845 -1487 -171 1234 807 -1104 -1298 99 1043 467 -672
3905 -672 -1254 -183 831 493 -872 -1299 192 917 784 -982 -1050 232 1281 163 -1317 -1048 641
3922 641 1002 -161 -1008 -648 338 1084 182 -1075 -1019 251 1254 355 -1090 -1196 743 1150 27 -1173
3940 -1173 -667 640 1038 -299 -874 -575 577 947 11 -1026 -935 817 1084 -193 -1179 -399 1021 1024
3958 1024 -472 -1212 -338 1029 464 -514 -911 -373 488 402 -84 -949 -762 520 988 -624 -1271 -429 1220
3977 1220 696 -991 -1584 158 650 140 -796 -634 241 496 277 -315 -1252 -725 968 1092 -523 -1603
3995 -1603 -120 1319 549 -1335 -895 944 1163 -198 -885 -390 149 100 476 111 -794 -323 1099 905
4013 905 -1075 -1655 671 1956 373 -1923 -842 677 608 -503 -480 384 283 -41 -168 -328 -1207 -254
4031 -254 1423 1282 -1195 -1871 722 1662 -238 -1777 201 1881 204 -1564 -874 278 87 111 706
4048 706 -36 -651 -748 965 664 -1218 -845 1803 1980 -1357 -2407 64 1884 260 -526 395 740 -240
4066 -240 -907 70 109 -491 27 1853 606 -2361 -1891 1351 1780 -985 -1566 1161 1694 -1346 -2195 225
4084 225 1447 491 -97 411 -457 -1872 -588 1524 853 -1462 -569 1864 688 -2867 -1841 1983 2482
4101 2482 -39 -1219 323 527 -892 -619 1583 782 -508 541 962 -827 -2599 -51 3179 1663
4117 1663 -1886 -1466 1245 593 -2129 -1205 1869 2253 -1031 -944 392 -952 -1756 882 2717 428 -2037
4134 -2037 -247 1617 -575 -2980 213 3785 1452 -1902 -2011 585 188 -1006 328 2496 287
4149 287 -1744 -501 768 -1521 -1917 1965 3695 107 -3499 -1032 1746 102 -1647 515 2939
4164 2939 588 -2460 -1138 667 -259 -348 2110 2547 -1376 -3211 19 2196 -431 -1752 1652 3478
4180 3478 -692 -3862 -1334 1881 774 -375 1334 1252 -1655 -2847 31 1152 -462 -210 2581 2331
4196 2331 -2940 -3848 385 3251 179 -1463 1244 2213 -1707 -3077 211 1916 251 -85 1777 820
4212 820 -3144 -2673 1936 2572 -474 -1360 2006 1422 -2746 -3334 1377 3238 689 -656 566 92 -2415
4229 -2415 -1473 2283 2201 -656 -567 1606 94 -3746 -2037 3117 3434 -884 -2040 757 628 -2547 -1610
4246 -1610 2324 2422 -493 -892 495 -850 -2804 -238 3627 2145 -2296 -1800 1287 435 -3031 -955
4262 -955 3493 2747 -1524 -2069 132 -209 -1395 736 3129 640 -2109 -1030 1410 -673 -2275 745
4278 745 4214 1483 -3003 -2367 941 593 -1101 332 2472 597 -1950 -1047 790 -361 -878 1811
4294 1811 3237 -902 -3697 -902 1837 400 -1852 748 3085 353 -3000 -1594 993 671 -519
4309 -519 1120 1763 -1357 -2945 -376 1818 -221 -1171 1618 2701 -1231 -3749 -783 2536 914 -895
4325 -895 361 1416 -718 -2519 -190 1546 316 -218 1917 1347 -2143 -2728 1060 2688 141 -1447
4341 -1447 707 1874 -1196 -2621 299 2416 816 -647 299 432 -1799 -1685 1454 2116 -759 -1149
4357 -1149 990 912 -2160 -1839 1348 2780 65 -1339 241 256 -1067 -1095 959 1471 -453 -545 922
4374 922 -118 -2084 -1026 2295 1959 -1157 -2040 895 948 -1213 -963 1376 1657 -187 -1190 39 96
4391 96 -1000 239 1858 977 -1326 -765 865 455 -1375 -440 1682 1692 -1184 -1674 146 545 -699
4408 -699 7 1099 242 -1066 -327 666 -96 -982 375 1995 415 -1848 -1111 1044 1113 -894 -536 954
4426 954 644 -873 -800 191 -38 -317 609 653 -526 -1503 -174 941 151 -1089 -93 1698 440 -1331
4444 -1331 -868 986 542 -243 34 86 -16 -452 447 681 -148 -607 686 745 -820 -1133 -307 1362 512
4463 512 -962 -416 739 332 -627 -174 274 170 53 168 66 -1018 -683 547 1256 -75 -872 -126
4481 -126 691 -64 -1080 -274 721 516 -528 -365 -224 -275 -18 321 111 -255 -446 355 418 -815 -403 764
4501 764 702 114 -898 -47 358 333 -168 -59 384 4 30 -214 15 -490 126 495 371 -466 -707 398
4521 398 530 -302 -597 -95 772 127 -704 -228 404 264 -13 448 -378 -465 -146 559 -57 -438 16 373
4541 373 392 -454 -848 369 850 181 -153 -298 212 45 61 -204 -207 -228 266 645 -100 -483 -259 862 344
4562 344 -486 -402 315 316 -20 -395 -196 108 565 355 -243 -402 -148 462 228 -282 -609 -97 271 303 -261
4583 -261 -360 473 523 26 -652 -311 -24 219 -500 -315 -187 -126 137 -290 -276 -248 238 211 -406 -311 -151 662
4605 662 301 102 -285 -92 208 288 32 -206 -138 229 393 -94 -311 -330 248 442 276 -574 -153 723 510
4626 510 -227 -272 39 214 155 -51 -190 -61 238 157 -114 -498 112 512 371 -246 -556 -164 309 108 -616
4647 -616 -473 197 -28 -197 50 -242 -232 -123 47 -373 -355 -24 473 528 -69 -687 117 466 91 -519 -130
4668 -130 273 -155 -204 -319 353 79 378 240 15 -423 -131 549 200 -606 -624 501 629 -168 -786 187
4688 187 361 324 -146 347 16 -135 90 418 125 -640 95 907 60 -731 -329 209 178 -169 -358 165 330
4709 330 -539 -330 381 121 -135 422 209 -423 -592 -83 725 365 -835 103 696 89 -857 -232 522 353
4729 353 -197 -248 23 -51 -774 185 750 35 -494 194 529 -238 -1035 278 956 551 -987 -455 297 -34
4749 -34 -359 7 817 206 -593 17 286 -502 -600 498 1054 72 -1139 -195 859 -269 -1130 155 1382
4768 1382 17 -630 -453 82 -376 -431 658 1094 -439 -728 316 620 -653 -580 1110 1209 -227 -1492
4786 -1492 -341 944 -130 -507 737 897 -200 -1109 92 581 -627 -191 1161 1062 -1155 -1433 306
4803 306 1152 -257 -527 929 1017 -842 -1589 -71 850 -16 -319 945 778 -1427 -1018 419 1089 -357
4821 -357 -292 1252 637 -1548 -1575 979 1178 -287 -647 819 478 -1510 -1053 804 989 -291 -257 1348
4839 1348 -181 -1864 -1323 1501 1656 -436 -421 1036 201 -1755 -928 1090 1319 -466 -293 512 -270
4856 -270 -1933 -607 1712 1058 -774 -533 973 -46 -2162 -526 1982 1380 -909 -577 593 -205
4872 -205 -1526 60 2011 1132 -820 -473 404 -509 -1850 197 2301 791 -1343 -1003 619 -304 -1316
4889 -1316 413 2064 876 -1492 -736 504 -461 -1168 859 2304 253 -1707 -666 843 -678 -1037
4905 -1037 1111 2454 268 -1868 -661 704 199 -508 1184 1822 -515 -1824 -443 753 -263 -847
4921 -847 1367 1865 -794 -2319 -153 1103 54 -880 1182 1782 -715 -2057 -248 999 -271 -350
4937 -350 1239 1250 -1406 -2138 407 1372 48 -754 1258 1082 -1713 -2044 360 1439 209 -332 1019
4954 1019 934 -1302 -1731 852 1255 -96 -175 1143 724 -1914 -1603 959 1814 -295 -700 717 811 -1694
4972 -1694 -1547 1131 1617 -61 -412 856 -93 -1843 -1396 1665 1223 -623 -641 515 17 -1554 -916
4989 -916 1766 1995 -350 -724 629 -66 -1539 -560 1741 1206 -607 -832 582 27 -1386 -455 1685
5006 1685 1322 -1077 -732 191 179 -1187 -2 2020 1179 -1097 -1025 499 36 -1311 157 2026 677
5023 677 -1280 -582 727 430 -969 203 1768 272 -1431 -896 729 -3 -589 896 1709 109 -1843
5040 -1843 -595 929 141 -783 509 1683 66 -1450 -716 778 62 -383 523 1319 -134 -1379 -351
5057 -351 753 183 -593 834 1088 -626 -1833 -102 1068 174 -579 478 913 -492 -1118 -234 922
5074 922 137 -320 676 934 -765 -1228 465 1033 105 -202 668 567 -784 -1138 740 1052 -28 -662
5092 -662 -36 433 -784 -924 430 952 -188 -154 569 394 -870 -739 800 865 -153 -674 232 408 -817
5111 -817 -468 515 1055 -176 -522 339 178 -514 -349 702 824 -131 -332 583 -36 -406 -265 917 856
5130 856 -383 -349 210 62 -463 -304 802 445 -410 -402 180 101 -328 -33 924 699 -778 -471 307 178
5150 178 -251 -75 323 296 -550 -555 493 234 -243 -11 802 79 -723 -200 455 340 -228 -118 467 356 -598
5171 -598 -97 169 246 -161 72 554 106 -261 -208 216 260 -178 188 516 94 -665 208 503 264 -317 -11
5192 -11 434 3 -601 -82 317 86 -64 -66 446 -167 -195 172 368 135 -387 174 74 80 -418 -43 410 -77
5214 -77 -322 169 281 20 -242 80 91 -217 -197 -130 149 -41 -305 486 370 13 -164 -23 -24 -20 74 322 384
5237 384 77 -263 251 30 128 -65 -15 266 -59 62 25 146 185 -97 -142 50 -152 16 194 551 -48 -271
5259 -271 310 212 -71 -277 -10 -129 -5 -70 -64 194 -17 31 199 -208 66 -185 271 -51 53 -205 24 11
5281 11 57 -347 73 123 -188 -166 111 96 232 -68 102 59 -160 177 -104 97 47 431 15 412 -19 -84 20
5304 20 111 -161 -205 135 137 28 -218 235 -80 -70 192 -212 -73 -26 204 0 -35 -236 -59 210 104 -242 43
5327 43 235 37 121 -85 -7 -215 -198 16 183 -14 -344 -169 362 19 -106 -149 607 -44 -371 45 105 55
5349 55 -276 63 210 -140 -319 -47 -9 34 -387 -140 418 84 -339 -69 237 121 -94 -232 82 -270 -344
5370 -344 540 97 -211 -100 -179 74 -123 -90 106 481 -85 -463 13 58 -310 -179 136 243 116 0 -125
5391 -125 94 -259 -105 -134 199 -306 -811 -32 224 -102 -509 177 424 -189 -333 -61 -74 -188 -110 358 470
5412 470 -39 -460 214 520 -674 -115 432 352 -204 -767 20 72 256 -20 330 407 -719 -350 127 344
5432 344 133 -87 493 499 -707 -524 474 254 -236 -501 335 311 -1033 -613 376 305 -93 -27 196 -55 -432
5453 -432 -374 291 -92 -520 100 631 153 -784 -394 591 477 -379 -285 434 156 -964 -78 457 177 -415
5473 -415 73 551 11 -784 6 639 487 -495 -198 518 131 -984 -261 1003 449 -315 -208 423 -219
5492 -219 -826 171 1003 303 -332 -110 369 -76 -868 186 799 323 -412 -424 460 -273 -495 169 803 105
5512 105 -600 147 369 -319 -491 503 978 -9 -646 -35 188 -206 -586 744 810 -107 -721 169 125 -157
5532 -157 -152 558 760 -745 -1047 39 504 -535 -316 752 1088 -62 -1104 16 614 -441 -162 824
5550 824 991 -844 -1008 203 475 -364 -232 1068 760 -1010 -1288 151 917 -540 -437 817 573 -937
5568 -937 -1375 320 597 -610 -138 694 206 -1196 -878 1049 858 -338 -412 821 269 -1150 -1242 528
5586 528 1138 -125 -383 973 221 -1509 -765 854 956 -359 -214 928 98 -1364 -787 1200 877
5603 877 -622 -383 567 -40 -1372 -801 1174 528 -210 -292 447 -450 -1653 -20 1224 547 -624 -290
5621 -290 376 -94 -1302 -155 1235 742 -618 -542 610 -452 -961 301 1429 534 -1009 -273 101
5638 101 -401 -1031 593 1498 582 -1350 -520 471 -105 -634 469 1567 247 -1258 -332 329 -134 -868
5656 -868 1020 1249 -484 -1307 -356 555 -444 -469 283 1232 117 -1046 -560 486 -239 -365 830 970
5674 970 -423 -1343 -100 762 -327 -916 811 881 -840 -1415 125 998 124 -314 582 625 -465 -1172
5692 -1172 73 652 -7 -56 901 785 -1258 -1424 132 1163 -244 -668 659 454 -703 -1290 155
5709 155 736 67 -416 590 308 -1164 -966 504 683 -51 -309 643 110 -985 -1094 610 900 -83
5727 -83 -590 257 109 -1141 -581 970 379 -278 -222 382 -120 -987 -485 1254 961 -633 -518 203 338
5746 338 -751 -326 699 567 -331 -372 -130 -21 -541 -37 992 263 -648 -89 243 206 -600 78 981 707
5766 707 -689 -608 203 -260 -425 47 654 169 -608 -618 214 -79 -548 465 1173 141 -1065 -120 520
5785 520 175 -500 -109 905 25 -873 -678 327 -120 -188 315 755 36 -850 12 357 -125 -327 257 723
5805 723 19 -834 -409 289 -177 -12 221 371 -29 -463 11 300 38 -310 722 342 -585 -869 39 528
5825 528 -42 -570 33 116 -80 -268 170 394 -82 35 256 -53 -298 -633 252 682 -48 -330 126 264
5845 264 -341 -702 201 564 144 -316 81 -90 -18 -218 272 61 -243 -321 382 110 -526 -117 438 813 -76
5866 -76 -428 -167 250 0 -63 -65 78 -76 -349 133 -94 -521 53 45 137 -222 -293 354 132 -155 -269 456 235
5889 235 -163 -378 -230 -213 207 75 216 -7 -274 -226 226 -138 -360 -97 275 142 -315 -166 232 610 -152
5910 -152 -210 -62 148 406 -23 -147 -230 10 39 100 -25 -449 -268 642 118 38 -255 343 174 -81 89 -296
5932 -296 -11 115 24 -261 -31 -113 312 -6 -156 -529 -235 485 217 -289 48 61 86 118 -310 -76 87 -65
5954 -65 -35 -500 -255 205 141 205 -319 -254 48 98 131 -355 -221 177 77 -257 -285 -43 148 -36 -17 133 -27
5977 -27 -1 65 79 -116 -3 377 -7 -213 -26 131 165 -72 80 -376 325 112 101 -167 88 50 172 -36
5999 -36 175 -71 -258 262 149 -569 -474 -93 331 222 -174 -46 355 297 154 2 -281 141 40 335 47
6020 47 -286 -184 103 111 -405 -366 266 291 -46 -102 7 297 -61 -55 -19 62 -174 178 213 75 -560 -76 401 379
6044 379 -270 79 193 250 76 -421 -142 177 109 -12 -131 222 -74 82 -55 20 -362 -211 209 -249 -339
6065 -339 -128 153 115 -101 -323 236 246 14 81 -136 -10 -230 124 53 32 -88 86 302 -22 -112 -67 355
6087 355 163 -508 -330 232 554 103 -173 33 163 -4 1 263 78 -276 51 41 -94 -190 -65 358 250
6108 250 -432 -441 349 -55 3 -160 267 95 -42 449 14 -587 -404 219 303 118 -199 124 421 8 -278
6129 -278 36 546 194 -44 72 122 112 214 299 460 -69 -332 237 202 -413 -202 473 409 -134 -716 11 709
6151 709 204 -322 339 94 -149 -40 176 21 -223 189 430 323 -563 -672 609 355 -562 -236 296 476
6171 476 -77 -472 -25 220 39 -59 379 161 -612 -301 426 -350 -554 62 814 654 -667 -541 471 412
6191 412 39 -184 379 118 -457 -262 494 118 -125 329 357 144 -824 -424 712 423 -198 11 723 346
6211 346 -451 -386 405 236 -258 84 18 -92 -412 -91 607 173 -356 -106 422 -258 -979 89 665 475
6231 475 -265 -254 172 -185 -492 164 315 -171 -470 123 292 -721 -704 11 1197 156 -570 -230 502 -158
6251 -158 -687 -2 696 139 -245 -157 322 -435 -387 818 834 -252 -782 -54 342 -317 -495 375 847 29
6271 29 -832 -308 65 197 -243 560 773 5 -398 -88 70 -495 -517 866 717 -849 -1215 -112 463 -167
6291 -167 -129 697 835 -196 -630 -226 145 -395 123 695 577 -785 -657 77 673 -117 -245 887 634
6310 634 -985 -1007 330 546 231 -73 765 281 -483 -607 318 272 -174 140 1051 -26 -1039 -419 468
6329 468 594 -71 -398 640 318 -515 -390 403 518 22 -53 824 -462 -1224 -323 1019 759 -633 -71
6348 -71 379 78 -973 -318 945 604 -219 53 405 91 -719 16 831 6 -378 23 282 -524 -894 144
6368 144 1127 533 -500 -419 447 54 -515 -62 760 197 -447 80 216 -655 -443 800 1016 117 -668 -255
6388 -255 631 49 -484 32 761 221 -498 -443 296 -114 -118 583 764 -180 -410 122 492 -251 -562 533 1225
6409 1225 -68 -683 -222 553 103 -161 501 320 94 -305 -186 40 -228 -142 729 463 -245 -910 348
6428 348 715 -32 -206 410 736 -152 -810 0 331 -87 -19 113 142 -291 -508 583 456 -282 -56 376
6448 376 577 -753 -479 290 850 328 -160 27 352 167 -563 438 227 -368 129 271 103 -764 -570
6467 -570 280 607 -106 -264 534 80 -214 -271 544 551 -22 151 375 -144 -292 183 639 292 -328 33 549
6488 549 189 -484 -399 430 774 -341 -15 -173 130 -35 190 458 94 -281 406 390 -73 -333 -48 522
6508 522 94 -444 -164 225 138 -435 -43 112 385 -135 -238 29 -164 -146 311 426 -300 -748 94 519 -53
6529 -53 -335 -45 154 211 -337 -477 360 204 133 -127 469 -203 16 405 313 -37 -287 360 378 -98 -373 -5
6551 -5 554 169 -117 143 106 256 114 -216 -53 18 309 113 549 -269 -167 185 360 -180 -290 470 217
6572 217 -250 -520 -377 543 184 245 165 -113 72 -23 222 281 211 -6 120 302 -213 -352 312 405 100 -300
6594 -300 27 19 33 -282 -154 212 -139 -99 132 -163 62 -195 349 93 -11 -409 346 7 13 -392 -111 72
6616 72 -67 -241 138 359 65 219 -210 -72 -121 -38 87 -70 -556 -13 95 155 -159 -249 -54 166 556 -177
6638 -177 -228 -10 175 45 -175 -115 84 -108 17 -1 -486 -30 338 16 -170 -82 430 240 282 93 49 249
6660 249 240 183 24 -41 -402 269 505 -301 -358 406 326 296 -315 -380 161 386 77 -185 69 165 375 -15 -253
6683 -253 -199 202 -42 125 -365 -16 166 466 159 -173 -90 220 277 -141 -260 -151 -197 -37 -96 -266 -153 11
6705 11 174 -48 -200 -94 239 310 172 -84 32 452 158 -193 -250 178 300 39 -292 -148 150 215 86
6726 86 -16 -169 75 309 126 -363 -260 -21 505 95 -24 -570 -325 -189 -129 -167 -164 -63 142 4 -378 -373
6748 -373 72 463 341 5 -290 172 416 330 -112 -297 275 522 102 -30 134 -64 305 78 -86 -336
6768 -336 -24 331 234 -527 -200 323 281 -159 66 -212 135 180 159 -58 -455 -7 3 263 -325 -210 223 436
6790 436 319 -290 -234 203 26 -92 -401 125 248 162 -201 -414 162 -12 117 46 87 -396 -62 245 -8
6811 -8 -207 121 53 281 -170 -26 -10 169 246 12 -259 165 -69 355 327 -445 -46 368 29 -23 -470 -289
6833 -289 343 -23 -171 -251 188 241 19 -190 -173 42 197 -46 -30 -122 -105 251 549 47 -170 172 299 121
6855 121 -700 -264 215 498 -131 -160 193 -81 -134 260 -17 -239 -282 231 151 -156 -148 338 520 125 -439 151
6877 151 154 268 -434 64 545 21 86 286 -45 -270 -64 451 310 -340 -338 112 575 -13 -472 315 424 -365
6899 -365 -105 101 40 -22 -8 383 -236 -312 -155 168 -66 -449 -216 589 365 -538 -686 -5 579 293 6
6920 6 -30 53 -292 -372 146 79 -7 373 292 -14 -774 -219 454 445 -102 -221 421 105 -348 -638 114 62 80 72 54
6945 54 162 -821 211 356 -32 -357 29 482 57 -928 -169 495 375 63 -92 -97 53 -405 -85 244 172
6966 172 -287 361 316 -404 -804 107 779 1 -221 36 283 82 -502 -292 424 426 -245 15 98 -406 -209
6987 -209 352 386 -412 -612 316 258 -275 -551 -128 550 306 -395 -352 -110 -64 -166 172 178 21 -289 99 -49
7009 -49 -710 -277 104 438 -153 -782 35 392 31 -370 601 636 -74 -231 -111 46 -330 176 325 417 -424
7030 -424 -525 127 313 -396 -433 609 326 -446 -714 -222 212 -84 147 26 -70 -157 -324 358 33 -532 -43
7051 -43 543 378 -843 -619 -100 378 -515 -249 274 43 -351 -661 141 156 -23 339 289 61 -727 -145 466
7072 466 -68 -481 -278 405 465 -722 -270 191 -32 -81 -243 262 -131 -450 -417 405 -53 -476 -182 106 -237
7093 -237 -702 -56 523 388 -162 -274 -86 -267 -380 -262 29 53 182 79 -139 -650 -497 -49 335 166
7113 166 -755 -332 68 -67 -635 92 227 476 -207 -275 64 -133 -397 389 298 -180 -555 18 244 -63 -333
7134 -333 333 687 -103 -323 11 142 -71 -337 189 89 -5 -88 187 -64 -252 -15 164 396 -555 -103 -126
7155 -126 467 -117 -352 -216 8 173 -609 -244 -104 59 143 389 42 -480 -318 351 241 -213 -74 269
7175 269 213 -630 -654 -220 316 90 -55 171 99 -153 -177 -114 266 142 172 262 217 -467 -414 255 317 -58 -241
7198 -241 215 170 67 -387 -54 96 291 -71 40 -153 -334 224 376 -135 -302 22 346 233 -272 -455
7218 -455 248 477 2 -130 -89 -332 -87 -138 47 119 -38 -50 417 -82 -323 -45 82 29 -169 -513 259 254
7240 254 -242 -330 48 198 178 -218 -382 160 200 234 3 -121 -184 57 201 86 -294 -15 154 138 33 -182
7262 -182 -355 9 51 -258 -372 -178 34 334 14 -310 -177 103 295 -141 -436 -117 293 -18 -319 -76
7282 -76 71 73 -20 134 -37 -311 -53 426 29 -349 -56 179 382 -121 -569 42 272 66 -161 -420 64
7303 64 154 33 121 -46 196 144 -44 -205 -107 95 214 331 -318 -259 -102 124 162 -471 -172 74 95 -359 79
7326 79 -47 290 430 -44 -48 -251 107 108 202 -20 -42 428 262 -147 -501 30 228 -144 -222 -201 62 62 -163 63
7350 63 -138 106 -269 178 78 -206 -217 -45 23 48 -401 -165 361 110 -294 -118 -242 212 94 92 -317 -202
7372 -202 203 -121 -31 -193 -231 498 235 -329 6 -405 -114 356 67 -543 139 125 415 93 -123 12 27
7393 27 242 -189 -234 -54 273 665 -208 -31 -176 355 115 -2 -226 -20 -5 157 393 -46 126 -154 60
7414 60 -206 -227 -330 521 124 -127 -55 428 144 -60 -147 -25 35 8 73 -567 -248 -69 245 -32 -284 -66
7436 -66 199 372 -240 -347 -3 67 479 233 63 -263 248 -42 117 -156 33 -94 224 -34 39 -395 434
7457 434 274 121 -155 -24 295 -199 -50 -2 52 12 -62 32 -154 -155 162 257 -160 -142 303 393 124 62 -109 112
7481 112 316 -271 -238 -367 325 69 -155 -52 -42 -107 -310 305 69 -151 -333 332 349 -207 -419 102 280
7502 280 27 -357 -305 -51 -117 -98 328 -89 -68 408 121 -26 -209 -12 88 65 -232 -126 107 538 -26 -172
7524 -172 95 19 -162 -200 -51 -240 99 221 159 -477 -324 -91 365 77 -230 -192 257 356 -133 -93 167 215
7546 215 -77 163 64 34 78 282 56 -54 -91 178 296 -55 -316 -138 118 279 -407 -172 213 0 -383
7567 -383 -178 104 51 242 158 -6 -392 -83 -24 -28 158 -221 280 533 258 -305 -118 274 81 20 -175 137
7589 137 63 -199 305 98 -29 -217 165 333 -354 -355 268 790 187 -202 113 395 22 -16 -181 90 9 -86
7611 -86 -90 -35 -529 220 680 376 72 -327 132 261 -162 -461 -42 78 461 -466 -67 39 -63 197 444
7632 444 22 114 -23 -4 22 -404 -16 433 543 -184 93 225 189 -282 -193 86 36 182 -18 300 -213 25
7654 25 27 672 40 -495 -257 452 222 -215 -251 369 328 -249 -391 95 3 -214 352 215 -171 -357 190 120
7676 120 301 3 -89 652 -34 -619 -258 486 341 158 -219 376 203 -390 -32 -67 282 -176 159 233 -348
7697 -348 -590 -191 502 201 -176 155 340 331 -110 -405 198 50 282 193 187 -36 -348 160 371 236 -111 138
7719 138 455 -499 -402 308 619 432 -220 -563 225 -80 -346 -146 40 33 199 -93 62 -129 -108 435 601
7740 601 58 -296 242 720 -114 -446 -99 364 518 97 5 146 -44 75 508 357 -233 -291 116 61 -390
7761 -390 -410 247 357 -467 -261 -344 -465 72 285 344 -339 -124 -354 22 155 179 -111 604 281 -251 -409
7782 -409 207 358 -259 21 181 -79 -31 -167 10 -300 14 429 394 79 -326 -254 322 441 -474 -231 619
7803 619 211 -314 -303 -213 543 33 -135 21 -46 -31 -23 187 -202 -131 98 154 155 -413 -81 470 463 -119 -84 152
7827 152 69 -232 -305 -204 -115 53 243 267 -267 -305 179 595 47 -294 215 243 -111 -225 -245 169 388 201
7849 201 -134 -203 179 -176 134 355 -1 -18 213 238 -183 -264 48 514 106 -340 -119 -50 198 -153 95 -43
7871 -43 19 -176 -25 -114 -149 77 373 418 -390 -196 133 46 -105 -74 -29 45 -105 -231 -117 -48 338 366 260 -22
7895 -22 -147 193 289 189 -344 20 277 395 -277 -15 -131 132 237 -94 90 4 61 -102 -204 74 -209
7916 -209 176 215 257 -141 -304 306 394 -109 -267 141 249 79 -338 -35 170 -236 83 105 -95 -181 -184 -78
7938 -78 -164 -370 225 181 8 -467 -119 320 252 -38 -78 9 26 3 -26 47 -39 -38 209 345 188 -294 -136 645
7962 645 362 -21 -187 -165 288 -7 -69 -23 69 195 -5 -257 -122 -77 262 -34 -252 -406 -20 289 2 -346
7984 -346 -102 161 -213 -130 -207 214 -81 56 76 -203 -44 229 9 44 -35 -251 375 -117 -55 -172 29 112
8006 112 184 -101 -535 269 249 129 -55 -46 -119 11 343 -116 38 129 111 -107 63 -222 -45 341 69 -73
8028 -73 -287 179 170 205 -42 21 153 252 95 -77 147 166 279 126 -499 -155 151 194 128 -157 -324 -42 431
8051 431 174 -159 302 324 -45 204 93 -112 -134 52 98 -192 -22 350 185 277 -413 -54 36 140 66 -426
8073 -426 -334 16 280 110 -115 -4 162 164 -84 99 -68 84 123 137 -17 -136 189 272 -42 -66 23 70 79 -208
8097 -208 65 -242 25 12 104 -135 17 423 325 -133 -166 43 -96 319 -399 -70 153 248 78 -135 54 8
8119 8 256 111 -351 -222 -281 125 -114 -64 -266 -153 96 253 -101 -472 164 339 188 -388 -360 -7 92 -51
8141 -51 -46 -36 -29 46 129 -160 -337 295 315 149 -330 32 116 214 288 51 -474 71 -167 170 -282 -70 97 145
8165 145 130 -205 105 196 -14 -196 -88 -106 181 359 129 -98 121 42 298 -5 -431 -70 177 241 186 -386
8187 -386 -3 -21 345 -302
8191c02
##END NTUPLES=NMR FID
##END=
