##TITLE=1H_IAMT-132
 C6D6, 8 sc, 
 18.10.2019
##JCAMPDX= 6.0         $$ Bruker NMR JCAMP-DX V2.0
##DATA TYPE= NMR FID
##DATA CLASS= NTUPLES
##ORIGIN= UXNMR, Bruker Analytische Messtechnik GmbH
##OWNER= root
$$ XWIN-NMR		Version 3.5
$$ Fri Oct 18 15:34:38 2019 Russian Standard Time (UT+4h)  she@DPX200
##.OBSERVE FREQUENCY= 200.1315
##.OBSERVE NUCLEUS= ^1H
##.DELAY= (6, 6)
##.ACQUISITION MODE= SIMULTANEOUS
##.ACQUISITION SCHEME= undefined
##.AVERAGES= 8
##.DIGITISER RES= 18
##SPECTROMETER/DATA SYSTEM= spect
##.PULSE SEQUENCE= zg30
##.SOLVENT NAME= C6D6
##.SHIFT REFERENCE= (INTERNAL, C6D6, 0, 15.7039)
##AUDIT TRAIL= $$ (NUMBER, WHEN, WHO, WHERE, WHAT)
$$ ##TITLE= Audit trail, XWIN-NMR		Version 3.5
$$ ##JCAMPDX= 5.01
$$ ##ORIGIN= Bruker BioSpin GmbH
$$ ##OWNER= she
$$ F:/spectra/data/she/nmr/H-F/1/audita.txt
$$ ##AUDIT TRAIL=  $$ (NUMBER, WHEN, WHO, WHERE, WHAT)
(   1,<2019-10-18 15:33:32.50 +0400>,<she>,<DPX200>,
      <created by zg, POWCHK disabled, PULCHK disabled
       configuration hash MD5:
       00 E9 B6 7A A2 85 ED C7 34 08 36 98 17 FE 4E 26
       data hash MD5: 16K
       E6 44 E6 32 27 35 2F 3C 89 4D 4F CD B5 03 80 9C>)
$$ ##END=
$$ 
$$ hash MD5
$$ 9F 92 85 D7 84 F0 BA 5D 73 7E 56 15 64 ED F5 1B
##$RELAX= 
##$RELAX= 
##$RELAX= 
##$RELAX= 
##$RELAX= 
##$RELAX= 
$$ Bruker specific parameters
$$ --------------------------
##$DU= <F:/spectra>
##$EXPNO= 1
##$NAME= <H-F>
##$PROCNO= 1
##$TYPE= <nmr>
##$USER= <she>
##$AMP= (0..31)
100 100 100 100 100 100 100 100 100 100 100 100 100 100 100 100 100 100 
100 100 100 100 100 100 100 100 100 100 100 100 100 100 
##$AQSEQ= 0
##$AQ_mod= 1
##$AUNM= <au_zg>
##$AUTOPOS= <>
##$BF1= 200.13
##$BF2= 200.13
##$BF3= 200.13
##$BF4= 200.13
##$BF5= 200.13
##$BF6= 200.13
##$BF7= 200.13
##$BF8= 200.13
##$BYTORDA= 1
##$CFDGTYP= 0
##$CFRGTYP= 5
##$CHEMSTR= <none>
##$CNST= (0..31)
1 1 145 1 1 1 1 1 1 1 1 1 1 1 1 1 1 1 1 1 1 1 1 1 1 1 1 1 1 1 1 1 
##$CPDPRG= <>
##$CPDPRG1= <>
##$CPDPRG2= <>
##$CPDPRG3= <>
##$CPDPRG4= <mlev>
##$CPDPRG5= <mlev>
##$CPDPRG6= <mlev>
##$CPDPRG7= <mlev>
##$CPDPRG8= <mlev>
##$CPDPRGB= <>
##$CPDPRGT= <>
##$D= (0..31)
0 1.2 0 0 0 0 0 0 0 0.06 0 0.03 0 0 0 0 0.0002 0 0 0 0 0 0 0 0 0 0 0 0 
0 0 0 
##$DATE= 1571398411
##$DBL= (0..7)
120 120 120 120 120 120 120 120 
##$DBP= (0..7)
150 150 150 150 150 150 150 150 
##$DBP07= 0
##$DBPNAM0= <>
##$DBPNAM1= <>
##$DBPNAM2= <>
##$DBPNAM3= <>
##$DBPNAM4= <>
##$DBPNAM5= <>
##$DBPNAM6= <>
##$DBPNAM7= <>
##$DBPOAL= (0..7)
0.5 0.5 0.5 0.5 0.5 0.5 0.5 0.5 
##$DBPOFFS= (0..7)
0 0 0 0 0 0 0 0 
##$DE= 6
##$DECBNUC= <off>
##$DECIM= 24
##$DECNUC= <off>
##$DECSTAT= 4
##$DIGMOD= 1
##$DIGTYP= 9
##$DL= (0..7)
0 120 120 120 120 120 120 120 
##$DP= (0..7)
150 150 150 150 150 150 150 150 
##$DP07= 0
##$DPNAME0= <>
##$DPNAME1= <>
##$DPNAME2= <>
##$DPNAME3= <>
##$DPNAME4= <>
##$DPNAME5= <>
##$DPNAME6= <>
##$DPNAME7= <>
##$DPOAL= (0..7)
0.5 0.5 0.5 0.5 0.5 0.5 0.5 0.5 
##$DPOFFS= (0..7)
0 0 0 0 0 0 0 0 
##$DQDMODE= 0
##$DR= 18
##$DS= 0
##$DSLIST= <SSSSSSSSSSSSSSS>
$$ [...]
##$SUBNAM2= <"">
##$SUBNAM3= <"">
##$SUBNAM4= <"">
##$SUBNAM5= <"">
##$SUBNAM6= <"">
##$SUBNAM7= <"">
##$SUBNAM8= <"">
##$SUBNAM9= <"">
##$SW= 24.0689530833862
##$SWIBOX= (0..15)
0 0 2 0 0 0 0 0 0 0 0 0 0 0 0 0 
##$SW_h= 4816.95568400771
##$TD= 16384
##$TD0= 1
##$TE= 0
##$TE2= 300
##$TE3= 300
##$TEG= 300
##$TL= (0..7)
0 120 120 120 120 120 120 120 
##$TP= (0..7)
150 150 150 150 150 150 150 150 
##$TP07= 0
##$TPNAME0= <>
##$TPNAME1= <>
##$TPNAME2= <>
##$TPNAME3= <>
##$TPNAME4= <>
##$TPNAME5= <>
##$TPNAME6= <>
##$TPNAME7= <>
##$TPOAL= (0..7)
0.5 0.5 0.5 0.5 0.5 0.5 0.5 0.5 
##$TPOFFS= (0..7)
0 0 0 0 0 0 0 0 
##$TUNHIN= 0
##$TUNHOUT= 0
##$TUNXOUT= 0
##$USERA1= <user>
##$USERA2= <user>
##$USERA3= <user>
##$USERA4= <user>
##$USERA5= <user>
##$V9= 5
##$VALIST= <valist>
##$VCLIST= <CCCCCCCCCCCCCCC>
##$VD= 0
##$VDLIST= <DDDDDDDDDDDDDDD>
##$VPLIST= <PPPPPPPPPPPPPPP>
##$VTLIST= <TTTTTTTTTTTTTTT>
##$WBST= 1024
##$WBSW= 4
##$XGAIN= (0..3)
0 0 0 0 
##$XL= 0
##$YL= 0
##$YMAX_a= 665623
##$YMIN_a= -908618
##$ZGOPTNS= <>
##$ZL1= 120
##$ZL2= 120
##$ZL3= 120
##$ZL4= 120
##$ABSF1= 10
##$ABSF2= 0
##$ABSG= 5
##$ABSL= 3
##$ALPHA= 0
##$AQORDER= 0
##$ASSFAC= 0
##$ASSFACI= 0
##$ASSFACX= 0
##$ASSWID= 0
##$AUNMP= <proc_1d>
##$AZFE= 0.1
##$AZFW= 0.1
##$BCFW= 1
##$BC_mod= 2
##$BYTORDP= 1
##$COROFFS= 0
##$CY= 11.3945322036743
##$DATMOD= 1
##$DC= 2
##$DFILT= <>
##$DTYPP= 0
##$F1P= 20.1720416913024
##$F2P= 0.152960286110954
##$FCOR= 0.5
##$FTSIZE= 0
##$FT_mod= 4
##$GAMMA= 1
##$GB= 0.15
##$INTBC= 1
##$INTSCL= 1
##$ISEN= 128
##$LB= 0.24
##$LEV0= 0
##$LPBIN= 0
##$MAXI= 10000
##$MC2= 0
##$MEAN= 0
##$ME_mod= 0
##$MI= 1.114404
##$NCOEF= 0
##$NC_proc= 0
##$NLEV= 6
##$NOISF1= 3.799351
##$NOISF2= 2.8
##$NSP= 1
##$NTH_PI= 0
##$NZP= 0
##$OFFSET= 15.70392
##$PC= 1
##$PHC0= -9571.437
##$PHC1= 17.00089
##$PH_mod= 1
##$PKNL= yes
##$PPARMOD= 0
##$PSCAL= 0
##$PSIGN= 0
##$REVERSE= no
##$SF= 200.130013532006
##$SI= 16384
##$SIGF1= 3
##$SIGF2= 2
##$SINO= 400
##$SIOLD= 16384
##$SREGLST= <1H.CDCl3>
##$SSB= 0
##$STSI= 0
##$STSR= 0
##$SW_p= 3612.71676300578
##$SYMM= 0
##$S_DEV= 0
##$TDeff= 0
##$TDoff= 0
##$TI= <>
##$TILT= no
##$TM1= 0
##$TM2= 0
##$TOPLEV= 0
##$USERP1= <user>
##$USERP2= <user>
##$USERP3= <user>
##$USERP4= <user>
##$USERP5= <user>
##$WDW= 1
##$XDIM= 8192
##$YMAX_p= 0
##$YMIN_p= 0
$$ End of Bruker specific parameters
$$ ---------------------------------
##NTUPLES= NMR FID
##VAR_NAME=  TIME,          FID/REAL,        FID/IMAG
##SYMBOL=    X,             R,               I
##VAR_TYPE=  INDEPENDENT,   DEPENDENT,       DEPENDENT
##VAR_FORM=  AFFN,          ASDF,            ASDF
##VAR_DIM=   8192,          8192,            8192
##UNITS=     SECONDS,       ARBITRARY UNITS, ARBITRARY UNITS
##FACTOR=    0.0002076,     1,               1
##FIRST=     0,             0,               0
##LAST=      1.7004516,     0,               0
##MIN=       0,             -908618,         0
##MAX=       1.7004516,     665623,          0
$$ Real data points
##PAGE= N=1
##DATA TABLE= (X++(R..R)), XYDATA
0@%%%qK4k4J7l3N6p0Q6j04J28j61J99k42K92l52M17m90N78o78P85r07J047j200
26f40J370j561J774k009K265k547K862l206L581l993M446m945N487o082O743p469
42c924Q267r155J0142j1240J2476j3880J5481j7328J9491k2062K5179k9052L4013
55A8408m0634M9976o4247Q8999j43792M65988k54911r49367O90969O70873k92924
66B39338n79977K87881L17705k24654k16586L26493Q9900l64218j19287L97000
76A53595P7251l71037p9896L95186P4851l54731r6799L14573M5492l01016m2821
87a85352L11289N2743k79952o2819K57277M2597k67499q0943K56105J27708j96983
98b5829j53418J32446J55076n9712j44093l4480N2466O1195N4153J2864p2984
$$ y = [0, 0, 0, 0, -8, 16, -8, 9, -24, 32, -38, 48, -56, 72, -89, 110, -132, 160, -192, 225, -265, 313, -365, 420, -487, 560, -640, 730, -831, 943, -1066, 1199, -1348, 1514, -1692, 1889, -2104, 2342, -2603, 2884, -3198, 3545, -3924, 4343, -4812, 5330, -5910, 6566, -7314, 8167, -9161, 10330, -11732, 13447, -15605, 18408, -22226, 27750, -36497, 52502, -91290, 374698, 119787, -829580, -138611, 532262, 239338, -340639, -52758, 264947, 40293, -176293, 150200, 240100, -124118, -243405, 153595, 230846, -140191, -220087, 175099, 249950, -104781, -201580, 112993, 158485, -142531, -185352, 125937, 178680, -101272, -164091, 93186, 135783, -131716, -212659, 43446, 171154, -25829, -179247, -46801, 108275, 48563, -95530, -130010, -77544, -16349, 37804, 50668, -22316]
109b2316r1259J6147J14481O0159q9610j43816j6248J54793J52391l4847j74343
120g4468r3242Q6228J29107M177j08551p0805O3824J23140K0961j08889p6943
131a05461O8812Q8330n4216j03926M5391J40314O092j33488m0766J14574N8611
142H4267j06966r0177Q5736J31164k2166j23499k2193J05815N3021r3074r3841
153i1913N9920J25259l574j14991j7898J20138M8226j29431j12156Q4860J51563
164A20003N45j21460n4898O6773Q6141R832p9479r8878K367J26225Q4812q1892
176F0091j05178N0364R2563n5457r7358N7053R6174p1671j06829R0707J45695
187A56154p1278j69449K2829J39062j5787j16940K4449J15416j8148j10256Q418
$$ y = [-22316, -113575, -97428, 17053, 77212, -12398, -156214, -172462, -17669, 134722, 99875, -74468, -167710, -81482, 47625, 51802, -56749, -127554, -63730, 59410, 80371, -28518, -105461, -36649, 51681, -2535, -106461, -61070, 79244, 85336, -48152, -88918, 25656, 84267, -22699, -112876, -27140, 104024, 81858, -41641, -63834, 41981, 95002, 1928, -91913, -31993, 93266, 89692, -25299, -43197, 76941, 125167, -4264, -116420, -31560, 120003, 120548, -912, -55810, 10963, 97104, 106936, 27457, -71421, -69054, 57171, 141983, 60091, -45087, 5277, 97840, 42383, -54975, 2078, 98252, 26581, -80248, 10459, 156154, 84876, -84573, -61744, 77318, 61531, -55409, -30960, 84456, 66308, -43948, -35530]
198c5530R7240p361j05762k9283Q2002O1692k6648n3429j5535K2531K3609r686
210C840l8663k2329K7338M7188J2304l2155l3503L890K3229j1329m0464Q919O8741
223A7006J5382q3862l6920J04107P3158j23704j43885Q7020J89511k3718j85025
234a10930j1858J79855M2155j73761q3667J41251J01773j06046j01171Q8110J17247
245H2958m1724j05902r100N1837J5912k708J1355j3148k5595L3388N6692l1205
257B2760q8131K82Q4110K1361n8645m992O4719M383o9969p952P1843K156r3680
270e1755j5601J21708O9438r8986j01770O2622J07564l7058j13890N182J07213
281E4667L1219p0949k8787N3942K1324n6891l5752L8948L7783j6074j6113K1013
$$ y = [-35530, 61710, 54349, -51413, -80696, 1306, 62998, 36350, -17079, -32614, -10083, 13526, 3840, -34823, -57152, -29814, 17374, 29678, -2477, -35980, -32090, -8861, -20190, -60654, -51735, 17006, 32388, -51474, -88394, 15713, 88871, -34833, -178718, -91698, 97813, 74095, -110930, -122788, 57067, 99222, -74539, -158206, -16955, 84818, -21228, -122399, -34289, 82958, 41234, -64668, -73768, -21931, -6019, -8727, 2628, -10520, -36115, -2727, 53965, 22760, -65371, -65089, 19021, 40382, -18263, -23255, 41464, 45847, -24122, -32074, 39769, 41925, -51755, -67356, 54352, 123790, 24804, -76966, -14344, 93220, 56162, -57728, -52546, 54667, 85886, 14937, -13850, 40092, 61416, 4525, -31227, 7721, 45504, 29430, 13317, 34330]
293C4330J2734k2761j6564P335k802j4010J3537K6117q546j7887K6378J9690n8921
306a370o1810N5425R3551l9100j15083K3091J43634J5156j56263p3101J21535
317E665R3089r1425r8189P2047J08357m1520j03976J0006P4985j2959p1481O430
329d8971P1418J5017m8538j9026K5261M294k4692q644P536j55J0684L1170k65
342A5089m7610j8882M6736J9261o2804l9477P3188P5168n2137q9076L4028R5294
354D8778k5210j14744o335J17372M2240r2501m9204Q4711N9725p9152q3155N2332
366d5143Q7869k5788p5811K1688Q3534N71p8697k6612N1803K7382l1145j7771
378b8120K8230K4952n524r673q551j8364l639L0971J7182l2276j7288N1802M1767
$$ y = [34330, 47064, 24303, 7739, 15074, 12272, -1738, 11799, 37916, 29370, 11483, 37861, 57551, -1370, -63180, -7755, 85796, 46696, -68387, -45296, 98338, 113494, -42769, -115870, 5665, 98754, 7329, -90860, -18813, 89544, 48024, -55952, -45946, 29039, 16080, -55401, -48971, 22447, 37464, -11074, -30100, -4839, -545, -25237, -33881, -26345, -26500, -15816, 15354, 15089, -32521, -51403, -4667, 14594, -48210, -87687, -14499, 60669, 8532, -80544, -46516, 48778, 23568, -91176, -97511, 19861, 62101, -30400, -79604, 5107, 64832, -14320, -97475, -45143, 42726, 16938, -58873, -37185, 46349, 46920, -31777, -58389, -6586, 20796, -10349, -28120, 110, 25062, 19538, 9865, 1314, -17050, -20689, 10282, 27464, -4812, -22100, 29702, 71469]
391G1469n4395o8886L6098P6319k6208q3286K2963J05440N827j05380l0330R0815
403D0446L6856r0429n2235Q5724P5377n7767p4402M0317O7218l7594p5572J6782
415b5279P0588L439m8365j327L9993J497l8759j4399J4017N098P23J3831K399
428B3456j9536J955K8012j1390n8378r380O8433L2336o5574m3197O9528O3328
440G9593o8515r5604L7665R9066j5211r5215K997J00317J9967r4006m5660O6110
452h496M5335n4992m8209M6685N9931k0447n2714j322K9581k00k1712n534R473
465b2621J1121J8255Q277k8693l3127K0275M1940k1261n8057J6296Q3954J3793
477E0152q4532l7477P4430M8236p3374o8319O2025Q9008l1095q1965J9623P6453
$$ y = [71469, 17074, -51812, -15714, 60605, 34397, -48889, -25926, 79514, 85341, -20039, -50369, 40446, 77302, -13127, -65362, 20362, 95739, 37972, -36430, 3887, 71105, 33511, -42061, -25279, 45309, 48748, 383, -944, 39049, 40546, 1787, -12612, 1405, 6503, 7226, 21057, 23456, 3920, 5875, 33887, 22497, -35881, -45261, 23172, 55508, -10066, -53263, 16265, 79593, 11078, -84526, -46861, 52205, 36994, -58221, -55224, 45093, 65060, -28946, -74606, -8496, 36839, -18153, -66362, -19677, 40254, 19807, -32907, -34229, -4648, -4848, -26560, -32094, -22621, -11500, 6755, 15032, -13661, -46788, -26513, 15427, -5834, -63891, -47595, 36359, 50152, -34380, -71857, 2573, 50809, -22565, -90884, -28859, 60149, 29054, -52911, -33288, 43165]
489D3165j6874q4350J775Q3380J3684p0972j2302P7333K8038p4353n0154M9582
501a2048N2020k7728m0486K2168M0624m473k5429n298R29q717O042K1407r47j8858
515g94J1811L3033j2862n3302l554N7098J3132o1267j8871P6582M6751p3326p1999
528e7568N4146P6577m7453q8056L8792J06294j1986j05562r507R6151K0407r7001
540b4766m8350P8190P0690l8120o3524J0034M3303P41k8319j5008k324P085K7306
553A6938K1653k4697l8914J2761L8538j6894n1963J0695O1993J015o1175k483
565c2533O8603N948q4747l1578P7190M6369o3027m5319O1083N2867n6907o4618
577f6669L9158O0350l2017o1582K4991O9147J483n4660k0890K3045J2789o411
$$ y = [43165, 26291, -58059, -56284, 27096, 40780, -30192, -42494, 34839, 62877, -11476, -61630, -12048, 39972, 12244, -28242, -6074, 34550, 30077, 4648, -650, 279, -8438, -2396, 19011, 18064, -794, 11017, 44050, 31188, -22114, -25668, 31430, 44562, -16705, -35576, 41006, 87757, 14431, -57568, -3422, 73155, 25702, -62354, -23562, 82732, 70746, -34816, -44323, 51828, 72235, -24766, -73116, 5074, 75764, 37644, -25880, -15846, 27457, 28198, -121, -15129, -17453, -10368, 16938, 38591, 13894, -25020, -12259, 26279, 9385, -42578, -31883, 30110, 31125, -30050, -32533, 36070, 42018, -42729, -74307, 2883, 49252, -13775, -59094, 1989, 54856, -2051, -66669, -27511, 32839, 822, -60760, -35769, 33378, 34861, -19799, -40689, -17644, -4855, -11266]
589a1266l79r92q504Q827K7786K751l4490k1189J7817J5179j0405K468K8002k75
603A5330m0821p925N2872K2114o6795n5844N8944R1970k1276r4165p166Q6038
615C3276K4293p9916m3857O3569N5586l9510m7399L3568M9088k4869n2975K917
627b6229L7970Q495j4958p34Q825o33r60L927r376j6639M877J9089R6r005J6317
642B1062J9281k7692m5777J4094O2305P674p1325l6689P1116P7856m0474j01670
654e0239p150Q6503L2560o4465l8604M8920L9807l4476k9588L1213J6384m7360
666a6495l2656M8575N4913k4166n7072j09M5218J4439l4489k9557R636K5881R958
679A4076o830n735j391l360n070l404l746M058J5787O641k1161j5791K8754L1305
$$ y = [-11266, -11645, -12637, -21141, -12314, 15472, 18223, -16267, -37456, -19639, -4460, -14865, -12397, 15605, 15330, -25491, -33416, 19456, 41570, -25225, -81069, -22125, 69845, 48569, -45596, -52762, 33276, 57569, -22347, -66204, -2635, 52951, 13441, -33958, -390, 48698, 23829, -29146, -26229, 11741, 20236, 5278, 4544, 13369, 12736, 11776, 15703, 6327, -10312, -5435, 13654, 13750, 4745, 21062, 40343, 12651, -33126, -19032, 43273, 50947, -20378, -57067, 14049, 91905, 51431, -50239, -57389, 29114, 61674, -2791, -41395, 7525, 47332, 12856, -16732, 14481, 30865, -16495, -49151, -576, 54337, 30171, -26901, -27010, 18208, 32647, -1842, -31399, -21763, 4118, 14076, 7246, 1511, 120, -3240, -8310, -11714, -15460, -11402, 4385, 11026, -10135, -25926, 2828, 34133]
693C4133l2982o1067J2160P0767J4180n7525j8060N0513J4686n5878j8662N8415
705A0680K3661o7610l8168P5018P2466n0593r4109O177Q0397K3832n2349l3316
717d3914K5732L0854K509p663o488j7329j4535J3965K7838N026j5887o917N029
730a780N0R93J2823l210l5608j3912N2187M9820l7641o9478J8558P2542q402p8978
744d2036l117Q2921J8777p5237k3595P5092L2670p3828n2659N2701N8336k5585
756B4440m3109J6939L0943j3352k2079J0910R514k0693r913K6904K1427j4028
768A7903j5857N175m675j8990J3244L8975j1778o0953M93Q4567L2355q7964p0517
781g8022N9100Q0251l3603p0584K4890O1287k2449n2581K6421M8097m1337o5775
$$ y = [34133, 1151, -59916, -47756, 23011, 37191, -20334, -38394, 12119, 26805, -29073, -47735, 10680, 34341, -33269, -71437, 3581, 76047, 25454, -68655, -62478, 17919, 41751, -10598, -43914, -18182, 12672, 15181, 7518, 1030, -16299, -30834, -16869, 10969, 15995, 108, -6809, -1780, -1730, -737, 12086, 8876, -26732, -40644, 11543, 61363, 23722, -45756, -27198, 45344, 36942, -42036, -45153, 37768, 56545, -18692, -42287, 32805, 65475, -8353, -61012, -8311, 50025, 24440, -18669, -1730, 29213, 15861, -6218, 4692, 14206, -6487, -16400, 10504, 31931, 17903, 2046, 7221, 2546, -16444, -3200, 35775, 23997, -36956, -36463, 48104, 80459, -7505, -78022, -18922, 61329, 27726, -42858, -17968, 43319, 20870, -31711, -5290, 42807, 1470, -64305]
793f4305L6230Q4922q591q0795j3922O0893K2357m3527k7598K0045J6884m073
805a480N312R637j3976j8805J0094J3912j7305j5711K7170K8112k6471l7803K5875
818a1439M9167k2256o8064N86P0655K1699n4965k3266M9240K1494n4178l0141
830e1468N4733L9858n3385n3456M8456P7340j8848q2924j9793N7882L6118k6506
842H007l1117N995K0440J0360K116q458k2335j0685J9156K1475o748j2887R752
855E071J0094j6333j4237K1202J7919k8988l2128L1083N4825j1397o0515q055
867c1459N2345J4668m9630k1885M6893L2027l5718l2167L1214L3192k9659m2309
879c2488J5159L9946L19k4905l55J7493j996j5637j660P836j680n599L777R304
$$ y = [-64305, -28075, 56847, 48256, -32539, -46461, 14432, 36789, -6738, -34336, -14291, 2593, -1480, 3832, 13469, -507, -19312, -9218, 4694, -12611, -28322, -1152, 26960, 489, -37314, -11439, 37728, 15472, -52592, -52006, 18649, 40348, -14617, -37883, 11357, 32851, -21327, -51468, 3265, 43123, -10262, -63718, -15262, 62078, 43230, -39694, -59487, -1605, 34513, 8007, -23110, -17115, 3325, 13685, 15801, 7343, -14992, -25677, -6521, 14954, 8206, -4681, 5071, 15165, -1168, -15405, 5797, 23716, -5272, -37400, -6317, 48508, 37111, -23404, -31459, 20886, 35554, -14076, -35961, 10932, 42959, 7241, -24926, 6288, 39480, 9821, -32488, -17329, 22617, 22936, -1969, -2324, 15169, 13173, -2464, -4124, 3712, 2032, -3567, 210, 9514]
893I514N469p16r300j6100n074J8896J8089j3827k8215P496M0666J2088m3999
906e013l7667K6858M4230j1836m3656O794M8739K957n0970j5326M6370J8752m7961
919a7729l1176M6258M9629k6635n4287M545M4351O313l5226j6691K0172K0496
931A0020O45p649p641p316K897J0353l847j5710M410K6534M582k8587j0746K9503
945G448J3893l6973k6753L4911M2357k0962m4429J3752M4909r086n1416k909N1383
958A6125J3970m4743j8097M5522K9241l9993m1801K2639L9777j0216l0890R333
970i133K9330m950k4011L055J7136r687k0377R364K6120J612j7515l462P140l014
984A608l123Q221k735j9525M611L8341J0595m4758k8670L8752L7329l5580m7451
$$ y = [9514, 14983, 14267, 4967, -11133, -16207, 2689, 20778, 6951, -21264, -13768, 26898, 38986, -5013, -42680, -15822, 28408, 16572, -27084, -20290, 28449, 31406, -19564, -34890, 11480, 30232, -17729, -48905, -2647, 46982, 20347, -33940, -29395, 14956, 21269, -13957, -30648, -10476, 10020, 10665, 3016, -4625, -11941, -9044, 1309, -2538, -18248, -13838, 12696, 17278, -11309, -22055, 7448, 21341, -15632, -42385, -7474, 34883, 13921, -30508, -16756, 28153, 19067, -32349, -35258, 16125, 30095, -14648, -32745, 12777, 42018, 2025, -39776, -17137, 22640, 12424, -18466, -9133, 20197, 15247, -8764, -5709, 11427, 1740, -18637, -9273, 16847, 18459, 944, -2518, 4622, 1608, -1515, 6706, 3971, -15554, -10943, 27398, 37993, -6765, -35435, 3317, 40646, 5066, -42385]
997d2385K8142N9002j1638n7761L16N2136M462n4010j6208M8903K7094l4952k7062
1010b3961K7542K6952k3782l1773J0740K7045j496j7058R53J2905K327n305n958
1023h69j0308n587J6009K0832j2308k8761Q612L9600n04n0394j9105M5473L2699
1036C5389l4973l5947K9914M1257k2685m5392J1270M0185r141l8444R401M4975
1048B5809j339m3433q014L7073R848l5429j6695L0801K4556j5901k0793O831J2390
1061E704m306q899j037j26K706J4180P395j6267j6860J3895J9513j5055k8340
1074b7497J2420L7652j283l6755k960L6919N437m2963j6687M2588K8373l5896
1086f52l2283L3505M2014k6933n2952R583N1992M684m4447j1015L9987K0856k8563
$$ y = [-42385, -14243, 44759, 33121, -24640, -24324, 27812, 32274, -21736, -37944, 10959, 38053, 3101, -23961, 3581, 30533, 6751, -25022, -14282, 12763, 11267, -5791, -4838, 8067, 10394, 5089, -869, -11177, -16764, -755, 20077, 7769, -20992, -12380, 27220, 26716, -23678, -42783, 2690, 35389, 416, -35531, -5617, 35640, 12955, -32437, -21167, 19018, 9877, -28567, -19166, 25809, 24470, -18963, -26977, 10096, 19944, -15485, -32180, -1379, 23177, 7276, -13517, -6686, 5704, 1398, -7501, -8538, -8664, -5958, 8222, 15617, -650, -17510, -3615, 15898, 843, -27497, -15077, 22575, 21292, -15463, -18423, 18496, 23933, -19030, -35717, 6871, 35244, -652, -32935, 570, 42584, 15651, -37301, -27718, 24274, 28958, -15489, -26504, 13483, 34339, 5776]
1099E776k6431J2488J7770n202q503M746L935j391N653M488j4405j6407J2792
1112d691K1535j0063k2407J2391L0262r384l6692J336L6048L25m0290m529M7672
1125B1513J7464m5417k7889L8146L2666l4322m2305K3994M8115p329m2095j485
1137a8944L4040M970l0533j2338K0857J3492r431p244Q359M023p341n685J345
1150d430n20o04N296N158n075l283R390K630j7960j2954J9130K0976j5344k6060
1164b3650J5958L5632q980m5119n672M3189J5338l8477k2011L6998L3044k7889
1176H361l7793J4317L2745r240k9945O240K9783J017k1699k394J5360j361j6313
1189a0922o33J2997K996l647M074R45r561j703J2380j276k1481j776L1326J4575
$$ y = [5776, -20655, -8167, 9603, 4401, -4102, 644, 4579, 3188, 8841, 13329, -1076, -17483, -4691, 16844, 6781, -15626, -3235, 27027, 17643, -19049, -17713, 18335, 18660, -21630, -26159, 21513, 38977, -6440, -34329, 3817, 36483, 2161, -40144, -16150, 31965, 24636, -17459, -18944, 15096, 20066, -10467, -22805, -1948, 11544, 2113, -5131, 3228, 7251, -90, -5775, -4430, -4950, -5554, -258, 4900, -175, -3458, 5932, 8562, -9398, -22352, -3222, 17754, 2410, -23650, -7692, 27940, 18960, -26159, -31831, 11358, 26696, -11781, -33792, 3206, 36250, 8361, -29432, -15115, 17630, 8390, -21555, -15315, 14468, 15485, -6214, -8608, 6752, 5391, -10922, -11555, 1442, 4438, 791, 4865, 5810, -3751, -5454, 6926, 5650, -15831, -17607, 13719, 28294]
1203B8294l0580k2498K7163K7773k6450l8209J8669M5491o476m3526K35M3933
1215B3819P145m4891j9865L5584K6425k4341k4326J9154K5166j2790k4543L910
1227i553J7049k382j2199K675J1596L531m937n220n997k019Q966Q103r610j4697
1241a4694J1283K6314l060l3972j1483K9725J9655k6357k5133K4940L4375j7303
1253A4290l9435Q380L9368n534m3972j641M6842J4634m0409k0220L2224K0174
1265B4701k9672k2992K2921K3015j5539j7423J5363J6893j3862j8947N533J2221
1277B212k427l536O422J505q852J616J3291m686k3372k474K7979J2283k4173j4612
1291a8824K4439J7688k6910k5016K3992K9183k1923l3722K2116M5101j2195n1301
$$ y = [28294, -2286, -24784, 2379, 30152, 3702, -34507, -15838, 29653, 23177, -20349, -20114, 23819, 30964, -13927, -33792, 1792, 28217, 3876, -20450, -1296, 23870, 11080, -13463, -9553, 7496, 5114, -7085, -4410, 7186, 10717, 5780, 560, -5437, -7456, 1510, 9613, 3, -14694, -3411, 22903, 19843, -14129, -25612, 4113, 23768, -2589, -27722, -2782, 31593, 14290, -25145, -16765, 22603, 17069, -26903, -28544, 18298, 32932, -7477, -27697, 4527, 24701, -4971, -27963, -5042, 17973, 2434, -14989, 374, 17267, 3405, -15542, -10009, 2212, -215, -3751, 2671, 4176, -4676, -3060, 10231, 5545, -17827, -20301, 7678, 19961, -4212, -18824, 5615, 23303, -3607, -28623, -4631, 24552, 2629, -31093, -8977, 36124, 23929, -27372]
1303b7372m041M5372J3910l7291j9001K9726K3990j7692k0125Q887J2346q652
1315E7j1155O449J0706J485k483k744o760n14J2224L236j9215j2245K2389K6514
1329B7944j3253l1700K509K8744P68k8004n477K8184J1471k5355j3429K6192J8253
1342B6847k6499l0759J7358L5378l774l0183k175K5056N038k0394o932J2276L475
1355D712j1156Q1J3960N163q703r146k406K762O957N171p176j2699N917K0883
1369A4320L962k2277j6383J2476J8465n436j5398M308J7687k099k0294j152K1824
1382A0003L885k9268j3171L1946K9495k2142l6942Q184L5485K04l2244q684K5298
1395B049J4555j5441j1597J1629J0289j1265j5015L933J5032N589p865q301J514
$$ y = [-27372, -31413, 13959, 27869, -9422, -28423, 1303, 25293, 7601, -12524, -3637, 8709, 57, -11098, -4649, 6057, 7542, 5059, 2315, -4445, -4959, 7265, 10501, -8714, -20959, 1430, 27944, 14691, -17009, -14500, 14244, 15012, -12992, -18469, 9715, 21186, -4169, -17598, 8594, 26847, 348, -30411, -13053, 22325, 18551, -11632, -13807, 11249, 16287, -4107, -11039, 1237, 4712, -6444, -6363, 7597, 12760, 4057, -5089, -7495, -4733, 2224, 7395, 219, -12480, -6563, 14320, 18282, -3995, -20378, -7902, 10563, 5127, -10271, -5963, 11724, 9625, -10669, -11821, 10003, 13888, -15380, -28551, 3395, 32890, 10748, -26194, -18010, 17475, 17679, -14565, -23249, 2049, 16604, 1163, -10434, 1195, 11484, 219, -14796, -10863, 4169, 9758, 1893, -6408, -4894]
1408d894Q843N253o344j3564m118J3864J4937n919j6786J537J7515J49k1996n075
1422a6598K4629R527k6145j3954L2535K4963l2314l8713K0312M3579q231l9948
1434b0358J271L5113M892k7318m642K0313j072k3888R37K8494Q302k3585j3530
1447a5071J4754J2593q109r534J141J823p85R683R788j0849j9878M560K1480j463
1461A0133k2036J33K4550K546k5650k153K9789L030l9236j4373M1124K7962l2724
1474C095l3901K4401L5214j7289l5605R248L0534o124k6367O681K8000o71k6124
1487h908q577J5098Q964l749l685k083m646O392J5798k716k4387r722K2385J6594
1501A6758j6318j5718J6121J6629j7521k0743J7966K4447j9587l3647J6187M4768
$$ y = [-4894, 3949, 9202, 2858, -10706, -14824, -960, 13977, 8058, -8728, -7191, 10324, 10473, -11523, -16598, 8031, 17558, -8587, -22541, 9994, 34957, 2643, -36070, -15758, 27821, 19590, -20358, -19087, 16026, 20918, -6400, -11042, 9271, 8199, -15689, -14752, 13742, 22044, -1541, -15071, -317, 12276, 4167, -5367, -4226, -2403, -3188, 6495, 16283, 5434, -14444, -9884, 11596, 10133, -11903, -11770, 12780, 15326, -10324, -12477, 17312, 20342, -18894, -33267, 7857, 35819, 3095, -30806, -6405, 28809, 11520, -24085, -14837, 15697, 9573, -16794, -10113, 17887, 17216, -8908, -17485, -2387, 6577, 2828, -857, -2940, -7586, -1194, 14604, 11888, -12499, -22221, 164, 16758, 440, -15278, 843, 17472, -49, -20792, -2826, 21621, 2034, -31613, -15426, 29342]
1513B9342j733m5847j2339L7595J8559k9351k0907K0846K0082j2454j3480J1588
1525A901R142j4007j1132J0298J1377n630n632N327K807n996P05O685o017j3321
1539a3493O238K0174L7k0873j933K1534K630k5726r282K7905J6306k6490k1545
1552b4518K5778L0006j9148l8141O345L5735L016k8499n810K4380P523j9234p244
1565i811J5187L285j7821m707J9324J2522j2332j4216L171Q779J853k931m620
1578b317p018K819J6345R010j6900j9926J0461K2785n092k5168l58K7162P667
1591A9470k5478j1027K3168J3500k5490k0187K1951K7522j3385k8608P987K7989
1603A7412m055k8811k747K5654O429k0394p648J8981J1511j4461j5469M453J1133
$$ y = [29342, 27609, -18238, -30577, 7018, 25577, -3774, -24681, -3835, 16247, 3793, -9687, 1901, 11043, -2964, -14096, -3798, 7579, 1949, -3683, 1644, 4451, -1545, -840, 5845, -172, -13493, -7255, 12919, 12956, -7917, -9850, 11684, 14314, -11412, -20694, 7211, 23517, -2973, -24518, 1260, 31266, 12118, -26023, -19678, 16057, 19073, -9426, -15236, 9144, 16667, -2567, -9811, 5376, 8661, -9160, -13867, 5457, 17979, 5647, -8569, -5398, 3381, 5234, 2303, -2317, -9335, -6516, 9829, 18839, 1939, -17987, -7526, 15259, 10167, -15001, -15359, 11803, 19470, -6008, -17035, 6133, 19633, -5857, -26044, -4093, 23429, 10044, -18564, -10577, 17412, 13357, -15454, -18201, 7453, 13882, -6512, -14160, 4821, 16332, 1871, -13598, -9145, 1988]
1616A988K487l357l014l245K282J0426K916j5207j3606J1844J8646n152j7390
1629a0382L105J8805k254k0643j253K0765K666k3252n143K7658J4606k5963k2802
1642b4087J8704K5482j3143k7739O971K9093J561k4111n257J8965N317j7187q718
1655a4149J3873J0135o600o719M332L507l550k062N84k911j642Q723O763q730
1669A554r250R215J0469j1787j6860J1146K3253p215k5763M618K9962R71l4259
1682a3946j1248L0983J8894k5236k1852K0964K5745j3887k7476N289K3313j274
1694A0269j9787j233J9387N247j3994p549O584M983l724l231Q59Q77L091N859
1708G638j743j2188l503J3067O224j4108j0701J5866J8370j2565k2613O722K3594
$$ y = [1988, 4475, 1118, -1896, -5141, -2859, 7567, 10483, -4724, -18330, -6486, 12160, 7008, -10382, -7277, 11528, 9274, -11369, -12622, 8143, 10809, -12443, -17586, 10072, 24678, -1285, -24087, -5383, 20099, 6956, -20783, -13812, 15281, 16842, -7269, -12526, 6439, 11756, -5431, -14149, -276, 9859, 3259, -3460, 872, 4379, 829, -1233, -649, -3560, -5202, 3521, 10284, 1554, -7696, 1519, 11988, 201, -16659, -5513, 17740, 10525, -15238, -10620, 19342, 20313, -13946, -25194, 5789, 24683, -553, -22405, -1441, 24304, 10417, -17059, -11770, 11543, 10269, -9518, -10751, 8636, 13883, -111, -7660, -1076, 3907, 183, -3048, -2189, -1312, 1779, 7638, 5895, -6293, -9796, 3271, 9495, -4613, -15314, 552, 18922, 6357, -16256, -9534, 14060]
1721A4060l633k6478k175K8210R923k3555j3945J9212J5442j7698j9235J3327
1733f545K0350p494j7845N503J7868l618j8341j680J4264L993r929l154Q834M252
1747F458n293m083k59o64J321M986mo830j60J1717L217j5898r960J4632J4571
1762A3751j2660j7190J1871K3087p411k6633O96K6146K666k5607p490K5959J5043
1775B2228k1294j8640J4582J8974j0579j9741M569J8655K657j2197m292O101L488
1788D511l415l022j985N21O403O217n475j0886L769J3361k722j8607j665K1127
1802H132R096j9612j2394J8194J5639j7271k1975J2482K4758o248k4932L287K6220
1815A5376J483k5820r451K1541J1825j6353j1668J2950J3062q045j2513L785P510
$$ y = [14060, 10427, -16051, -18226, 9984, 19907, -3648, -17593, 1619, 17061, -637, -19872, -6545, 13805, 6311, -11534, -6031, 11837, 8219, -10122, -11802, 2462, 6455, -3474, -6628, 2206, 6458, 1165, -2918, -3177, -3841, -2520, 2466, 2462, -4368, -4528, 7189, 10406, -5492, -15452, -820, 13751, 1091, -16099, -4228, 18859, 11448, -15185, -14489, 11657, 14323, -11284, -18774, 7185, 22228, 934, -17706, -3124, 15850, 5271, -14470, -9901, 8754, 11411, -786, -5078, 1023, 4511, 1096, -1926, -3911, -3390, 3013, 9230, 3755, -7131, -3362, 9999, 7277, -11330, -12995, 8132, 17228, -2384, -14778, 3416, 19055, 1784, -20191, -7709, 17049, 10801, -14131, -10844, 15376, 16859, -8961, -18412, 3129, 14954, -1399, -13067, -117, 12945, 4900, -7613, -3828, 3682]
1828C682l604n386L806N503k460j691K399j378n651J640O198k826q694N004J4794
1843A1336k368j9122k110K0129M740k2141j0189K2719J8109j8146k2262J2735
1855f570K3831r142k6621K547K7014M391k2290p120J9120Q601j6792j2107J1767
1868c371J1965p003q486N590P216k823n646J6L64j151L797M315m879n594O635
1883I45R651p945j5667M006J9284J005k0513m119K2168J0823k1594j7829J6427
1896c358K0475j1841k1437Q589K4125l772k3287o58K0388J839j9770m011J8955
1909F237Q019j4766q528J0410P523q289q101M449O240n68q11J312l083k637N020
1924B427K998q753o718J0400J2634p855j5796N678J7578k900k1430l485K1692
$$ y = [3682, 78, -5308, -1502, 4001, 1541, -150, 2249, 871, -4780, -3140, 3058, 232, -8462, -3458, 11336, 8968, -10154, -12264, 7865, 12605, -9536, -19725, 2994, 21103, 2957, -19305, -6570, 17261, 8119, -18502, -15955, 11059, 15450, -6840, -13960, 5160, 13761, -3031, -15138, -3371, 8594, 1591, -6895, -1305, 5911, 3088, -2558, -2542, -2178, -3329, 468, 4783, -96, -5690, 945, 10596, 2651, -13016, -9010, 10274, 11279, -9234, -13353, 8815, 19638, -1956, -19785, -3358, 17117, 5276, -16161, -7572, 16553, 12781, -10506, -11164, 9224, 11063, -8707, -12718, 6237, 14256, -510, -9038, 1372, 8895, 606, -7495, -3046, 3194, 2626, 1815, 3127, 44, -2593, 2427, 5425, -3328, -10046, 354, 12988, 5133, -10663, -4985, 12593, 9693, -11737, -15222, 6470]
1937F470R515j7852j2200J6650J3969j5017j7815J0977J8588p911j8458N894K0638
1950A3448r39k0219n709J5004P398r321p711M628O832J622j255m727o728J797
1964e880J0261J642j0955m333J2861Q803j2650j2870R674J4619q786j7299P125
1977g788K1952k188k2852l139K2017N738k2038j0128K1248J5086j7723j6976J5094
1990a697J9099j2237k1994N298K0948R76j4695k785R475J832m432L16p2n503l73
2005e844J0475M481j0016o019Q866N460j0668n692J1361P271j2824q928J6232
2018D155J4539j5544k2267R238K5411k157k5247l210K4986R162k1723j3361J6860
2031H42J3407j4443j3892J1765J6108p193j3772L411R703l432o680K541L890l089
$$ y = [6470, 15985, -1867, -14067, 2583, 16552, 1535, -16280, -5303, 13285, 5374, -13084, -7190, 13448, 12509, -7710, -13419, 1585, 8983, -338, -8049, -3421, 3411, 5033, 3778, -949, -7677, -5880, 4381, 6023, -4932, -9265, 3596, 12399, -251, -13121, -3447, 11172, 2386, -14913, -7788, 14164, 11976, -10876, -14015, 8002, 13740, -8298, -18426, 2822, 17908, 185, -16791, -1697, 17402, 5165, -16829, -11531, 9417, 10393, -4302, -7087, 2388, 4220, -212, 104, 32, -5471, -5844, 4631, 9112, -904, -6923, 1943, 7403, -3265, -8957, 2404, 9675, -3149, -12077, 4155, 18694, 3150, -19117, -9879, 15532, 13375, -11872, -15082, 9904, 19066, -2657, -16018, 842, 14249, -194, -14086, -2321, 13787, 6594, -7178, -3767, 5936, 2504, -4176, -1635, 2255, -834]
2045h34n28O745M87q049k562O272O39o939K771R804k448j2991J045J6281K318
2060A2011k0467j0328J9124J8783j2290k2270N775K2436o24k1423m804J8033O815
2073A0771j5246o750J6077Q896j4185j3817R029J4432m176j2270m4R502M148m165
2087B202m349k057N82L405K477l337k571M953M726o137p934N081J0608m454j4099
2102a0904P72J7851P796j6022j4693R629J6744m923j6321P07J6313K468j3940
2115d523k904J3574K737j5478p515J4955J2189q838j2854L305J0970R00p231m894
2129e607J758L836L208N02l328k285L304J946m844l859N871O266n288r033N381
2144b172J3272j265j7659o565J6071J2295j1959j3230Q798J4937o684j5879M462
$$ y = [-834, -1362, 5383, 5870, -2179, -4741, 1531, 2170, -4769, -1998, 7806, 5358, -7633, -6588, 9693, 12011, -8456, -18784, 340, 19123, 6833, -15437, -9662, 12774, 12150, -9273, -14077, 3956, 10771, -4475, -11225, 4852, 13748, -437, -14254, -5225, 9207, 5031, -7239, -7283, 2219, 6367, 2202, -2147, -4204, -3622, -217, 2260, -1077, -3648, 1305, 6031, -106, -8040, -2959, 7649, 3195, -10904, -10132, 7719, 15515, -507, -15200, -5571, 11173, 6250, -10071, -9364, 6949, 9417, -4523, -7427, 6147, 8884, -6594, -14109, 846, 13035, 4197, -8657, -5352, 5618, 6518, -713, -5607, -3849, -13, 3195, 3697, 369, -1916, 1388, 3334, -1510, -5369, 502, 6768, 1480, -7553, -2172, 11100, 9835, -7824, -14389, 1682, 13977, 2018, -11212, -2414, 12523, 5839, -10040, -5578]
2157e578J5939m088j8489J740K1753N500k0916j0967J4350J3337q945j3114L566
2170e912J0528J176m312j687l4j795J101K757k499k876M685N281n681q071N797
2185a542J0639n911j5898K439K0175M410j9487r441J7029J2194j4543j5600J1016
2198d520J6592p865j5650O647J7310m420j9041j335J7047M906j2240n825Q434
2211D0N549m606l159K366j922l142L433N827k734m722L257L344n009l941P094
2226A675M431j0069p739J2581J5386j0331k1055L826K2426J577k1483o026K0406
2239E605J0188j7116j1828J4338J2904j3770j6023J0606J8992m898j7308J11J4376
2252F177K921j1034m425N703K945j651J95J858j979j247K083o86m674Q76Q114
$$ y = [-5578, 10361, 6273, -12216, -10476, 11277, 16777, -4139, -15106, -756, 12581, 3636, -9478, -5912, 4616, 5792, 1480, -207, -241, -2036, -935, 1822, -677, -3553, 1132, 6413, 732, -7339, -1542, 9097, 3186, -12712, -10273, 9902, 14312, -5175, -14616, 2413, 14607, 64, -15536, -4520, 12072, 4207, -11443, -4796, 12514, 8094, -10947, -12282, 4765, 9671, -2569, -8394, 40, 5589, 983, -2176, 190, -1732, -4874, -1441, 4386, 1652, -3070, 187, 3531, -1478, -5419, 1675, 6106, -3963, -11702, 879, 16265, 5934, -15121, -11295, 11131, 12708, -8775, -14801, 5605, 15793, -1323, -13151, 1187, 14091, 321, -15702, -5096, 13896, 8998, -8310, -8199, 6177, 9098, -1936, -6361, -658, 2287, 636, 831, 2689, 710, -537, 1546, 860, -3814, -2938, 5176]
2267E176O83j0321k954J3010P331j4183j3145R962J7911n352j7772J301J7583
2280I230J674j7083n132J5325O689j4544q581J3847J3295j0637j5703M822J4148
2293G350q44j1588j665Q290L327l673j933M12j193k13K597O99m418K7O525J179
2309D879q456k077Q567L004j0755n768J2692R579j0669j2829Q659J4441p139j6959
2323a2831L986J8356k16j7485k867J7948O312j7382j1405J3469J3548p586j3698
2336i851M074J3104m64j0272l115O003K973l049j194J671J320K28K62k259l361
2351c930K442N212k080o702J276J0867J452j3388n586J1908R295j0390j2310R359
2365b575J4918n380j6384J765J5859J193j6222m271J5168Q070j1569r314P891
$$ y = [5176, 5859, -4462, -7416, 5594, 12925, -1258, -14403, -4441, 13470, 8118, -9654, -8353, 9230, 10904, -6179, -11311, 4014, 10703, -3841, -12422, 1425, 14720, 4083, -11620, -6798, 7350, 6506, -5082, -6747, 1543, 4870, 1197, -736, -324, -1517, -1730, 867, 1566, -2852, -2825, 3700, 4879, -3577, -5654, 2913, 5917, -4838, -10606, 2086, 11665, 996, -11833, -3174, 11267, 4128, -12831, -8845, 9511, 9295, -8190, -11057, 6891, 13203, -4179, -15584, -2115, 11433, 3847, -9851, -5777, 7327, 6863, -3409, -6524, -521, 2452, -597, -1791, -120, 1200, 1428, 1690, -569, -3930, -1488, 3724, 1644, -5058, -3782, 7085, 8537, -4851, -10437, 1471, 10766, 376, -11934, -2575, 12343, 6963, -9421, -7656, 8203, 9396, -6826, -11097, 4071, 12141, 572, -8742, -851]
2378h51Q926n315q870K405P087j37l955R10J663r13j387Q45j510j218L013M347
2394E040l571o289M093Q169m125j2275J572J4570K486j5083n436J5308R871j4688
2408c58j4483J0845J6432o811j6671L806J6976N3j6005l982J3407M591j1100n108
2422h408R797O250o730o530M295M900k958m362J538K218L23J309P76m365l075
2437e022N423M706n946q372O371J2147l250j4241q1J4810K837j4937o990J4290
2451A745J0550j1288j2093Q896J2625o913j3869M205J3086p16j2129o75J2135
2464E559K714j0588n256O656N927l506m253J235L011R99L5j677m511q17P010L844
2480F382p240o163P264R349o515j1511L150J2825j319j3539K87J4661L066j4528
$$ y = [-851, 8075, 2760, -6110, -3705, 3382, 3245, -710, 200, 1863, 950, -437, 408, -1102, -2320, 693, 5040, 1469, -4820, -727, 7442, 3317, -8958, -7386, 7184, 9670, -5413, -10849, 4459, 14330, -358, -14841, -3996, 12436, 5625, -11046, -7240, 9736, 9789, -6216, -10198, 3209, 7800, -3300, -8408, 1389, 7639, 909, -5621, -1326, 3574, 616, -3746, -2208, 10, 333, 1642, 2418, -1947, -5022, 401, 5107, -839, -9211, -2840, 9307, 6057, -8184, -8265, 6545, 9382, -5555, -12545, 1745, 12295, 1007, -11086, -2190, 10435, 3522, -10347, -6142, 6944, 6228, -5901, -6576, 5559, 8273, -2315, -7571, -915, 5012, 1506, -2747, -1512, 1499, 2498, 2533, 856, -3655, -4472, 2538, 6382, -858, -7021, 243, 9592, 3077, -8434, -5284, 7541, 6222, -7317, -7030, 7631, 10697, -3831]
2494c831o711J2928R109j2188j0980R869J3835o085j4556K994J2999l91j2653
2507e661k401J0087N288o328n303L353L973j132k881p47n9J250L496K80m803j759
2523c347M797K636o042m467O572O310n631q085N905R907n371j2841J891J4342
2537F576J649j3950m431J3541P506j1129j0724P417J1706m819j1247K889J0327
2550E311J82q266j902M809J730k459j187Q25K28J892K063k572n327J464O508j69
2566C130q267m70J0017L328j1024n373J0142P680r919j0880Q805J3861m342j5033
2580h345N68J4987K020j4451n693J2697Q691r675q504O848Q444m967q639K876
2594c143P207j480m995J447M170j124k547M23K10j816J231L514j534m551K061
$$ y = [-3831, -10542, 2386, 11495, -693, -11673, -1804, 12031, 5946, -8610, -5616, 7383, 6992, -5661, -8062, 2025, 7313, 985, -4318, -965, 3008, 1876, -1005, -1752, -1811, -561, 2935, 3215, -1588, -3347, 1450, 4086, -1956, -6423, 149, 6459, 828, -7257, -1352, 8555, 3184, -9657, -7766, 6576, 8225, -5725, -10156, 3385, 10891, -238, -10962, -3545, 8161, 3342, -7905, -5016, 5311, 5493, -2773, -4675, 134, 1864, -595, -1782, -957, -729, 1163, 3226, 654, -4673, -3209, 3299, 3130, -5137, -5607, 4410, 7738, -3286, -8659, 1483, 9163, -756, -11636, -2831, 11030, 6688, -8345, -7777, 7210, 9230, -5221, -10914, 1783, 10474, 799, -7705, -857, 7587, 2620, -6019, -3143, 4064, 2584, -2411, -964, 3206, 2082, -465, -42, 168, -1648, -417, 3097, 1563, -2988, -927]
2609i27P126j857r965r22J0945L784j1154o040J0951R247r253j1688N850J2473
2623H570k925j3731J301J3968K004j3059m594J0974N734r466p112P242Q179m845
2637B240p172K667N794j236m929n23K671J127P19M07l149k360M483M355m933p818
2653g657L240J1217l95j1397k814J1262M521j0691p346R474R543p511j0987O229
2667c312J2572l792j4381l78J4299L601j1775o008R932P637o988q004L580O476
2681C459k067m632J757L306l90j586k3q30r26K201J792l180k825M635N253m180
2697A764p409K645Q296j616q951pJ0816J914j0311n045J0300P282r498j0428O937
2712c311J2954k698j2603j022J1390K885r041m471N967M716l902k867K903K367
$$ y = [-927, 6199, 4342, -5623, -6545, 4400, 8184, -2970, -9010, 1941, 11188, 1935, -9753, -3903, 8570, 5645, -8086, -6785, 7183, 9187, -3872, -8466, 2508, 8242, -1224, -8336, -1094, 7085, 2240, -4932, -2265, 3529, 2293, -2636, -3159, -488, 639, 1358, 1765, -1384, -3744, 739, 5094, 161, -7657, -4417, 6800, 6405, -4992, -7806, 3456, 7977, -2714, -10060, -586, 8957, 1446, -9541, -3312, 9260, 5468, -8913, -9291, 5008, 8609, -3166, -9174, 758, 8395, 1407, -6597, -3017, 3459, 1392, -3240, -1483, 1823, 1433, -153, -176, -1006, -1932, 269, 2061, -1119, -3944, 691, 5944, 1764, -5645, -3000, 5296, 3680, -5271, -5278, 5538, 7452, -2859, -7904, 2396, 9678, 180, -10248, -3311, 9643, 6945, -5658, -6680, 4710, 7595, -1446, -5917, 50, 4766, 864, -2003, 900, 3267]
2726C267k742j959R40R76K18J459j104l906J260O507Q82r111m684Q777P725o098
2742B407j0152M614J0720j555j1326j373J0651K706j0448m045R995P201q725r423
2756h753N353J0074k695r942Q65Q026K009o572k029M505J648l650k352K115K607
2771A209Q80j714k315j516L296M282k575p768K67R404M123q493o710N825P888
2786F083m671q173L407Q150j831q799J203J0336J067j1444m803R900Q277p109
2800A593r142M092R717j370q657j434O741J907n042j763M089L030k616l022N5
2815a822K059K181o40l389k072L967N555k041q038r71Q048L262p456m977O656
2830C22P262n205q421L135R701k157j0596r99J1465M932j0232p094P214Q580m816
$$ y = [3267, 525, -1434, -494, 482, 700, 2159, 1055, -2851, -1591, 4916, 5798, -3313, -7997, 780, 8505, 2407, -7745, -3131, 7589, 6034, -5292, -6665, 3986, 6692, -3756, -7801, 2194, 9395, 670, -8753, -3400, 6674, 3979, -5963, -5098, 2928, 4937, -1635, -3664, 841, 2489, -1161, -3513, -1398, 1209, 2089, 375, -1940, -3456, -160, 4122, 1547, -6221, -5954, 3450, 7573, -920, -7630, -1805, 6083, 1412, -6761, -3354, 4796, 2965, -5834, -4631, 5705, 6772, -4672, -9475, 425, 8702, 1593, -7549, -3457, 6260, 4890, -3767, -5201, 1540, 3447, -1595, -3358, 731, 3761, 1145, -1877, -1822, 237, 2418, 1778, -1611, -3683, 284, 5839, 3798, -4240, -5211, 2837, 6099, -1357, -6334, 322, 7584, 2379, -6042, -2907, 6794, 4637, -5959, -6958, 4507, 9439, -793, -7887, -673, 7907, 3091]
2845C091q993K142Q485n36o744k40O346On848j133M195K265k153k386o0J552J996
2862A985J434l609m959K220O923J182p833l185O887N330o603o591N220P772m489
2877A684r460M100J1572j632j3332k022J2789N127j0857p494Q231Q596m847p946
2891e491K944O078k218n473J555N053l46l557n95J847K49O14K57k061k656K370
2907a430N743j256p173k14P265J139p436k219P971L381q416m732R016P526q274
2922H91j1145N648J2932j435j2568j970J1165M300q560n501N735N124m035l780
2936c199K878M250k046l998N47K786n8q71j35j512O64L465J271m469m197M075
2952e49N940l146p046J621R008k17r685j863R669L829r499o514R037Q742o342
$$ y = [3091, -5902, -3760, 4725, 4189, -2555, -2795, 3551, 3557, -2291, -3424, 771, 3036, 883, -1503, -1563, -11, 1985, 3419, -190, -5149, -2929, 3994, 5176, -2657, -5842, 1045, 6375, -228, -6819, -1599, 6173, 1684, -7776, -3676, 7896, 6264, -7068, -9090, 3699, 8826, -2031, -9525, -1294, 7302, 2455, -5491, -2547, 3531, 1313, -4160, -2605, 2448, 2102, -1455, -2050, -203, 46, 660, 917, -1144, -3800, -1430, 4313, 3057, -4116, -4330, 2935, 4074, -3362, -5581, 2390, 5771, -2645, -7377, 1639, 9165, 891, -10254, -4606, 8326, 6891, -5677, -7647, 3518, 7818, -742, -6243, -508, 4616, 581, -3199, -321, 3929, 1883, -2115, -1568, 1218, 1160, 289, 154, -1358, -694, 2771, 4042, -427, -4624, -549, 5391, 2245, -4801, -3180, 5828, 5611, -4074, -5937, 3732, 7561, -1938, -8452, 585, 9327, 2985]
2967B985j0076L154R924o11r620j282P964K834n991l219M851L186m422l449L098
2982f74L095j082k224n50J560J063P45j654l513m2N075K936n653m670M322O837
2998E571l294q199J641Q952P2r394j107R066L658q493o329O790P365m805q441
3013f947L463Q912j702p940j84P004R54o274k106N416L434l238l567J332K231
3028G88J81o41j422j470J494L756P25n460k750N745M453n463o398M489Q330k794
3044C563r060J337R265O39r811k907R286N014p736o031O230P288n102p908K808
3059c125Q120o96p688k86O548J630m896k694K694K450r08j503J14L05P47J380
3075B192j112k815j16L876J167m894j769N439L511n663n212M628O750l812q233
$$ y = [2985, -7091, -3937, 5987, 5376, -4244, -5526, 2438, 5272, -719, -3938, 913, 4099, -323, -3772, -674, 2421, 1339, -885, -1435, 125, 1188, 1933, 279, -3234, -3276, 1799, 4735, -918, -5588, -1266, 5571, 2277, -5922, -4281, 4671, 4743, -4651, -5758, 3308, 6966, -1527, -7856, -1066, 6299, 1494, -6947, -3484, 5428, 3726, -4214, -4398, 2606, 3560, -2714, -4820, 596, 4030, 792, -2775, -1443, 788, 969, 328, -1094, -2564, -1070, 2686, 3411, -2049, -4799, 946, 5399, -64, -6462, -1973, 6357, 3563, -5497, -4160, 5105, 5744, -4067, -6974, 2312, 7326, -410, -6441, -211, 7077, 1975, -5933, -3125, 4995, 4299, -3389, -3675, 2873, 4503, -393, -3087, -393, 2057, 1149, -354, -240, 65, 812, 2192, 1080, -1735, -1851, 2025, 3192, -1702, -3471, 1968, 5479, -184, -5396, -768, 5982, 2170, -6063]
3090f063K590R104m61r187j923Q691L603p675n302N977O777l810o888J601O210
3105C244j86n492j286M137J939j752k021P16R93L67l71j830m38K125K114j949
3121C10l691J517M817m25o118j566O483M087o120n633M982P243l209q837J357
3136d803Q310J018p756k484P808L770o156n383M209N668k450n283P22M835O51
3151B676k896j557J560Q13Rq89n21j07K151J112k576k466K361L772k272n471J840
3168b461O884Q5p357j795O692L777o353n479N586O823l863p661K746P874j128
3183D370q080j257P299L327o132l689L959M479k734l934R39K994l13j341N50k14
3199B23l04J070P17j976j879K263K810k868l778K933N532j900p393O58P619J220
$$ y = [-6063, -3473, 5631, 5170, -4017, -5940, 2751, 6354, -1321, -6623, -646, 6131, 2321, -4567, -2966, 3244, 3058, -2434, -3720, 417, 2356, 604, -1417, -701, 292, 659, 288, -1542, -1980, 145, 2259, 310, -3381, -1864, 2953, 2528, -3590, -5156, 1327, 5414, -706, -6339, -1357, 5886, 2677, -6160, -4803, 3507, 4525, -3231, -5715, 2093, 5863, -293, -5676, -1467, 4201, 1751, -3532, -2810, 2025, 2676, -220, -1777, -217, 596, 605, -284, -805, -912, 1239, 2351, -225, -2691, -330, 3442, 1170, -4301, -2461, 4423, 4508, -2849, -4644, 2048, 5825, -528, -6007, -421, 6402, 2539, -5122, -2376, 5498, 4370, -3710, -4967, 2332, 5659, -473, -4162, -203, 4276, 1542, -2392, -1453, 1541, 1228, -113, 437, 223, -81, 989, 1706, -270, -2149, 114, 2924, 56, -3722, -789, 4743, 2843, -4550, -3892, 3727, 4947]
3215D947p740l452P617M840o277o674N342P038l711p608J711P996P43p761k207
3230e196O348L392n242m065L212M707k132k968L13K332R4j456n05J87N84J137
3246G42J63k452j287M067J747l684m293L672N780k203o744O74P970O80p564l140
3262e872O717N032n650o043M214P160k518p404L67P161Q45n897k747N642L229
3277D236l756l460K053L445j482j783k96J562M09N7n14j436L43K034P12l366j480
3294b722L562L985m057n340L245O245j660p057j33P363K117p011l720O132M975
3309E924n057n974L512O293j669o382K31O152Q18n138k357L882K982k346k655
3324a784R96K018K87j430j081m85J497J995j435k999P69M160K87n028j885M985
$$ y = [4947, -2793, -6245, 1372, 6212, -65, -6739, -1397, 5641, 1930, -5678, -3967, 4029, 4772, -2989, -5196, 1152, 4544, -698, -4763, -1551, 3156, 1024, -1944, -1631, 701, 795, -661, -1166, -979, -395, 742, 905, -1547, -2834, 1233, 2980, -704, -4997, -1325, 4455, 2252, -4492, -3818, 4152, 4832, -2732, -5872, 845, 5877, 227, -5816, -1602, 5558, 3040, -4364, -3997, 3164, 4009, -1888, -4635, 1007, 4236, 480, -2980, -927, 2518, 1036, -747, -1043, 519, 928, 985, 471, -965, -622, 1412, 2124, -1242, -2722, 840, 4825, 768, -4572, -1327, 4918, 3258, -3799, -3932, 3431, 5548, -1463, -5183, 949, 5924, 867, -5107, -1595, 4698, 3029, -3353, -3122, 3030, 3848, -1290, -3647, 235, 3217, 871, -1784, -788, 1230, 1517, 87, -994, -1479, 18, 2013, 578, -2421, -1652, 2508, 2795, -2233, -4118, 867]
3340H67L586m862m691L777O181k313p194Q63O778R85o904k219O122L786m998m484
3356d720L452N171k109n690Q53N145O69l999j264K636J197j060j180r1P7R49J388
3373A424j204k303P76L359n87m348j46M829J681m998k817N272M101m836n850M021
3389a626P079k261p573L36P520J301o800k802N850L654m374m778L688N673k785
3404B102n237Q48M943L9l519j260K018J538k41r53j379Q0J376K115j704l618K159
3421f93M263j009n628J86N970J314o520k934O310M882n387n899L439O576k309
3436B561o511N80O361P29n945j604N608K582m818l772L132M232j269m339J68K590
3452B85J471r04j349q48l2J598J327j395k328J338K950j378l407P63M282o98m573
$$ y = [867, 4453, -409, -5100, -1323, 4858, 2545, -4649, -3786, 2992, 3977, -2927, -5146, 976, 4762, -236, -4720, -1268, 3903, 1794, -3896, -3043, 2102, 2771, -1228, -2492, 144, 1341, 281, -899, -990, -913, 36, 1424, 220, -2083, -1307, 2052, 1465, -2883, -3029, 1800, 3481, -1517, -4334, 938, 5039, 203, -5647, -1626, 5453, 3192, -4381, -4045, 3475, 4776, -2024, -4826, 1024, 4678, 304, -4474, -786, 4887, 2102, -3135, -2287, 2656, 2695, -824, -2084, -66, 1472, 1231, 278, -1101, -1021, 355, 2470, 766, -2852, -693, 3570, 2561, -3067, -2881, 3089, 4403, -2117, -5051, 1259, 6141, 754, -5145, -1706, 4870, 2561, -3950, -3370, 2991, 3720, -2225, -3829, 1779, 4361, -457, -4229, -1097, 3135, 1866, -2473, -2305, 285, 1756, 852, -497, -1345, -1377, 221, 1548, 153, -2175, -837, 2113, 735, -2672, -1909, 2373, 1675, -2898]
3469b898J20N460O98n730k606N624M477m817n869L313O496j120o654o04N653K304
3485C847m849l022L934L345k261l628R32L005L30k107j110J120J012L30r86p55
3501h63M43J379r2j599n32K310J405l114k329L178M152k734o004J064O999J606
3517E269o809l630N338M920l372n605J710N049m47m467N50L930N40m185j381L494
3533I04J999k338l052J296K522R6j506q63J80J038Q88m63j863J61K472N19l052
3550a062j782L557K945l011m757K204N769o85o094j149N686J994m591k757L605
3565a28L546l048m004K516M732k071n064M26N422R32m524k692L216L511j022l462
3581a714n07J846J596j79j411j202P25K229k93l017j53L547J043l879k311L858
$$ y = [-2898, -2778, 2682, 3380, -2350, -4956, 668, 5145, 328, -5541, -2228, 4268, 3148, -3506, -4110, 1543, 3847, -1002, -4024, -90, 3255, 994, -2634, -1702, 1303, 1633, -474, -1584, -464, 548, 878, -108, -863, -420, 959, 867, -732, -1264, 1046, 2451, -663, -2992, 186, 4338, 1604, -4400, -3336, 3663, 5269, -1540, -5170, 168, 5088, 1716, -3889, -2179, 2870, 2423, -2044, -1494, 2436, 2976, -1209, -2590, 904, 2903, 565, -2487, -1191, 1331, 1427, -79, -942, -762, 276, 1164, 701, -1162, -1001, 1471, 1990, -1062, -2844, 713, 3658, 647, -4110, -1906, 3863, 3178, -2916, -4065, 1621, 3615, -976, -3733, -128, 3418, 370, -3634, -1118, 3614, 1543, -3521, -3095, 2327, 3259, -1265, -3957, -741, 2770, 1748, -1714, -2221, -375, 1221, 1042, -369, -1571, -846, 1383, 1090, -1927, -2080, 1467, 2510, -1369, -3680, 178]
3597A78L724l530m905K899N386j243n812j32N732J598n365k510M329L807l860
3612B96m188K748M793j751m595L20L978O10k694j355J560J107k29m89n5j046R57
3629c3J335l94j962J64K291L20l026p38L679J723m135k787M001M003k843n629
3645d031K031N514j79n942n60N006K121m542k896M060L666l653m198K172M234
3660B803k77m284o07K852J561j362j766K67J030R72j047q50jR09J368j886j252
3677a570J136K560r27l463l51M481J395m518k839L818M149k953m717J812M742
3692B755p20m159r86M765J471m218k589L318L222j977l721J075L208M16k934j157
3708b231J889J397q63j044j39J136P01o76j753L24J791J494k174k129J752K970
$$ y = [178, 3902, 372, -4533, -1634, 3752, 2509, -3303, -3435, 2297, 3895, -1470, -3980, 349, 4156, 296, -3892, -1144, 3649, 1898, -2697, -2377, 1601, 2211, -483, -1838, -278, 829, 600, 111, 56, -990, -33, 1302, 908, -1054, -890, 1401, 1721, -1305, -2043, 1636, 3359, -776, -3563, 438, 4441, 1598, -4031, -2000, 3514, 3335, -2607, -3167, 1839, 3960, -582, -3478, 582, 4248, 595, -3603, -1431, 2803, 2526, -1758, -2365, 487, 2048, 686, -1080, -813, 217, 1189, 142, -708, -709, 200, 1568, -318, -1570, -434, 2126, 1199, -2264, -2615, 1866, 3261, -1257, -4096, -278, 3871, 918, -3799, -1987, 2755, 2035, -2124, -3110, 1655, 3126, -1092, -3681, -363, 2859, 882, -2839, -1764, 1444, 1860, -1074, -2231, -342, 1055, 192, -852, -991, 145, 846, 170, -1583, -1259, 532, 2026, -148, -2277, -525, 2445]
3724B445o93m066l08M135J772l940k957L454L704k255m369J602M187l80m245m69
3740b383L737J744l220k764K570K564r74k255k64K580N15j382j511L86J479N95
3756A417j131j558N76K025O69k746j413K608K291k180l573J825M129o57m716n7
3772b491M421J364m422k296L947L058k787m175J687M512n02m158r10L723J387
3787B358k703j771J926J653o75j870p7J455L27n45q55J7O76J024m83j721l48J966
3805C54J541k658k311K525L104k089l405J140M372n88m584m28M708J659m206l011
3821c877L502L705k439m241J287M351K73l874j164L382J224k161j949J505J788
3836A312o42j651J88J031Q81o05p16r55P45J843n08j938o27K600J485k480k427
$$ y = [2445, 1752, -2314, -2622, 1513, 3285, -655, -3612, -158, 3546, 1291, -3078, -1476, 2711, 2331, -1914, -2383, 1354, 3098, -122, -2886, -316, 2248, 1274, -981, -1245, 1335, 1850, 468, -1043, -657, 822, 1417, 286, -1272, -696, 1329, 1998, -748, -2161, 447, 2738, 558, -3015, -1190, 2939, 2282, -2434, -2491, 1930, 3294, -1128, -3424, 523, 3581, 794, -3381, -1694, 2818, 2316, -1842, -2752, 971, 2358, -345, -2116, -190, 1463, 788, -1082, -1159, 296, 623, 78, -777, -760, -84, 940, 457, -1264, -1612, 354, 1895, -763, -3074, -549, 2555, 466, -2939, -1799, 2573, 1985, -2599, -3027, 1681, 3340, -866, -3877, -375, 3330, 891, -3350, -2063, 2288, 2561, -1313, -2477, 905, 2129, -32, -1981, -476, 1312, 670, -981, -793, 238, 1119, 514, -202, -1157, -412, 1431, 923, -1015, -1642, 958, 2443, -37, -2464]
3853b464K421K945j637l976J182M300O4m607j392M330K457l420l456K722L910
3868C379k106l537O86L790j70l504l93K921J209k261j811J350K113k98k161p1
3884h64R32J213M4j606j281J077K231j34k940q27L025K030l223k320K182L367
3900B906j647m035R20L956N93m390j418L813J930k799k564J616L133j169l051
3915b206Q46K849j03k345q16J932J308j148j640M02J059Q88n37j764m25J895J774
3932A969j677k318O87L031k2l445p42L410J573k877k407K740K773k140l463J255
3948a653M200n86m083m73L487J676k956k181K140K601j410k494L81J961J057j744
3964g7q91N53J541R2j159j164L64K084J03j835j297K138J862j647k475N49L394
$$ y = [-2464, -43, 2902, 1265, -2711, -1529, 2771, 2835, -1772, -3164, 1166, 3623, 203, -3253, -531, 3379, 1273, -2264, -1578, 2212, 2042, -1462, -1855, 1066, 2275, 14, -1797, -447, 1666, 1368, -793, -864, 68, 1281, 1325, -281, -1562, -485, 1746, 1612, -1328, -2155, 870, 2900, -323, -2643, -461, 2906, 1259, -2776, -1856, 2100, 2693, -1697, -3115, 698, 2628, -171, -2735, -1119, 2014, 845, -2206, -1360, 1489, 1386, -959, -1775, 157, 1465, 317, -1323, -921, 138, 1026, 489, -1275, -1700, 195, 1969, 292, -2026, -1339, 1692, 1670, -1775, -2517, 893, 2466, -411, -2818, -78, 2695, 555, -2908, -1653, 2547, 1961, -2122, -2595, 892, 2568, -388, -2569, -429, 2172, 762, -1732, -1351, 610, 1667, -77, -968, -415, 1126, 1218, 59, -1105, -741, 1343, 1446, -389, -1686, 452, 2314, 667, -1808, -1259, 2135]
3981B135j34l313p80L691J342l311k458K932K953k284l390P89M608m2m120j087
3997b469L244K029k671k418J924K622j029k265j44J782N88j084n56L02M97J28
4013D80j68o58n15J489O39j375j673J517J973r25l173O84L674K2m023p97L547
4030G18K031l375k789K911L287j695l578L89L448P50l196j432K420J979j955j767
4046a854Q34J891j93j610k6J363J77n04o24O4R70N0n47j075J05K066M58k043k179
4065b677K377K586j298l134M24L608K78l544j077L132K181k902k648K044L204
4080B554j277k635oK669O20k495r96J927J560j829j106P38J517l91j432K08R34
4097E60M00k91q04o05R52J553o70k417K2K387J536k733k044J495L066j129l199
$$ y = [2135, 2001, -1312, -2092, 1599, 2941, -370, -2828, 104, 3057, 773, -2617, -1828, 2780, 2738, -1382, -2469, 775, 2804, 133, -2285, -361, 2261, 1232, -1033, -1177, 605, 1193, 109, -447, -145, 352, 480, 312, -346, -861, 628, 1267, -108, -1781, -264, 1709, 784, -2389, -1705, 1969, 1991, -2032, -2829, 718, 2749, -626, -3415, -504, 2783, 1088, -2490, -2101, 1347, 2097, -1099, -2531, -111, 1868, -87, -1854, -1020, 871, 678, -932, -958, 405, 582, 78, -546, -482, 488, 538, -9, -1084, -979, 1087, 1545, -498, -2677, -300, 2286, 988, -2146, -1722, 1886, 2164, -1380, -2457, 675, 2856, -46, -2694, -650, 2554, 1277, -1358, -1364, 1305, 1925, -570, -1566, 361, 1921, 92, -1014, -276, 1241, 850, -582, -374, 560, 960, 669, -135, -740, 212, 1765, 1095, -1322, -1300, 1087, 2623, -110, -2154, -659, 2407, 1278, -1921]
4114a921M20L376k60l013l01K598J295k475k055K070K515j412k540M42K565K09
4130A513k030r92J207J317o35j282l56J285P32k92j090n44J252J218j475j483
4146a655O62K308o3k661o60K739J071k277j698J967K344j845k352R97L131m59
4162A549l642p7L104J059k279k087J377K808p14k439PJ433N72o16r17M21N28K38
4180C25n58o72P56P09j71j228l34J456J170j486j792R45K817l73k752o21K651
4197H42J229k141k115K017K582j434k458K99L029L78k867j099J882J758j263j807
4213a168P04J766l78j379k79J069J105p22j636R99R23k48r11p70R17J170J39j932
4231f31n93J217K045j102k491N45K168P64k372j335K004J564j679j872J146K456
$$ y = [-1921, -1501, 1875, 1615, -1398, -1699, 899, 2194, -281, -2336, -266, 2249, 837, -1703, -1261, 1304, 1513, -517, -1509, -302, 1015, 380, -902, -1258, 27, 759, 467, -623, -1167, 85, 1303, -172, -1655, -993, 1315, 1252, -1409, -2069, 670, 1741, -536, -2234, -267, 2077, 232, -2120, -1123, 2008, 1549, -2093, -2170, 934, 1993, -286, -2373, -996, 1812, 1098, -1341, -1334, 99, 671, 55, -862, -441, 87, 325, -233, -905, -149, 560, 389, -839, -1173, 283, 1453, -33, -1825, -880, 1937, 1564, -1188, -1809, 842, 2071, -70, -2185, -168, 2414, 980, -1478, -1179, 1850, 2228, -639, -1738, 144, 1902, 639, -1168, -464, 1302, 924, -455, -734, 335, 1440, 718, -918, 81, 1004, 756, -155, -925, -8, 1162, 1301, -631, -1224, -7, 2038, 936, -1555, -1010, 1158, 1922, -450, -1785, 219, 1783, 104, -1768, -622, 1834]
4247A834r53k711L08L127K32k684j267K181K002j882k424R66K881q73j785m70
4263a518J556P50j020j107Q20P84L30j101m21L50Q16N16j223r57O25K005m79k113
4281a387M3K345K44k219j171K356J679j890k337J314K960q11l039K1K687J433
4297B228k615j603J398J660l47j888K50J476K2j245j37N89J128j5j270l98R68
4314B01Q73o93j080M3J632P25j733j588J726J492r16k029N59K345j64k254r43
4331a804K530J537k177j849J082K601n86k548k1K148Q29k085o45R62J399j027
4347C46m45n14J217J53n26p52M10N82L98o75j109M82J819n71j869n3J760O61j516
4366b02j559J451K123j380k115O43K498K0k931n73K314J525j504k163O84K158
$$ y = [1834, 881, -1830, -1522, 1605, 1837, -847, -2114, 67, 2069, 187, -2237, -1271, 1610, 737, -1048, -1518, 38, 788, -232, -1339, -519, 265, 595, -506, -927, -577, 239, 755, -468, -1425, -800, 1205, 726, -1387, -1344, 1001, 1245, -974, -2145, 211, 1890, 0, -2337, -1023, 1937, 1126, -1913, -1892, 795, 2228, -387, -1990, -592, 1068, 721, -1167, -917, 559, 581, -664, -801, -212, 916, 901, -369, -767, 201, 1074, 381, -699, -656, 976, 1701, -32, -1620, 106, 1598, 682, -1347, -788, 1557, 1393, -861, -1804, 726, 2263, 86, -1763, -681, 1920, 1334, -1214, -1235, 913, 1742, -343, -988, -26, 1373, 346, -99, -613, 604, 757, 231, -521, -111, 471, 869, 194, -915, -433, 1386, 815, -1054, -1107, 653, 1314, -202, -1761, -310, 1813, 433, -1682, -1039, 1459, 1479, -1452, -2025, 289, 1814, 310, -1853, -1169, 989]
4382I89k57j780NJ298M93q30j037N50R56l38m53n13Q12M80j98q42r9J014P25j297
4402c22j025Q82J537n1k042p43K228J424k295j925J912K438j032k752L86K585
4418A205L15k319j150K040J685j634j417R78J524m93j635J9J646M61j608q92J063
4435b12J231k14j117r5O02O43q6j109k22Q44J061o91j519K88J695K68j700q73
4453a206J912J047j191j725P17J900n13j816j21J966N16j811j331J901J304j124
4469D25j619P04J208L62j666r91J597J214q79j014k15J102Q45p77j215K25J236
4486E42J90j044j076J334J188q60j483N68J760q3j965o98K045J129k023j257J094
4503f39J957m56k104J49J694P73k015q45J292J377o48j740K39J429N57j322j082
$$ y = [989, 732, -1048, -1043, 255, 748, -82, -1119, -569, 387, 49, -404, -917, -105, 375, 177, -665, -764, 250, 975, -322, -1347, -465, 1072, 1021, -1021, -1764, 464, 1888, -407, -2332, -420, 2018, 986, -1766, -1380, 1205, 1520, -799, -1949, 91, 1776, 142, -1275, -297, 1227, 734, -901, -882, 764, 1225, -383, -1275, -212, 1019, 805, -312, -407, 195, 838, 752, -357, -579, 265, 1326, 635, -884, -596, 1099, 1367, -333, -1206, 706, 1753, 562, -1163, -446, 1454, 941, -875, -996, 970, 1486, -325, -1656, 245, 1549, 425, -1194, -490, 718, 1080, -586, -1577, 20, 1234, 355, -659, -874, 228, 1073, 296, -919, -694, 542, 732, -312, -1388, -54, 1134, 274, -1209, -641, 1119, 1036, -929, -1627, 418, 1547, -476, -1733, -639, 1318, 862, -1242, -1093, 601, 1374, -641, -1486, -194, 1183, 535, -1205, -966, 463, 1020, -302, -1384]
4520a384J125J067j39j299m66R28R56l98j553M14J345M4j213p34J445J000j096
4537D2j616Q82J668J11j828p89J846J127j289j364Q85J560m22j648n4J529N58
4554A198r90j428J132J225m21j291n6R93O35o35q95J07J039J03r67q9J90J295
4572A145n46j146k19J448Q11j539j146J115J913j100j904Q4K438M41k352r87J872
4589C28J364j656j383O23J805m8j734m11J900L83j396r49O84J524o37r83l72R56
4607bP07r51n37K48P39J10l82o96K44Q84k3j112k95J277O63o01j651N65J844l73
4627F58k188L53J606O43j321j065J077J476j334j313M01J980j10j810k68J386
4643A71Q85o45j380M93R54J99j032n71O58J012n82p02J99M93O20o18j033O03J207
$$ y = [-1384, -259, 808, 669, -630, -1096, -168, 788, 390, -1163, -749, 596, 640, -573, -1307, 138, 1138, 42, -1574, -692, 976, 1087, -741, -1530, 316, 1443, 154, -1210, -325, 1235, 813, -835, -889, 640, 1198, 208, -1220, -88, 1137, 716, -575, -631, 362, 997, 362, -533, -426, 613, 716, -251, -340, -150, 1145, 599, -547, -766, 682, 1493, -46, -1192, -77, 1836, 736, -1168, -1084, 1354, 1795, -557, -1544, 328, 1692, 36, -1347, -724, 1081, 1033, -701, -1112, 788, 1171, -225, -1174, -490, 1034, 397, -586, -958, -2, 705, -246, -783, -535, 204, 314, -68, -764, -520, 364, 341, -771, -1066, 211, 874, 273, -1378, -813, 1031, 658, -1530, -1177, 429, 1072, -249, -1314, -237, 1239, -95, -1408, -1007, 973, 863, -947, -1215, 171, 1056, 411, -969, -476, 478, 677, -355, -926, -268, 744, 162, -540, -341, 152, 772, 154, -879, -276, 931]
4662I31k57r75p88J521R82j209j341O13J747j99j840k69J861O10j414j087Q92
4679b22J613p21j648L96J624R8j204r38R01J097j37j686M60R35K90q03p14O52
4697gQ29m64o36q1O34P13j185q88R73J042k60j278m51J399R44j302r09M93J045
4716F11J49j512k57J164J030j153j158M58J504q4j384l00J158N48r51m97K6J327
4734F79m9r77o45R64O28n20j091L46J099K84j161p41J084Q23l47j469K44J430
4752E81K00j374j043J664J379j371j386P73J296J61j547j64J073O65j458l23N41
4769c33Q25L7j129k28J325K82q34m79L12P34j19m87m53M89P69k49q55k34J088
4788D61M53p80q07O89J181n57j226j53J215Q37j218j189J144J460j175j215M26
$$ y = [931, 674, -301, -1089, 432, 1414, 205, -1136, -523, 1224, 1025, -815, -1084, 777, 1387, -27, -1114, -222, 1391, 670, -978, -582, 1042, 1140, -64, -1002, -101, 996, 859, -827, -367, 568, 858, 55, -659, -7, 822, 358, -278, -359, 275, 988, -197, -1085, -112, 930, 670, -608, -1059, 340, 1284, -18, -927, -434, 611, 760, -752, -1009, 155, 1185, 32, -1126, -668, 836, 752, -632, -932, 226, 774, -177, -674, -648, 679, 630, -347, -992, -28, 600, 80, -1011, -665, 434, 718, -443, -1184, -100, 723, 376, -1093, -849, 581, 781, -593, -1636, 28, 1407, 36, -1350, -577, 719, 880, -667, -831, 242, 907, -551, -874, -333, 492, 529, -600, -828, 497, 779, -55, -534, -222, 512, 393, -94, -547, -58, 711, 462, -393, -627, 461, 914, 134, -673, 16, 1197, 640, -586, -739, 476, 1313, 95, -1094, 50, 1510, 335, -880, -454]
4805d54J284J4j419J16J086L71p77j074P57J095m11q54n64J005P27q85o63J90
4823d56R35N35j049m56K83Q44j55m65p90P41J080p65j179M24J393k54j596l96
4841a326J608R27j497j038J147J295o53j737L28J168M61j332n86J196P41p26r88
4858a012J14J466K25j277l34O56Q40k68j187n8J080K76o09q79M16J034j66j061
4876g44R4J117L26r35p56L57J321p0j903K26J247N07r29p90P32J015n24p61J0
4895d60P63N98r16p31L96J461o83r42r3J121N30p48j226N12J438l16j036l76Q35
4914A27P49p23o79N37N55N1j115j77J335N14j224o76M55J147K16j579l82R24R30
4933I85n14j068M05P28L4r69j09R52N17o06j088L49J115j20j356M2P90O85q12
$$ y = [-454, 830, 844, -575, -459, 627, 998, 221, -853, -96, 999, 588, -266, -830, 175, 902, 17, -646, -456, 479, 1014, -35, -491, -208, 636, 481, 16, -774, -33, 1047, 282, -897, -473, 920, 666, -930, -1326, 282, 1209, -288, -1326, -179, 1116, 463, -1274, -946, 222, 683, -649, -1235, -39, 702, -24, -1012, -898, 568, 793, -484, -818, -162, 678, 410, -777, -835, 245, 521, -88, -967, -551, 483, 317, -744, -650, 467, 793, -142, -898, -541, 780, 710, -1193, -967, 280, 787, -142, -932, -200, 815, 291, -470, -460, 303, 901, -15, -746, -350, 1111, 428, -514, -607, 514, 1044, 296, -930, -418, 1020, 704, -332, -708, 127, 876, 153, -526, 11, 566, 617, -498, -675, 660, 1174, -50, -726, -271, 876, 1092, -487, -869, 55, 985, 471, -597, -192, 536, 570, -399, -508, 444, 961, 355, -733, -384, 731, 611, -745, -703, 87, 772, -40]
4952d0p45J96J029J06j158l10R59O21r43m55M5J370j76j151l53R20R01n59j249
4971i92K87J373J08j260n69J045N79p23q82M97J018l92n01o47J320J03p47m73
4989h56L22J138L5j016k71O11N90j37j069kR78J29m77p51Q01P85m77r22k49J271
5009D33O71r77r20N97J080m53j101k5J361J60p55p64Q65P75p63r28N70J056k79
5028F03r49k75J093O33o61j017K29P11L79q03l27O81M14m65n93J26P16K49r01
5047a57n68O21P07k64r42oR44L32m30q13K0J481l29j394J81R79L62r09l39O02
5067G8R19p20j066pJ318L66j158o97N34J105m98j045M5J114J62n69p10O83N16
5086C70l15o85L9P33L37o53o97M22J148l45p28m94J015K46m21q04K08J024j42
$$ y = [-40, -785, -589, 440, 546, -612, -922, 37, 658, -285, -740, -695, 675, 499, -652, -1005, -85, 816, 257, -992, -705, 668, 776, -484, -1053, -8, 571, -152, -1034, -537, 481, 89, -412, -1059, 261, 364, -383, -856, -534, 604, 639, -377, -648, -37, 553, 416, -653, -655, 323, 452, -25, -776, 25, 810, 333, -589, -838, 433, 1104, 127, -793, -196, 884, 431, -670, -695, 666, 826, 71, -693, 172, 947, 184, -744, -174, 882, 603, -346, -621, 472, 1105, 444, -573, -344, 367, 746, -57, -384, 297, 711, 246, -347, -221, 495, 744, -157, -725, -104, 603, 339, -603, -609, 335, 667, 237, -576, -556, 925, 596, -798, -617, 362, 724, -185, -524, 78, 997, 277, -789, -796, 522, 888, -270, -967, -433, 672, 174, -871, -826, 288, 450, -119, -829, -146, 370, 55, -630, -591, 142, 479, -174, -871, -449, 699, 354, -374, -868, 147, 393, -28, -832, -624, 400, 258]
5105B58p57j40N30O21m38r29N01O55M19j253l49J151J17l11n64j36J400l32j128
5124f85J56P42O09r64q36P88Q77r1j139N2R18Q4n01p98N17R35j07p73Q7M05N39
5145H15o90o78K46J044q3q22r3N93K66l82m61K59M03J50q34k21Q02L47k07q99
5165d45j99J091K48j042k28M75Q01l21r47L04P69L6q35n40R67P09p72o62K11Q43
5185D63L09j095k80J069J34r07l27J67J107l64q63O1L75N71m38l22m06N14L19
5204H7l01n54M81N35l58m42j65J187o7n23p17N20P65l13j048PJ226N7p89l28N26
5225b14P16n5j439M66Q98R8p05m98P73N79l55p08j31P60K15o08o04N18Q25r3j123
5246f85L47R24J02q79m73P08O57n68n97N0Q40M22j008m09O86M30m80m43N6R54
$$ y = [258, -499, -639, -109, 512, 74, -855, -354, 301, 720, -533, -882, 269, 386, 75, -489, -625, 775, 443, -685, -529, 213, 822, -142, -978, -190, 687, 596, -543, -491, 427, 511, 10, -788, -271, 664, 557, -216, -129, 276, 815, 125, -553, -307, 737, 654, -168, -261, 332, 598, 216, -245, 14, 417, 567, -267, -488, 314, 661, 454, -445, -644, 447, 695, -347, -575, -100, 701, 380, -567, -263, 506, 542, -293, -833, 134, 843, 71, -591, -380, 463, 772, -323, -603, 466, 600, -307, -634, -467, 640, 276, -587, -526, -151, 420, -18, -340, -746, -232, 87, -214, -768, -287, 248, -110, -552, -717, 470, 403, -120, -837, -317, 448, 135, -913, -906, 320, 377, -412, -740, -214, 502, 447, -992, -526, 372, 470, -235, -733, 40, 619, 264, -444, -575, 185, 400, -208, -812, -294, 531, 438, -685, -338, 586, 688, -191, -664, 44, 701, 133, -464, -414, 426, 848, -160, -569, 117, 547, 67, -376, -320, 634]
5266F34j88n60n9L33L80j87n21n30R59K25k51r52O3J142O9p23m00P38L65n71o35
5287f69O76O58l37q63R3P71M52r16n52O20M69q9j054L47N63M78q24k09K92M56
5307C62l88n80K68L01L93m25m67J88P80J76j019p7K08P86o61m64J22P06j28m30
5327c49n04P29N88l26q95K48J136O0j304j90Q06O76o08n77J20J013k03r10j90
5346f80J025K02p22k61R4Q50l13j50k50O64J51l72n99j0Q23P3n48n13Q51J42j81
5367B76o26J9Q26Ql11m37L09Q83m42r80L02Q25Q7r12o69Q56P09k55o20j20N38
5388B66K23n27j31M12K13j36r44L64Q89k51m52j34K95J75L12j078K85Q01k7o06
5408e1l85K11N87po60M2M94N84r70o28R23J78j39o26J11Q41j13m25p89P67M66
$$ y = [634, 446, -114, -173, 160, 540, 353, -168, -698, 261, 486, 235, -717, -654, 488, 557, -166, -566, 172, 537, -34, -669, 7, 665, 328, -535, -442, 329, 781, -135, -687, -67, 402, 313, -741, -394, 169, 647, -177, -386, -94, 362, -26, -606, -338, -37, 356, -69, -536, -348, 432, 608, -411, -488, -280, 506, -155, -619, -497, 209, 81, -349, -853, -124, 464, 138, -757, -509, 627, 687, -617, -807, -1, 675, 67, -510, -390, 623, 420, -490, -680, 345, 547, -175, -436, -342, 508, 195, 45, -205, 459, 610, 238, -361, -371, 452, 525, -23, -536, 315, 457, 276, -350, -331, 495, 503, 192, -245, 64, 947, 505, -475, -173, 652, 739, -173, -842, 14, 723, 468, -152, -272, 266, 489, -38, -169, 243, 456, 320, -624, -260, 629, 378, -74, -208, 87, 262, 574, -504, -219, 582, 555, -51, -436, -225, 362, 355, -305, -263, 231, 815, -155, -783, 140, 318, 179, -447, -336, 505, 392, -33, -822, -55, 411]
5429D11n25k41Q4L72J9n18l0K07O40n01k96O3L34J67l77l44L14M07q4o53j73Q29
5451A05r2Op57O28P27m81n44j80P30L88o84l24L47N57l00j044O39O44K46n95n63
5472e47O04M76m60l83J40N13p1j32l59o2N25p0m07P8N37L35p15m50K98P60j21
5493D89m11m62M46O50n89o41M17P86j38p07j66O18M10p31m06O56N22n89r60K62
5513e44J135j80m32k86N20O72o42l86j68J61N32k28o10L74L90j04l82j32K58M38
5533C86l25k36k75M22N76p63l57J99Q56l33m91k30P21L14q12m50P02M68l94o61
5553f83K96O42m4n38k76Q39L37p77l99J49N24L69p82j0L02N09p78l4R4P04k66
5574A78n53Q3K90J17j61k89M3Q44l52l97j29K90M98l62m29k39Q42R3m38m27O24
$$ y = [411, -114, -355, -271, 101, 120, -398, -428, -221, 419, -82, -378, -315, 19, 186, -191, -535, -221, 186, 102, -551, -724, 105, 13, 19, -738, -110, 617, 136, -408, -588, 142, 530, -154, -478, -131, 426, 126, -918, -279, 365, 611, 16, -547, 57, 533, 73, -310, -170, 343, 272, 140, -219, -281, 244, 174, -233, -155, 382, 717, 2, -448, -150, 610, 489, 78, -384, 62, 712, 123, -518, -101, 685, 547, -160, -326, 292, 702, -29, -435, 221, 743, 154, -806, -544, 591, 411, -21, -307, 213, 885, 243, -143, -311, -150, 382, 154, -456, -82, 308, 204, -178, -310, -52, 386, 61, -175, -450, -28, 548, -215, -572, -373, 483, 150, -341, -571, 150, 464, -348, -798, -96, 372, -22, -683, -387, 255, 211, -327, -603, 236, 573, -204, -603, -454, 70, 439, -343, -353, -51, 458, -320, -354, -260, 444, 178, -375, -292, -2, 115, -46, -335, -292, 552, 200, -197, -326, -36, 462, 100, -329, -568, 274, 367, -71, -498, 126]
5595A26O16q10l82J97Q81k62m14k91P25N70p91n70N90M25k35o95j6M94M9m7j67
5616gr0N39R1l47o26L82M81J01o42p5M12K96o32j63M4R15m69n68K4Q24k07p61
5638d78J15L67K44k53p08L58P76k85n54J39J42M89k91k48K73k04N19n15j27mN50
5659C05j24o67L2M93M81n70q21O58N58r3p72l69P77N65o93p11O45Q74o40o60J97
5680e35J061M5q90l82Q42K75m95o21N12O85j95p07k41P79J14j68r2j28k7N13m71
5701a26l66L72L32L70m96k55N4L60L1o66J75O28J22q08l43O91K61k88l57J30Q91
5722G12k63o53r3Q18l4p91j97O92M74k44n94L00K64l41J22l79O04l2J10o64p9
5743b68P11N9l60k89o2M56J31l09l58R5N19j23m40j98P68k91p8n67M63P40n24
$$ y = [126, 742, -68, -450, -253, 628, 366, -48, -339, 386, 956, 165, -405, 185, 610, 375, -320, -336, 158, 207, 160, -7, -97, 442, 533, 186, -440, -58, 423, 524, -118, -193, 219, 515, -117, -280, -236, 679, 210, -358, -334, 490, 283, -478, -363, 4, 248, -5, -713, -355, 421, 136, -418, -279, -137, 352, 61, -187, 86, -118, 401, -114, -241, -245, 305, 181, -486, -454, 39, 520, -50, -871, -213, 345, 252, -520, -889, -112, 453, -240, -951, -306, 568, -72, -732, -535, 526, 571, -319, -701, 141, 416, -79, -700, -188, 497, 302, -405, -646, 133, 247, 79, -13, -141, -168, 345, -126, -492, -120, 212, 582, 86, -169, -115, 245, 276, -390, -215, 413, 535, -273, -616, 75, 336, 48, -309, -179, 712, 449, -204, -297, 521, 487, -304, -501, 191, 665, 421, -173, 127, 391, 50, 172, -207, 397, 365, 475, -189, -268, 443, 502, 142, -147, -209, 247, 378, 69, -289, -194, 325, 202, -238, -436, 332, 41, -37, -604, -141, 599, 75]
5764G5o90M36P55j55q24K9M79J73l88j21K7M44N1p47J52M32K45l65l43J41N34
5785C40o39K91j45Q1J75j41j16k20O0M49n46K75k13O46j92o96J66P12J7o68N2
5806c12J37O06k78n64J14R95l21p06J58L14j32K2n70J77M91J6l76l4L61K51l82
5827c3m70L02M10K34k99l11K52K35M24o28o14N78O11o83k77l7P46l07j75j30M94
5848C22r5l27l20N97K08l44l62K24O21l96l34m4K39O91m73j88J94o2k25Q6kK1
5870C1K0R8l73J77N0K31M3n34L6K68K50l87l57N13N93o60n86M00O70l90k28k60
5892c95P40L8q51j76M40N80k37q61N52L55j53l41k23L40K98k47j41L16r9Q1l09
5913b93j2L1L98K8k83k73L67J32j67j02k65P45L07o30n68K68N83p6o55O4N80M7
$$ y = [75, -615, -179, 576, 421, -403, -374, 105, 278, -110, -231, -204, 240, 291, -456, -304, 128, 373, 8, -335, -194, 340, -299, -8, -153, -72, 103, -38, -154, -374, -314, 135, -411, -136, -349, 297, 105, -591, -425, 287, 304, -364, -312, -175, 431, 153, -411, -297, 698, 377, -329, -171, 143, 11, 33, -537, -360, 131, 147, -229, -263, 98, 349, -33, -503, -201, 209, 443, 144, -167, 85, 320, 744, 116, -498, 80, 691, 8, -269, -306, 440, 133, -42, -172, 322, 227, -100, -420, 177, 385, 41, -321, -97, 524, 128, -206, -250, -11, 680, 207, 19, 213, 151, -74, 12, 10, 31, 51, 149, -224, -47, 3, 234, 277, -257, -221, 47, 297, -90, -447, 66, 659, -1, -587, -187, 483, 93, -135, -395, 345, 383, -468, -644, -204, 376, 139, -722, -170, 185, 32, -309, -532, -192, 106, -141, -282, 34, -65, 16, -293, -305, -274, 124, 152, -131, -404, -37, 95, -72, -174, -439, 306, 613, -17, -585, -317, 266, 190, -465, -401, 179, 226]
5935B26m19m21N94M45o07m59P67M87m56n47K49O23k39m43p9K14N42n44P1J7n2
5956c1j48J68J05l25L44J27j23m64j15R67K01n99l64P45j41k79o07Q72K14m48
5976I9n96K56P94l13m62q0P08J28n07k96M29K03m65k87L13N1L89n34mJ89o2Q9
5998D2kN6k69N35j53l79Q7K41oj56l34N8O02k38l92j05O90L10p39m35N15Q61j195
6021d06J55J76J64j4m42J66J10J63l93pJ47M01m18jpL77k89j3R7r8J51j15K97
6044B01n21K72K99q7l42k58P52q6q1m85MP53J48p94J2M94L58j014J85K58L87k47
6066B08p83N24M72j53n40J19P16N5p43j17M6M29k95k1K03R1n51M73Pl62K95P8
6088A51O1m42J4L69M12m84k79J86N64l33n51K06Q01l54n21k23M53N57o94n34N03
$$ y = [226, -193, -614, -20, 425, -182, -641, 126, 613, 157, -390, -141, 482, 243, -200, -279, -65, 477, -67, 4, 21, -31, -179, -11, 94, -231, 113, 240, 117, -347, -462, 505, 706, 107, -257, 488, 347, 68, -539, 333, 547, 99, -497, -241, 553, 240, -222, -302, 406, 534, 27, -269, 160, 363, -102, -389, -76, -25, 364, -170, -174, 15, -47, 42, 40, 96, -173, 362, 209, -170, -83, 158, 152, -4, -338, -280, 322, 84, -308, -413, 277, 587, -152, -587, -72, 789, -406, -251, -75, 89, 75, -367, -201, -91, 72, -321, -328, -181, 220, -198, -199, -206, 171, -118, -131, -34, -132, 19, -96, 201, -320, -48, 251, 164, -178, -436, 316, 230, 149, -336, -332, 421, 569, -225, -213, 281, 639, -375, -190, 68, 455, 208, -575, -51, 421, 268, -272, -153, 563, 618, -125, -242, -196, 233, -62, -83, 120, 211, -340, 133, 140, -222, 73, 151, 212, -230, -216, 153, 565, 81, -198, -12, 552, 219, -332, -126, 675, 321, -200, -423, 30, 587, -107, -641, -138]
6109a38P19o50k09K73M79l58m51j68O76j99j86q2J47K19k41l1J49J71j46pJ23
6130I0m28K62L39j88k41j12L37L3R0p41N04J95r3m02K71R6L68n86k22P11j90j89
6152i6n13M30Q37m17n21K15J78J39l90J38L21r7j91m30O50k28L21l52r8J16L02
6173C14m5j42k40J09J6N29q56m0M58R1k73l61M44O63l51p33k0R56k02m33k60L34
6195d2L22j02l62L22R8q8k93J24K30j01k39k47N47J52j63k64l1J58K2j8J14l86
6217b47J96K35l41j86J98O86l52p88M4N58J52l13l43N29O68p98n72N49K82J56
6237C13n60m7O33k58j56l93K24N11l28o9j26L27k01J01j40r5J21K14M9m91j37
6258e08N33JM7j28L8N3K80k73k11K96L35q86P2N82M3Po24L40M36j32o97N06J2
$$ y = [-138, 581, -69, -278, -5, 474, 116, -335, -503, 173, -26, -212, -294, -147, 72, -169, -200, -51, 120, -26, -33, 90, -338, -76, 263, 75, -166, -278, 59, 92, 182, -559, -55, 140, 47, -355, -84, 12, 380, -206, -428, 283, 93, -96, -609, -179, 658, 241, -280, -65, 113, 252, -138, 0, 321, 224, 33, -397, 253, 25, 346, -6, -104, 12, 314, 269, 127, -113, -4, 12, 541, -315, -355, 103, 194, -79, -440, 4, 667, 316, -417, -437, 519, 317, -116, -376, -42, 280, 178, -184, 138, 236, 148, -145, -21, 209, 108, -131, -378, 169, 321, 158, -106, -137, 21, 43, 25, 139, -247, -51, 184, -157, -343, -145, 541, 189, -599, -555, 3, 155, -158, -501, 28, 696, -102, -674, -125, 157, 313, -247, -294, 339, 81, -75, -468, -244, 267, -61, -130, -256, 71, -130, -29, -169, -264, -143, 71, 120, -371, -508, 25, 26, 73, -55, -17, 36, 316, 43, -168, 128, 463, -423, -351, 231, 274, 281, -343, -3, 433, 301, -396, 110, 122]
6281A22K30o49K45L68r7k41l17L62L3k8l63L86L19l38J07k93J35Pj54M33l96k8
6303a57R3M01j13m97L88L27m33k01L55J61Ll31k58M05P50r58p28O86O54k22p60
6324d35K34K17L00o18j01Q63j78k99l30K60L46l04j74J18K65j06l82L17J04j28
6344c1j76L55n0j52k05K71J15l21K60J62j1o69J25O40o0m94k17N77Q4m09k01J26
6366b81M09j39m49O1Q11k6o65l2L91J19n74J65R7K51r3N3k91p2J62Q3j98M7K09
6389C8Q5j34j32k02N91q8j40k03J53L15j87l62K00J89J92k83k97L93M26m80n37
6410d63L09N24k87j31j12K53M8m67Q4J03K95m2L6j82O1QJ75l24q3L62rK2j87J33
6434A26R1M3l36l07O02K50m18o49P38L95l49p67M96L1L20m91j57N60K82m43m74
$$ y = [122, 352, -297, -52, 316, 219, -22, -339, 23, 56, 28, -335, 51, 370, 32, 139, -154, -19, -12, -166, 267, -129, -157, -64, 337, 224, -273, 115, 442, 9, -192, 163, 324, 327, -4, -262, 143, 893, -65, -793, -107, 547, 325, -435, -201, 16, 316, -302, -403, 460, 282, -17, -347, -87, 259, -45, -219, -101, 164, 58, -324, -7, 97, -31, -207, 148, 98, -54, -259, 12, 127, -194, 66, 228, 217, -452, -327, 313, 253, -241, -458, 119, 203, -206, -407, -281, 128, -11, -460, -399, 412, 386, -279, -311, 80, 199, -375, -210, -113, 138, 45, 98, -193, -265, -103, -20, -218, -171, 38, 123, -11, -143, -345, 246, 158, 18, -185, -32, 283, 96, -266, -66, 123, 315, 32, -265, 128, 554, 74, -463, -154, 370, 83, -48, -160, 93, 141, -326, -242, -139, 156, 114, 150, -32, 29, 37, 212, -112, -195, 167, 158, 180, -7, 126, 217, 260, -76, -383, 219, 469, 51, -598, 140, 535, 186, -581, -85, -54, 266, -225, -382, 178, 460, 17, -457]
6455d57M46N23m88j97K37K24N6q02K61K63r3q9p9J52K16k86M15l53j60Q1K05N
6477H0l56l4L77J57k89k83K97L66j54m03M72L46n64m66J84M44N2o72J31N35J5
6498B35o24nL53K22n60J45L50L71k54m86K94J78k73r8J88K60l39J93k02M06m96
6519a42J37R9J4n12j76P29L26o98JM08J49j11l02J08M81l75o03M41K20Q7j24k40
6541h3K10M12l81n41N62M22o08l05N83l19O0J25O5K6k17J08p4l15J28J75J36m44
6563b75J73J8K71j48Q9k07L13O8k82k99L87K62m41m52M22K62k39k15K60J80k07
6584f0p8m3J65J67j26l40J73L87q5Lk18J25j62j9N2k0K25o0K36m63J7%L94j71
6608I9n33L31M10j55o50K94K64J69n13k59K86L28K6m21K81M51k73l42J57M83l83
$$ y = [-457, -11, 512, 24, -173, 64, 288, 344, -458, -197, 66, -27, -116, -195, -43, 173, -113, 302, -51, -211, -130, 75, 80, -276, -310, 67, 224, -65, -348, -51, 315, 161, -242, 230, 576, 12, -454, -270, 174, 226, -446, -315, 220, 235, -389, -394, -41, 181, -379, -234, 116, 487, 233, -253, 41, 219, -54, -152, 36, 296, -43, 150, -52, 354, -142, -5, 94, 108, -404, -580, 149, 475, -223, -222, 186, 335, 224, -78, 30, 511, 136, -467, -26, 194, 281, 157, -83, 127, 539, 158, -383, 179, 601, -7, -312, 271, -48, 12, 137, 202, 228, 11, 119, 45, -270, -142, 33, 169, -275, -102, -84, 187, 39, 128, -79, 234, 302, 20, -279, 108, 370, -71, -523, -101, 161, -78, -293, -33, 147, -60, -138, -181, -16, 151, 25, -315, -142, 245, 160, 163, -55, 70, -92, -111, -59, -79, 146, 86, 322, -141, -124, -124, 270, 99, -434, -103, 307, 152, -498, -204, 60, 229, -284, -543, -257, 71, 97, -324, -43, 408, 135, -207, -50, 433, 50]
6629E0j21J21j59K18j9l31K57L1l08O08l75J18j87M11l32N5k27O04j53m22J1K41
6651I1K90l77j31pN93k09n52R4N67K30o87k66P72k1n51j8L73J74l53k78K33K21
6673A88R0k94j10J01K16j19r2RM2OJ3M8l74J41K46J9l40K23J86J16k78m0J26k25
6697a02k2l03K67K37J69n55o6M39J49l80j17L86K38k92n28P93k07j44k31L17M03
6718D51l77l38m2J39K06J2k80L76k84K4k73P56p94L1M40M7k57l76M87M29k47k67
6740a37J98J92J24n80L91J98k04k24k62M91n0l55r6J28N78m72k21K31J63o1K54
6761B86m68L05K84n49L26j36J45J38m85L53m57L98q7J89j89Q7l4P3m64L15L63
6782C93r1l07n75P88QJ9l44R9J74Nn58K63L24j22k87L5M50p3k90k95P33j52QQ5
$$ y = [50, -71, 50, -109, 109, 90, -241, 16, 47, -261, 347, -28, 90, -97, 314, -18, 37, -190, 414, 261, -161, -150, 91, 381, 4, -127, -134, 459, 250, -302, -208, 359, 589, -98, -364, 408, 387, -164, -182, 191, 365, 12, -266, -33, 188, 278, -16, -126, -25, 191, 72, -20, -11, 31, 37, 50, 98, -276, -135, 111, 130, -210, 13, 199, 315, 37, -3, 123, -102, -124, -427, -160, 77, 246, -309, -375, 64, 213, -167, -284, 102, 340, 48, -480, 313, 106, -38, -269, 48, 451, 74, -264, -306, -167, 39, 51, -229, 147, -137, -113, -386, 370, -424, -393, 47, 94, -163, -539, -52, 377, 130, -137, 61, 253, 377, -203, 188, 386, 182, -42, -304, 187, 137, -218, -314, -186, 392, -80, -301, -70, 93, 32, 286, -182, 123, 407, -142, 184, 48, 193, 331, -154, 199, -258, 140, 53, 242, 53, 140, 106, 179, -285, 30, 393, 302, -5, -580, 208, 216, 235, -109, -10, 164, 169, -389, -126, 198, 76, -211, -176, 274, 201, -89, -384, 349, 197, 205, 290]
6806B90k75j65L90m31J91N2k28J88j68Q0j59k2n8L73l32J38K94k02r4k28M68J81
6828B83m80j8J1M16o97K03J20M02j32o44L97P7J6k92L30M14k97l01J17J42j15
6849d8k23K0M72j45n02K14N55n74R9J96K51k41l36J79K22k08p1L75N2M4o10K43
6871c6J12K00l16k27L07M08n76K50j10L46k67k63K09M12k20n65L05K75j68L1j9
6892H8K44l41j85K6L60k27l76P23l05Qk92K47J68p9n95N23Q9k06QK74Q0j63j83
6915a14l63P46M4m30j69M70J72n65k4J17L28m87k00N00J57r2k70J89L74j37n55
6936c09J74M2J52l4O5j38k28K34j92N66n28k74K58L35k76j38O42j76j66k1k06
6957b18M58j49l16J56L57J26m44j41K70O3j56l88M09M70k20m13K76Ok24K15j33
$$ y = [290, 15, -150, 240, -191, 0, 52, -176, 12, -156, -76, -235, -257, -315, 58, -274, -136, 158, -44, -138, -366, 102, 283, -197, -215, -204, 212, -485, -282, -162, 240, 108, -536, -139, -62, -46, -338, -8, 406, 109, -192, -75, 67, -48, -271, -251, 221, 76, -426, -212, 343, -231, -132, 64, 315, 74, -262, -83, 139, -69, -140, 235, 287, 331, -279, -36, 76, 276, -40, -267, 40, 448, -128, 122, 12, 358, 91, -172, 37, 449, 229, -336, -31, 244, 76, 107, 88, 332, -9, -194, -168, 192, -35, -411, 312, 7, 15, -277, -30, 138, 59, -536, -13, 76, -130, -122, 152, 232, 69, -114, -477, 269, 313, -117, -286, 184, 356, -209, -233, -116, 212, -275, -475, 25, 182, 90, -180, 9, 383, 246, -309, -135, -93, 59, 25, 90, -48, -276, -42, -234, 332, -196, -470, -212, 123, -153, -291, 351, 175, 9, -12, -218, 240, 91, -225, -69, 288, 414, -30, -171, 99, 162, 6, -382, 27, 497, 277, -136, 140, 146, -78, 137, 4]
6978DK51l90P0L9o7j42L84j10rJ00k07J87K94m11l12N75k25k9k55K12K04q9j49
7001g5Q4K69j40n64M14L65j25k62m00O15J01k55ON6j65j8J03l5M73l4q05N86j06
7024H8m21J75K69M0j28l2J71q3j17J27j11K17l92M1J58L60m48l04M55K08l93m7
7046a67K26L31l95k47M61q0k43l5k17N17j43k89L01J30k67m8l0K77q1J5J85l71
7068a70K7J92m5j58J18Oj08M46l64j08J51L38k81j48lJ00N66p04j72L52M58l48
7090A45l54J44L08l33j31N4L22J31l81O8K5K82k73j25Q2K69l44J28M30m53l60
7111c66L84M93j90o41M61J94l76l27N60J4J8m71L33L53k84j27j10N98l25j53k26
7132a88M27j8j23o48K86P17m82l46K81J12J61k51j76N54k85j62l67P65l71l6j71
$$ y = [4, 255, -135, -65, -26, -93, -235, 149, 39, 30, 130, -77, 110, 404, -7, -319, 256, 31, 2, -253, -41, 163, 74, -75, 9, 278, 138, -426, -12, 353, 228, -34, -434, 181, 282, 27, 33, 89, -76, -94, 9, -26, 447, 413, -392, 194, 88, -333, -158, 111, 151, 23, -9, 162, 79, -38, 89, -22, 195, -197, -156, 2, 362, -86, -390, 65, 273, -120, -167, 59, 390, -5, -252, 209, 129, -114, -149, -366, 151, 8, -281, 20, 150, -117, -165, -195, 82, 1, 16, 201, -170, -143, 49, 4, -154, -36, -30, -138, 308, -56, -164, -13, 325, 44, -104, -107, -7, 559, -145, -317, 35, 493, 145, -209, -65, 243, -90, -221, -167, 155, 286, -95, -27, -2, 280, 7, -118, -36, 233, -111, 17, 447, -6, -366, 18, 511, 321, -320, 141, 335, -41, -368, 192, 206, 224, -247, 86, 439, 155, 28, -82, 516, 191, 38, -188, 239, 221, 98, -550, -264, 453, -29, -375, -94, 18, 179, -72, -248, 306, 21, -141, -508, 257, -114, -150, -321]
7153c21K00M36l83j78M85k90k29K40L08l19L2j1K98l14O4r9L18j30n9l79M02J46
7175B17k70q6K18K40k17n02L42J65j54j38K4pP4r6k21M77p4j14p0L09j99J50o9
7198an5J89k37J02j30j62K95m3M18R8p28N40L3m99J99l1OK93m82j7N51k34m98
7221c93M09K0qp4K9Q9m0J78j76J91J46m37R6J31l4j06mJ77M0k36K26N0j58k61
7245a45k8K45J12l40J07J75l10J39k49M14J64l07j62q6M96j96k47M79J00l31k02
7266a72P4K20J28k91j04L08k45J93n19N93R1n00j38L86J40j65JO4R9m13L23M24
7288D97O4n74r7M46k60n22K11K91K94n69j71K81M60j95l21L0M48k54j02p4M77
7309C60l06l45L65K24j73o7l66J83M35p8r5j19P3m43J33J11K77j57J08J33k57
$$ y = [-321, -121, 315, -68, -246, 239, -51, -280, -40, 268, -51, -19, -30, 268, -46, 18, -81, 237, 107, 48, -331, 71, 217, -53, -139, 79, 319, 102, -400, -58, 107, -47, -185, -161, -168, -94, -190, -411, 66, -8, -122, -192, 117, -82, 68, -1, -56, 133, -104, -2, -132, -294, 1, -42, 376, 474, -254, 286, 319, -180, 19, -12, -6, 287, -195, -212, 339, 105, -393, 16, 36, 28, -46, -17, 72, 32, 210, 34, 225, 371, -66, 30, 161, 127, 21, 17, 194, 234, -2, 224, 274, 116, -145, -173, 72, 184, -156, -49, 126, -184, -45, -294, 120, 284, -23, -185, -271, 225, 29, -218, 261, 361, 30, -172, -98, 122, 250, -41, -145, 163, -82, 111, -408, 185, 276, -224, -362, 24, 164, -1, 0, 64, 163, -250, 73, 497, 561, -13, -110, 336, 76, -446, -235, 56, 350, -219, -390, -109, 351, 156, -165, -135, 313, 59, -43, -117, 360, 54, -291, 74, 298, 125, 58, -308, -125, 310, 232, 137, 18, 91, -352, -219, -108, 169, 12, 120, 253, -4]
7330dl26M72K63l1n28q8O20m56l4j10L55O3j19m01J64K04k22L4J50K71j52l02
7352a77p8J09J55m5j42M92j32l36O6J62K27n53M15J36O1o79M88j72J48l69k15
7373d39N52j80m4M0L76l38j32p3O7K45p8m99L19L25l07K9M49j68k65l30N14K63
7395C26l01m54O45k40j68K28l38N83o93K03K3N17j38k86K3k9P6k04K77n5Q9k15
7417a31o7L39l23j5N8M13n84O4K09nK93M3m31K22J82m45J0J92J55k04l61M19J50
7440A83j33R2J7j14J43m06K62N1J03j36j30K91k79j35K67M7j78j27J02N21l53
7461H8k14L7L66j5n60L70K34j21j86K16L76l09n64Q6M74j81qm05L49J28k95j45
7483b79M35K8k50m25N66K30l14J80M5o9M3j02j43N4J05k76K35K76k22m2m8l1o2
$$ y = [-4, -330, 142, 405, 374, -154, -242, 378, -78, -112, -222, 133, 196, 77, -324, -160, 44, -178, -144, 6, 277, 125, -177, -255, -146, 9, -36, -178, 314, 182, -154, -88, 74, 301, -252, 163, 299, 360, -319, 169, -3, 145, -224, -439, 113, -67, -111, -71, 305, -33, -165, -238, -171, 74, -4, -503, -184, 141, -166, -137, 312, 144, -121, -451, 63, 326, 25, -429, 216, -24, -192, 36, -302, 281, -412, -209, -186, 331, 193, -93, -70, -99, -23, -227, 50, -5, 84, -131, -198, 141, -182, -197, -139, 274, -310, -246, -37, -42, 251, 294, -137, 85, 267, -178, -168, 24, 179, -25, -386, 33, 183, 50, 142, 159, 45, 188, -218, 44, 95, 198, 62, -68, 223, -56, -191, 76, 123, -55, -182, -80, 441, 88, -126, -89, 277, 262, -298, 72, 306, 185, -1, 215, 591, 282, -282, -196, 278, 97, 89, -316, 33, 161, -134, -279, 156, 184, -66, -491, 75, 305, -9, 171, 216, 147, 190, 88, -55, -1, 104, -172, 63, 339, 117, 75, 27, -4, -66]
7506f6l9J02Nj93j4O1N64p4l11k09P70m68n13K70M48k37j0l65K49J38m5l77L56
7529D2M3m0k11L87P3j09n42M35m1j83K49j68J63n4q7J24m8j77j5N01l31k48M5
7552a92K86L50l63N8m8L77l62k31j02L18Lk01j42N42j7k44m38M56J30j26n97N09
7574c4J79j3o6j51L19k24j56L01o4j81j36M94k11j68J25L50k40j56j92M28o1l31
7596a88R3K41p0o5l36L67K74j52l64Q0J71k39o6J2K50k9k21K28J74j93J30qJ27
7619B16k88L59m84J15Q5j09L83n6n52K67L1J45l51r3L38K27K4m24R0L34j48j46
7641c7m21O38K2m41Q5K81J99l13j12J35j89l4o7J86P0j80j33M01j65K09j34l9
7663c9N07k43k22N3n5q6j22J15K10j64qJ94j60K61l33M3K3O7j61j8L29k19J84
$$ y = [-66, -105, -3, 2, -191, -205, -144, 420, 346, 35, -174, 596, 128, -385, -115, 333, 96, 86, -279, -30, 108, 63, -314, 42, 85, 45, -166, 221, 294, 185, -357, 78, 37, -146, 103, -65, 98, 44, -43, 81, 33, -144, -159, 342, 11, -237, -192, 94, 444, 81, 139, 91, 468, 106, -125, -227, 91, 94, -107, -249, 293, 276, 32, -406, 50, 180, 54, -543, -34, 145, 132, 66, -85, 234, 10, -146, 155, 91, -90, -226, 268, 57, -111, 14, 364, 124, -32, -224, 204, 143, -188, -95, 146, 76, 11, -325, 42, 316, 164, -200, -120, 51, -188, -254, -242, 8, -21, -242, -14, 160, -33, 97, 89, 216, -72, 287, -197, -82, 3, -106, 277, 221, -331, -64, -33, 112, -239, -332, 6, 233, 257, -167, -77, 257, 109, -37, -458, 180, 202, -239, -154, 127, 326, 13, -99, 36, -153, -187, -254, -68, 2, -178, -311, 90, -75, 134, 0, -39, 468, 225, 3, 56, 1, -85, -207, -92, 118, -46, -54, 140, -20, 241, -92, -49, -26, 41, -120, -138, 191, -28, 156]
7686A56k17O7k1k11N3O2N22n18m4L09J35m96K0N67j42j52j33J36J89l55m16N60
7708G1L42j50o02N57m7k45J44j43J90k77j79L06K49j3l44N7K71Nm25N7L73k47
7730e0j39k7K92N8m84K36L58N3k11k05J34j77J67r8K41j38K6o5l52K29K99j65
7752a8p2L27j96n7J0J07k11k43M14N4j63p0J49K60l74j42J92k6J36m94L47M78
7774D08j51q37M54K85J19n45P6M18n4l59r5K34K26k42m72P18o4j53q9K95j0k01
7796c9J83l54K21j86L6m6K46k8j34K63J18j50l20J18K21k41J10J57n8J10j80K3
7818G0j73J94k31J40J90Nm87o0M23j82OL0j22M22n21L84n1k11J32j02L57j26k51
7841a64J63K62m50j46M27L7Q4m00J97J74O6l51j33L17K3k12j93J27K38p3k24J20
$$ y = [156, -61, 6, -15, -226, -173, -111, 411, -107, -151, 158, 293, -203, -183, 384, 242, 90, -43, 93, 282, -73, -489, 71, 413, 263, -339, 218, 171, -74, 70, -73, 117, -160, -339, -33, 216, 203, -141, -84, 187, 192, -233, -176, 197, -50, -189, -216, 76, 134, -350, -114, 244, 297, 86, -119, 15, -162, 5, -93, 148, 10, 36, -29, -381, -152, 147, -18, -90, 237, 41, -16, -6, 101, -110, -353, 61, 115, -48, -118, 31, 291, -83, -225, -33, -59, 77, -417, -70, 408, 257, -580, -126, 159, 278, -267, -191, 227, 173, -186, -281, -47, 179, -63, -535, 183, 119, -34, -123, 172, 162, -39, 144, -210, 11, -175, -139, -185, 61, 33, -101, 162, 280, 130, -190, -72, 149, -92, 18, 175, 117, 227, 47, 70, -103, 91, -140, 0, 190, 195, -292, -352, 71, -111, -105, -75, -197, 225, -296, 88, 37, -174, -42, -144, 213, 87, -164, -1, 261, -189, -335, 92, 129, 213, -187, 10, 184, 250, -101, -234, 83, 106, -106, -299, -172, 66, -7, -231, -111]
7863a11J07j79l28M08O1K35m63K08M76n48j48nM28l61N01l58J82O1n12J97J37
7884a2n8j36J33L93l93j84j17O27j80k37J7N23j61l49j01J59L50k44k67K79K48
7905B90l36R0m07N16o6k14J62k15L48j66J19R5k2j30M8j4J7j96nj27J12K07q6
7928B0K30j76l70N85q2K1k98O7K14%l70j01O74o09L42m24J48L11k11p0L54O6j01
7951B20k38J17J79m33mJ83qj83j0L6l3R3K4j35L32j58L0j31M01o52L01j64M72
7974B39n85L07J84l42J16j92J61K27l30l78N63J01nk18J45n0K55o1n29M14L15
7995C37m27q4L45k29j5J01j66K94n35L3N98j37l17K17K0j11j39L78j5j04j77J72
8017C9M5P5k7l74M77q9K9k59N4lj67J94Q5m1K39l71K9m5K67k22J42K22k70r4l3
$$ y = [-111, -4, -183, -511, -103, -42, 193, -270, -62, 414, -134, -282, -287, 141, -220, 281, -77, 105, 166, -346, -149, -12, -70, -206, -73, 320, -73, -257, -374, 253, 73, -164, -147, 376, 215, -134, -235, -76, 274, 30, -237, 42, 290, -46, 44, -363, 153, 87, -127, 35, -180, 168, 2, 121, 216, 194, 64, 112, 98, 115, -81, -86, -213, -101, 106, 20, 250, 74, -296, 289, 207, 228, -70, -3, 211, 211, -159, -260, 414, -195, 147, -277, -129, 182, -29, -99, 255, 321, 220, -18, 99, 278, -155, -159, 24, 16, -167, -177, -141, -174, -81, -57, -192, 140, -18, 12, -119, 282, -370, -69, -233, 239, -346, -39, 145, -197, -81, -273, -112, 115, -215, -593, -30, 71, 66, -152, -7, -57, 198, 137, -392, 22, 337, -90, -174, 171, -58, -73, 28, -138, 156, -379, -346, 252, 115, -202, 15, 35, -76, -215, 163, 148, 44, -133, 39, 84, 159, 132, -242, 235, 146, 175, -84, -30, -33, -200, -6, 79, 38, 277, -94, -65, -110, 157, -65, 77, 299, 29, -65, -98]
8042i8L17j74jL6J70l51K12j30J32Ol01q1J96N3k78J30K70J54m98j37N78j44k38
8065a77K42J01p7O0l20K23K68j87k11L48L20j4p22N9K87q3j62k36J63J1K3J8j28
8088a94rJ1L7M9N3q6K2P8J47l44J53J73J24n05J72K89j20j69j65L86j75k11q3
8111c67J87K36o8l56K55J99J1l12N9J88O9j81Q3K4J64n21M73J53k97j71jL71k64
8134f6k68L56n6L5J34r5K17l0k63L7K40j86J85n47L51M5%m32N77k55N4L9P3J06
8158B51k52M0q5K82j71jj4L5L50o72K28j46K7K59l62L34k00n4k09K17p4K70k15
8181a62J76J31k44l46K03K00m77L44M9N0
$$ y = [-98, 219, 45, 44, 80, 250, -101, 111, -19, 113, 119, -182, -263, -67, -14, -292, -162, 108, 262, -236, -373, 205, 61, -177, 65, 166, 89, 149, -171, 52, 320, 133, -78, 270, 590, 576, -146, -87, 200, 117, -45, -281, -118, -107, -84, -66, -194, -203, -192, -155, -106, -53, -139, -117, -39, 108, -236, -83, 90, 214, -291, -119, 170, 50, -119, -284, 102, -73, -284, -367, -180, 56, -12, -368, -113, 86, 97, -215, -156, 32, 101, -80, 3, 27, 191, -330, 143, 296, -1, -172, -173, 198, -66, -334, 22, -34, 1, 135, 40, 257, 227, -36, 1, 241, 55, 240, -307, 44, 89, 89, -343, 234, -21, 33, 72, 145, 251, -1, 39, -46, 236, 65, 64, 50, 85, 435, -237, -9, -155, -128, 131, -231, 103, -97, -151, -360, -143, -217, 53, -162, 14, 145, -99, -445, -242, -42, -519, -175, -126, -76]
8191g6
$$ Imaginary data points
##PAGE= N=2
##DATA TABLE= (X++(I..I)), XYDATA
0@%%%Qj6QqJ6j6J6k4M0m8N6o9Q5j04J17j33J60j89K18k50K90l37L81m32M95n61
29b97O29p05P94q92R93j103J229j368J517j680J863k064K281k525K799l102L443
46A812l831M273m781N378o089O950q018R380j1187J3711j7475K3670l5602O6431
60D4622k82523o70717Q14045P60196m82915o80414L07919M75208k04828k80367
70a99774K34718R5374l45898p0373M32676J06027m08556j21599L71932R5428l38082
81a48127p3145L16227L1377l26170k9155L47402P5851l01055r6119K32239M6111
92G5436k30428j9932K79710Q3660k64210j59650J83181J89624p8383j66494j9030
103a26516Q5621O9665L7204l581p5602q2682K2286J04479M3244p8490r2167L1793
$$ y = [0, 0, 0, 0, 8, -8, 0, -8, 8, -8, 8, -16, 24, -24, 32, -37, 48, -56, 61, -72, 88, -101, 117, -133, 157, -180, 201, -231, 264, -297, 332, -373, 421, -471, 522, -581, 648, -720, 797, -883, 980, -1084, 1197, -1328, 1471, -1631, 1812, -2019, 2254, -2527, 2851, -3238, 3712, -4306, 5074, -6113, 7598, -9877, 13793, -21809, 44622, -237901, -908618, -94573, 665623, 182708, -497706, -189787, 285421, 80593, -199774, 34944, 130318, -215580, -285953, 146723, 252750, -155806, -277405, 94527, 189955, -148127, -221272, 94955, 126332, -199838, -228993, 118409, 194260, -106795, -202914, 29325, 75436, -154992, -174924, 104786, 188446, -75764, -235414, -52233, 137391, 59008, -107486, -126516, -40895, 28770, 65974, 62393, -13209, -95891, -73605, 30874, 74118, -4372, -96539, -64746]
115f4746J37747P7402r2912j53990j8767J31278R8181n6088j18312j4187J15919
126D1525J05889m2440j47813o1379J04785J11251m6258j03349L0951J11266j3731
137I0697j19953j1538J18808K9770j27875p0898J19976J33503n2415j48541k4581
148f3047J05857M8618q0625o2404P1884R4931m2835j18197N666J26453K5060j44803
160c3442r4519J13379J53110k6904j40076m5658P8117O4803k5242p6129m9400
171h1961M1209J08166L5087j06504r1210P0608R5989o4984j07505N4072J07324
182F0291m9868r4405P4186J09677r4423j59113N7330J64558j8077j36157J1781
193g4220J16665j3578j05614J0812R2052j9574j03880M20J10448N3056o1372p3226
$$ y = [-64746, 73001, 150403, 57491, -96499, -115266, 16012, 114193, 58105, -60207, -74394, 41525, 147414, 104974, -42839, -104218, 567, 111818, 65560, -37789, -6838, 104428, 90697, -29256, -40794, 78014, 107784, -20091, -90989, 28987, 162490, 110075, -38466, -63047, 42810, 91428, 10803, -51601, 20283, 115214, 72379, -45818, -40152, 86301, 111361, -33442, -127961, -14582, 138528, 111624, -28452, -74110, 4007, 68810, 43568, -32561, -81961, -40752, 67414, 102501, -4003, -95213, -24605, 71384, 6400, -101105, -47033, 60291, 10423, -83982, -9796, 99881, 5458, -153655, -96325, 68233, 50156, -86001, -74220, 42445, 28867, -76747, -65935, 26117, 6543, -97337, -96917, 13531, 66587, 5215, -68011]
205f8011m356M1031L0464q956l2989j2015L2233M0211j08l6492k7195Q755K1417
218a6011n882k1195K2877O0190l90q4353l0098R4798N8754j11756j06989J07871
230c2184J69410n2842j84064R979J82463K1723j84549o4662J65882J04289j17166
241A8279j01796R2642J05730o6896j12216J8537Q2538J5063k6829j783k253j3490
253G526K4405L5261m1584p6604K0649R6688J8617p1436j9163N5394K693o5897
265a3451m496O9304J748q3310l304J13729M4336j15830r4403P5336J03423m7921
277D5161j07663K5016J12806J1935r3843l5055N9684K4252n7228l0608M8040L9475
289D1972k3785k5670J5744Q519k8830j9488J4932J0535o469R835J8632j3433k4366
$$ y = [-68011, -72367, -31336, -872, -9828, -42817, -54832, -22599, 17612, 17504, -18988, -46183, -37428, -16011, -21893, -43088, -20211, 39979, 39589, -44764, -74862, 19936, 78690, -33066, -140055, -32184, 137226, 84384, -99680, -89701, 92762, 114485, -70064, -134726, 31156, 135445, 18279, -83517, 9125, 114855, 47959, -64257, -45720, 36818, 51881, 25052, 23269, 21016, 7526, 31931, 67192, 25608, -50996, -30347, 66341, 84958, 13522, -5641, 49753, 52446, -13451, -17947, 51357, 53105, -30205, -33509, 80220, 124556, 8726, -85677, -10341, 93082, 45161, -62502, -37486, 75320, 87255, -6588, -41643, 18041, 42293, -14935, -45543, 2497, 41972, 18187, -7483, 8261, 16780, -12050, -31538, -16606, -6071, -12540, -2705, 15927, 2494, -21872]
302b1872J4267J4765m5858m0676N9581P9279m5627j02518L2461J26834j0917j56983
314i7264m5614J44125Q9053j04110r6168Q0287J03233n7959j08952K2563Q8537
325A7731r580o9685J3950P5349N810o2752k1937L3742J1760k2650l434J9913Q017
338c766M030J5344p757m1544j0839M7542J9296n1826k3891P3902N9385o4540q5568
351g0232M0863R1363k8670j03190J3606J21437K7071j04936m7061Q7031N2780
362H0062q3478p2170O8744R0135l4258q0007K3413P7991j3935q4490j4295O7189
374B4901L0821l7883k1724L0210K1336j8385k1239n288n574M310K8218J2514k9770
387A2447j6530L9972K5264n7312n7402M5565P4210k9123p8167K5866R3832j1447
$$ y = [-21872, -7605, 7160, -38698, -79374, -19793, 59486, 13859, -88659, -56198, 70636, 59719, -97264, -142878, 1247, 90300, -13810, -109978, -29691, 73542, 15583, -93369, -70806, 17731, 8151, -61534, -47584, 27765, 33575, -29177, -51114, -17372, -5612, -28262, -31696, -11783, -3766, 264, 15608, 7851, -33693, -44532, 3010, 22306, -29520, -53411, 20491, 79876, 15336, -70232, -29369, 61994, 33324, -69866, -56260, 65177, 92248, -12688, -59749, 27282, 80062, -3416, -75586, -6842, 83293, 49035, -30972, -7559, 70432, 56497, -27993, -42288, 24901, 55722, 17839, -3885, 26325, 47661, 29276, 8037, 2749, -2825, 1485, 29703, 42217, 12447, -4083, 35889, 61153, 3841, -53561, -7996, 66214, 37091, -41076, -15210, 78622, 67175]
399F7175j10018k1654R6146L4044q9619m2369R0415O4075p3631p9160M5097O7880
411D8381l9899p1652K8909P6022m762o0442n309M0948k061m2464r041K7583J3130
424f57l395M442q30j8725k872K0312r133m3133M150O7000K2450o6849l8425O6396
438G31M9661p2086q0950N5328J01157k3442r5853R918R7696O134j00322l5089
450h7117Q0719M8438n7444m3868N3306N5116l4911n9281P370M1003K208k3097
462a7558J47J8649J1042N152m007k6434k2085K5604L9367j8447m6888K2301P3414
475F0257k697q7438k7834P9186M3963p2813n5897P1541Q1955m6452q7352K2549
487b1032P7070j8868p9794J2039Q6471Q054p5937j2718P2212J7259p9196m0273
$$ y = [67175, -42843, -64497, 31649, 65693, -23926, -66295, 24120, 88195, 14564, -64596, -19499, 48381, 8482, -63170, -34261, 41761, 36999, -23443, -28752, 12196, 10135, -32329, -41370, -13787, -657, -4052, 390, -440, -19165, -22037, -1725, -10858, -53991, -49841, 17159, 39609, -27240, -65665, 731, 50392, -21694, -102644, -47316, 53841, 30399, -65454, -55536, 42160, 48294, -52028, -87117, -6398, 42040, -15404, -59272, -5966, 49150, 14239, -45042, -37672, 3331, 5539, -17558, -17411, 1238, 12280, 17432, 13425, -13009, -35094, -9490, 29877, 11430, -35458, -13157, 60257, 57560, -29878, -57712, 21474, 65437, -7376, -63273, 8268, 90223, 43771, -43581, -21032, 56038, 37170, -42624, -30585, 55886, 63940, -11997, -24715, 47497, 64756, -14440, -54713]
499e4713O3621N4602l6357m5796K5035L9811j5050l6279l297J1995m59N616J6989
512B5718k796k0305M450K2563j6259m5167N324N6534R650n7170j5275O8253L0339
525F5859p9590o2402O2790P4982m9552q0887M5106R7902k6931j09748k038R8835
537C4326J4446r7361l3185R1725O2687n9551p1349K0522N2585m702l6790r123
549c5770J4902J5299J7406O505k9851l3617J7621L8153j3943m3575J6639N8483
561B8252l934o1896k888O3065J502p7664j7347Q4573M2241o8301m5767O0759M7696
574E0291o0538n9707M8590O4161l3285n8479L1026O6900j2661o5312j4147L8817
586d344K0053j1327n496L569k597O499J8252n655l4319j3019K7928K2332j0452
$$ y = [-54713, 8908, 63510, 27153, -18643, 6392, 46203, 31153, -5126, -8423, 3572, 3113, 8729, 25718, 22922, 2617, 7067, 29630, 13371, -31796, -26472, 30062, 39712, -17458, -32733, 35520, 65859, -13731, -76133, -13343, 61639, 12087, -68800, -23694, 74208, 47277, -62471, -64509, 34326, 48772, -48589, -81774, 9951, 72638, 13087, -58262, -37740, 14845, 10143, -26647, -35770, -20868, -5569, 11837, 18342, -11509, -45126, -27505, 10648, -3295, -46870, -30231, 28252, 24318, -37578, -40466, 22599, 24101, -53563, -70910, 13663, 55904, -12397, -58164, 2595, 50291, -10247, -69954, -21364, 42797, 9512, -48967, -17941, 48959, 36298, -29014, -43161, -4344, 15709, 4382, -1114, 2455, -142, 6357, 24609, 18954, -15365, -28384, -456, 21876, 11424]
599A1424m152J8164l436l5403l698M6318J3147o0402l6244O8016P7065m1609r6782
612d7592M019Q9868J6066q3004l3827P3455N2470n0440n2094L4366M5939l1428
624A7798n2681J3871M8361N590k5418n813J0499k003o244O43o173j0010Q613K0366
638A7399j035j3804O181R536k5078l2758K2511N5043l693o7200k1011P3517N6896
651G6504o1062r5093J5563R7228K3130p4893l6644N6304L9484m1937l6863K9042
663i237K1539l8819k1478N1964M4708l8075n9168J0269N1170P820m1046k2505
675d2858K3130L1183K780j6194j0082o59l45k227J668K696O205J0654J394j8611
689a1266j1544K4185K2522l2828m6139K5725P0258L361o4745j8802N2393J6007
$$ y = [11424, 7272, 25436, 22000, -13403, -17101, 29217, 42364, -18038, -54282, 13734, 90799, 49190, -47592, -43573, 46295, 62361, -20643, -54470, 18985, 71455, 21015, -31079, 3287, 49226, 17798, -34883, -21012, 27349, 32939, 7521, 1708, 12207, 10204, 3960, 4603, -1570, -11580, -2967, 17399, 16364, 2560, 8741, 18277, -6801, -39559, -17048, 37995, 34302, -32898, -53909, 19608, 76504, 15442, -79651, -64088, 33140, 56270, -18623, -55267, 1037, 40521, -1416, -38279, -9237, 12302, -26517, -47995, 3969, 48677, 10602, -48566, -38297, 12873, 20693, -20353, -42858, -19728, 11455, 14235, -1959, -12041, -12700, -13045, -15272, -13604, -10908, -4703, 5951, 7345, -11266, -22810, 1375, 23897, -8931, -55070, -29345, 40913, 44274, -20471, -39273, 13120, 29127]
701B9127n2902j5542N7841K1695o1336k7707P3388N4544o6705q7370K8748R1339
713D5120J2352o6005k9752L9851L4361j0791k1638q445o916k075J9874K4921l870
726B6987k3166q485R288M016j981N031l659k3053j286M6809L1718m7920o3429
739d9130K6864P1726j3096p5268M191Q2048J1471p9545k2521P3216K6181p6410
751b0273m3187O5402N8687l7840n1862J8869L5291j5987k7200J0917J5268j5039
763f954p361K5746J5862k2534k2162O548N512j0455J0597K8885j3063m9429P412
776c1396P3157J3391r0912n3871P5565Q0053m4465p6445K7594O5503k3454n7052
788d2332K2387M8070l4521n4551M3156P7551k3498q6317m694P0943J9066n2373
$$ y = [29127, -23775, -39317, 18524, 40219, -21117, -48824, 24564, 79108, 12403, -74967, -46219, 45120, 57472, -8533, -38285, 1566, 35927, 25136, 3498, -4947, -11863, -13938, 5936, 30857, 26987, 3821, -4664, 4624, 8640, 6659, 11690, 8031, -15022, -16308, 30501, 62219, 14299, -49130, -22266, 49460, 36364, -38904, -34713, 47335, 58806, -20739, -43260, 29956, 56137, -20273, -63460, 1942, 60629, 22789, -29073, -10204, 25087, 9100, -18100, -7183, 8085, -6954, -14315, 11431, 27293, 4759, -17403, -10855, -5343, -15798, -5201, 23684, 10621, -38808, -31396, 41761, 55152, -35760, -89631, -14066, 65987, 21522, -54923, -27329, 38174, 14720, -42332, -19945, 28125, -6396, -60947, -17791, 59760, 36262, -50055, -54749, 16194, 35260, -17113]
800a7113k5457L2664K4389q971n483N062j2786j5207J1871J7772j1973j2333K3498
813E933K1951k8001l2972K5576M2267k4897n8930J3954P2638J3034o3303k4238
825c6988M9948K1163n1144k4551N5628L5384n3256m5142N3031O5698l6758q4278
837e1265j068P3110L1215m0289l4610J5308K6592L309j0400j2583j4315l34K3970
850H640J9448j2201j8650O513J0038j3894j2162J8277J5775k4498k2875L2247
862F658M3663k3291o0911k57N6531J2231n0261j7287M9140K7345m1806l3687L2050
875A18L1028l1521l7304K3526M3143o102l2394k372J9189k185j7197j44J1787
888d28J131n080L786P572l08p696r411q578L239J9445J2261j6199k2894J1459
$$ y = [-17113, -42570, -9906, 14483, 5512, 29, 5091, -7695, -22902, -11031, 6741, -5232, -17565, 5933, 27884, -117, -33089, -7513, 34754, 9857, -49073, -35119, 37519, 50553, -12750, -36988, 12960, 34123, -17021, -41572, 14056, 49440, -3816, -48958, 4073, 69771, 33013, -51265, -52333, 20777, 51992, 11703, -22907, -7599, 18993, 22302, 11902, -681, -14996, -15330, 8640, 28088, 15887, -2763, 3750, 13788, -106, -12268, 6009, 21784, -2714, -25589, 6658, 50321, 27030, -33881, -34138, 22393, 34624, -15637, -32924, 16216, 43561, 1755, -31932, 118, 31146, -375, -37679, -14153, 28990, 22888, -9506, -11878, 7311, 5126, -12071, -12215, -428, 703, -4377, -591, 6981, 6673, -1023, -10434, -19012, -15773, 3672, 15933, -266, -23160, -11701]
902a1701L4121Q1m5215k5926L7063M3085j7335m3736R155M5752k630n1679r675
915c8640M8376J7846m6125k3376M9120M1290l8152n4576J4262M9851K199l9685
927a7610j1079K9744K0609r056j5853o825r31O100R318j928j1527N795K1643p39
941A7661k8770q638K8688J1614l2707j8625L8029L6205k8827m3993J5984M3656
953C0277j1792m8232M337N2741R751m7326j6096M4321K2269m4419l6759L2359
965h569M2820j4935l4330R024K9680q114k7456K714K0033o128j7751J1282K4821
978B3091m332k3184m833J1540Om880O071K37j2785N896K8575J165m3900k1281
992c8614M2053L3596l6297m2343L3268N3863k0540n9992M279N4430J946n3340
$$ y = [-11701, 22420, 22501, -22714, -48640, -11577, 31508, 14173, -29563, -20408, 25344, 22714, -28965, -38640, 9736, 27582, -18543, -41919, 7201, 48491, 10339, -44237, -29975, 19876, 22075, -17610, -28689, 1055, 21664, 12608, -3245, -10070, -11001, -4901, 4417, 2489, -9038, -3243, 18400, 17661, -11109, -19747, 8941, 20555, -12152, -30777, 7252, 43457, 14630, -29363, -13379, 30277, 18485, -29747, -25410, 27331, 37082, -10244, -26340, 17981, 40250, -4169, -40928, -8569, 34251, 19316, -15014, -5990, 23690, 15576, -11880, -9166, 10867, 4739, -13012, -1730, 23091, 18759, -4425, -9258, 2282, 2288, -2592, 3479, 3716, -9069, -3173, 25402, 26567, -17333, -38614, 3439, 37035, 738, -41605, -8337, 45526, 24986, -35006, -30727, 23703, 25649, -27691]
1004b7691r212N2737K2794m2242k8069K9931K6099k6765l0029J8106L1009m638
1016A2030k1589O63J4303m0j0881n183k177J626J4948J3992j4773k4811J0055
1029a1837L3732o340m5607r114N0122K7769l9988l4635L1960L8093k7383m4086
1041c7314J6594M3953q575l8056R914M1660n934m5386m475M0362R147l6052j1936
1054b6098L5122K1301k3644k3894J0171J6018n640j0205K404N710L292P640J623
1067A3800j6954j3014J4941J8489j4119k3524J5663L3929o919l8080j853L5284
1079A7643L487l9816r653M4307K3274l9369l0441L3933L6131l1675m8584J9104
1091b1659N3731j239m7964p730M2302J5355l5864k5643K0498K2985p410j2097
$$ y = [-27691, -36903, 15834, 38628, -3614, -31683, -1752, 24347, -2418, -32447, -14341, 16668, 12030, -9559, -8896, 5407, 5367, -5514, -10697, -12874, -11248, 3700, 17692, 2919, -21892, -11837, 21895, 15555, -30052, -39166, 10956, 38725, -1263, -35898, -3938, 34155, 6772, -37314, -20720, 23233, 14658, -23398, -13484, 28176, 22242, -23144, -27619, 12743, 21890, -14162, -26098, 9024, 30325, 6681, -17213, -7042, 8976, 3336, -6869, -4465, 1245, 4537, 12177, 13800, -3154, -16168, -1227, 17262, 3143, -20381, -4718, 29211, 22292, -15788, -17641, 17643, 21130, -18686, -28339, 15968, 39242, -127, -30568, 3365, 39496, 7821, -40763, -21659, 32072, 30833, -17131, -24861, 17441, 32796, -3068, -28711, -8213, 14772, 7362, -4735]
1103d735M981O087l148l63J407j1345j0100J4772J9782j0493k1417J0789K5412
1116B1629j2319l4430M779L6663K77l7251j280M5066R729m7934k4083M1118L0608
1129C2572l6262l7096L0855M6511j6176m5783J944L6857K927l2198q101K6185
$$ y = [-4735, 246, 6333, 3185, 2822, 4229, -7116, -17216, -2444, 17338, 6845, -14572, -3783, 21629, 9310, -25120, -20341, 16322, 16599, -20652, -21932, 23134, 32863, -15071, -39154, 1964, 32572, -3690, -40786, -9931, 36580, 20404, -25379, -23435, 13422, 16349, -15849, -23950, 2235]
$$ [...]
8191a44
##END NTUPLES=NMR FID
##END=
