##TITLE=1H_IAMT-131
 DMSO, 8 sc, 
 28.5.2019
##JCAMPDX= 6.0         $$ Bruker NMR JCAMP-DX V2.0
##DATA TYPE= NMR FID
##DATA CLASS= NTUPLES
##ORIGIN= UXNMR, Bruker Analytische Messtechnik GmbH
##OWNER= root
$$ XWIN-NMR		Version 3.5
$$ Tue May 28 16:03:10 2019 Russian Standard Time (UT+4h)  she@DPX200
##.OBSERVE FREQUENCY= 200.1315
##.OBSERVE NUCLEUS= ^1H
##.DELAY= (6, 6)
##.ACQUISITION MODE= SIMULTANEOUS
##.ACQUISITION SCHEME= undefined
##.AVERAGES= 8
##.DIGITISER RES= 18
##SPECTROMETER/DATA SYSTEM= spect
##.PULSE SEQUENCE= zg30
##.SOLVENT NAME= DMSO
##.SHIFT REFERENCE= (INTERNAL, DMSO, 0, 15.7039)
##AUDIT TRAIL= $$ (NUMBER, WHEN, WHO, WHERE, WHAT)
$$ ##TITLE= Audit trail, XWIN-NMR		Version 3.5
$$ ##JCAMPDX= 5.01
$$ ##ORIGIN= Bruker BioSpin GmbH
$$ ##OWNER= she
$$ F:/spectra/data/she/nmr/H-F/1/audita.txt
$$ ##AUDIT TRAIL=  $$ (NUMBER, WHEN, WHO, WHERE, WHAT)
(   1,<2019-05-28 16:01:56.29 +0400>,<she>,<DPX200>,
      <created by zg, POWCHK disabled, PULCHK disabled
       configuration hash MD5:
       00 E9 B6 7A A2 85 ED C7 34 08 36 98 17 FE 4E 26
       data hash MD5: 16K
       99 13 6D B2 E1 9A F1 99 65 26 77 27 07 07 D6 EC>)
$$ ##END=
$$ 
$$ hash MD5
$$ 3E F0 E2 BF DC 34 84 CC 65 97 7D DE 11 C5 62 11
##$RELAX= 
##$RELAX= 
##$RELAX= 
##$RELAX= 
##$RELAX= 
##$RELAX= 
$$ Bruker specific parameters
$$ --------------------------
##$DU= <F:/spectra>
##$EXPNO= 1
##$NAME= <H-F>
##$PROCNO= 1
##$TYPE= <nmr>
##$USER= <she>
##$AMP= (0..31)
100 100 100 100 100 100 100 100 100 100 100 100 100 100 100 100 100 100 
100 100 100 100 100 100 100 100 100 100 100 100 100 100 
##$AQSEQ= 0
##$AQ_mod= 1
##$AUNM= <au_zg>
##$AUTOPOS= <>
##$BF1= 200.13
##$BF2= 200.13
##$BF3= 200.13
##$BF4= 200.13
##$BF5= 200.13
##$BF6= 200.13
##$BF7= 200.13
##$BF8= 200.13
##$BYTORDA= 1
##$CFDGTYP= 0
##$CFRGTYP= 5
##$CHEMSTR= <none>
##$CNST= (0..31)
1 1 145 1 1 1 1 1 1 1 1 1 1 1 1 1 1 1 1 1 1 1 1 1 1 1 1 1 1 1 1 1 
##$CPDPRG= <>
##$CPDPRG1= <>
##$CPDPRG2= <>
##$CPDPRG3= <>
##$CPDPRG4= <mlev>
##$CPDPRG5= <mlev>
##$CPDPRG6= <mlev>
##$CPDPRG7= <mlev>
##$CPDPRG8= <mlev>
##$CPDPRGB= <>
##$CPDPRGT= <>
##$D= (0..31)
0 1.2 0 0 0 0 0 0 0 0 0 0.03 0 0 0 0 0 0 0 0 0 0 0 0 0 0 0 0 0 0 0 0 
##$DATE= 1559044915
##$DBL= (0..7)
120 120 120 120 120 120 120 120 
##$DBP= (0..7)
150 150 150 150 150 150 150 150 
##$DBP07= 0
##$DBPNAM0= <>
##$DBPNAM1= <>
##$DBPNAM2= <>
##$DBPNAM3= <>
##$DBPNAM4= <>
##$DBPNAM5= <>
##$DBPNAM6= <>
##$DBPNAM7= <>
##$DBPOAL= (0..7)
0.5 0.5 0.5 0.5 0.5 0.5 0.5 0.5 
##$DBPOFFS= (0..7)
0 0 0 0 0 0 0 0 
##$DE= 6
##$DECBNUC= <off>
##$DECIM= 24
##$DECNUC= <off>
##$DECSTAT= 4
##$DIGMOD= 1
##$DIGTYP= 9
##$DL= (0..7)
0 120 120 120 120 120 120 120 
##$DP= (0..7)
150 150 150 150 150 150 150 150 
##$DP07= 0
##$DPNAME0= <>
##$DPNAME1= <>
##$DPNAME2= <>
##$DPNAME3= <>
##$DPNAME4= <>
##$DPNAME5= <>
##$DPNAME6= <>
##$DPNAME7= <>
##$DPOAL= (0..7)
0.5 0.5 0.5 0.5 0.5 0.5 0.5 0.5 
##$DPOFFS= (0..7)
0 0 0 0 0 0 0 0 
##$DQDMODE= 0
##$DR= 18
##$DS= 0
##$DSLIST= <SSSSSSSSSSSSSSS>
##$DSPFIRM= 0
$$ [...]
##$SUBNAM2= <"">
##$SUBNAM3= <"">
##$SUBNAM4= <"">
##$SUBNAM5= <"">
##$SUBNAM6= <"">
##$SUBNAM7= <"">
##$SUBNAM8= <"">
##$SUBNAM9= <"">
##$SW= 24.9337058887773
##$SWIBOX= (0..15)
0 0 2 0 0 0 0 0 0 0 0 0 0 0 0 0 
##$SW_h= 4990.01996007984
##$TD= 16384
##$TD0= 1
##$TE= 0
##$TE2= 300
##$TE3= 300
##$TEG= 300
##$TL= (0..7)
0 120 120 120 120 120 120 120 
##$TP= (0..7)
150 150 150 150 150 150 150 150 
##$TP07= 0
##$TPNAME0= <>
##$TPNAME1= <>
##$TPNAME2= <>
##$TPNAME3= <>
##$TPNAME4= <>
##$TPNAME5= <>
##$TPNAME6= <>
##$TPNAME7= <>
##$TPOAL= (0..7)
0.5 0.5 0.5 0.5 0.5 0.5 0.5 0.5 
##$TPOFFS= (0..7)
0 0 0 0 0 0 0 0 
##$TUNHIN= 0
##$TUNHOUT= 0
##$TUNXOUT= 0
##$USERA1= <user>
##$USERA2= <user>
##$USERA3= <user>
##$USERA4= <user>
##$USERA5= <user>
##$V9= 5
##$VALIST= <valist>
##$VCLIST= <CCCCCCCCCCCCCCC>
##$VD= 0
##$VDLIST= <DDDDDDDDDDDDDDD>
##$VPLIST= <PPPPPPPPPPPPPPP>
##$VTLIST= <TTTTTTTTTTTTTTT>
##$WBST= 1024
##$WBSW= 4
##$XGAIN= (0..3)
0 0 0 0 
##$XL= 0
##$YL= 0
##$YMAX_a= 317742
##$YMIN_a= -306762
##$ZGOPTNS= <>
##$ZL1= 120
##$ZL2= 120
##$ZL3= 120
##$ZL4= 120
##$ABSF1= 10
##$ABSF2= 0
##$ABSG= 5
##$ABSL= 3
##$ALPHA= 0
##$AQORDER= 0
##$ASSFAC= 0
##$ASSFACI= 0
##$ASSFACX= 0
##$ASSWID= 0
##$AUNMP= <proc_1d>
##$AZFE= 0.1
##$AZFW= 0.1
##$BCFW= 1
##$BC_mod= 2
##$BYTORDP= 1
##$COROFFS= 0
##$CY= 11.3945322036743
##$DATMOD= 1
##$DC= 2
##$DFILT= <>
##$DTYPP= 0
##$F1P= 18.9103706918063
##$F2P= -1.10871071338519
##$FCOR= 0.5
##$FTSIZE= 0
##$FT_mod= 4
##$GAMMA= 1
##$GB= 0.15
##$INTBC= 1
##$INTSCL= 1
##$ISEN= 128
##$LB= 0.24
##$LEV0= 0
##$LPBIN= 0
##$MAXI= 10000
##$MC2= 0
##$MEAN= 0
##$ME_mod= 0
##$MI= 1.114404
##$NCOEF= 0
##$NC_proc= 0
##$NLEV= 6
##$NOISF1= 3.799351
##$NOISF2= 2.8
##$NSP= 1
##$NTH_PI= 0
##$NZP= 0
##$OFFSET= 15.70392
##$PC= 1
##$PHC0= -8857.709
##$PHC1= 11.20025
##$PH_mod= 1
##$PKNL= yes
##$PPARMOD= 0
##$PSCAL= 0
##$PSIGN= 0
##$REVERSE= no
##$SF= 200.130013532006
##$SI= 16384
##$SIGF1= 3
##$SIGF2= 2
##$SINO= 400
##$SIOLD= 16384
##$SREGLST= <1H.CDCl3>
##$SSB= 0
##$STSI= 0
##$STSR= 0
##$SW_p= 3612.71676300578
##$SYMM= 0
##$S_DEV= 0
##$TDeff= 0
##$TDoff= 0
##$TI= <>
##$TILT= no
##$TM1= 0
##$TM2= 0
##$TOPLEV= 0
##$USERP1= <user>
##$USERP2= <user>
##$USERP3= <user>
##$USERP4= <user>
##$USERP5= <user>
##$WDW= 1
##$XDIM= 8192
##$YMAX_p= 0
##$YMIN_p= 0
$$ End of Bruker specific parameters
$$ ---------------------------------
##NTUPLES= NMR FID
##VAR_NAME=  TIME,          FID/REAL,        FID/IMAG
##SYMBOL=    X,             R,               I
##VAR_TYPE=  INDEPENDENT,   DEPENDENT,       DEPENDENT
##VAR_FORM=  AFFN,          ASDF,            ASDF
##VAR_DIM=   8192,          8192,            8192
##UNITS=     SECONDS,       ARBITRARY UNITS, ARBITRARY UNITS
##FACTOR=    0.0002004,     1,               1
##FIRST=     0,             0,               0
##LAST=      1.6414764,     0,               0
##MIN=       0,             -306762,         0
##MAX=       1.6414764,     317742,          0
$$ Real data points
##PAGE= N=1
##DATA TABLE= (X++(R..R)), XYDATA
$$ [...]
2575a602O133J438m257o097k898L470O925K941l588p180k714L184P248L632l159
2590C476o558l664K921N752L792j796n890m400J073N426M617r77m857n306J53
2605f238N205N970O40n193n604r43N198O570J072m878o201j404M695N932J695
2620F516m552n648k456L514N988K449k670n855k864K148O383M054k098o013m349
2635e453J554O135M629j278o361n099P93N918M722k98n681n046M68N328M592P70
2651E693m593n148p47M178N251J555m231o087k027L245O108K415l380o532k756
2666g056L172O465L061k945n860l448K797O236L364j754n881l582J212M779M581
2681E141j145n222m597J19N198M938N66n156n377n14M925O012Q95m488n717j173
$$ plain form
2575 -1602 4531 5969 1712 -4385 -7283 -3813 3112 6053 2465 -4715 -7429 -4245 3003 6635 3476
2590 3476 -3082 -6746 -3825 1927 5719 3923 -1967 -6367 -5294 132 4749 3772 -1085 -6391 -6238
2605 -6238 -1033 4937 5577 384 -5220 -6163 -965 5605 6677 1799 -4402 -5806 -1111 4821 6516
2620 6516 1964 -3684 -6140 -2626 3362 5811 3141 -2714 -5578 -3430 2953 7007 4909 -1104 -5453
2635 -5453 -3899 2236 6865 5587 -774 -5873 -5080 838 5560 5262 -419 -5465 -4997 331 4923 5693
2651 5693 1100 -4048 -4795 -617 4634 6189 1958 -4129 -6156 -2911 3197 5612 2232 -4300 -7056
2666 -7056 -3884 2581 5642 2697 -3163 -6611 -3814 2422 5786 4032 -1849 -5431 -4219 560 5141
2681 5141 3996 -1226 -5823 -5704 -506 4432 4998 -158 -5535 -6049 -1124 4888 5783 1295 -4422 -5595
2697e595M674N530J284l991n802j574L252N545K110l052n275k439K281N144M022
2712F114k165n394l625J575N635M129j137n807m596Q89N456M475j339m966m609
2727e365P12M651M389M44m472m306o71M431M608J194l278n370j721L135N076K193
2743E650l070n998k834K897N936K881k731n752l025K811N569K928j767m934l774
2758e213J830M696L911j071n054m131K38M674M481L4m291n093l21M418N309J280
2774E697m737n281o00M288N291J122m145n404j557L185N339J512k952n116j767
2789e125K332M755K936k030m539l003J386N343L641j340n214l860J103M601M516
2804E502j094n426m145M29M812M405l57m440m159j24L651M671R04l214m663j586
$$ plain form
2697 -5595 -921 4609 5893 1902 -3900 -5474 -2222 3323 5433 2381 -2894 -5333 -3052 2092 6114
2712 6114 3949 -1445 -5070 -3495 2140 6269 5132 -675 -5271 -4382 1074 5549 4210 -756 -5365
2727 -5365 -4653 -2 4387 4831 359 -3947 -4618 -187 4421 5615 2337 -3033 -4754 -1619 3457 5650
2743 5650 2580 -3418 -6252 -3355 2581 5462 2731 -3021 -6046 -3235 2334 5262 3495 -1439 -5213
2758 -5213 -3383 1313 5224 4153 -901 -5032 -4794 -120 4361 4395 104 -4989 -5310 -892 4417 5697
2774 5697 960 -4321 -4921 -633 4658 5780 1635 -3769 -5326 -2141 3198 4710 1758 -3358 -5125
2789 -5125 -2793 1962 4898 2868 -1671 -4674 -3288 2055 5696 4356 -858 -4718 -3615 986 5502
2804 5502 4408 -1018 -5163 -4734 78 4483 4126 -314 -4473 -4597 -946 3725 4629 1415 -3248 -4834
2820d834L476M812J808l127m956k771L175N270K373k702n416k499K514N039K945
2835E107k139m707k787J665M461L228r48m686l445O74L658M008R9m166m390m48
2851d816M343M397O37l798m604q13M183M698Q34l793m510j353L242M855J144k774
2867A872m661k295K695M416K600k098m635k574J580M827L354j408m798l639J315
2882c449M689L828j214m325m297N84M572L479l6m424l820p5L778M139Q01l522
2898G08m288p90L014M741J441k832m934j525K224M862K182k351n211k340K445
2913b654M667K641k039m551k768J798M427L173j438m020l035O56L932L420l54
2928C855m106l632m82L907M278O43m012m335l62L459M440J022l677m322r04L092
$$ plain form
2820 -4834 -1358 3454 5262 2135 -2821 -5592 -2417 2853 5226 2524 -2892 -5391 -2877 2162 5107
2835 5107 2968 -1739 -4526 -2861 1600 4828 3880 -806 -4251 -3577 81 4089 4188 22 -4368 -4816
2851 -4816 -473 3924 4561 763 -3841 -4654 -471 4227 5061 1268 -3242 -4595 -1353 3502 4646 1872
2867 1872 -2789 -5084 -2389 2027 4627 2529 -2106 -4680 -3100 1727 5081 3673 -1125 -4764 -3449
2882 -3449 1240 5068 3854 -471 -4768 -4184 388 3867 3831 -593 -4413 -4488 -710 3429 4230 708
2898 708 -3580 -4370 -1356 3385 4826 1994 -2940 -4465 -2241 2621 4803 2452 -2759 -5099 -2654
2913 -2654 2013 4654 2615 -1936 -4704 -2906 1521 4694 3256 -764 -3799 -3143 789 4209 3855
2928 3855 -251 -3883 -4365 -458 3820 4463 451 -3884 -4246 -787 3653 4675 998 -3324 -4228 -1136
2944a136M402J368l184m302j534K449L930K143j897m330k446J666M525K939j314
2959C279m353l009R36M355L235p01m057l494L83L942L513o47m125l370L9L946
2975a28L401L63l426l400q30K919M166J016k370m100j602K596L961J954k220m435
2991b135k373K264M385K359k055m315k363J814M026K313j284l895k667Q68L788
3006G30L205o49l824l032RL356L453K31l212l830n64L626L734J073l351m103o85
3023c833K581M159J078k674m098j361K135L702J879j787m071k034J598L972K642
3038C888j554l774k790J548L628K936o02l727l193R90L867K793n09l305l487o4
3054c355L339L527N8l060l453p28K770L987M76k396l440j391K524L571J809k062
$$ plain form
2944 -1136 3266 4634 1450 -2852 -4386 -1937 1993 4136 2239 -2091 -4537 -2871 1654 4593 3279
2959 3279 -1074 -4083 -3147 1208 4443 3742 -315 -3809 -3426 516 4029 3382 -743 -4113 -4074 -128
2975 -128 3273 3636 210 -3190 -4020 -1101 3065 4081 1711 -2389 -3991 -1395 2566 4520 2300 -2135
2991 -2135 -4508 -2244 2141 4500 2445 -1870 -4233 -2419 1607 3920 2636 -1259 -3926 -3058 730
3006 730 3935 3286 -538 -3570 -3561 -205 3248 3479 267 -3563 -4127 -501 3233 4306 955 -3148 -3833
3023 -3833 -1252 2907 3985 1311 -2787 -4148 -2013 1689 3568 1781 -2290 -4324 -2726 1246 3888
3038 3888 2334 -1440 -4230 -2682 946 3882 3280 -447 -3640 -2650 1217 4010 3501 196 -3291 -3355
3054 -3355 -16 3511 3569 509 -2944 -3672 -902 3085 3561 1165 -2275 -3666 -1142 2429 4238 2176
3070B176m204k016K336L944J778j547l901k543J833L784K468j406l446k483J079
3085b148L228K686j122l195k991L13K893L535j06k870l919k98L323L693K89l139
3101A72l633p15K999L857P21k569l654j197K266L848J364j805l605j590J311L789
3117A559J666j189l813k340J810L062K749j175l374l048Q13L697L223p45l204
3132c09l161N06L255L006K6k931l416l9K882L366Q25k867l297r60K736L294J044
3149C960k310l631j292J737L746J652k003l221k019J439L244K313j328l514k109
3164c336R66L164K651p48l035k570K11K909L304k76l028l187j87K897L001M61
3180C197k518l693o75K430L504J000k822l440p56K005L283J485k132l062j147
$$ plain form
3070 2176 -2028 -4044 -1708 2236 4014 2467 -1434 -3977 -2144 1640 4108 2702 -744 -3227 -2148
3085 -2148 1080 3766 2644 -551 -3542 -3229 -336 3199 3093 223 -3696 -3994 -671 3022 3311 172
3101 172 -3461 -4176 -1177 2680 3401 832 -2822 -4019 -1753 2095 3459 1654 -1951 -3541 -2230 1559
3117 1559 3225 2036 -1777 -4117 -2307 755 3504 2329 -1045 -4093 -3280 417 3640 2895 -309
3132 -309 -3470 -2964 291 3297 3323 392 -3024 -3063 -181 3185 4010 1143 -2154 -3114 -378 2916 3960
3149 3960 1650 -1981 -3273 -1536 2210 3862 1859 -1362 -3381 -1942 1302 3615 2287 -1227 -3336
3164 -3336 -2370 794 3445 2697 -338 -2908 -2697 212 3516 3240 212 -2975 -3162 -265 2736 3197
3180 3197 679 -3014 -3689 -1259 2245 3245 423 -3017 -3773 -1768 1515 3000 868 -2194 -3341
3195c341J208L074K305j471k975k138R90L227K327o34l170k791P65L310K501n26
3211B661l179k610M38K756K866N6l141k637k24K588L023M68k441k583r39K198
3227g00L246R78k217k707j394J942L082J897k064l229j750J376L428J588j193
3242B283l237j868Q93K783J770m11k848k150N63K488K629m41k776k432Q6K543
3258a25K657M96k373l193o86K557L047Q35k187l215q74J935L111J021j942l116
3274b052j373J750K588J448j355k786j404Q57L356J863j168k967j682P11K871
3289F57K427n42k845k223K71K358K894j66k835k592L66J983K603M98k827k577
3305b550m32K209L223N37k146l002o45J459K985J436j431l212j460J615K909J966
$$ plain form
3195 -3341 -2133 941 3246 1775 -1200 -3338 -2348 879 3206 2572 -598 -3389 -2624 686 3187 2661
3211 2661 -518 -3128 -2690 66 2932 2988 -153 -2790 -3014 -426 2597 3065 624 -1959 -2898 -700
3227 -700 2546 3524 1307 -1400 -2794 -852 2230 4127 2063 -1166 -2916 -1540 1888 3476 2283
3242 2283 -954 -2822 -1929 854 2624 2213 -635 -2785 -2222 266 2895 2454 -322 -2754 -2668 -125
3258 -125 2532 3028 655 -2538 -3224 -667 2380 3215 1028 -2187 -3061 -1126 1985 3006 1064 -2052
3274 -2052 -3425 -1675 913 2361 1006 -1780 -3184 -2327 1029 2892 1724 -1243 -2925 -2214 657
3289 657 3084 2542 -303 -2526 -2255 103 2997 2831 -4 -2596 -2230 -247 2356 2854 27 -2550
3305 -2550 -2982 -773 2450 2987 841 -2161 -2806 -1347 1638 3074 1643 -1569 -3029 -1414 1495 3461
3321C461j530k945j547Q72K973J867q46k787k332J053K295K017j13k870k411J70
3337b673K500K240M70k388k517n50K272K862N32k293k492p02K198K436N78j455
3353A018k404j200J536K482J528j663k529j606R06K500J971n50l050j515M12K559
3369C95K485r50k632k217L74K522K541l84k589j743l04K372K500K34k212k204
3385a812l17J850K650K80j684k710q93J892K404N50j024k876j291J360K732J247
3401B358p89k599j433O52K693J292j33k507j688M13K128K383l15k579k044K06
3417a962K059J915K92k366k014n0J617K679O8j990k349q73K028K781O78j949k487
3434a923o48J737K117J233j293k675r01J248K105J722r41k617j515J062K247J785
$$ plain form
3321 3461 1931 -1014 -2561 -1689 1284 3151 2305 -482 -2814 -1761 534 2551 2438 -432 -2843 -2673
3337 -2673 -173 2067 2537 149 -2368 -2918 -646 2216 2748 455 -2037 -2739 -541 1895 2473 1018
3353 1018 -1386 -2586 -1050 1432 2960 1297 -1232 -2838 -1932 568 2539 1989 -1061 -2576 -2164 395
3369 395 2880 1930 -702 -2919 -2545 -23 2518 2134 -455 -2198 -2502 -130 2370 2604 392 -1812
3385 -1812 -2129 -279 2371 2651 967 -1743 -2636 -744 1660 2210 1186 -1690 -2981 -1621 1111 2358
3401 2358 1569 -1030 -2463 -1811 882 2174 2041 -466 -2154 -1741 387 2770 2455 -124 -2168 -1962
3417 -1962 97 2012 2304 -62 -2076 -2126 -509 2170 2238 248 -2101 -2974 -946 1835 2513 564 -1923
3434 -1923 -2571 -834 1283 2516 1223 -1452 -2353 -1105 1000 2722 1781 -836 -2351 -1289 958 2743
3450B743j079k354j893P15J997K016j47k153k454M84J970K328J11j622k873n7
3466b268J777K594L05j614k093j213J691K248J181j495k451j121J507K485P80
3481B313r78k188j528J022K248J508p58k407j758O77K267J802m23j957k128M1
3497b247K171K125k16k021j750j10K102K363k02j876k234k20J370K890K96j956
3513D85k172n48J364J980J277j678j907q03R44K140J252q55k249j235P57J952
3529G04J546o17k235j538O93J828J738j85k001j954P7J753K013K12j831k055k64
3546b116K070J933L09j582j899j076J645K131Q55j490j943r72J065J866J224j269
3562G51k154r89J339J870J390q76j658j522M21J829J913n74j848j665j68K198
$$ plain form
3450 2743 1664 -690 -2583 -1868 129 2145 1998 -155 -2609 -2125 -155 2173 2284 662 -2211 -2268
3466 -2268 -491 2103 2408 794 -1299 -2512 -821 1427 2608 1113 -1338 -2459 -952 1533 2313
3481 2313 1335 -853 -2381 -1359 889 2397 1639 -768 -2526 -1849 418 2220 1797 -160 -2288 -2247
3497 -2247 -76 2049 1833 -188 -1938 -2048 54 2417 2215 339 -1895 -2115 -745 2145 2441 485
3513 485 -1687 -2235 -871 1109 2386 708 -1199 -2002 -1058 1082 2334 1479 -770 -2005 -1248 704
3529 704 2250 1633 -602 -2140 -1447 381 2119 1934 -67 -2021 -1944 -191 1822 2034 203 -1852 -2116
3546 -2116 -46 1887 2196 614 -1285 -2361 -716 1415 2270 780 -1163 -2135 -1070 796 2020 751
3562 751 -1403 -2392 -1053 817 2207 1331 -327 -1849 -1428 401 2314 1740 -108 -1773 -1941 257
3578B57J552nj844k325L62J891J649L41j900j584m72J428K080N55j392k020o69
3595b096J559J867Q25j684j307j155R23K109J320j047j878j491Q66J831J345n10
3611A477k291j114O27J432J688m75j733j658k0J939J992l61j377j503j47J344
3627a80K051r8j473j609n02J260J994O50j373j779r57J179J695J348j716j696
3643a206o97R53J453J226n15j894j392Q45J626J632l64j893j556M12J680J563
3659A873k59j542j788k16J603K007j56j314j680j42J510J504M80j442j516o19
3675a697J423J402R62j337j880q07P85J858J104o87j727j551R92K021P17n51j609
3692e82j172K97J587J494k68j571j549P3J889J399j72j262j917l12J229K121L46
$$ plain form
3578 257 1809 1804 -40 -2365 -2003 -112 1537 1878 -22 -1606 -2078 -650 1430 1985 593 -1427 -2096
3595 -2096 -537 1330 2155 471 -836 -1991 -1068 1041 2361 1314 -564 -2055 -1189 642 1987 1477
3611 1477 -814 -1928 -1301 131 1819 1344 -389 -2047 -2067 -128 1864 1503 126 -1377 -1524 -180
3627 -180 1871 1773 300 -1309 -1811 -551 1443 2093 720 -1059 -2016 -837 858 2206 490 -1206
3643 -1206 -1903 -950 503 1729 1214 -680 -2072 -1227 399 2031 1667 -226 -1782 -1370 310 1873
3659 1873 1614 72 -1716 -1932 -329 1678 1522 208 -1472 -1614 -104 1400 1880 438 -1078 -1697
3675 -1697 -274 1128 2090 753 -1127 -1934 -1149 709 1813 1126 -601 -2152 -1160 861 1578 1027 -582
3692 -582 -1754 -1457 130 1624 1356 -215 -1764 -1691 198 1597 1425 163 -1754 -2066 -837 1284 1630
3709A630j360j675m99J387J760P64j146k070n43J286J601O70j197j790r63O97
3725a448K008J011n45j776j169Q59J681J323k87j838j063m8J827J254m10j319
3741F0j516k3J473J493m7j509j318k67J398J540L30j119j927j70J104J278J267
3758B047j275j669p71R44J882N81n55j694j127M44J781J561j000j420j400M41
3774a230J469J274m38j539j256J99J434J530jj587j501P6J317J512K48j087j535
3791a115l76P91J989K02r19j322n05O28J145J154j054j539r53O58J490J216p84
3808G06j600j043Q58J309J385l06j856j150O61J557J331n46q08j447l74J489J396
3825A562J71j635j364l36J377J161P48j355j637j16Q50J765M39r82j446n01M17
$$ plain form
3709 1630 270 -1405 -1904 -517 1243 2007 861 -1209 -1752 -466 1135 1805 608 -1182 -2145 -1448
3725 -1448 560 1571 1026 -750 -1919 -1060 621 1944 1657 -181 -1244 -1292 535 1789 1379 60
3741 60 -1456 -1479 -6 1487 1440 -69 -1387 -1654 -256 1284 1614 495 -1432 -1602 -498 780 2047
3758 2047 772 -897 -1668 -724 1158 1739 1184 -510 -1637 -1193 588 2149 1149 -271 -1671 -1230
3774 -1230 239 1513 1075 -464 -1720 -1521 -87 1443 1442 -145 -1646 -1570 -253 1259 1507 420 -1115
3791 -1115 -1491 -700 1289 1491 572 -750 -1255 -627 518 1672 618 -921 -1874 -1216 274 1490 706
3808 706 -894 -1937 -1079 230 1615 1309 -547 -1697 -1036 521 1852 1306 498 -949 -1323 166 1562
3825 1562 1733 98 -1266 -1602 -225 936 1684 329 -1308 -1424 -574 1191 1630 648 -798 -1299 -882
3842h82J848O74n52j836q96Q91J255J288n36j549j007O82J009J088O8j445j505
3859a405O3J546R91r2j382j391O2J258J243K86j314j242P0R57J364P67r46j667
3877h32l06P95J726L24q11j338p47N73J093Q84p62j260j320N68J685P61k45j435
3895f47r79M63J314J406l97j220j179K59J512Q70J29r78j424l90J227J563j93
3912A336j118j017o46J213J236M00p03j606m38P05J438P18n61j893p51R10J281
3929E04P50m89j209o40J80J355J132m80j095j191J82J168R23P6r13j394j24J241
3947b4Q64J82r19j358k21P21J813J30j006j088l55J066R71O44o00j225q58N81
3965f82J296O33l42j233r86K67J677Q56q33j137j125M59J257J217k55j363p09
$$ plain form
3842 -882 966 1640 1088 -748 -1644 -753 502 1790 1254 -295 -1302 -620 389 1477 1545 100 -1405
3859 -1405 -1342 204 1195 1103 -279 -1670 -1608 -350 893 1179 -135 -1377 -1307 -350 1014 1781 835 -832
3877 -832 -1138 -343 1383 1707 896 -442 -1189 -616 477 1361 599 -661 -1981 -1413 272 1033 788 -647
3895 -647 -1626 -1163 151 1557 1160 -60 -1239 -980 532 1402 1531 553 -871 -1261 -34 1529 1336
3912 1336 218 -799 -1445 -232 1004 1404 701 -905 -1343 -638 800 1518 957 -936 -1687 -777 504
3929 504 1254 765 -444 -1084 -904 451 1583 1103 8 -1183 -1001 167 1090 1166 253 -1141 -1265 -24
3947 -24 840 1022 103 -1255 -1476 -755 1058 1188 182 -906 -1261 -195 776 1420 820 -405 -1263 -682
3965 -682 614 1247 905 -328 -1314 -1047 630 1486 653 -484 -1609 -1150 107 1324 1069 -294 -1003
3982a003j96J068J165L8j025j133L5R02J227j71m76j568N7P95Q89J005j281j036
4000g08m22P59J407K66n02j016j258N54J200R37n25j185j028L08J659O49J4j478
4018c69o95J40R32J155j68j211n39J20L29J320J66o51j259m01Q59J246L21p36
4036E59j257m97Q79J078O68p44j234n81O75R62M98m46j122n53N43R62R07m70j412
4055e85l80K44Q79J282n07j177o85k26J593O54k43n75j177l7O79J174K63j257
4073h1q01k66O23Q62J050r20j159l45Q13R39O74p06r21m34K28J084O46n74j006
4092b94j015O40J088M33rj222o54K52R84R66o42p31r32K08Q62J041M5r48j205
4111a133k28J483Q57J38p28j163k12O67J009K83n42r81k69l13J934M82r08q42
$$ plain form
3982 -1003 -1199 -131 1034 1072 47 -1086 -1051 -149 1078 907 431 -1137 -1080 -285 604 1609 328 -708
4000 -708 -1130 -371 1036 1302 800 -216 -1474 -920 280 1217 692 -493 -1521 -1213 446 1095 1109 -369
4018 -369 -1064 -924 8 1163 995 -216 -755 -635 -306 1014 1180 529 -730 -1131 -272 974 1295 559
4036 559 -698 -1195 -316 762 1430 686 -548 -1129 -454 508 1006 560 -562 -1115 -572 390 1297 827 -585
4055 -585 -965 -721 158 1440 933 -244 -929 -1155 438 1092 849 274 -903 -940 -261 913 1176 -81
4073 -81 -882 -1148 -525 337 1387 467 -692 -1037 -224 715 1389 683 -238 -672 -444 640 1286 712 -294
4092 -294 -1309 -669 419 852 843 -379 -1033 -781 203 1169 527 -204 -1136 -928 -66 975 1020 72 -1133
4111 -1133 -1361 122 979 1117 389 -774 -986 -319 690 973 431 -550 -819 -1132 802 1284 376 -466
4129d66r10R52O98P81m06j078m62L28Q53O81k23p71r41J83R67J003J65j205r81
4148h32J32O21P23M51r24q59k57P47Q62L08m20j068m61N96O42Q92n95j153l35
4167i30L27J049M14k11q89l88K95M68P62p6j146p26L63R32N03j10r91n93k06J037
4187a16R43K09r24q79k64J015P32N71q96p59l77O32R18K05n76j052n20P45J091
4206F98M05q54n85o21L46Q02P13m79p27p99L55J033N09J3r13o74J59J167N76k55
4226H69n63r83k3P26Q63J18r17r23P5M39R88L0m96j161m0M71R72N44n66j146m02
4247a125N94R92N56l29p95o08K60M93J127n72j062l94k8O90P80K20q38r59p5O38
4267d35J362j5p37q02j70M20R01R8j88q69m10O87Q82L42m87q43p23J001N77L19
$$ plain form
4129 -466 -1376 -424 274 1055 649 -429 -891 -563 290 971 748 -23 -964 -781 186 1189 1354 149 -832
4148 -832 -700 -79 644 1095 171 -688 -945 -198 664 972 552 -516 -977 -381 261 1153 558 -595 -930
4167 -930 -603 446 860 649 -240 -628 -333 135 897 821 -325 -1051 -688 244 747 637 -354 -947 -1153 -116
4187 -116 827 1036 112 -767 -1031 -16 716 1287 391 -368 -745 -113 805 1010 434 -618 -1138 -393 698
4206 698 1103 249 -336 -957 -611 191 904 425 -302 -1101 -746 287 796 809 -104 -778 -619 548 1124 869
4226 869 306 -677 -700 26 889 1007 90 -833 -758 -319 669 699 203 -958 -998 -527 445 989 423 -723 -1125
4247 -1125 -531 461 1017 688 -107 -715 -455 38 1165 593 -469 -863 -891 -201 579 799 -39 -998 -1073 -435
4267 -435 927 912 175 -627 -797 -377 524 622 434 -435 -845 -158 724 1066 579 -264 -987 14 591 910
4287I10m19j005j52R3P92M03p6r22o05k24J433K33q0o05n01rR43N74J64p90n09
4308c52j2N16O96j5o57r18l33Q08P34J35n28n78n14J59J049K11j15q40m98O11
4328d41R07M93m06q00p19O90O08M99k54m78o75p1P11N18K06j032m18l1P59O24
4348F90Kp35n28j41Q08J27L46m56n62j62L81P88O9L6j147l49M63Q70J53j94q43
4369c84j85J06Q91M93l14o81p85J90O04N16K57r89n25K26Q33K29J79o08o97j40
4389g84R04M93J94p73l04l82O99K70K35o28j70n25M90N81J65k96n41p17O40O70
4409B21M74l82p34m24K27Q54N89n28r1m50n52Q88P25k64p39n32j97J128Q14m47
4429E80q07m62q6R83M35K3n86q98K40M61O53M71o48p04m68N62Q47M17o04r21j63
$$ plain form
4287 910 491 -514 -666 -573 219 622 546 -376 -981 -1205 228 461 381 -224 -725 -734 209 783 947 157 -352
4308 -352 -364 152 848 833 176 -742 -1075 -267 467 602 74 -504 -1018 -859 190 401 286 -554 -1052 -441
4328 -441 466 959 553 -247 -966 -276 332 831 577 99 -576 -647 64 582 788 -244 -662 -693 66 690
4348 690 692 -43 -571 -712 96 223 569 113 -449 -611 -230 558 627 663 -484 -833 -370 500 653 459 -384
4369 -384 -569 -463 428 921 607 -74 -859 -669 -65 451 708 -281 -806 -580 253 482 661 53 -644 -784
4389 -784 120 613 807 34 -270 -652 47 317 552 -76 -246 -771 -281 300 465 169 -372 -1089 -449 221
4409 221 695 313 -421 -845 -618 236 825 297 206 -244 -796 92 817 553 -186 -718 -915 213 1027 580
4429 580 -227 -689 -775 208 643 666 80 -818 -578 -117 536 1007 359 -345 -813 -251 596 1013 409 -512 -675
4450f75P07K80M01j49q91k56n6O08P20k51m94p58R0J012K92j46o02m33r3O95M04
4471D05K06l95o40j22O03P44j01o00l95l32K87P38J84l87m90n73N79M81M27m68
4491A51m16k00j4P89J40P5p73m06L30O78L95j23p34k87K28L29M54J78p05n16l99
4512h26O13P25K36p59m95l23Q89M38J05m29o06k54M55Q37K54n25m44k83J19M81
4532B08M79k33n85l03N9O25L60m30m66m57M99K10N38J1n42o89r8Q76L27J90o04
4553b5n35k10Q81M96Qn06m09l63L43Q82J26n99n41j05M37N55J02l35n57l19K96
4574c78L78N84k58o48l79K15M57O97j74m27n48n5M71M21Kk55p13K25N93N35k24
4595E19n13m72l60Q49L38L09o17l47J3J00N93K56n58l47k52R3R36j12J87q65n31
$$ plain form
4450 -675 32 312 713 564 -327 -583 -639 -31 689 438 -56 -814 -724 288 580 434 -168 -601 -694 1 405
4471 405 611 216 -424 -546 57 801 700 100 -295 -627 -340 398 582 195 -295 -868 -289 192 619 151
4491 151 -265 -465 -479 310 450 525 -248 -654 -324 354 749 626 -108 -395 -167 162 616 794 89 -427 -826
4512 -826 -213 512 748 -11 -506 -829 60 498 603 174 -432 -686 -231 606 860 335 -109 -392 -273 208
4532 208 687 454 -131 -434 -375 250 610 180 -286 -743 -244 -34 504 515 -27 -716 -814 62 389 579 -25
4553 -25 -560 -770 111 607 615 109 -300 -663 -320 562 688 89 -452 -557 -120 435 537 202 -355 -674 -378
4574 -378 0 584 326 -322 -701 -486 -29 668 494 67 -481 -536 -65 356 358 103 -610 -385 208 743 519
4595 519 6 -466 -826 23 361 670 53 -294 -281 -181 412 668 110 -237 -489 -396 540 428 615 -250 -781
4616g81N03M54N68o8o83p67N74K12O13j44n87m87N9O41N46m17l28l49p1L90Q60
4637G38j02r72J0J3J86L96L36l41n41l26O21L6P80k82r97l25O53K68M63l64m73
4658b23l21O9Q37K72m04l43k68QP00J67k93l09m69J05N60Q3M58n76n53j54L53
4679c01O16M27p24m57J11NP68j62j9k27l32j46O12M24l21n34k10J79M56O0K08
4700D33m23m16O6O33J2q0k78p15M39N13K20J27n11m84nK74Q67k49j82m95k72L32
4722a94N06n9l7n13k00J37M32M38m69m84l9O33J9L63k24k93n34P23p9L93O0o73
4744i4n24M28L5O36J5o00j17j52M23M43K1n62m8j8J24N57j89j5p60k45L89N11
4766B58L62j98n84k29K87L49L47k68l06m36j43L92P43k26o36k75l1Q80J42rm75
$$ plain form
4616 -781 -278 176 744 676 -7 -774 -200 12 625 481 -106 -593 -534 107 653 236 -92 -441 -512 -122 738
4637 738 636 -336 -326 -313 -127 269 605 264 -277 -603 18 54 834 552 -445 -770 -117 151 614 250 -223
4658 -223 -544 -475 362 634 230 -113 -381 -373 327 494 201 -108 -577 -472 88 171 629 53 -500 -654 -301
4679 -301 315 742 18 -439 -328 -323 445 283 264 37 -295 -441 171 595 274 -260 -470 -291 165 225 433
4700 433 10 -406 -340 293 305 225 -53 -768 -329 184 404 531 20 -464 -469 -195 672 423 241 -254 -526 -194
4722 -194 312 253 216 -297 -497 -360 72 510 41 -443 -482 151 170 533 309 16 -518 205 126 519 579 -94
4744 -94 -618 -190 -155 481 496 -104 -221 -373 50 493 514 -48 -96 -114 10 567 378 363 -397 -642 -253 258
4766 258 620 422 -162 -391 -104 245 592 324 18 -418 -561 -169 574 348 -288 -563 -594 286 428 419 -56
4787e6m41j6N79N31O1m50p52O3L41N43J40n12l04K09l9L78J94q35j63j17J14Q06
4809B74K58l47n81J42N2N08J42j34n35j67J64K92K92L71r63j31J5O55J51r7k35
4830A26o33l21R07P2K14m98k92j69M67N25q3o84k30L45l5P79J42k29m33j91M4
4851a77L55L51l12n69k15K18M25M11n0n10m06K94J23L98J71m76n53P2N28M67J30
4872F75p84j29k46P02J48qk08m43k85O20M24j83m47j95j56J59M84M44j93n95k27
4893d43L86L16L98k50o13l94M75M05J90j91m69q3k03N63L59rl29l69R5J42M62
4914D38k32l39m74K17J63M52J58j82o23J08J45M96J84l76l91p4K29K63M67k82
4934C47r23K14L50M1M92j79m27l79l8N83N18o72K87p69M71J11N21m39n0l69l9
$$ plain form
4787 -56 -497 -513 66 597 658 208 -544 -481 -140 403 543 31 -273 -64 -103 275 469 -366 -529 -646 -532 274
4809 274 532 185 -396 -254 -202 306 448 314 -221 -388 -224 68 360 731 -232 -363 -348 307 458 361 126
4830 126 -507 -828 79 151 365 -133 -425 -594 -127 398 315 -369 -599 -254 -289 490 632 403 -30 -221 -177
4851 -177 178 529 217 -352 -567 -349 76 487 437 -73 -479 -185 -62 336 507 31 -522 -450 78 545 675
4872 675 -109 -238 -484 218 366 358 150 -293 -578 42 466 283 -164 -359 -515 -356 128 572 379 -216 -443
4893 -443 -57 259 657 407 -206 -600 -125 280 470 279 -190 -273 -476 87 446 437 108 -261 -166 -24 438
4914 438 206 -133 -607 -390 -227 225 383 201 -422 -314 -169 327 511 135 -256 -330 -101 162 629 347
4934 347 -576 -362 -12 29 521 342 -85 -464 -502 81 599 -73 214 -555 -84 27 548 109 59 -310 -349
4955c49M17L68j57j43m59jJ41O54J04m79k50oj56O15J5k01l76j67K21K24K93p1
4977B37n27l50P03j76O14k09n69l89N54J79L10P4n32j74k67M76L23k49J16o10
4997d66J8L04K84J90j34l01j92J96K88p2R8m84q9J95N89j5l51n8m40K78L44R6
5019B78L5o14l9PJ6N46k53k8m36M21J96K26l75%j14m38P65J69k00j17l07j41M70
5042F7K89Q3l69k74J44k22N74l4M5k77m10K57J22L16n91K53j99k11Q26K64l96
5063B57k65j63MO59L3ll41m41o3K88L79Pl51l90P5K63N46k66m39l12k3M60N81
5086D95k00l13n68L71J32M63j65N6k04m60J63N40J87k35l73o5k27O21R1l7m85
5107b13J62L1J9K55j45j18l76k26N78N16j41n62M4r0L0N29L37o10n71L16K58J05
$$ plain form
4955 -349 68 436 279 136 -323 -324 -183 471 575 96 -154 -160 -316 299 314 113 -263 -430 -209 15 308 237
4977 237 -290 -640 63 -113 501 292 -277 -666 -112 67 377 451 -81 -255 -522 -46 277 28 144 -466
4997 -466 -448 -144 140 330 196 -105 -297 -101 187 115 213 -271 -360 -165 424 409 58 0 -440 -162 182 278
5019 278 313 -301 -340 -333 -317 229 -24 -52 -488 -67 129 355 -20 -20 -134 -572 193 362 162 45 -262 -403 67
5042 67 356 439 70 -204 -60 -282 292 258 303 26 -384 -127 -5 311 -280 -27 -226 -437 389 653 257
5063 257 -8 -171 -167 492 525 522 181 -260 -323 -35 344 351 0 -390 -315 -52 494 228 -211 -523 -546 -86 495
5086 495 295 -18 -586 -215 -83 380 215 271 67 -393 -230 310 497 262 -111 -176 -403 218 309 272 -213
5107 -213 -51 -20 -1 254 109 -9 -385 -611 -33 483 342 -220 -176 -266 -236 293 630 20 -551 -235 23 128
5129A28K30j55m40k0N9M49M4Q9n51l22J7N71K79k72j87K5j34N12k61J92o58K24
5151a81L5M45m8L7l57l15J45J74K85M01o29j42k21L22K72L85m88m52l82O46L4
5172c4M53l15l09j07K75K45n4J88n66O9K29K9K70N1m41j86k07M25L62l00j95k4
5194a42l0p2L00K92j0o57o7M53o5R0Ql87j2L52RM00l02l75J34Q2qL65P8o22r2
5219b78K63J13J18k07k46j83L66K89K68k37l31m69J88L46K40J11m47k87M5N43
5239B05J3J01k94l19k46O18q5O6J94k53j81M6L72K74l16o18Q5J29N20k6n6m42
5261b13k73R5J69L34L75o49k43mN86L18l03q9l45k2L58K80L04q40j0jK51J22o1
5284A39q3l69J94P1M48p0l92k18r2J34L11K75m72j69O7J38N93k23j20l19k65M72
$$ plain form
5129 128 358 203 -237 -257 -198 251 295 384 -167 -489 -472 99 378 106 -81 -56 -190 322 61 253 -405 -181
5151 -181 -146 299 251 288 -69 -384 -239 -65 220 621 -8 -150 -371 -49 223 608 120 -332 -714 -68 -34
5172 -34 419 104 -205 -312 -37 208 154 342 -224 -155 74 103 373 424 -17 -203 -410 15 377 77 -118 -142
5194 -142 -172 -244 56 348 338 -319 -386 67 2 92 100 -287 -299 53 62 462 160 -215 -81 1 -7 358 436 -186 -278
5219 -278 -15 98 216 9 -237 -420 -54 235 503 266 -65 -534 -346 0 240 351 -96 -383 -338 205
5239 205 218 319 25 -294 -540 78 -7 59 253 0 -181 -135 237 511 195 -423 -338 -209 311 285 229 -213
5261 -213 -486 -391 -222 112 487 -162 -405 -409 177 495 192 103 -242 -264 94 374 678 -162 -172 -173 78 200 139
5284 139 56 -313 -119 -48 400 330 -62 -280 -372 -238 73 348 -124 -293 -226 -88 505 282 162 -157 -422 50
5306E0J49K91k79k66J15l10J25N56Q0n40p0j92J73M51j57k99k24k19K43O81k7
5327C31j64p74K06M30L11K06l42l01l0LK17M16j80n30M5j67L93L04j35m53k4k5
5349b63L98J16l63J14k15P3J20L55J10m23n46K20K29M87l30L1m70j03M20K47M18
5370F25o06q7m20O17K27k37l9m16j30L02K82K04k02k64j29P2O05J13j93m40j33
5391b49k64Q05l9J3L9l19l86O30K4J3n63o1N9P7L82L53o52k14q1L26J79J65j12
5414A25m80j14L03M16l29K05l38J8j1N33L40n70j82k5k01Q9L78K64k32o23J53
5435b81L29L16j82q2k87J37L85j05K79n16l29KL55J55k36ll5j08J70K37J35l71
5457c5j76j05L39J52L34k43j77k04nJ31J26J47k22j74K0J26L27q0j65l44K29j96
$$ plain form
5306 50 199 490 211 -55 60 -250 -125 431 511 -29 -99 -291 -118 333 176 -123 -347 -566 -323 358 331
5327 331 167 -607 -401 29 340 546 204 -97 -127 -124 93 509 329 -201 -156 -323 70 374 239 -214 -238 -263
5349 -263 135 251 -112 2 -213 -140 -20 335 445 22 -524 -304 -75 412 82 113 -357 -460 -40 207 625
5370 625 19 -68 -488 129 356 119 80 -336 -466 -164 118 322 120 -144 -273 -201 404 517 324 -116 -249
5391 -249 -513 292 253 266 305 -14 -400 230 254 267 -296 -357 -298 -221 161 514 -138 -352 -433 -107 72 237 125
5414 125 -355 -469 -166 250 -79 126 -212 -194 -205 328 668 98 -84 -109 -310 -221 157 421 189 -434 -281
5435 -281 48 364 182 100 -187 -50 335 230 509 -7 -336 -334 21 176 -60 -63 -98 -206 -36 201 336 -35
5457 -35 -211 -316 23 175 509 266 89 -115 -120 11 137 284 62 -112 -92 34 361 281 116 -228 1 -195
5479a95J79J13J82n45j90L48M26J76m54j84k34M04L36j31J39m65j81o4M72J50
5499B82j18k19j76J25N88p4qn12oj01K17J53j7l10o5Q7n6N38j60Q7p47K06K08
5522g8K27N6l32o17L39N52L00j07k71l32J23K33K33l51N1K0j75k00N11K43l19
5543A06J06m82n5L45K12l42m5j65O3q2J018o07k33k38L72j2J76J30n04j46K18
5564a65L14N9j07k00N0j89K60M10k94l46J58m14K51N10j12j75j6j07j1q5K73J76
5586B40n60K23p2o1N48l83J28l73L89n0K01J10l76O4r9K77J0L3J8n46l90N27M15
5609B73N5l31l1k39L68L21j24k52j66j34J18K12M92m00j7n44M80j26N47j45o43
5630b86K99l46O85l78M40o72k0K6L32Q0k99P1l45K82R7K17Q3k40j14LJ25P0L1
$$ plain form
5479 -195 -16 97 279 -266 -456 -108 318 494 40 -144 -378 26 362 231 370 -95 -276 -340 132 282
5499 282 164 -55 -231 -106 482 408 400 -112 -118 -219 -2 151 134 -176 -241 -154 -210 328 168 255 -492 -286 -78
5522 -78 149 205 -127 -744 -405 147 447 340 69 -263 -140 93 326 -25 26 46 -129 -329 182 425 106
5543 106 212 -270 -325 20 232 -110 -155 -320 -257 -339 679 72 -161 -399 -27 -39 137 267 -237 -383 -165
5564 -165 149 208 101 -99 -49 -238 22 432 138 -208 -50 -464 -213 297 185 10 -6 -113 -124 -209 64 240
5586 240 -320 -97 -169 -230 318 -65 63 -310 79 29 230 340 -36 28 -71 206 216 249 267 -279 -669 -142 273
5609 273 328 -3 -34 -273 95 416 292 40 -126 -260 -142 70 562 162 145 -399 81 -45 502 357 -286
5630 -286 13 -333 352 -26 414 -258 -278 -252 80 160 -139 -68 -413 -131 -34 183 266 26 -88 -85 40 110 141
5653A41l77L2j75M69P7j52Ml78P9L52J35j24k1j73j85j19P14K06p62L02l87J42
5675b00K34k7J59k12j82J00M0K20N8L5l83J80M0J21p8J06n30J66J94Q2J17l48
5697a08n4j77K33L46j76j25k67J0K25R9K8k2n2j96J85N09k77l95J27k86L62K34
5719B23K4j55m3m26N50J79j46k32j33j48PJ91M86j34m04lk4J89M3J06q8l30J88
5742h0J95M79j02l26l10N2J46M3K08k12k11k29K81Q2J42K78n95J08k62M07M80
5763E74m19r5m92K38L09kM4N6l02P4L1M10J48o83Q6J7R3l7K56l57J00j80j19M33
5787A83j14l1k30p8K00M33j69l87J42j02L36k53K62l54R0j80L08L0J17M2k41l17
5809c13J59L75P4j58l95P2kK23J64m7l58J66k71L25k9J66j41n3P4M0M2Q3o98M89
$$ plain form
5653 141 -236 -204 -379 90 167 15 19 -359 -280 72 207 83 62 -111 -296 -415 299 505 -257 45 -342 -200
5675 -200 34 7 166 -46 -228 -128 -88 132 190 225 -158 22 62 183 105 211 -319 -153 41 123 240 -108
5697 -108 -162 -339 -106 240 64 -61 -328 -318 -93 6 34 12 -40 -236 -51 458 181 -214 -87 -373 -11 223
5719 223 247 92 49 -377 173 352 206 -26 -159 -307 -300 -109 377 243 -161 -164 -188 1 44 150 62 -268 -80
5742 -80 115 594 492 166 -144 -92 54 97 305 93 -118 -347 -66 16 158 436 -159 -51 -313 94 574
5763 574 155 60 -432 -194 115 113 157 213 -89 -15 16 426 574 -109 -23 -6 87 50 306 -51 49 -131 -250 183
5787 183 69 38 -192 -270 -70 363 194 -193 -51 -153 183 -70 192 -162 -72 -252 56 86 203 245 4 -313
5809 -313 -154 221 295 137 -258 -186 -188 35 199 152 -206 -40 -311 14 -15 151 10 -43 31 71 113 196 -502 -13
5833a3m09N77j24r9jQ9l76J63L29k90R9l67K99J43qJ2J43k74j5k42L98K13j89
5856E8k5j10J3K6L95o7m71R9l16P67k88K50l66l72K08J43J17p6o5r8k06L54K37
5879B07l6k41r9kJ22J71j8J33l13j3J22J20k4J67k33k28QO25k0k85o1m12L35K66
5903B91k64o3q4p1k65L74K23K20n92J82j39J98J25L14n39m40L88P9J93J69M0l55
5925a6Q9j45L16K14k16m58j07J71L3M20m2k79k55L57k6l3j95j49K47j85K52L22
5947C15R5l42j87N0p0L18m3Q9k63mK74k33j34K64l25k51m6O77j83l84R7J26J12
5970d8J3J95O8k34m7l5K56J02j71j87j36JK20J80n5L26n74J26j24M31J43m97J7
5993c0n9R5J67R3k86l7%j90N54j55L39n61l24N11k09K45J89n02R1R0nK32j19j69
$$ plain form
5833 -13 -422 155 31 -68 -69 20 -356 -193 136 -154 -55 -422 -123 20 12 24 167 -107 -122 -364 34 247 58
5856 58 33 -77 -64 -38 357 290 -181 -82 -398 369 81 331 -35 -407 -199 -56 61 -15 -80 -178 -384 -30 207
5879 207 171 -70 -169 -171 -49 122 104 237 -76 -89 33 153 129 296 63 -165 -157 468 448 163 102 -310 25 291
5903 291 27 -36 -120 -191 -456 -82 141 361 -231 -49 -188 10 135 449 -90 -530 -142 -63 130 299 339 -16
5925 -16 73 -72 244 458 242 -216 -323 -152 -119 301 259 -20 -275 82 56 23 -172 -321 -74 -259 -7 315
5947 315 410 68 -119 -69 -139 179 136 225 -38 -42 232 -1 -135 129 -196 -447 -493 184 1 -383 -286 -160 -48
5970 -48 -35 160 228 -6 -53 -88 168 270 99 -88 -224 -223 -3 177 122 448 -126 0 -124 307 450 -47 -30
5993 -30 -89 6 173 266 -20 -57 -57 -247 307 152 491 -70 -394 117 -92 153 342 -160 -69 21 16 248 129 -40
6017d0R9k96K46M1Pk85J0O2M3J45Q8O3n37J71L58L5k89L31l54k97N91l39L09j74
6041a2J01l31L16j0J26k28j59q3O1L24J18r2j65k07M63k9k30L36m29r6k0K15K15
6064A84L2k39l93L23N1r4L82l31p0j06K62J06K45j19j66l20J93J1M33m87L6Q5
6086A8k64L07o3L42m97J02j83O67j28k43j29l16K52R1J04K57n95K16m15M93J6
6107C2J51j15n55L79J31K11j15o2j57k67O60o9l72K75k75p2L71j74J11n7j44J78
6129F5k28K49O0p9j55q8K42k26J7M0K52m73L84K09j17J22m22L18k18J12Q6o2N2
6152A40l23J1l1J10L53k99l71L58Q8n2M55n08o7j96K14J73j15N02m22j07R4K04
6174B11mj36l7j72L74j59J35l42J03o9n03M21L48j72q4j15J31J93k6l74M5Nj1
$$ plain form
6017 -40 59 -237 9 50 57 -228 -218 -156 -113 32 120 183 -354 -183 175 210 -79 252 -102 -399 192 -147 162 -12
6041 -12 89 -242 74 64 190 -38 -197 -280 -219 105 223 131 -34 -241 222 193 -37 299 -130 -226 -246 -31 184
6064 184 216 -23 -416 -93 -42 -136 246 -85 -155 -261 1 107 352 233 67 -253 -60 -49 384 -103 -67 18
6086 18 -246 61 -2 340 -157 -55 -238 429 301 58 -71 -387 -135 -44 60 317 -278 -62 -477 16 32
6107 32 183 68 -487 -108 23 234 119 57 -100 -367 293 224 -148 127 -148 -220 151 -23 88 31 -113 65
6129 65 -163 86 146 67 -88 -176 66 -160 -143 -103 149 -324 60 269 152 274 -148 170 -48 64 150 88 140
6152 140 -183 -172 -203 -93 260 -39 -410 -52 36 -16 439 -69 -136 -332 -118 55 -60 442 20 -87 7 211
6174 211 207 71 34 -138 236 77 212 -130 -27 -96 -599 -178 170 -2 -86 -201 -70 123 97 -277 -232 -227 -238
6197b38K20J17K35l12j1l63N15k23J06K1p2k85N08l03J98j39j21%k9R1K13N9k50
6220f3p0P3L97k77J21k74k93K29K48l1J10l87J0J23L37Q1j78J82l78l20K28K90
6242A58j03j22O1m4k92M91j20J60k47j75L73J36J19m45L7j24K3O0Q0L12n37R4
6264a05L5j9K30q0q9L6m49L24R3J75o1m79L28k98Q85n30j3l02J38L15j53j2q1
6287a12j24L47pO8l27O8l9l89L19J42J91j13p9K17o1M7j07L56p27J82J73J62J41
6310C28l76J1Kj58M44R2k43l08K80L0j42J27O3m62K7L61k17K54J22j89J30m15
6332b39J37K44L4L5m8j98k65M09j38J31k89j36K57J88j22o8J82K02m56L95J6q7
6354A84r3k48J35q7K72j87j62L73o76O55k4J26k13k52J14o5M4L68k67j84J00j44
$$ plain form
6197 -238 -18 99 334 22 11 -352 163 -60 46 67 -5 -290 218 -85 113 -26 -147 -147 -176 -85 128 187 -63
6220 -63 -133 -60 337 60 181 -93 -386 -157 91 60 170 -217 -207 -84 253 334 156 338 -40 -360 -132 158
6242 158 55 -67 -6 -50 -342 149 29 189 -58 -233 140 276 395 -50 -13 -137 -114 -54 26 338 -199 -105
6264 -105 -70 -89 141 61 -28 8 -441 -117 -24 151 90 -389 -61 -359 526 -4 -17 -319 -181 134 -19 -31 -112
6287 -112 -236 111 104 172 -155 -87 -126 -515 -196 -54 137 24 -55 162 101 148 41 397 -330 -148 25 187 328
6310 328 -48 -37 -35 -193 251 343 100 -208 72 102 -40 87 150 -312 -285 76 -141 113 235 46 176 -239
6332 -239 -102 142 176 211 163 -35 -300 109 -29 102 -187 -323 -66 122 0 -68 114 316 -140 255 271 184
6354 184 91 -157 -22 -109 163 -24 -186 187 -489 166 142 268 55 -197 -83 -148 -104 264 -3 -187 -87 -231
6376b31r6O83j77l42r3J81M84n53Q9K15m90K82L5k06M47l74n6J5L15J71m85K15
6398B9Q9j52J1J53j94N0QR7j13K88j17j86o8N0j10L35k25J13l19M5L5L48N7l23
6422i9K51n2k0j38J58M3n2m90M38j52J64J94k48L5m14M35L3J7j9k65J13K08j35
6445El2O1O4l44K51J91o6l4k50L30k13k10L90j00l9o0J47j66M01k22k56j83J71
6468a64Q3K98k73J29r1j55J39j11L23j95J08j23k07K81K45k58k1R8k5J56j2k21
6490Dk1l7j96M90J7K5m45j18L80j8R4j91L37l57k37M91n0k9j94N4M4K00j88j38
6514h3r5M79n64K54k66K34K10k14K6l57O05l15j08J28j81L38L10l80j80k7p5J85
6536g6K08J70o48lL30KK93j48l08L31k23K49J48n05J23Rj53J30p9K86P3l79J24
$$ plain form
6376 -231 -327 356 179 -163 -256 -75 409 -144 -55 160 -330 -48 -13 -219 228 -146 -202 -187 128 299 -186 29
6398 29 118 -34 -23 130 -64 -14 -6 91 -22 266 149 -37 -105 -55 -165 170 -55 58 -261 -216 -181 167 224 -99
6422 -99 152 100 80 -58 100 143 91 -399 39 -113 51 245 -3 32 -382 53 86 103 84 -181 -68 140 5
6445 5 -27 34 98 -246 5 196 130 96 -154 176 -37 -247 143 43 4 -56 91 -75 326 104 -152 -335 -164
6468 -164 -81 217 -56 73 -18 -173 -34 -145 178 -17 91 -32 -239 42 287 29 8 106 81 237 225 4
6490 4 -17 -54 -250 240 257 282 -163 -281 99 81 175 -16 321 -36 -273 218 168 139 -55 -1 43 243 55 -83
6514 -83 -178 301 -263 -9 -275 -41 169 -45 -19 -376 229 -86 -194 -66 -247 91 401 21 -159 -186 -261 -76
6536 -76 132 302 -346 -349 -19 -17 276 128 -180 151 -72 177 325 -180 -57 -48 -201 -71 -150 136 209 -170 -46
6559d6LJ94K79m90J1k13o8N42n9N6n6j94J26q2J63J2R5k14j00L55j00j5j13l17
6583b31K47p5Q6K1Q9k47k83K53J4K52nk70k04M16o3m8L57k78l39O04k47J23m6
6606A26Lr0l64J70L25j42j92m0kJ12o3M02n22J99Q6K6L5j35j6O6l0L6K19J04k34
6631G9k48r6J56L41j7k48K01k67L6J71J34k57m8Q3K5k03J64P7j47K7N4k49M14
6654A82p0M6l53qp4K50K92j88l1p8l9K40O0l22r4kK49J01NR8k26k72M09k09K12
6679A78L3j13J76n11J08L76j94j69rL00j34k1J75m3l23k22M50K68l68o1n0qK73
6702A11m6j77K17k00O0j2L93j51j05J4q1p2R0K45k12j26m1rj06L77j29j71j64
6725b95M20j03k2n7K15j02l27K02k6L87l70L0j96M25J61j79k80K56l3l4l52J46
$$ plain form
6559 -46 -43 151 430 -60 -49 -262 -330 212 153 209 153 -41 85 3 166 178 273 59 -41 314 214 199 86 -231
6583 -231 16 -59 27 48 137 -110 -393 -140 -126 126 121 -149 -353 63 0 -48 309 31 -308 296 49 172 126
6606 126 129 39 -325 -155 170 28 -164 -204 -206 -94 -157 245 -277 -78 8 34 69 -66 -82 -16 -46 -10 209 313 79
6631 79 -169 -265 -109 232 215 -33 168 -99 -63 108 242 -15 -63 20 45 -158 6 83 -64 -37 17 -232 182
6654 182 112 158 -195 -203 -277 -27 265 77 46 -32 -71 169 229 -93 -187 -189 60 161 166 264 38 -234 175 -34 178
6679 178 211 98 274 -237 -129 247 53 -116 -125 175 41 20 195 152 -171 -393 57 325 -43 -104 -154 -162 111
6702 111 65 -112 105 -95 -35 -47 346 195 90 104 23 -49 41 286 74 -52 -93 -102 -208 169 40 -131 -295
6725 -295 125 22 0 -57 158 56 -271 -69 -95 292 -78 -48 -244 181 342 163 -117 139 106 72 -280 -134
6747a34J76k21N1m5K30K32k08k03j15K77Q3m44L82J23j19j01J08Nj64Mj55J49
6769h9J45j12R0J08k28KP8p8j89K99m0m23J81L21j90N27l32J5j83m8K33O2J18
6792B67k89J16q9R4K69l10l2k16L31k88O3J16Mk38Q0O4L05j21k62J08j40K85Q4
6815B01l59P7k05J64K49N7j26k16j18J92J81J46j83K8m4k4L19l46j12LK1o4J88
6838B9KJ30k02m8K12o2j18J36nk97L32n6R1Q0J9L1l54j24N55j98j34o9L4J0J84
6863A78k03K0K9J02k68j06J88rk75L00R1j60K27o5j45J06l85N08j85R7j99m2L55
6886A59j36J34k03K60k99j12M2K58J85l29j71M1J86r0K62r3j58j61J2K94L03l43
6908D1j6l25L59O5j54n4m8J1m1K59k28K23k77O1L40o5k22J57k10R1K8N1q1M00
$$ plain form
6747 -134 42 -179 -128 -173 57 289 81 -122 -237 40 123 -321 61 184 65 -36 72 77 -87 -83 -238 -89
6769 -89 56 -56 34 142 -86 -84 -6 -84 -273 26 -14 -437 -256 65 -125 402 70 85 -98 -146 87 149 267
6792 267 -22 94 5 99 368 58 26 -190 141 -147 -84 32 36 -202 -122 -58 247 126 -136 -28 -168 117 201
6815 201 -158 -81 -286 -122 127 184 58 -158 -276 -84 97 243 60 88 44 20 339 -7 -119 -116 -95 -159 29
6838 29 31 161 -41 -89 123 61 -57 79 74 -223 109 53 144 224 243 274 -80 -204 351 153 19 -50 -16 -6 178
6863 178 -25 -5 24 126 -142 -248 -60 -69 -344 -44 47 -113 114 49 -96 10 -375 133 -52 45 -154 -196 159
6886 159 23 157 -46 214 -85 -197 -155 103 288 -41 -212 -171 15 -75 187 94 -64 -225 -213 81 384 41
6908 41 25 -300 59 124 -30 -84 -132 -121 -162 97 -131 92 -185 -124 216 151 -71 86 -124 -33 -5 46 -35 365
6932C65l50N4k33MK14k15M53l69m2L07l86L63k54QP2J33j12J85n37L72k00L31
6954A63n4m9j21K07m27K20K28k97L63j12m18K23N7L39k24k32J19k59L11kk3L9
6976E1q2P5j47K68p7j29m6r3L51j16J76l7J5j72O0J00k23P1Jk81J42K76Nj66j91
7001a69k35L63K22m31L31J6j84J90J6J36n6k13j41RK69R4N5j92k8k16M10j12j77
7024d3Kn8l20M78l76L87L22m62j78K84J0L14o08N38k61p8n8J58j52qK81j63K06
7047B15j37l52M62m19K0L63J08J3m93J37M6R8j9qj23J95j92R7KK05j25%k14K51
7071A30J6J72p9m34p5K69k04K81J5j53p5J04L48q9n29q5P2K74P5j19L76l03l7
7094e0J55R2l2N6p2j81j30K42m31N74m74k3lJ7K05O9m07P5J03J50K27j66j5J47
$$ plain form
6932 365 15 69 -164 -160 54 -161 292 -77 -119 188 -198 165 -89 -81 -9 124 12 197 -340 32 -168 163
6954 163 109 60 -61 146 -281 -61 167 -130 233 121 -297 -74 -17 322 98 -134 -15 -274 37 35 12 51
6976 51 -31 44 -103 165 88 -41 -87 -180 171 55 231 194 209 37 97 197 -26 45 46 -235 -93 183 188 22 -169
7001 -169 -404 -41 181 -250 81 97 -87 103 119 255 199 -14 -155 -146 123 217 272 80 52 -164 246 134 -43
7024 -43 -41 -99 -419 59 -317 70 392 -70 -248 36 46 360 -248 290 29 -49 -107 51 -101 -109 172 9 215
7047 215 78 -274 188 -231 -211 152 260 273 -220 -83 -37 61 42 34 -89 106 -86 11 13 218 93 93 -121 130
7071 130 146 318 239 -195 -270 -1 -205 76 91 -62 -137 -33 315 226 -303 -388 -316 -42 33 -86 290 -13 -50
7094 -50 105 197 165 221 149 -32 -162 80 -351 223 -251 -274 -277 -260 -55 14 -393 -318 -215 -65 162 -4 -19 128
7118A28l24o6L15j34J21K03k88j0K71k00j48O3L86j51j82K79o73L67k16J37j56
7139b78K62p5k55M55m7k18J59j05L96k78j88J24Q6j25K30j21j71M79j29j67j51
7160a17R0k93O3K24R3K39m43L33m52L54m9k18K31L81n73p6O22m32J76j62r9j12
7182b20M41r9j03j2K5k7k01N34l58J09j87j8n3K68k8j17q2L97l9q5k01q2k0j42
7206c00L41O1j17P6Q6M3n23K24M28k61k59K16j09L11j70k41N7J96K9j45M2K19
7228B04k80Q8L61m16M8m1K50l73L81l08L47j73k38O2RR9J51k2j05j07O0L36p1
7251B62J2k53M5j43J00J6RP6n47K10K21O4Rj39J27n2N8l3J11j37j3J41k79M4J55
7276F4m52J62K91J56l01K24q4m29K98J4R2Q0J65n87M66l49L56K77o42J41K73l99
$$ plain form
7118 128 -196 -262 53 -81 40 243 -45 -55 216 16 -132 -69 317 166 -16 263 -410 -43 -259 -122 -278
7139 -278 -16 -91 -346 109 62 -156 3 -102 294 16 -172 -48 38 -87 143 22 -149 330 201 34 -117
7160 -117 -27 -320 -257 -33 60 299 -144 189 -263 91 42 -176 55 436 -137 -213 409 -23 153 -9 -108 -220
7182 -220 221 122 19 7 32 5 -196 338 -20 89 -98 -116 -169 99 71 -46 -128 269 230 145 -56 -138 -158 -300
7206 -300 41 102 -15 61 147 190 -333 -109 319 58 -201 15 -94 217 47 -194 -137 59 88 -57 -15 204
7228 204 -76 12 373 -43 5 -36 214 -159 222 -86 261 88 -150 -88 -79 20 171 149 44 -63 -3 333 262
7251 262 274 21 66 -77 23 39 48 124 -423 -213 8 72 81 -58 69 17 75 42 153 16 3 144 -135 -91 64
7276 64 -388 -226 65 221 -80 144 60 -369 -71 -57 35 115 280 -307 159 -190 166 443 -199 -58 215 -184
7298a84J45k9J02J46j28n2m7K49m85K24J39l73L23K30k37nr4K05q0J0J47k2j20
7321F4R3O6l67M93kk84j47J46k3JN2m62L85q1j1L4pj34M3R4j41N9J13j3Q9l93
7347c33L86K00j90q9j45N18j86j27L8k20L16J10k51J1J26l41K88l1j95N4n8J73
7369E4n4m9Q9m0N6K00m09R5K47p9k71n8J9K8J92O2J12m1M1k54r0o1M21l72R3M6
7395b3J46q3r9K1J3Oq5J42Q6n1J47k95L8r1pJ68j05K3r7K2J12N37m69n4k93R1
7421b00N44l22K4k46K09j95M0J36R7M0k94j23J60J43M7Q9l23k40M13k6M8k0l1
7444c0Qo4J96k96n0J70m4J57N3J38j86l1k20j9j6J86J97k42Q6n3K09K31j76j53
7468E1j28p0K6j10J50L49j85j82J03P7O7j41j16j09jJ43m8R5R0l7r5K70j70J5
$$ plain form
7298 -184 -39 -68 34 180 52 0 -47 202 -283 -59 80 -293 30 260 23 18 -76 129 49 59 206 184 64
7321 64 157 223 -144 349 347 63 -84 62 39 40 92 -370 15 -66 -77 -43 -50 -184 -141 -47 -188 -129 -16 -29 60 -333
7347 -333 53 253 63 -26 -171 347 161 34 72 -148 168 278 27 38 164 -177 111 80 -115 -61 -119 54
7369 54 0 -49 40 0 56 256 -153 -58 189 110 -161 -219 -200 -172 20 82 194 153 194 -60 -150 -211 210 -162 -69 -23
7395 -23 123 40 -59 -38 -25 -19 -104 38 124 73 220 -75 -37 -128 -135 33 -72 -49 -146 -124 -12 525 56 2 -291 -200
7421 -200 344 22 46 -200 9 -186 -146 -10 87 127 -167 -290 -130 13 60 149 -174 -414 -1 -27 21 1 -30
7444 -30 -22 -86 110 -186 -236 -66 -110 47 100 238 52 21 -199 -218 -234 -48 149 -93 -7 -60 149 380 204 51
7468 51 -77 -147 -121 -231 -81 268 83 -99 4 81 148 7 -109 -218 -219 -76 -124 -29 61 24 -71 199 29 44
7492D4k3r4k4J49M0j20q2j95K34j97L18M1m0l43K29mm7J20K00j39O0j47K48k15
7516A3j05J21J58k60M5Kj21L1K48j59J15J78n6O7o2m64K63J38r2k27J01M2J48
7539A24J28k22k41J20J54k71N21j28pj94r8K16K46l91J43j50J95n7J6O2j89Qj6
7562c1M1Ro3P3j65p1n8L70M0q8m72L07L63j54J11l2j43l45K69nL17l9k87LQ2p9
7588d7k18K9M01O9l30J49J04p9l26K48P4o0o5J24M8l63J8L23j47J49j6L1J16k72
7612d0J92p7l83L78k08J13j10p3J85J5M4l72N45j69J12j68K16k23J8J83j52p2
7634d6R5l10L46j7k51Q4m9LK83k17L75n70J20K58j01L2J25n5j70P7q3J22R2j35
7658Hr1Q7K76k83R5L8l17L96k19J60k0J34l38n2K95%j54j06j01J3K5J3K6K55p1
$$ plain form
7492 44 21 -73 -97 52 92 -28 -110 -305 -71 -268 50 91 51 -292 -63 -67 -114 6 206 67 127 -20 228 13
7516 13 -92 29 187 -73 -28 -26 -147 -116 132 -27 88 266 210 277 215 -249 14 152 60 -167 -66 -24 124
7539 124 252 30 -211 -91 63 -208 313 185 178 -16 -114 102 348 -43 100 -50 145 88 104 166 -23 -15 -31
7562 -31 10 19 -44 29 -136 -207 -265 105 145 57 -415 -108 255 101 212 180 37 -308 -39 -44 273 234 -53 -50 32 -47
7588 -47 -265 -236 165 234 -96 53 157 78 -248 0 74 14 -51 73 121 -242 -224 99 -48 101 85 116 232 -40
7612 -40 152 75 -308 70 -138 -25 -135 -208 -23 -8 36 -336 209 40 152 -16 200 -23 -5 178 26 -46
7634 -46 49 -261 85 68 -183 -99 -148 -145 138 -79 296 -274 -154 104 3 35 160 105 -65 12 -71 51 143 8
7658 8 -83 4 280 -3 92 130 -187 209 -10 150 130 264 -74 -126 169 169 15 -91 -192 -179 -154 -141 -115 140 69
7683F9j19J73j14J29k92L45n19L16M5J00n5J61m00K7J65j72N87n65J54J3Q4l54
7705b22m2M30k49p7L30k26K92j31o2k73J2J98K5Q8J2Kk89L59j98m6Ml19N08j81
7729e5K44j7K43l85o1P3p0J8L62l53j80J56K62k18J17j15N8K6K1J76l30nL8m3
7753c8R5l4K15l69K17p4j61K22j88L11m72J47p5K17q0Q7j00j34M64k42K42Nl23
7776f8m7j83L54K21m7q6m78M78r7K44j72j23j93j22M50K6j47j52k62M16O0j1j78
7799a17K5J50m8k53L47l65N81m87L6R0M1K87l81N05p34K51P5J5J3n7j48MK01p5
7823d4J14n2p0J88j84L19n4j65l07K97j18K77k91K12o1j39K00k05m5J30j05R5
7845hk68K15L64m14q8J06p7K29K10p4j58j0j30lK06N8r2l38J52j3K09k01J62j47
$$ plain form
7683 69 -50 123 9 138 -154 191 -328 -12 33 133 78 239 -161 -134 31 -141 446 -119 35 48 132 -222
7705 -222 -264 166 -83 -160 170 -56 236 105 43 -230 -218 -20 5 93 105 107 -182 177 -21 -67 -63 -382 126 -55
7729 -55 189 172 415 30 -31 42 -28 -10 352 -1 -181 -25 237 19 136 21 79 105 126 302 -28 -33 5 -38
7753 -38 57 23 238 -131 86 12 -149 73 -115 196 -276 -129 -204 13 -67 20 -80 -214 250 8 250 255 -68
7776 -68 -115 -298 56 277 230 144 -334 144 47 291 119 -4 -197 -319 131 157 10 -142 -404 12 72 61 -117
7799 -117 -92 58 10 -243 104 -261 320 -167 -131 -41 0 287 -94 411 -323 -72 3 18 31 -26 -174 -170 31 -44
7823 -44 70 18 -52 136 -48 271 217 52 -255 42 -76 201 -90 122 61 -78 122 -83 -128 2 -103 -8
7845 -8 -276 -61 303 -111 -199 -93 -170 59 269 195 37 27 -103 -106 100 158 66 -272 -120 -133 76 -125 37 -110
7869a10K43q2j22M13m81j19K89j35L87k87k89L66N3l72M69q6j04J48j02j68J39
7890E0r4J58m0k9n7K92q0j93J77j52Q3j55J58j64J48k00J70%p4R5l10J16L1J22
7914E2N4j06K1j51j0k83L29L08K5j44l07J02R7P0k15R5k22K95l2M27k05l28j9
7937a47k5O9J59J84j87k06J00J19J05m05j7J90r0P3K25j2L1k13K46o6j75R4q2
7960c0J97l71M9K56j55R3j43n8K46J29n5k06m0q5O0J62J70o5j08k20M20k43r7
7983i4n9j36J72J55k51K53K89m23L86m35o9L01l20J82q1K17k69RM1L01l7n8l83
8006c09L50m3j2k20K5M35l86Q6M7k8K00k99K59J67m05oL49k72K81j78l30K25k7
8029i1l3K02J81m73J45Mk07K41R0K16j13p00N55M8j81k2L60m62L68pN7M83k62
$$ plain form
7869 -110 133 51 -71 342 -139 -258 31 -104 283 -4 -293 73 126 -246 223 137 33 181 79 -89 50
7890 50 -44 114 74 45 -12 280 200 7 184 32 115 -40 118 -46 102 -98 72 72 -2 93 -217 -101 -70 52
7914 52 106 0 21 -130 -140 -423 -94 214 239 95 -212 -110 -13 57 -158 -63 -285 10 -22 405 200 -128 -147
7937 -147 -172 -103 56 240 53 -153 -53 66 171 -234 -251 -61 -151 -78 147 135 166 -47 199 133 -42 52 -30
7960 -30 167 -204 -155 101 -54 39 -104 -162 84 213 158 -48 -88 -173 -113 49 219 154 46 -174 246 3 -94
7983 -94 -153 -289 -117 38 -213 40 329 -94 292 -143 -212 89 -231 -49 -130 87 -182 -173 -132 169 132 74 -309
8006 -309 41 -2 -14 -234 -209 226 -160 -74 -27 -55 145 -154 105 272 -133 -139 210 -62 219 41 -289 -64 -91
8029 -91 -124 78 259 -214 -69 -65 -272 -31 59 275 162 -538 17 65 -116 -138 222 -240 128 121 178 661 399
8052C99n25L37l41K41p6j42K64k11K59k38O0m7K11j32J14k71K32O2k87k39L65
8073C5L3l3q9J63Pl03K93o6j90K83l07M8q3L31j88K47J9m33L78k8l07OL73j55
8097C4j74K64j52j49J45l9L58k85K37k78L0j91J99L7j7J21j78QO5m8M0O2j66j00
8121a77J06M70m94K80L9j29m88L69J79l12J49L12k52m3o9K5n0j89J81k46O75k05
8143A31R3n79L40K24m34O94n54P7J08j38J28q8O7n4l75M10L5j36j9K52o8k6j68
8166h0M1j14L9K64k06KK45j82j02J67N4k54ML07M6m33L00k11m05Q60n3m04j3K89
8190A61m2
$$ plain form
8052 399 -126 211 -130 111 35 -107 157 -54 205 -33 27 -20 191 59 173 -98 134 196 -91 -330 35
8073 35 68 35 -54 109 116 -187 106 40 -150 133 -174 -126 -209 122 -66 181 200 -233 145 117 -190 -184 189 34
8097 34 -140 124 -28 -177 -32 -71 287 2 239 -39 -9 -200 -1 36 19 140 -38 -30 35 -13 27 89 -77 -177
8121 -177 -71 399 -95 185 224 95 -393 -24 155 -157 -8 304 52 9 -60 -35 -85 -274 -93 -339 336 131
8143 131 224 -355 -15 209 -225 469 -85 -8 100 -38 90 2 69 15 -360 50 85 -51 -70 182 114 88 -80
8166 -80 -39 -153 -114 150 -56 -54 191 9 -93 74 128 -126 -122 185 231 -202 98 -113 -518 342 289 -115 -128 161
8190 161 119
8191A19
$$ Imaginary data points
##PAGE= N=2
##DATA TABLE= (X++(I..I)), XYDATA
0@%%%%%%qJ2j2J6j6J6k4L2l2M0n4O2p2Q8j04J22j41J62j89K17k46K80l17L57m04
31b15M55n09N71o37P09p91Q79r74J081j197J326j470J625j798J995k215K468k759
49a456L090l482L956m532N252o190P464r310J2234j7598L0700j21310k05580J56486
63a50276K47716J70308p6298j89953j20839Q6422J94252J34160n7845j85170j60472
74a07995K153J39827J44441k056j60733j92769m5408J47599K06698N9856j47042
85D4571k08263m8915J68900K31099P1556j43250k03662n4588J45876K03905O9320
96B76549j17640j84905p9437Q9580J69627R3954o8112j76217j33412K7049J61245
107E8281J36108l6820j96031j81334K106J77678J67667j9193j93730j77375J6416
$$ plain form
0 0 0 0 0 0 0 0 -8 4 -8 8 -8 8 -16 16 -16 24 -30 32 -40 48 -56 66 -75 87 -102 115 -131 149 -168 189 -215
31 -215 240 -269 302 -335 374 -417 462 -512 569 -628 698 -772 853 -945 1050 -1165 1303 -1456
49 -1456 1634 -1848 2108 -2424 2828 -3362 4102 -5208 7026 -10572 20128 -101182 -306762 -150276
63 -150276 97440 267748 191450 1497 -119342 -32920 161332 295492 237647 52477 -107995
74 -107995 -105842 33985 178426 176370 15637 -177132 -222540 -74941 131757 191613 44571
85 44571 -163692 -212607 -43707 187392 258948 115698 -87964 -142552 3324 207229 276549
96 276549 158909 -25996 -105433 -15853 153774 247728 179616 3399 -130013 -102964 58281
107 58281 194389 157569 -38462 -219796 -217690 -40012 127655 108462 -85268 -262643 -246227
118b46227J93182J81882N248j55490j46475J0984J58871J65051L1876j18363j57725
129g7186n7316R0153J51136O2948j03356j94974j17342O4976J78175J07022q3715
140B0521j98647j16519Q7693K10566J33503o1172j74692r8405Q0542J86259J23159
151A92808m0012j50952j16772K1606J35636J25477k733j34756j51608l0629J21688
162c0247J60803M1723j26641j75978m9690J32373J86063N5887j28936j80217n1535
173a66395J24404J72536N4132j07970j58756n9298R0284J53116P8946o0046j39314
184a8361q8504M5899J45560J14356k6704j51375j37527Q922J47483J34867k3476
195A51140j70696j56594N164J52066J40932j1025j47050j34552P810J39651J40161
$$ plain form
118 -246227 -53045 128837 134085 -21405 -167880 -156896 1975 167026 198902 80539 -77186
129 -77186 -134502 -44349 106787 169735 66379 -128595 -245937 -180961 -2786 104236 20521
140 20521 -178126 -294645 -206952 3614 137117 75945 -98747 -197152 -116610 69649 192808
151 192808 152796 1844 -114928 -93322 42314 167791 165058 30302 -121306 -151935 -30247
162 -30247 130556 172279 45638 -130340 -180030 -47657 138406 194293 65357 -114860 -166395
173 -166395 -41991 130545 184677 76707 -82049 -141347 -51063 102053 180999 120953 -18361
184 -18361 -106865 -60966 84594 198950 172246 20871 -116656 -107734 39749 174616 151140
195 151140 -19556 -176150 -170986 -18920 122012 110987 -36063 -170615 -162805 -23154 117007
206A17007J9636j05452j23068k5865R5551J34105N1694q2882j49794q2416O1875
217h9609J45817Q1188p5321j68737j00656O5634J66838J02276o0699j56123r0857
228a80249O6103J58784J01102m2353j34352r5684K7880J20727J01448j0867j15798
239c259j20424j6439J04464J28655K9765j03726j39196l6358J10227J55415M9166
250A58290j03737j50022m4233J04825J47547M4773r7292j41774n2813P7518J27730
261G0812N8161o1550j21769p0225M5683J23346R1907k3614j18475j01931J6804
272i0851J26200J15325j3103j34677j27015M039J26989J18625j0649j28526j19822
283a33465L727J17465J17343J1073r5929j05964j5010Q9662J14747L8401p2224
$$ plain form
206 117007 136643 31191 -91877 -117742 -22191 111914 163608 80726 -69068 -151484 -89609
217 -89609 56208 137396 62075 -106662 -207318 -141684 25154 127430 66731 -89392 -180249
228 -180249 -114146 44638 145740 103387 -30965 -126649 -98769 21958 123406 112539 -3259
239 -3259 -123683 -140122 -35658 92997 122762 19036 -120160 -156518 -46291 109124 158290
250 158290 54553 -95469 -139702 -34877 112670 157443 60151 -81623 -134436 -56918 70812
261 70812 128973 67423 -54346 -124571 -78888 44458 136365 112751 -5724 -107655 -90851
272 -90851 35349 150674 137571 2894 -124121 -120082 6907 125532 114883 -13643 -133465
283 -133465 -129738 -12273 105070 116143 20214 -85750 -100760 -11098 103649 142050 69826
294F9826j18274n7754N7202J18935O2507o4428j38410q3036N2097J34824Q1079
305A14568n4053j33520p8488N5618J35605Q6955l7784j16504p9291L2573J09566
316C5245Q4565j6626j02390r6989p304Q7880J00012J4428r1365j15413k8101R0278
328d5780J23931L7161q6042j22989l5626Q9327J26795M0119q3154j20949m3875
339a21082P0510J10715M5073n9910j06500n7030M4337J04559P1491k5953r8826
350b2616p7744K1464J07588R4106j0607j08111j01703M725J05858R8863r313j11413
362h903j05068m9R8542R8324M764q7258r3001r332Q2418J00233L0488o2615r5176
375d6633l7860N7973J01974N0419n3852j11879o5395M3804J08915O4584m8435
$$ plain form
294 69826 -48448 -106202 -49000 69935 132442 68014 -70396 -153432 -101335 33489 114568
305 114568 60515 -73005 -151493 -95875 39730 126685 88901 -27603 -106894 -74321 35245
316 35245 119810 103184 794 -96195 -103499 -15619 84393 98821 7456 -107957 -136058 -45780
328 -45780 78151 115312 29270 -93719 -129345 -40018 86777 126896 43742 -77207 -121082
339 -121082 -50572 60143 105216 45306 -61194 -118224 -73887 30672 102163 76210 -22616
350 -22616 -100360 -78896 28692 122798 112191 4080 -97623 -92898 12960 111823 102510 -8903
362 -8903 -113971 -114020 -15478 82846 87610 352 -92649 -101981 -19563 80670 111158 48543 -46633
375 -46633 -84493 -26520 75454 125873 72021 -39858 -105253 -61449 47466 112050 63615
386F3615j16043o9859M3667J12527P1757l5216j02881o8038L0759R8561P3185
397A02034j7946r0097p8962K451P9394Q2056N415p9215r3940j8816P6461J01606
409G0441K7766p3328j01494k7129P6970J07538L3912p0643j04031l6880O2125
420c4753R6233L5115n8823r7867m8371M1023Q8858N3788l0384q6891o1666K4946
432g8792R3122P8402j0680q7300p8152J1194R2535Q5292o438r2404q9155o65Q4494
445A453Q2957Qq2025q4613r880P1088Q4280J9951o0170q2364k7665N5010Q8066
458E6096L9571m6805r1710m9141M0709R3231N3526m0307r7059n8991L7189R6474
470C2783O1900l0503q9911n9728K8161Q7549O4000j7531q0705o8302N855P0773
$$ plain form
386 63615 -52428 -122287 -78620 33907 105664 70448 -32433 -100471 -69712 28849 102034
397 102034 84088 -6009 -84971 -82520 -3126 78930 84345 5130 -88810 -107626 -31165 70441
409 70441 98207 24879 -76615 -103744 -26774 80764 114676 44033 -59998 -96878 -34753
420 -34753 61480 96595 37772 -60095 -108466 -67443 21415 75203 44819 -42072 -103738 -78792
432 -78792 14330 92732 82052 -5248 -83400 -72206 20329 105621 99183 6779 -82376 -83041 1453
445 1453 84410 84418 2393 -82220 -92100 -21012 63268 83219 23049 -59315 -86980 -31970 56096
458 56096 95667 48862 -42848 -91989 -51280 41951 95477 55170 -41889 -100880 -63691 32783
470 32783 94683 64180 -25731 -85459 -57298 30251 94251 76720 -3985 -72287 -66432 4341
482D341O8149r74p2665p9914j4634O4840Q2407K0194o3281q5536k1759O7404R3334
495F1906L2107n7375q6448k8628N7239Q7414L3678n0871q6012m1164L7595P7169
507C6610M2847l4282q0063n3223K2248P8192O1423j3806p6140o4569J2076Q0459
519A1772P2906m970p6848p3993J926P4745P3260J254p2199p4741q003O4518P3943
532F3570J4093n6440p3004k1179N0496P6652L0335m4094p8913l9288L7191P8389
544C7808M2313l8023q3767n0984L0546Q1546N2019k7994p9183n2353K5681P8903
556A6512N8069j4943p0166n7129J0008O7433O0791k370o4535o7974q962N7424
568a5842O7992J2188n7947p4495j9208N5786P7996K5352n0211p5248k4948N1206
$$ plain form
482 4341 72490 71516 -1149 -81063 -95697 -30857 51550 71744 8463 -77073 -98832 -31428 61906
495 61906 94013 36638 -49810 -78438 -21199 66215 99893 49022 -36990 -78154 -40559 36610
507 36610 79457 45175 -34888 -88111 -65863 12329 73752 59946 -16194 -80763 -68687 11772
519 11772 84678 79708 2860 -71133 -69207 5538 78798 80052 7853 -66888 -74891 -10373 63570
532 63570 77663 21223 -51781 -72960 -22464 54188 84523 40429 -38484 -77772 -40581 37808
544 37808 80121 42098 -41669 -92653 -62107 19439 71458 43464 -35719 -88072 -62391 16512
556 16512 74581 59638 -10528 -67657 -57649 9784 70575 68205 3670 -64304 -73266 -15842
568 -15842 52150 64338 6391 -68104 -87312 -31526 46470 71822 21611 -53637 -78585 -27379
580b7379P8216L1434m3530p3936l5023L6754P1353L7557l1075p1484m4718K2537
592d9294O9215N0895j4661o6929n3977J2381O9579O2045m977o6431o2948J849
604e3253O4341O3447K90o4041o7531q003N5620O4018J0888n2305o6195j6797M6903
617b2618O7872K5561m0121o6731l0177L6793O9679L6252l3207p1582m2368K6927
629d3720O9227M3192k6593p0228m8562J9907O7863M9316j5620o3680n1621R899
641f0620O0652N4129l695n7504n7959m417N2600O0214R162n1492o2596j4946M9306
654b7166O7196K1538m3613o4550k1549M5055O8582K8194l7766o5804l0258L2844
666b7297O3026L2490k9893o4892m0495K0873O0800M2238j6403o0193m5528J3039
$$ plain form
580 -27379 50837 82271 38741 -35195 -70218 -33464 37889 75446 44371 -27113 -71831 -49294
592 -49294 19921 70816 56155 -10774 -64751 -52370 17209 79254 74277 7846 -55102 -53253
604 -53253 11088 74535 74825 10784 -56747 -64750 -9130 54888 65776 13471 -52724 -69521 -22618
617 -22618 45254 70815 30694 -36037 -66214 -29421 40258 76510 43303 -28279 -70647 -43720
629 -43720 25507 68699 42106 -28122 -76684 -56777 11086 60402 44782 -18898 -70519 -60620
641 -60620 32 54161 50466 -7038 -64997 -69414 -16814 43400 52562 1070 -61526 -76472 -27166
654 -27166 40030 61568 17955 -46595 -68144 -23089 45493 73687 35921 -29883 -60141 -27297
666 -27297 35729 68219 38326 -26566 -67061 -46188 14612 56850 40447 -19746 -65274 -52235
678e2235O1744N3512l100n6011n1871M360N8522N7487K171n4597n7725o832M9315
691D740N6717Q414m8863o1090j6842M0952N8386J9091l8660o0378k5970L2795
703c0708O0977L0369k9418o1221l5210K5669O1816L8314k1644o0787m0971J8449
715d4365N9779M4314j3422n6951m5370Q624N4450M7434m643n2980n1800l488M6677
728a1741N0763M775m7507n6781j2236M2586N6612J6559l9170n5648j7697L9984
740b9501O1118K6633l0737n6427k4573L1236N8536L1089k5585n7182l5131J8984
752c1540N3858L5399j7391n5787m2130J0062N2470M3961o517n0539m5431L811
764d9774N1160N0861K980m6351m9126l876M5917N2327R418m1618n2403j3217L7966
$$ plain form
678 -52235 9509 63021 59921 3910 -47961 -43601 14921 72408 74579 19982 -37743 -44575 4740
691 4740 61457 69871 21008 -40082 -56924 -15972 42414 61505 22845 -37533 -63503 -30708
703 -30708 30269 60638 31220 -30001 -65211 -39542 22274 60588 38944 -21843 -62814 -44365
715 -44365 15414 59728 46306 -10645 -56015 -47391 7059 54493 49850 -3130 -54930 -58418 -11741
728 -11741 39022 43797 -3710 -60491 -72727 -30141 26471 43030 3860 -51788 -69485 -29501
740 -29501 31617 58250 27513 -28914 -53487 -22251 36285 67374 41789 -15393 -50524 -31540
752 -31540 22318 57717 40326 -15461 -57591 -47529 4941 48902 42385 -8154 -53585 -49774
764 -49774 1386 52247 55227 8876 -40250 -44126 1791 54118 63536 21918 -30485 -43702 -5736
777e736N2587J6608l5246n4556k2071K9843N2677K4614k8368n4905l1003K1865
789c3691N3157L1567k0703n4150l6250J5816N3067L8447j1725n0088l9162R389
801d4326N0796M3748l287m5972m4159OM3767M5777L455m2776m9945j0369L7043
814a6242M8237J1390l7395n1961j6803L3212N1793K0769k8592n0321k1936K8679
826b9170N2531K8144k1635m9655k8688K0113M9553L3033j5478m8734l5965J0484
838c5467M6935L8165p981m6025m1168L573M3625M3157M76m2025m4256m475L9978
851e488M5815Q184l7750m6406j1310L4935M7556J5499l0776m7436j8597K8798
863a6976M8381K2372k4832m7647k5317K1114M6775K7850j8839m7586l2425J3301
$$ plain form
777 -5736 46851 63459 28213 -26343 -48414 -18571 34106 58720 30352 -24553 -55556 -33691
789 -33691 19466 51033 30330 -23820 -60070 -44254 8813 47260 35535 -14553 -53715 -44326
801 -44326 6470 50218 46931 959 -43200 -43194 573 46350 49805 7029 -42916 -53285 -16242
814 -16242 31995 43385 5990 -45971 -62774 -29562 22231 43000 14408 -35913 -57849 -29170
826 -29170 23361 51505 29870 -19785 -48473 -28360 21193 54226 38748 -9986 -45951 -35467
838 -35467 11468 49633 41652 -4373 -45541 -41968 1657 44814 45290 3265 -40991 -45466 -5488
851 -5488 40327 48511 10761 -35645 -46955 -12020 35536 51035 20259 -27177 -45774 -16976
863 -16976 31405 53777 28945 -18702 -44019 -22905 23870 51720 32881 -14705 -47130 -33829
875c3829M5351L2797j1770m5170l6768P499M3808L7893k852m1152l9297N64M0674
888b252M2093L501l6871m2725p103L4769M3943J0230l3194m5485j4347K9880M4905
901B7344J6818k7194m5628k0118K4627M5301K3404k0515m5186k5815J8055M4640
913A5733K8906j4694m3762l0994J1217M2473L3697p487m1442l4805M057M0560
925C459L7429l69l7700l8884k351L6075M0062O031l4580m1621r093L0857M1701
938C1016J1884k9238m2644j6071K6294M2804J9168k2499m3216k1390K0714M2661
950A9483K4831j6753m1664k7319J3869M1488K9086j1229m0552l1755P329L8704
962E518L3311m471l7069l5522J149L5732L6846K703l4126l8208n502L2273L8750
$$ plain form
875 -33829 11522 44319 32549 -12621 -49389 -41890 1918 39811 36959 -4193 -43490 -42926 -2252
888 -2252 39841 43342 6471 -36254 -43357 -8588 35355 45585 12391 -33094 -47441 -17561 27344
901 27344 44162 16968 -28660 -48778 -24151 21150 44554 24039 -21147 -46962 -28907 15733
913 15733 44639 29945 -13817 -44811 -33594 8879 42576 35089 -6353 -41158 -37101 3459
925 3459 40888 40519 2819 -36065 -38416 -2341 37721 43752 9172 -32449 -41542 -10685 31016
938 31016 42900 13662 -28982 -45053 -18759 24045 43213 20714 -22502 -43892 -23178 19483
950 19483 44314 27561 -14103 -41422 -27553 13935 43021 31792 -8760 -40515 -33186 5518
962 5518 38829 34358 -2711 -38233 -37084 -1352 35494 38197 4071 -34137 -39639 -7366 31384
975C1384Q909k9932l9813j2001K7223M0114J4943k4607m0424j7754K2346M0853
987B1241K0271j8756m0007k2947J6304L9798K5709j3664l9811k7529J0056L8067
999H732K9367p544l7224l1571M452L5510L3081o04l4339l4463j415L2786L5995
1012C2763M636l0579l6579p905K8564L7703J0637k6863l8172j3619K4089L8410
1024B3085J5907k1408l8293j8895J8846L8503K1422j6293l7453k3359J3169L7157
1036A2388K5811j0046l6950k7880P659L5241K9147m211l4537l0903J535L2550
1048a96L2575J594l1021l3581m334K9538L5106O914k7584l5400r753K5176L5970
1061B5004J2319k3120l6402j5158K0297L6373J7516j8090l6524j9767J5112L5804
$$ plain form
975 31384 40293 10361 -29452 -41453 -14230 25884 40827 16220 -24204 -41958 -19612 21241
987 21241 41512 22756 -17251 -40198 -23894 15904 41613 27949 -11862 -39391 -29335 8732
999 8732 38099 30555 -6669 -38240 -33788 1722 34803 34199 -140 -34603 -36018 -3232 32763
1012 32763 37399 6820 -29759 -37664 -9100 28603 39240 12377 -25795 -39414 -15325 23085
1024 23085 38992 17584 -20709 -39604 -20758 17745 39167 22874 -14579 -37938 -24769 12388
1036 12388 38199 28153 -8797 -36677 -29018 6223 35370 31159 -3378 -34281 -32746 -196
1048 -196 32379 33973 2952 -30629 -34963 -5425 29681 36595 9011 -26389 -36142 -10966 25004
1061 25004 37323 14203 -22199 -37357 -17060 19313 36829 18739 -17785 -37552 -22440 13364
1073A3364K2141j2516l5618k4160J0074L4689K6162p582l3196k7743M361L2580
1085B556K9245j307l0905l0723j167K9432L2268M141k8290l2711o412K5918L3257
1098B5302R395k4193l4050j1721K1963L4709J3936j9693l4645j6078J7226L4692
1110A6843J8687j4303l3474k1451J2935L3693K2989r486l3181k4190P013L2013
1122H088K6195m537l1322k7685J763K9440K8879K29k8499l0347l002K6014L0862
1135B6078N450k4314l2131q273K3052L2189J0729k1015l2452j2837J8606L2796
1147A7878J5562j7222l2883j7657J4297L1916J9692j2306l2119k1291R640L0281
1159E788K3585p247l0571k4698M469K9389K6163k085k7706k7459j25K6547K9146
$$ plain form
1073 13364 35505 22989 -12629 -36789 -26715 7974 34136 26554 -6642 -34385 -30024 2556
1085 2556 31801 30494 -411 -31134 -32301 -2869 29399 33540 5250 -27461 -33873 -7955 25302
1098 25302 34697 10504 -23546 -35267 -13304 21405 35341 15648 -18997 -35075 -17849 16843
1110 16843 35530 21227 -12247 -33698 -20763 12930 35919 26433 -6748 -30938 -23925 8088
1122 8088 34283 29746 -1576 -29261 -27498 1942 30821 31050 2551 -27796 -30798 -4784 26078
1135 26078 31528 7214 -24917 -33190 -10138 22051 32780 11765 -20687 -33524 -14918 17878
1147 17878 33440 16218 -16665 -34322 -20025 11891 31583 19277 -12842 -34133 -24493 5788
1159 5788 29373 22126 -8445 -33143 -28674 715 26878 24793 -2913 -30372 -30497 -3950 25196
1172B5196K996k5345k9280m898K4077L0485P844k2011l0880q947K0145L1293J1842
1185C2517j7740l1290j3891J5988L1229J6227j3707l0738j8160J1135L0625K0460
1197C2655r072k9747k1806O876K9510K3553m631k8374k4353K473K7051K6291m08
1210C0018k5839k6702k314K3806K7732M230k2908k8822p170K0043K9420Q906j9933
1223A0467k9627j1712J7945K8919J3271j6141k9862j5422J3619K9230J6778j1630
1235A5835k9326j8492R092K8411K0333p177k7401k1593M832K6790K3141k639k5642
1248c836k4303J9K4432K5683J758k3328k6454m296K1654K7611O260k0209k7464
1261b2473q217J9482K8264J0952j6730k7619j1698J5497K8139J4752j2084k7940
$$ plain form
1172 25196 28192 2847 -26433 -31331 -7254 23231 31075 9064 -21816 -30763 -10618 20675 32517
1185 32517 14777 -16513 -30404 -14416 16813 33040 19333 -11405 -29565 -18430 12195 32655
1197 32655 23583 -6164 -27970 -21094 8416 31969 27338 -1036 -25389 -22916 4135 30426 30018
1210 30018 4179 -22523 -24837 -1031 26701 30931 8023 -20799 -27969 -7926 21494 30400 10467
1223 10467 -19160 -30872 -12927 15992 29263 13122 -16740 -32162 -18543 10687 27465 15835
1235 15835 -13491 -31983 -22891 5520 25853 18676 -8725 -30318 -25486 1304 24445 21806 -3836
1248 -3836 -28139 -28120 -3688 21995 23753 425 -26029 -30325 -8671 18940 25200 4991 -22473
1261 -22473 -30690 -11208 17056 28008 11278 -16341 -28039 -12542 15597 30349 18265 -9675
1273i675j5852J0917K7948J7731q854k7262j9225O489K6694K0788n089k6337k1599
1286b3326K564K5133K3265j165k3057k4336j569K2252K4869L796k0890k5587n738
1299b3789J9102K6169P869j7736k6818j0097J5808K6635J1390j4920k7297j3781
1311b7465J2274K5824J4906j1254k6894j7308Q810K5598J8095p260k4875j9314
1323b8863M831K4329K1140k251k3509k1588Q06K2921K2933J595k1759k3679l425
1336b6519K0403K3898N028j8605k5403p028J7107K5340Q855j5470k5054j0312
1348b7760J4118K5761J3303j1685k5048j3518J0712K4863J6919q292k4652j6802
1360b2081O619K4115J8859m656k3364k0044K498K2561K0927j477k1557k1670j301
$$ plain form
1273 -9675 -25527 -14610 13338 31069 22215 -5047 -24272 -17783 8911 29699 24610 -1727 -23326
1286 -23326 -20762 4371 27636 26471 3414 -20922 -22491 -239 24630 28426 7536 -18051 -23789
1299 -23789 -4687 21482 29351 11615 -15203 -25300 -9492 17143 28533 13613 -13684 -27465
1311 -27465 -15191 10633 25539 14285 -12609 -29917 -21107 4491 22586 15326 -9549 -28863
1323 -28863 -24032 297 21437 19186 -4323 -25911 -25105 -2184 20749 22344 585 -23094 -26519
1336 -26519 -6116 17782 22810 4205 -21198 -28226 -11119 14221 23076 7606 -17448 -27760
1348 -27760 -13642 12119 25422 13737 -11311 -24829 -14117 10746 27665 19373 -5279 -22081
1360 -22081 -15462 8653 27512 22856 -508 -20552 -18054 4507 25434 23957 2400 -19270 -20571
1373b0571K0831K1938L061j9650k2546n131J7852K3417O747j6239k3959q494J4842
1386g902K4066J0642j3486k4502j2308J1612K4241J3021j0336k4336j5557Q107
1398a6738K3228J5474o405k3745j7665M877K2086J8428k857k1352j9482J353K0682
1411b116K0805J041j9000k1587k395J8588K1758M557j7253k2876o114J6185K2695
1424A4288P506j5122k3007r091J3618K3012J1030j1774k2264j2276J0131K2754
1436H805J4474q022k2192j5161O642K1930J7006m515k1591j7548L018K0982J8724
1449B2552j290k0054j9373k29J8709J9671K120j7887k0795l620J6325K1112N160
1462B2401j4894k1736o986J3556K1736R335j2758k1736j0786J1723K1963J1448
$$ plain form
1373 -20571 260 22198 25259 5609 -16937 -22068 -4216 19201 25948 9709 -14250 -22744 -7902
1386 -7902 16164 26806 13320 -11182 -23490 -11878 12363 25384 15048 -9288 -24845 -16738
1398 -16738 6490 21964 15559 -8186 -25851 -20974 1112 19540 16683 -4669 -24151 -22798 -2116
1411 -2116 18689 19730 730 -20857 -23252 -4664 17094 21651 4398 -18478 -24592 -8407 14288
1424 14288 21794 6672 -16335 -25426 -11808 11204 22234 10460 -11804 -24080 -13949 8805
1436 8805 23279 15257 -6935 -22096 -15454 6476 23482 18967 -2624 -20172 -17154 3828 22552
1449 22552 21262 1208 -18165 -18394 315 19986 22106 4219 -16576 -20196 -3871 17241 22401
1462 22401 7507 -14229 -21215 -7659 14077 23412 10654 -11082 -21868 -10145 11818 23266
1474B3266j0042k1616j3420Q236K0864J4531o769k0977j5890M817J9814J6851
1486A9665l129j9866j7554J316J8561J8800N70j7678j9159k498J7628J9625L968
1499B0249j6074k0309n246J5111K0751N963j3341k0795q177J2067K0714R611j0557
1512I967k0677j0963R171K0672J2578p399k0366j3736O348J9834J5201m594j9610
1525c574j5644K927J9097J6814j704j7990j7467m4J7653J7859J109j6174j8805
1538a5943k837J5003J9263M407j4150j9256o386J2759J9685P769j1415k0157r045
1551b0303J0509K0150J0362r160j9936j1466P782J9528J2451n806j9620j3943
1563a9452M700J8500J4860l216j8122j5369J294J7394J6622K8j6766j7213j368
$$ plain form
1474 23266 13224 -8392 -21812 -13576 7288 21819 15050 -5927 -21817 -17000 2814 19665
1486 19665 16536 -3330 -20884 -19568 -1007 17793 18363 685 -18474 -20972 -3344 16281 20249
1499 20249 4175 -16134 -21380 -6269 14482 20445 7104 -13691 -21868 -9801 10913 20524 9967
1512 9967 -10710 -21673 -12502 8170 20748 13349 -7017 -20753 -14405 5429 20630 16036 -3574
1525 -3574 -19218 -16291 2806 19620 17916 -74 -17541 -17585 68 17927 19036 2862 -15943
1538 -15943 -18780 -3777 15486 19893 5743 -13513 -19899 -7140 12545 20314 8899 -11258 -20303
1551 -20303 -9794 10356 20718 11558 -8378 -19844 -12062 7466 19917 14111 -5509 -19452
1563 -19452 -14752 3748 18608 15392 -2730 -18099 -16805 589 17211 17239 473 -16740 -18108
1576a8108J5420J8554K204j4292j8511m591J4063J8981N383j2481j8813o811J1223
1589g779J8898Q627j0326j9001r779Q801J8780J0948p251j8524j2165O131J7916
1602E276J3166m366j8078j4111L007J7502J4869j729j6801j5432J53J5865J6566
1615A5887R90j5062j6982k284J4075J7541L914j3151j7727n140J1514J8092O629
1628A8296j0989j7860q238R633J8695Q550q677j7890j0126P311J7686J1327n924
1641A1794j7613j2085N099J7064J3046l109j6514j3766J833J5875J5026n01j5592
1654E57j5638j162J4666J6320J757j3391j6711l810J2797J6882M914j1855j7161
1667a1835n815J0692J7226P552r800j7043q339Q259J7158R609o916j7032j1106
$$ plain form
1576 -18108 -2688 15866 18070 3778 -14733 -19324 -5261 13720 19103 6622 -12191 -19002 -7779
1589 -7779 11119 19746 9420 -9581 -19360 -10559 8221 19169 11918 -6606 -18771 -12640 5276
1602 5276 18442 14076 -4002 -18113 -15106 2396 17265 15536 -1265 -16697 -16544 -679 15887
1615 15887 16877 1815 -15167 -17451 -3376 14165 18079 4928 -12799 -17939 -6425 11667 18296
1628 18296 7307 -10553 -18791 -9158 9537 18087 9410 -8480 -18606 -11295 6391 17718 11794
1641 11794 -5819 -17904 -12805 4259 17305 14196 -2318 -16084 -14251 1624 16650 16149 557
1654 557 -15081 -16243 -1577 14743 16500 3109 -13602 -17412 -4615 12267 17181 5326 -11835
1667 -11835 -17650 -6958 10268 17820 8020 -9023 -17362 -9103 8055 17664 10748 -6284 -17390
1680a7390O089J6570J1994m738j6715j2274L131J6029J3233k303j5236j4252P43
1693a5119J4676J4360J045j3673j5271j965J3172J5667L214j1868j5672n009J1673
1706d770J6047N940r945j6496o834R217J6250P847p892j6745r151O698J5969J0141
1720A6276n662j5884j1192M563J5623J1876l088j5023j2614K266J4828J3493o31
1733A4831j4330j3341j088J3792J3937J278j2579j5231k648J1270J4806M155j0891
1746C961j5523n211J0295J5126O698r148j5247p654Q340J5521Q052o805j4859
1759f454r502N368J5447J0176m546j5010j0681L117J4142J1935j858j4230j2816
1772a4912J506J3063J3172L02j2754j3740j155J1860J4043K992j1548j4038l571
$$ plain form
1680 -17390 -11301 5269 17263 12525 -4190 -16464 -13333 2696 15929 13626 -1610 -15862 -15119
1693 -15119 -443 13917 14962 1289 -13982 -15947 -2775 12892 16106 4238 -11434 -16443 -4770
1706 -4770 11277 17217 7272 -9224 -16058 -6841 9409 17256 9364 -7381 -16532 -9834 6135 16276
1720 16276 10614 -5270 -16462 -11899 3724 15600 12512 -2511 -15125 -12859 1969 15462 14831
1733 14831 501 -12840 -13928 -136 13801 15079 2500 -12731 -15379 -4109 10697 14852 3961
1746 3961 -11562 -16773 -6478 8648 15346 6198 -9049 -16703 -8363 7158 15210 8405 -6454
1759 -6454 -15956 -10588 4859 15035 10489 -4521 -15202 -12085 2057 13992 12134 -2096 -14912
1772 -14912 -13406 -343 12829 13131 377 -13363 -14518 -2658 11385 14377 2829 -11209 -14780
1785a4780J0852J5022N103r804j4806n724R166J4498O809p355j4835q390O709
1798g535J4812Q461n476j5355r609M434J4035J0637k955j4027j0916K038J3644
1811B188J2234p67j2622j2366l50J2364J2865J154j1815j3712k508J0618J3029
1824A0312L293j0389j3952m529R119J3842N637q649j4065o318P487J4334P105
1837A3227n959j3990q084N047J3809R109m560j3286r676L092J3089J0600k373
1850A0045j2638j1288J090J2501J1658K24j2181j2470n65J1325J2377J752j0402
1863A428j2710k893R778J3743M378r004j2864m715Q578J3594O014p128j3090o621
1877a1512O074J3194P620n794j3427q611M241J2664R048l321j2849r803K565J2036
$$ plain form
1785 -14780 -3928 11094 16197 6393 -8413 -14137 -4971 9527 16336 8981 -5854 -14244 -7535
1798 -7535 7277 15738 10262 -5093 -14702 -10268 3767 14404 11449 -2578 -13494 -11456 2188
1811 2188 14422 13655 1033 -11333 -11683 681 13546 14700 2885 -10827 -13335 -2717 10312
1824 10312 13605 3216 -10736 -15265 -6146 7696 13333 4684 -9381 -15699 -8212 6122 13227
1837 13227 7268 -6722 -14806 -9759 4050 13159 8599 -4687 -14363 -11271 1818 12418 10045
1850 10045 -2593 -13881 -12791 -290 11368 11592 -589 -13059 -13624 -2299 10078 11830 1428
1863 1428 -11282 -14175 -4397 9346 13724 4720 -8144 -12859 -4281 9313 15327 8199 -4891 -11512
1877 -11512 -5438 7756 15376 9582 -3845 -12456 -8215 4449 13497 10176 -2673 -12476 -9911 2125
1891B125J1124j305j1481j1117O75J1593J1270R10j0509j2461j442R970J1783
1904A1135K526r936j2947l774Q547J2396L984p697j3124n223O864J2611O538o347
1918E553j2914o833N299J2444P911m358j2287q522L113J2064R525k373j1404r992
1932a2774J410J1566J0347j36j1269j0692m43J0002J1374J130r516j2057k186
1945a3244R212J2082K653q162j1487m253Q543J2154N047n862j2244n593O540J2281
1959G667O733m971j2316p615M245J1583Q074l905j1867q823K434J1229R078j473
1973A0073j0449r943P47J0784J0751P8r657j0502j135R044J1070J877r224j1359
1987g845l253P959J1422L750q118j1527m914O939J1513N474n807j1527o418N118
$$ plain form
1891 2125 13249 11944 463 -10654 -9979 1614 12884 13794 3285 -9176 -10618 -648 11135
1904 11135 13661 3725 -9222 -12996 -4449 7947 11931 4234 -8890 -14113 -7249 5362 11900 5553
1918 5553 -7361 -14194 -8895 3549 11460 7102 -5185 -13707 -10594 1470 10995 8622 -2782 -12774
1932 -12774 -11364 202 10549 10413 -856 -11548 -11991 -1989 9385 10515 999 -11058 -13244
1945 -13244 -4032 8050 10703 2541 -8946 -13199 -4656 7498 12545 6683 -5561 -11154 -4614 7667
1959 7667 14400 9429 -2887 -10502 -6257 5326 13400 9495 -2372 -11195 -8761 2468 11546 10073
1973 10073 -376 -10319 -9572 1212 11963 12041 2384 -8118 -9253 -209 10861 12738 3514 -7845
1987 -7845 -11098 -3139 8283 12033 3915 -7612 -12526 -5587 5926 11400 5593 -5934 -12352 -7234
2001g234J1626O629m198j1481q116L457J1040Q116k442j0556r139J751J0834R045
2015I332l95j0300r404J96J0367R902N72r709j0257j657Q392J0747K448q317j1085
2030i168l124O950J1467M394o416j0721m677O050J1425O061m769j1200o394M506
2044e616J1077P071l918j1027p829K643J0336Q083j898j0669q095Q19J0140R402
2058A0519j39r158r585p66R234R946J628q660j0763k376P477J0713K938p778j0767
2073g537l963O846J1026M495n758j0485n668N520J0687O136m409j0650o858L168
2087g450J0678O787k614j0308q396J955R662Q704q71r417q995L87R227R695O80
2102I724q850r401j427Q371R697J737p590j0115k681O435J0064M010o353j0616
$$ plain form
2001 -7234 4392 11021 6823 -4658 -12774 -9317 1723 9839 7397 -3159 -12298 -10547 287 9332
2015 9332 8937 -1363 -10767 -10571 -204 9698 10270 561 -9696 -11353 -2961 7786 10234 1917 -9168
2030 -9168 -12292 -5342 6125 10519 4103 -6618 -11295 -5245 6180 12241 7472 -3728 -10122 -5616
2044 -5616 5461 12532 8614 -2413 -10242 -7599 2737 10820 8922 -1747 -9842 -9023 1117 10519
2058 10519 10380 1222 -8363 -9129 105 10051 11679 3019 -7744 -10120 -2643 8070 11008 3230 -7537
2073 -7537 -11500 -4654 6372 10867 5109 -5376 -11044 -5524 5163 11299 6890 -3760 -10618 -7450
2087 -7450 3228 10015 7401 -2907 -11303 -9348 314 9018 8147 -1270 -10265 -9878 -651 9044 9724
2102 9724 874 -8527 -9954 -1583 8114 9851 2261 -7854 -10535 -4100 5964 9974 3621 -6995
2116f995l882N865J0368N221m873r901n703M403J0335O238l794r990p001K636
2130g073R552P219k342r661p753J551R155Q341l92q504q254m39Q446R517Q56p550
2146B669r802j903P117R694K446p109j0277l441N990J0188M023n977r545m566
2160a0493N309R827N783m480r503n562L156R569O260k682r372p696J876R168P718
2175H878j447r154p963O72Q877Q534K1p844q296o36P793Q590J438o851r554k273
2191i215O419R025K634n717r586l548N020R507M706m352r366n072M456R602N712
2206A0225l213r745o074K621R120O419k629r387o605J409Q125P448l82q084p546
2221h298j05P577Q746J073p172q588j648O541R176K535o856r222l283N745R326
$$ plain form
2116 -6995 -10877 -5012 5356 10577 5704 -4197 -9900 -5497 4838 11076 7282 -2708 -9709 -7073
2130 -7073 2479 9698 7356 -2305 -10058 -8507 648 8989 8597 93 -8161 -8600 -154 9363 10219 2669
2146 2669 -7133 -9036 -1919 7775 10221 3112 -7165 -10606 -4616 5572 9595 3618 -5927 -10493
2160 -10493 -5184 4643 10426 5946 -3557 -9119 -5963 3606 9866 7184 -2188 -9884 -8008 1160 8878
2175 8878 7431 -1723 -9686 -9014 -137 8397 8418 574 -7722 -8358 -565 8025 9463 2612 -6942 -9215
2191 -9215 -2796 6229 8863 3146 -6440 -9988 -4968 4539 9245 4893 -4473 -9545 -5089 4513 10225
2206 10225 7012 -2733 -8807 -6186 2934 9353 6724 -2663 -9268 -7859 266 7714 7332 -752 -8298
2221 -8298 -8403 -826 7920 8993 1821 -6767 -8415 -1874 7302 9837 2981 -6241 -9524 -3779 5547
2236E547L110n571r236l451M608R037M973m344q251n060L654Q584N730k305q828
2251a803o714J766Q521O691j384q580p539P35Q566P960m96p832p762q3P555Q430
2267H031R05o863q086j958O323Q264J878n608q809l312N210Q640L959m509q923
2282d858m495M314Q999N663l926q534n701L045Q436O144k525q837o003J671P504
2297H97O648j240p494p320M66P354P313J220o516q035j009O506Q505K185o369
2312C111q826k796N820Q120L055n878q413l799N178Q411M145m034q060m150L549
2327d567Q244M986k606p513n819J674P224O657j486p856o991O94P296P264n66
2342F635p262p113k2O971P738J122o635p407j327O029P567J499m955p775l218
$$ plain form
2236 5547 8657 3086 -6150 -9601 -4993 4044 9017 4673 -3578 -8638 -4984 3600 9330 7025 -1803
2251 -1803 -8517 -6751 1770 8461 7077 -1503 -9042 -8307 259 8219 7723 -109 -7871 -7954 -399 8031
2267 8031 8936 2073 -6013 -7971 -1648 6616 8494 2886 -5923 -9235 -4025 4615 8574 4065 -4858
2282 -4858 -9353 -5039 3960 9623 5697 -2837 -8538 -5493 2943 9087 6562 -2275 -8278 -6607 897
2297 897 7545 6305 -1189 -8509 -8043 -689 6624 7844 1328 -6707 -7716 -1210 7295 9480 3111
2312 3111 -5715 -8511 -2691 5429 8484 2606 -5807 -9606 -4428 3983 8128 4094 -3966 -8116 -4567
2327 -4567 3677 8663 6057 -1456 -7275 -5601 1623 8280 6794 -1062 -8053 -7359 -63 7201 6635
2342 6635 -627 -7740 -7762 -791 6947 8069 1434 -5973 -7300 -1271 6296 7795 2840 -4935 -8153
2357h153M389Q124L181m454q023m051M128P969N007l407q327m731L056Q399N516
2372H623k473q262n635J842P370N538j360o987o239J1P002P014K8n643p065r28
2388g164O308P199K189n501q128j701N117P666K293n122q012l059M207P664L477
2403G433l946p542l546L651P270M625k409p039n151K116P201N589j559p091o729
2418g127O48P141O390j51p505o899J11O510P110O03o598o326r83N793O884J390
2434F991n002p249j980M065P159K721l893p650l959L614P842M231k846p561m558
2449h075K925Q056M854k336p783m816J882O976N061j317o689n953M61O480N555
2464E281n3n193o378p97N975O802J955n379o733j731N128P536K120m934p798k619
$$ plain form
2357 -8153 -3764 4360 7541 3087 -4936 -8987 -4859 3110 8117 4710 -3617 -8348 -5292 3107 8623
2372 8623 6150 -2112 -7747 -5905 1465 7003 5643 -1344 -7583 -7572 -570 6444 6472 829 -6236 -7164
2388 -7164 -856 6343 8532 3031 -5097 -6798 -1681 5985 8278 3156 -4856 -7915 -3708 3956 7433
2403 7433 3487 -4055 -7601 -3950 3320 7945 5536 -1503 -6654 -4538 2663 8252 6693 -398 -7127
2418 -7127 -6479 662 7052 6901 -604 -7503 -7392 -882 6228 6831 233 -6093 -7076 -1283 5601 6991
2434 6991 1989 -5260 -7240 -3175 3984 6705 2812 -4838 -8797 -5183 2659 6890 4044 -3517 -8075
2449 -8075 -5150 2906 7760 5424 -2359 -7175 -5293 1683 6744 5427 -1262 -7215 -6754 -274 5281
2464 5281 5228 35 -6343 -7140 -1165 5637 7592 2213 -4520 -6251 -1123 6413 8533 3599 -4199 -6818
2480f818M365P144K886m450o739l567L526P023L980k342o412m534K141O514M862
2495G579j511o299n584O10O332O158q50o730o389j07O589O388J38n878o370n69
2511f493N461O202J768n341o337j706L920O730J899l756o868l460L190O767L973
2526E949l016o778m439K585P700M767k410o892m580K213O785N044j887o434m825
2541f218O47N563M923Q5n997n506p0N217O104J300m668o339j596N407O575K210
2557G637m691o704k508M512O955K184l939o798k983L362O642K723k606n831l452
2572e497J911O014M897j746n761n189Q50O032N080l56o030o153J71N565N940N9
2588E787n924n841l45N640O002J115n049n604j487M252N663J864l704o100k589
$$ plain form
2480 -6818 -2453 4691 7577 3127 -3612 -7179 -3653 3370 7350 5008 -1404 -5938 -3797 2717 7579
2495 7579 6068 -231 -5815 -5205 1127 7285 6435 -295 -6684 -6791 -202 6186 6324 446 -5924 -6493
2511 -6493 -1032 5170 6938 1597 -4740 -6446 -2526 4204 6103 2347 -4521 -7981 -4791 1976 5949
2526 5949 2933 -3845 -8284 -5699 2001 6768 4358 -2534 -7114 -4901 1884 6928 5041 -1393 -6218
2541 -6218 -5571 -8 4915 5000 -997 -6503 -6573 -1356 4748 6048 1380 -4959 -6555 -1148 5427 7637
2557 7637 2946 -3758 -6266 -1754 5201 7385 3446 -3352 -6335 -2973 3669 6392 3786 -2045 -5497
2572 -5497 -3586 2428 7325 5579 -182 -5371 -4521 1511 6591 6235 205 -5948 -5777 -212 5728 5787
2588 5787 -137 -5978 -6323 -683 5319 6434 1385 -4219 -5706 -1454 4209 6073 2369 -3731 -6320
2603f320K575N947L326k912o642l600K574O655M164k354o606l915K265O715M169
2618F041j499o081m053Q35N211M851m97n552m952o1M713N336P74m269n850j401
2634f454N038N970J995m056o395k074M020O379K526l723o490k739L443O028K737
2649F205l042n616k839K109N389L798j564n108m013J312N252M665n56n902n487
2664e397L33N400N455o04n184n618n4M867N411N82m485n106q61M484N136J547
2680E906l482n220k377K652N668K704l040o064l296K779N716L464k036o180l553
2695f359K142N921M155j684n814m072J660N008M095n89m835m869J63M461M803
2710D186L97m001n256j143M249N464J877l748o050j673M241N671K236m059n689
$$ plain form
2603 -6320 -3745 2202 5528 2616 -4026 -7626 -5052 1603 5767 3413 -3193 -7108 -4843 1872 6041
2618 6041 4542 -1539 -5592 -4757 454 5305 4808 -744 -5696 -5757 -1044 4292 5066 797 -5053 -6454
2634 -6454 -1416 4554 6549 2493 -3902 -5976 -1956 4423 6949 3226 -3264 -6003 -2560 3468 6205
2649 6205 3163 -2453 -5292 -3183 2206 6004 4440 -668 -4681 -3369 1883 6548 5992 90 -5397
2664 -5397 -5064 336 5791 5187 3 -5615 -5669 -802 4609 5191 706 -4400 -5261 -777 4359 5906
2680 5906 2424 -2796 -5173 -2521 3147 5851 2811 -3253 -6549 -3770 1946 5410 3374 -2806 -6359
2695 -6359 -4217 1704 5859 4175 -1639 -5711 -4051 957 5052 4463 -372 -5241 -5078 -617 4186
2710 4186 4583 582 -4674 -5817 -1568 3896 5773 2025 -4025 -5698 -1457 4214 6450 2391 -3298
2725c298k434L125N640K378l081n150k814K543M999K894j392m630l818J158M957
2740A077M946q50n409m438Q8N247M999m78n177n066q9M769M761O89m496n203n20
2757e150M123M929J261l407m820j946L129M873K253k378n492k947K355N348L184
2772E315k340n201l915K137N954L587j650n319l733J576N218L810j358m605l988
2787d512K57M280L916M09m152m239q84L733M536J422l386n127j446L978N236J804
2803E825l412n712j737L235N171K010l027n087k478K809M058L226j972m888l125
2818e104J585M516L735n33m661m085L18M754M383j38m878m383j57M408M700J2
2834D472m442m387p0L288M579J327l668m071j626L157M549J654k094n347k376
$$ plain form
2725 -3298 -5732 -2607 3033 5411 2330 -2820 -5634 -3091 1908 4802 3410 -1220 -5038 -3880 1077
2740 1077 6023 5173 -236 -4674 -4586 661 5660 5182 5 -5061 -5150 -381 4380 5069 573 -4630 -5150
2757 -5150 -1027 3902 5163 1756 -3064 -5010 -1881 2992 5245 2867 -2625 -5572 -3217 2131 5315
2772 5315 2975 -2226 -6141 -4004 1950 5537 3887 -1432 -5165 -3589 1629 5439 4081 -524 -4512
2787 -4512 -4255 25 3941 4350 198 -4041 -4925 -1192 3344 4766 1380 -3747 -5193 -1215 4021 5825
2803 5825 2413 -3299 -5036 -1801 3370 5380 2353 -2734 -5212 -2403 1655 4881 2909 -1979 -5104
2818 -5104 -3519 997 4732 4199 -462 -4547 -4229 525 4908 4770 -108 -4491 -4648 -240 4460 4472
2834 4472 30 -4357 -4427 -1139 3440 4767 1099 -2972 -4598 -1441 3108 4762 2668 -2679 -5055
2849e055K275M954K937k366m927l058J674N266L643k027m765l520J666M983L237
2864D917q34m643l299L76M060L714l50l494m410p13L931M075J468l865m476j702
2880e245M033M594J708l413m899j653L216N027J658k701m877k012K327M794J651
2895D208j870l947l076J390M273L246p70m275l642N90M661L637k65m056m266J59
2911d003L844M055N89m272m453l77L815M042R63l383m145j081L403M062J170k292
2927A937m488j900K397M438K369j973m766k359J163M876K834j575m535k928J209
2942c301M499L225q55m253l108M28M011L292l20l785l471n03L657L728P20l100
2958H64m361j020L262M449J202k880m197j664K999M381J553k696m569j632K328
$$ plain form
2849 -5055 -2780 2174 5111 2745 -2182 -5240 -3566 1700 5343 3316 -1449 -4969 -3303 1680 4917
2864 4917 4083 -560 -3859 -3483 577 4291 3941 447 -3963 -4676 -745 3330 4798 933 -3543 -5245
2880 -5245 -1212 3382 5090 1677 -3222 -4875 -1659 3368 5026 2325 -2552 -4564 -2237 2557 4208
2895 4208 2338 -1609 -4685 -3295 978 4224 3454 -821 -4463 -3873 788 4425 4160 104 -4162 -4003
2911 -4003 -159 3896 4485 213 -4240 -4617 -802 3240 4203 820 -3325 -4406 -1003 3059 4229 1937
2927 1937 -2551 -4451 -2054 2384 4753 2780 -1986 -4345 -3182 1694 4528 2953 -1582 -4510 -3301
2942 -3301 1198 4423 3568 -685 -3793 -3365 646 3938 3618 -167 -3638 -4141 -484 3244 3964 864
2958 864 -3497 -4517 -1255 3194 4396 1516 -2681 -4345 -1346 3035 4588 1892 -2677 -4309 -1981
2973a981L925K247j740m364k333J179M022K296n46m106k526N02L842L817m12m070
2989b48l840P01L668L494J95l507l843k62L281M041M67l199m101p59L024L680
3005B792J308k542l795j520K062L813K254j926m719j747J352M218K557j565m079
3020a537k710J381M098K989j169l734l325J083L475L454n35l429l393L14K468
3035e70L964J84l190l671j043K994L822J266k662m430j056K771L960J611k428
3050A522l805j803K269M214J608k108l340k298J670L485K453j273l529k816J081
3065b670L370L079n56l373l291K13L357L359Q4l220l973j3L540L274N00k713l753
3082b786m23K561L525Q44k227l371j468K296L402J766j984l481j971J656L432
$$ plain form
2973 -1981 1944 4191 2451 -1913 -4246 -3067 955 3251 2705 -1401 -3927 -3425 417 4234 3822 -248
2989 -248 -4088 -3387 281 3775 3970 463 -3380 -3642 -361 3680 4147 948 -3153 -3912 -888 2792
3005 2792 4100 1558 -2237 -3757 -1695 2118 4372 2446 -2273 -4020 -2668 1550 4107 2542 -1537
3020 -1537 -4247 -2866 1232 4221 3052 -682 -4007 -2924 551 4005 3470 41 -3352 -3038 -570
3035 -570 3394 3578 388 -3283 -4326 -1332 2490 3756 1094 -3336 -4392 -1621 2339 3950 1522
3050 1522 -2283 -4086 -1817 2397 4005 1897 -1443 -3741 -2071 1414 3867 2594 -935 -3751 -2670
3065 -2670 700 3779 3223 -150 -3441 -3228 129 3488 3572 352 -3621 -3634 -94 3180 3680 967 -2786
3082 -2786 -3209 -648 2877 3721 1494 -1877 -3345 -1049 2353 4119 2135 -1346 -3317 -1661 1771
3097A771K182j237m340k389J323L830K662j065m066k312P73L564K553n50l145
3112d46k754L4L250K906R2k755l177m48K253L720R01k559l763j575K956L577J450
3129C662k552l828j437K141L829J800j965l559j880J455L429J895j055l464k090
3144c619J236L181K712q73l171k377j9L282K884K15l175l195J44K688L125N29
3160C567l208l150m09K374L201Q01k351l077r52J983L483J017j507l063j994J846
3176a439L348K068j086l836k008J178L340K263j180l420k109N52L026K620p50
3191B567l023l007L21K802K874K71l006k835o5K356K888R80k499l211j056K388
3207a255L362J129j864l493j376K175L159J274j443l718j555J674L140J706j349
$$ plain form
3097 1771 3953 2716 -1624 -4013 -2690 1140 3802 2737 -1329 -3641 -2868 696 3249 2699 -446
3112 -446 -3200 -3166 84 2990 3082 327 -2850 -3298 -1045 2675 3576 1017 -2746 -4321 -1365 2212 3662
3129 3662 1110 -2718 -4155 -2014 1815 3615 1650 -1909 -3789 -2334 1095 2990 1935 -1529 -3619
3144 -3619 -2383 798 3510 2637 -534 -2911 -2930 352 3236 3451 276 -2919 -2775 -87 3038 3567
3160 3567 359 -2791 -3200 -826 2375 3176 825 -2252 -3204 -1221 2262 3279 1772 -1291 -3285 -1439
3176 -1439 1909 3977 2891 -945 -2953 -1775 1565 3828 2648 -772 -2881 -2329 697 3317 2567
3191 2567 -456 -3463 -3142 -340 2534 2805 -201 -3036 -3101 -745 2143 3123 624 -2587 -3643 -1255
3207 -1255 2107 3236 1372 -2121 -3497 -1322 1837 3111 1668 -2050 -3605 -1931 1209 2915 1566
3222A566l449j710R73L037K288n68k785l032R10K875K608J25l129k642K24K662
3238d7L101J86k628k787o32K446L170M75k041l117r60J814K766J331j507l576
3254b006j199J779K975J478j283k833j952J258L127J784q52l289j553N12L317
3269A263K212p21k766k655M74K882K159k26k181l081j96K550K297P40j996l523
3285b768o14K266K747J135j884l118j039J865L060J185j537l244j371J989K595
3300A267J910j231l072j855R42K845J917o29k963k175N19K380K567j35k730k432
3316b875P5K415K751o7k207k596p9J971K572Q23j912k673q39K094K748P47j450
3333A498k717j468J645K698J260j266k864j570J156K618J401m71k993j746R10
$$ plain form
3222 1566 -1883 -3593 -2620 417 2705 2137 -648 -3680 -2770 105 2713 2838 -291 -2933 -2709 -47
3238 -47 3054 3240 612 -2175 -2807 -361 2809 3284 1243 -1874 -2834 -1020 1746 3077 1570 -2006
3254 -2006 -3205 -1426 1549 3027 1744 -1089 -3041 -1783 1344 3128 2276 -1013 -2566 -2054 1263
3269 1263 3475 2754 -12 -2667 -2193 689 2848 2622 441 -2640 -2836 -286 2011 2751 755 -2768
3285 -2768 -3382 -1116 1631 2766 882 -2236 -3275 -1410 1650 2835 1298 -1946 -3317 -1328 1267
3300 1267 3177 1946 -1126 -2981 -2039 806 2723 2094 -869 -3044 -2525 -145 2422 2287 -443 -2875
3316 -2875 -2800 -385 2366 2299 92 -2504 -2583 -612 1960 2783 871 -1802 -2641 -547 2201 2948 1498
3333 1498 -1219 -2687 -1042 1656 2916 1650 -1214 -2784 -1628 990 2391 1920 -1073 -2819 -1909
3348a909K225K680j030k279k440O43K393K541n34k198k278j30K249K648l4j960
3364E87k553l47J917K477N30j578k679j115J683K666J235j851k719j304J426K713
3380A088J479r18k962j372Q46K637K125r52k552j770L90K673J786j21k440k706
3396b769M31K475J993J7k227k261j00J979K222P68j932k570n78J707K367R83j703
3413H02k325r94J318L211P02j599k111j619J354K307J599p13k676j889Q37K284
3429D88J824k97k773k076J095K225J758r3k440k226L52K090J960R1j633k364l70
3446b389J894K408P21j489k856o65J841K291P53j303k420j295J664J977J147r10
3462A369k857q59Q22J965J928p08k324j809N56K552J705m79k015k309P02J970
$$ plain form
3348 -1909 316 2996 1966 -313 -2753 -2110 283 2824 2290 92 -2186 -2316 -67 2581 2547 587
3364 587 -1966 -2313 -396 2081 2611 1033 -1646 -2761 -1078 1588 2823 972 -1747 -3051 -1625 1088
3380 1088 2567 1649 -1313 -2685 -1839 798 2923 1971 -581 -2351 -1961 712 2498 2377 -63 -2769
3396 -2769 -2338 137 2130 2147 -80 -2341 -2441 -462 1760 2528 596 -1974 -2552 -845 1522 2505 802
3413 802 -1523 -2517 -1199 2012 2714 1115 -996 -2615 -1261 1046 2645 1932 -744 -2633 -1796 488
3429 488 2312 2015 -758 -2834 -1739 486 2244 2151 -289 -2515 -2163 -73 1887 1978 345 -2019 -2389
3446 -2389 -495 1913 2634 1145 -1711 -2376 -535 1756 2509 1206 -1214 -2509 -845 1132 2279 1369
3462 1369 -1488 -2347 -1525 440 2368 1660 -664 -2473 -1917 635 2340 1861 -154 -2463 -1761 209
3478B09K327j10k364k178k03K252K151O8j741k235m16J612K447N03j502k418m63
3495b061J144K271P48j012j891j730J222K191R61m76k451j313R72K255J620p84
3511A666k002j858N05K032J779k13k225j884J51J972K075N5j864k160o53K239
3527c85K018L91j220k519n01J266K754K71j138k415p81J155K241R60j094k296
3543a293q13O91K142J519q40j978j610Q38K421J320p15j983j733L89J951J641
3559A947j45j783j981j61J859J832J47j407j874p72J772J928Q82j521j985j073
3575b335J945J711J011j400j922r58J351J740P55o79k178j360O19K646P56k04
3591A498k079j305J18J912J858m38j927j595K57J853J689l92j343k113J5J492
$$ plain form
3478 209 2536 2426 62 -2116 -2319 -67 2084 2152 411 -1824 -2240 -628 1819 2322 820 -1598 -2061
3495 -2061 -917 1354 2102 1090 -801 -2531 -1309 882 1843 1367 -1084 -2397 -1425 830 2450 1666
3511 1666 -336 -2194 -1689 343 2122 1909 -316 -2200 -2049 -77 1998 2053 189 -1971 -2624 -385
3527 -385 1633 2024 804 -1715 -2216 -950 1804 2075 937 -1478 -2259 -1104 1137 2097 1003 -1293
3543 -1293 -2106 -1415 727 2246 1406 -572 -2182 -1344 1077 2397 1682 -301 -2034 -1645 306 1947
3559 1947 1802 19 -1962 -2123 -264 1568 1715 308 -1566 -2338 -566 1362 2244 723 -1262 -2335
3575 -2335 -390 1321 2332 932 -990 -1948 -597 1143 1898 1219 -959 -2319 -1700 946 1702 1498
3591 1498 -581 -1886 -1768 144 2002 1564 -363 -1958 -1701 152 1841 1449 106 -2007 -1992 -500
3607e00K125L55j612k066m87J591K269O08j678j979o53J387J956N63q37k015j098
3624b071N68K383R16o54j955j126O92J708J846r69j761j396M05J842J362O0j744
3641A06j876K78J594J713j33j635j544p58J840J597O94j565j910k29J221K137
3657A530N42j179j864q49O65K487O04r16j426j635O88J977J123l88j810j314M55
3674a310J751J446l56j589j446K95J176J624k00j455j467k09J270J706M54j413
3690B77j439n28J321J701K94n30j847j075J227J716P64j088j473q23N43J391J210
3707A641p33j803j003P32J528J277o27j099j708M44J581J574n00j496j505J45
3723a552J478J445J8j589j482k79J277J834K67j127j781m42J268J603J031j361
$$ plain form
3607 -500 1625 1980 368 -1698 -2185 -594 1675 2283 605 -1374 -2027 -640 1316 1879 1042 -973 -2071
3624 -2071 -1503 880 1796 1142 -813 -1939 -1247 461 2307 1338 -423 -1819 -1414 428 1790 1850 106
3641 106 -1770 -1492 102 1815 1682 47 -1497 -2255 -415 1182 1876 311 -1599 -1828 -607 1530
3657 1530 2072 893 -971 -1820 -1155 1332 1936 1020 -406 -2041 -1353 624 1747 1359 -451 -1765 -1310
3674 -1310 441 1887 1531 -58 -1504 -1209 -33 1591 1391 -64 -1531 -1740 -470 1236 1690 277
3690 277 -1162 -1690 -369 1332 1626 1096 -751 -1826 -599 1117 1881 793 -680 -1503 -960 431 1641
3707 1641 908 -895 -1898 -1166 362 1639 1012 -87 -1795 -1351 230 1804 1304 -192 -1697 -1552
3723 -1552 -74 1371 1389 -200 -1682 -1961 -684 1150 1417 290 -1491 -1933 -665 938 1969 608
3739F08j678p40J009J426J229r99j277j079L22J694R99o33j312j133K02J380J430
3756A448k47j544j429PJ519J681J48j426j500j85J345J622L25j437j401m99J171
3773d02J830N72j183j666r29J321J654O88j079j750r18O85J770J102p96j643q84
3790a628K09J983R10k48j489j362O24J368J426j83j492j313p9J202J565pj353
3807A33j734l13J268J539K99j365j108q29J689J056O03n20j714o05Q96J556R48
3824A799o57j727o71P13J118J147n63j464j016N37R72J405m73j404j394L40J326
3841a2J194N5j176j539j08J385J323M09j084j414m01R53J589N45j315j237q3P36
3859a80J439P22r08j639j078P90J598Q45p64j629j021M29J659R45k28j564j129
$$ plain form
3739 608 -1070 -1810 -801 625 1854 855 -422 -1501 -1179 515 1514 881 -431 -1564 -1362 18 1448
3756 1448 1201 -343 -1772 -1765 -246 1435 1583 157 -1343 -1528 -183 1439 1764 327 -1074 -1573 -402
3773 -402 1428 2000 817 -849 -1778 -457 1197 1885 806 -944 -1862 -1177 593 1695 899 -744 -1628
3790 -1628 -1419 564 1474 1226 -263 -1625 -1001 367 1793 1610 118 -1195 -1274 -72 1493 1486 133
3807 133 -1601 -1914 -646 893 1192 -173 -1281 -2110 -421 635 1238 718 -996 -1601 -705 851 1799
3824 1799 1142 -585 -1256 -543 575 1722 1159 -305 -1321 -784 188 1593 1120 -284 -1678 -1338 -12
3841 -12 1182 1237 61 -1478 -1586 -201 1122 1531 447 -967 -1368 -415 1174 1719 404 -833 -916 -180
3859 -180 1259 1981 1073 -566 -1644 -854 744 1589 825 -804 -1825 -1396 263 1208 980 -584 -1713
3876a713M72J590R76N3j571q86l16J756J129J5j157j402j8R89J173J91r25j810
3894a454L4O76J401M75o06j217r77O02J447O36m70j219n96K28J594R98m89j584
3912e21r86M59J540R86l05j089j339K80R46J355k65j051j452m2J174J307j02p18
3930A77j423l14J268J018L23m29j479l65Q05J273O71n58j634k91N07J528L04l21
3948A060j504q22L11J310P66l46j335q52J48J504P07l0j078j322J94J207J394
3965A312o5j072j114k01R76J385K39j003j562j6P16J090O71r69j210k29M31J141
3983E20P75p71j292n31N80J089P36l71j248q19M48Q22J208l34j287o99J07J339
4001B72J054l7j183r03l13J057J206L29j428p09o12R67J320L75j046j182l50N56
$$ plain form
3876 -1713 -1241 349 1325 1378 -193 -1079 -1395 361 1490 1505 348 -1054 -1072 -83 1090 1281 356 -1454
3894 -1454 -1420 -744 657 1132 526 -691 -1668 -1066 381 1017 547 -672 -1268 -1040 554 1552 1063 -521
3912 -521 -1507 -1048 492 1478 1173 84 -1255 -975 -29 1326 1061 10 -1442 -1484 -310 997 895 177
3930 177 -1246 -1560 -292 726 1049 620 -859 -1224 -419 854 1525 967 -667 -958 -451 1077 1381 1060
3948 1060 -444 -1266 -955 355 1121 775 -560 -1412 -1264 240 947 917 -161 -1483 -1289 -82 1312
3965 1312 1247 175 -939 -1140 -164 1221 1460 457 -1105 -1121 -405 685 1356 387 -823 -1052 -621 520
3983 520 1295 524 -768 -1299 -719 370 1106 735 -513 -1332 -884 -62 1146 812 -475 -1174 -1067 272
4001 272 1326 1289 106 -797 -1110 -53 1153 1482 54 -655 -1267 -300 1020 1395 349 -833 -1183 -627
4019f27J068P01q18j223l92Q23R68O78m46j192m99K83J247N15Jj280n14j1Q65
4038A47J054l02q50j134K06Q76J121j9j222q82k45R46J328Op91j397k44R59J245
4057H02Ll19j203n92Q43J141N05n66j304l73O24J245N41m94j499o24L49J420M93
4076I92K7j225j139P7J029J234j0j110r96mR88J012J10r03p90l21R16J134J13
4095A134q43j049m00O73J271L74p63r16o09N74J003O20m16j034q64L85J099M22
4113F61K54j324p64K54J124P26P9j132j078R2J142J040Pj113o69l30P59J223J65
4132A116j110r46JO13R35J54l07j154o54P77J183N83o15j056m80O20P55R71q26
4151E60q10r77O75Q44Q87n59p87o00q6Q38O52K05j047j030K74Q42R13q0q81m56
$$ plain form
4019 -627 441 1142 324 -899 -1291 -468 500 1178 732 -460 -959 -676 571 1086 1087 -193 -707 -718 147
4038 147 1201 899 49 -1085 -879 -3 1118 1099 -123 -1005 -1250 -304 1024 1030 239 -1158 -1402 -443 802
4057 802 805 486 -717 -1309 -466 675 1180 614 -690 -1063 -439 806 1347 853 -646 -1270 -921 499 992
4076 992 1019 -206 -1345 -1268 -239 995 985 -125 -1121 -1125 -137 875 985 82 -708 -1029 -113 1021 1134
4095 1134 291 -758 -1158 -485 786 1160 397 -519 -1128 -554 449 1069 653 -381 -1245 -860 239 661
4113 661 915 -409 -1173 -919 205 931 1010 -122 -1200 -1108 34 1074 1081 -32 -701 -1031 -272 951 1116
4132 1116 6 -940 -939 -326 609 763 456 -698 -1352 -575 608 1191 576 -480 -960 -340 415 1386 560
4151 560 -250 -1227 -552 292 1179 620 -167 -767 -853 -15 637 842 -205 -1235 -961 -119 794 714 -167 -623
$$ [...]
8191b97
##END NTUPLES=NMR FID
##END=
