##TITLE=1H_IAMT-130
 CDCl3, 8 sc, 
 29.4.2019
##JCAMPDX= 6.0         $$ Bruker NMR JCAMP-DX V2.0
##DATA TYPE= NMR FID
##DATA CLASS= NTUPLES
##ORIGIN= UXNMR, Bruker Analytische Messtechnik GmbH
##OWNER= root
$$ XWIN-NMR		Version 3.5
$$ Mon Apr 29 16:06:09 2019 Russian Standard Time (UT+4h)  she@DPX200
##.OBSERVE FREQUENCY= 200.1315
##.OBSERVE NUCLEUS= ^1H
##.DELAY= (6, 6)
##.ACQUISITION MODE= SIMULTANEOUS
##.ACQUISITION SCHEME= undefined
##.AVERAGES= 8
##.DIGITISER RES= 18
##SPECTROMETER/DATA SYSTEM= spect
##.PULSE SEQUENCE= zg30
##.SOLVENT NAME= CDCl3
##.SHIFT REFERENCE= (INTERNAL, CDCl3, 0, 15.7039)
##AUDIT TRAIL= $$ (NUMBER, WHEN, WHO, WHERE, WHAT)
$$ ##TITLE= Audit trail, XWIN-NMR		Version 3.5
$$ ##JCAMPDX= 5.01
$$ ##ORIGIN= Bruker BioSpin GmbH
$$ ##OWNER= she
$$ F:/spectra/data/she/nmr/H-F/1/audita.txt
$$ ##AUDIT TRAIL=  $$ (NUMBER, WHEN, WHO, WHERE, WHAT)
(   1,<2019-04-29 16:04:56.09 +0400>,<she>,<DPX200>,
      <created by zg, POWCHK disabled, PULCHK disabled
       configuration hash MD5:
       00 E9 B6 7A A2 85 ED C7 34 08 36 98 17 FE 4E 26
       data hash MD5: 16K
       8B C7 D9 4C 53 01 B4 E3 98 B7 1A 95 1E 77 E8 FD>)
$$ ##END=
$$ 
$$ hash MD5
$$ 28 9C 60 97 E5 B0 C0 B0 EA 92 17 BC 04 09 65 EC
##$RELAX= 
##$RELAX= 
##$RELAX= 
##$RELAX= 
##$RELAX= 
##$RELAX= 
$$ Bruker specific parameters
$$ --------------------------
##$DU= <F:/spectra>
##$EXPNO= 1
##$NAME= <H-F>
##$PROCNO= 1
##$TYPE= <nmr>
##$USER= <she>
##$AMP= (0..31)
100 100 100 100 100 100 100 100 100 100 100 100 100 100 100 100 100 100 
100 100 100 100 100 100 100 100 100 100 100 100 100 100 
##$AQSEQ= 0
##$AQ_mod= 1
##$AUNM= <au_zg>
##$AUTOPOS= <>
##$BF1= 200.13
##$BF2= 200.13
##$BF3= 200.13
##$BF4= 200.13
##$BF5= 200.13
##$BF6= 200.13
##$BF7= 200.13
##$BF8= 200.13
##$BYTORDA= 1
##$CFDGTYP= 0
##$CFRGTYP= 5
##$CHEMSTR= <none>
##$CNST= (0..31)
1 1 145 1 1 1 1 1 1 1 1 1 1 1 1 1 1 1 1 1 1 1 1 1 1 1 1 1 1 1 1 1 
##$CPDPRG= <>
##$CPDPRG1= <>
##$CPDPRG2= <>
##$CPDPRG3= <>
##$CPDPRG4= <mlev>
##$CPDPRG5= <mlev>
##$CPDPRG6= <mlev>
##$CPDPRG7= <mlev>
##$CPDPRG8= <mlev>
##$CPDPRGB= <>
##$CPDPRGT= <>
##$D= (0..31)
0 1.2 0 0 0 0 0 0 0 0 0 0.03 0 0 0 0 0 0 0 0 0 0 0 0 0 0 0 0 0 0 0 0 
##$DATE= 1556539495
##$DBL= (0..7)
120 120 120 120 120 120 120 120 
##$DBP= (0..7)
150 150 150 150 150 150 150 150 
##$DBP07= 0
##$DBPNAM0= <>
##$DBPNAM1= <>
##$DBPNAM2= <>
##$DBPNAM3= <>
##$DBPNAM4= <>
##$DBPNAM5= <>
##$DBPNAM6= <>
##$DBPNAM7= <>
##$DBPOAL= (0..7)
0.5 0.5 0.5 0.5 0.5 0.5 0.5 0.5 
##$DBPOFFS= (0..7)
0 0 0 0 0 0 0 0 
##$DE= 6
##$DECBNUC= <off>
##$DECIM= 24
##$DECNUC= <off>
##$DECSTAT= 4
##$DIGMOD= 1
##$DIGTYP= 9
##$DL= (0..7)
0 120 120 120 120 120 120 120 
##$DP= (0..7)
150 150 150 150 150 150 150 150 
##$DP07= 0
##$DPNAME0= <>
##$DPNAME1= <>
##$DPNAME2= <>
##$DPNAME3= <>
##$DPNAME4= <>
##$DPNAME5= <>
##$DPNAME6= <>
##$DPNAME7= <>
##$DPOAL= (0..7)
0.5 0.5 0.5 0.5 0.5 0.5 0.5 0.5 
##$DPOFFS= (0..7)
0 0 0 0 0 0 0 0 
##$DQDMODE= 0
##$DR= 18
##$DS= 0
##$DSLIST= <SSSSSSSSSSSSSSS>
##$DSPFIRM= 0
$$ [...]
##$SUBNAM2= <"">
##$SUBNAM3= <"">
##$SUBNAM4= <"">
##$SUBNAM5= <"">
##$SUBNAM6= <"">
##$SUBNAM7= <"">
##$SUBNAM8= <"">
##$SUBNAM9= <"">
##$SW= 24.9337058887773
##$SWIBOX= (0..15)
0 0 2 0 0 0 0 0 0 0 0 0 0 0 0 0 
##$SW_h= 4990.01996007984
##$TD= 16384
##$TD0= 1
##$TE= 0
##$TE2= 300
##$TE3= 300
##$TEG= 300
##$TL= (0..7)
0 120 120 120 120 120 120 120 
##$TP= (0..7)
150 150 150 150 150 150 150 150 
##$TP07= 0
##$TPNAME0= <>
##$TPNAME1= <>
##$TPNAME2= <>
##$TPNAME3= <>
##$TPNAME4= <>
##$TPNAME5= <>
##$TPNAME6= <>
##$TPNAME7= <>
##$TPOAL= (0..7)
0.5 0.5 0.5 0.5 0.5 0.5 0.5 0.5 
##$TPOFFS= (0..7)
0 0 0 0 0 0 0 0 
##$TUNHIN= 0
##$TUNHOUT= 0
##$TUNXOUT= 0
##$USERA1= <user>
##$USERA2= <user>
##$USERA3= <user>
##$USERA4= <user>
##$USERA5= <user>
##$V9= 5
##$VALIST= <valist>
##$VCLIST= <CCCCCCCCCCCCCCC>
##$VD= 0
##$VDLIST= <DDDDDDDDDDDDDDD>
##$VPLIST= <PPPPPPPPPPPPPPP>
##$VTLIST= <TTTTTTTTTTTTTTT>
##$WBST= 1024
##$WBSW= 4
##$XGAIN= (0..3)
0 0 0 0 
##$XL= 0
##$YL= 0
##$YMAX_a= 813790
##$YMIN_a= -434740
##$ZGOPTNS= <>
##$ZL1= 120
##$ZL2= 120
##$ZL3= 120
##$ZL4= 120
##$ABSF1= 10
##$ABSF2= 0
##$ABSG= 5
##$ABSL= 3
##$ALPHA= 0
##$AQORDER= 0
##$ASSFAC= 0
##$ASSFACI= 0
##$ASSFACX= 0
##$ASSWID= 0
##$AUNMP= <proc_1d>
##$AZFE= 0.1
##$AZFW= 0.1
##$BCFW= 1
##$BC_mod= 2
##$BYTORDP= 1
##$COROFFS= 0
##$CY= 11.3945322036743
##$DATMOD= 1
##$DC= 2
##$DFILT= <>
##$DTYPP= 0
##$F1P= 18.9103706918063
##$F2P= -1.10871071338519
##$FCOR= 0.5
##$FTSIZE= 0
##$FT_mod= 4
##$GAMMA= 1
##$GB= 0.15
##$INTBC= 1
##$INTSCL= 1
##$ISEN= 128
##$LB= 0.24
##$LEV0= 0
##$LPBIN= 0
##$MAXI= 10000
##$MC2= 0
##$MEAN= 0
##$ME_mod= 0
##$MI= 1.114404
##$NCOEF= 0
##$NC_proc= 0
##$NLEV= 6
##$NOISF1= 3.799351
##$NOISF2= 2.8
##$NSP= 1
##$NTH_PI= 0
##$NZP= 0
##$OFFSET= 15.70392
##$PC= 1
##$PHC0= -8862.648
##$PHC1= 31.80026
##$PH_mod= 1
##$PKNL= yes
##$PPARMOD= 0
##$PSCAL= 0
##$PSIGN= 0
##$REVERSE= no
##$SF= 200.130013532006
##$SI= 16384
##$SIGF1= 3
##$SIGF2= 2
##$SINO= 400
##$SIOLD= 16384
##$SREGLST= <1H.CDCl3>
##$SSB= 0
##$STSI= 0
##$STSR= 0
##$SW_p= 3612.71676300578
##$SYMM= 0
##$S_DEV= 0
##$TDeff= 0
##$TDoff= 0
##$TI= <>
##$TILT= no
##$TM1= 0
##$TM2= 0
##$TOPLEV= 0
##$USERP1= <user>
##$USERP2= <user>
##$USERP3= <user>
##$USERP4= <user>
##$USERP5= <user>
##$WDW= 1
##$XDIM= 8192
##$YMAX_p= 0
##$YMIN_p= 0
$$ End of Bruker specific parameters
$$ ---------------------------------
##NTUPLES= NMR FID
##VAR_NAME=  TIME,          FID/REAL,        FID/IMAG
##SYMBOL=    X,             R,               I
##VAR_TYPE=  INDEPENDENT,   DEPENDENT,       DEPENDENT
##VAR_FORM=  AFFN,          ASDF,            ASDF
##VAR_DIM=   8192,          8192,            8192
##UNITS=     SECONDS,       ARBITRARY UNITS, ARBITRARY UNITS
##FACTOR=    0.0002004,     1,               1
##FIRST=     0,             0,               0
##LAST=      1.6414764,     0,               0
##MIN=       0,             -434740,         0
##MAX=       1.6414764,     813790,          0
$$ Real data points
##PAGE= N=1
##DATA TABLE= (X++(R..R)), XYDATA
0 0 0 0 0 -8 8 -8 16 -12 24 -24 32 -38 49 -57 73 -86 105 -123 148 -171 203 -236 275 -314 363 -415 476
27 476 -539 612 -690 778 -874 979 -1096 1224 -1364 1518 -1686 1869 -2073 2294 -2542 2811
43 2811 -3116 3451 -3829 4255 -4741 5297 -5946 6712 -7633 8764 -10194 12063 -14641
56 -14641 18420 -24550 36220 -66705 323287 813790 692716 747949 696334 709328 658876
67 658876 664526 628933 617980 571569 559064 525384 505686 461953 439570 406093 381875 340536
79 340536 312671 279755 254858 217018 187743 157536 134457 102172 73831 45495 25020 -1491
91 -1491 -26634 -49862 -66188 -85958 -106949 -126618 -139095 -152954 -167756 -182746 -190900 -197811 -206525
104 -206525 -216278 -220412 -222032 -225317 -229590 -230042 -226800 -223207 -222753 -220164 -213678 -206697 -201753 -196975 -188695
119 -188695 -178001 -169579 -163831 -155783 -144833 -134997 -129897 -123514 -111709 -101785 -97009 -92972 -84451 -75680
133 -75680 -72812 -71628 -65483 -58327 -56599 -58419 -56334 -51783 -52078 -56403 -57891 -55082 -56279 -61992 -66114
148 -66114 -66650 -69202 -76313 -83747 -86559 -88862 -96103 -104737 -110090 -113632 -120895 -130722 -137646 -141555 -147379
163 -147379 -157014 -164342 -167894 -172936 -181105 -188718 -191736 -194079 -199935 -205417 -206848 -207258 -210143 -213911 -213411
178 -213411 -211203 -210298 -210171 -208011 -203007 -199351 -196602 -192410 -186091 -178950 -172981 -167283 -159610 -150871 -143419
193 -143419 -137158 -129657 -120662 -111819 -104897 -97981 -88864 -80064 -73761 -68753 -61557 -53421 -47100 -43348 -37862
208 -37862 -30169 -25993 -24365 -21592 -16520 -12964 -12669 -11854 -8885 -7104 -8386 -11128 -11187 -10623 -13778 -17954
224 -17954 -20441 -21752 -25927 -32905 -37635 -40819 -45636 -53241 -59882 -63837 -68520 -76426 -84288 -89237 -93657
239 -93657 -100816 -108412 -113043 -115706 -121065 -127799 -131895 -133201 -136902 -141174 -143408 -142519 -143138 -145135 -145935 -144203
255 -144203 -141794 -141087 -139571 -135174 -130655 -127188 -123863 -117969 -111628 -106183 -100080 -93441 -84849 -76751 -69269
270 -69269 -61506 -52354 -42603 -34098 -25095 -14830 -3913 6207 15145 24750 35913 46312 55271 64610
284 64610 75369 85650 94449 102291 111299 119949 127288 133576 140645 148017 154108 157938 161964 166653
298 166653 170021 171415 172756 175226 176830 176032 174496 173925 172810 169997 165743 162581 160379 156109 149564
313 149564 144594 140280 134478 126437 119602 114242 108035 99605 92001 85444 78949 70559 61454 55401 49226
328 49226 41421 33744 27348 21825 15060 7089 1090 -2459 -7693 -13705 -18007 -20971 -24569 -28864 -32305
343 -32305 -33678 -35233 -37155 -38205 -38851 -38504 -38729 -38855 -37933 -35829 -33909 -32473 -29926 -26853 -23899 -20702
359 -20702 -17982 -14719 -10194 -6188 -2402 1884 6551 10495 14067 17619 22207 26936 30656 34335 38788
374 38788 42324 45703 47864 50829 54309 56560 58489 60507 63172 64642 64751 64672 65444 66112 65456 64301
390 64301 63920 63281 61307 58405 56586 54880 52406 48311 45434 43236 39772 35187 30906 27850 24159
405 24159 19572 15037 11758 8696 3962 -603 -4067 -7068 -10871 -14895 -17434 -19894 -23346 -26540 -29135
420 -29135 -31395 -33366 -35957 -37454 -38319 -39384 -40456 -41729 -42051 -41799 -42066 -42086 -40811 -39606 -38479 -37513 -35840
437 -35840 -33345 -31378 -29651 -27153 -23898 -20676 -17854 -14884 -11464 -8522 -4911 -1860 1885 5260 9029
452 9029 11947 15318 18381 21324 24283 26691 29580 32285 35162 36275 38137 39812 41318 41912 42972
467 42972 44529 45147 45098 44477 44803 44325 43542 42349 41676 41253 39501 37605 36158 34182 31570 28651 26032
484 26032 24309 21646 18367 15157 12636 9527 5618 2299 -73 -3004 -6456 -9981 -12540 -14966 -18518
499 -18518 -21596 -23469 -25586 -27569 -30043 -31273 -32488 -33684 -35455 -36176 -36169 -36700 -37173 -36650 -35702 -35228 -34802
516 -34802 -34185 -33114 -31702 -30399 -28966 -27055 -25164 -23754 -22253 -20488 -18571 -16594 -14571 -12507 -10285
531 -10285 -8485 -6595 -4773 -2552 -575 1430 3273 5293 7152 8932 10125 11672 13150 15081 16430
546 16430 17066 18756 19822 20568 20687 21105 21544 21673 21078 21330 20933 20237 19349 17664 16380 15551 13939 11918
564 11918 10714 9525 6981 4403 2679 1066 -1088 -3657 -5475 -7122 -8859 -11414 -13269 -15180 -17018
579 -17018 -18956 -20914 -22353 -23342 -25367 -27045 -28061 -29026 -30814 -32023 -32362 -32743 -33695 -34696 -35109 -35273 -35471
596 -35471 -36330 -35935 -35472 -34747 -34576 -33972 -33284 -32358 -31951 -30686 -29321 -27635 -26393 -24791 -23279 -21964 -19880
613 -19880 -18025 -16212 -14693 -12742 -11266 -9531 -7852 -6863 -5374 -4317 -3275 -2009 -1109 -125 226 659
629 659 1062 1155 1230 1399 1676 1927 1457 945 940 1207 407 -36 -180 -320 -627 -1338 -1520 -2106 -2583 -3099 -3788 -3736
651 -3736 -4841 -4953 -5510 -5719 -7051 -8009 -8094 -8577 -9223 -10224 -10540 -11003 -12021 -12894 -13540 -13669 -13939 -14765 -14648
670 -14648 -14814 -14920 -14943 -15097 -15262 -14631 -14489 -14121 -12855 -12358 -11754 -11100 -10220 -9172 -7827 -6958 -5662 -4408
688 -4408 -3418 -2426 -1139 360 1300 2436 3685 4894 6162 7267 8316 9131 10698 11567 12632 13900
704 13900 14921 15923 16964 17812 18472 19421 20248 21183 21768 22468 23409 23527 23728 24012 24474 24719 24518 24176 24560
723 24560 24057 23396 22361 22254 21550 20570 19857 18865 18005 16902 15272 14107 13294 11875 11024 9987 9122 8116
741 8116 6413 5974 5052 4114 3201 2595 2291 2015 1139 628 357 -316 -514 -701 -965 -1108 -1249 -1553 -1949 -1865
761 -1865 -2373 -2332 -2597 -2207 -2371 -2389 -2465 -2297 -2464 -2370 -2163 -1916 -1254 -1272 -686 -141 111 698 1491 2095 2912 3541
783 3541 4172 4700 5466 6141 6813 7309 8266 8987 9659 10426 10585 11043 11513 11751 11773 12210 12601 12848 13060 12927
803 12927 12669 12690 12612 12214 12407 12343 12134 11709 11441 11373 10624 10074 10330 9800 9187 8818 8189 7545 7151 6604 5864
824 5864 5351 4404 3837 3114 2652 1761 721 91 -285 -760 -1522 -2077 -2266 -2754 -3640 -3951 -4322 -4082 -4304 -4301
844 -4301 -4074 -4181 -4174 -3713 -3469 -3134 -2567 -2315 -1598 -1019 -231 365 768 1714 2080 2781 3663 4364 4941 5486 6017
865 6017 6265 7101 7446 8209 8887 9325 9777 10070 10744 11003 11282 11585 12028 12351 12856 13229 13494 13481 13415 14041 13930
886 13930 13803 14063 14066 14430 13785 13501 13684 13347 12619 12762 12170 11780 11303 10792 9851 9790 9055 8268 7776 7078 6405
907 6405 5669 5053 4420 3788 3058 2694 2406 1475 1200 252 -280 -453 -1021 -1356 -1419 -1755 -2166 -2220 -2279 -2555 -3165
928 -3165 -3233 -3303 -3198 -3070 -3339 -3244 -3233 -3096 -3341 -3296 -2885 -2811 -2621 -2362 -2152 -1889 -1802 -1366 -1316 -1027 -584 -439 -234
951 -234 -321 -335 -109 116 503 404 801 874 799 559 296 163 42 -263 -173 -854 -975 -1696 -2142 -2318 -3385 -3859
973 -3859 -4412 -4733 -5277 -6048 -6580 -7331 -8545 -8875 -9536 -10255 -10673 -11842 -12441 -13273 -14318 -15352 -15246 -16345
991 -16345 -16850 -17196 -18269 -18637 -19680 -20439 -21061 -21455 -21839 -22698 -22793 -23147 -23773 -24592 -24791 -24598 -25446 -25483 -25785 -25760
1011 -25760 -26120 -26131 -26543 -26453 -26350 -26280 -26077 -25993 -25656 -25895 -25544 -25647 -25269 -25183 -24851 -24569 -24234 -24137 -23827 -23394 -23064
1032 -23064 -22878 -22434 -21913 -21472 -21318 -21120 -20875 -20428 -20122 -19972 -19504 -19092 -18966 -18252 -18075 -17866 -18184 -17535 -17067
1051 -17067 -17217 -16851 -16696 -16177 -15651 -15842 -15747 -15122 -14828 -14368 -14110 -13758 -13522 -13443 -13085 -12535 -12534 -12238 -11458 -11241 -10915
1072 -10915 -10367 -10024 -9575 -9179 -8648 -7843 -7831 -7088 -6502 -6227 -5586 -5441 -4981 -4264 -3927 -3100 -2546 -2162 -1754 -1252
1092 -1252 -694 -453 553 943 1649 2240 2672 3412 3785 4004 5064 5714 6021 6794 7602 8135 8779 9148 9656
1111 9656 10620 11289 11647 12198 13160 13417 14006 14516 14891 15366 15868 16294 16857 17354 17950 18052 18386 18252 18863 19365
1131 19365 19859 20238 20185 20489 20575 20679 20989 21355 21371 22092 21712 22201 22200 22204 22285 22361 22448 22631 22478 22449 22546 22634 22179 22110
1155 22110 22313 22220 22103 22225 22080 21936 21482 21499 21198 21441 21182 21021 21044 21413 20956 20552 20679 20674 20664 20824 20789 20613
1177 20613 20448 20055 20186 20145 19911 19905 19715 19724 19558 19105 18802 18916 18527 18748 18115 17844 17355 17273 16915 17044 16638
1198 16638 15768 16160 16301 15821 15833 15630 15061 14940 14887 14688 14553 14363 14394 14132 13963 13505 13231 12699 13184 12521
1218 12521 12459 12238 11773 11522 11055 10527 10030 9847 9120 8886 8531 7763 7258 6641 6058 5573 4848 4396 3946 3722
1238 3722 2612 2429 1949 1611 808 490 -41 -557 -819 -1639 -2274 -2585 -3075 -3367 -3995 -4195 -4391 -4717 -5350
1257 -5350 -5447 -5968 -6426 -6727 -6775 -6897 -7499 -7827 -7926 -8104 -8154 -8018 -8385 -8103 -8210 -8282 -8191 -8100 -8040 -8056 -8083 -7555 -7355
1280 -7355 -7291 -6962 -6831 -7024 -7126 -6646 -7007 -6365 -6371 -6186 -6323 -6214 -6238 -6159 -5993 -6027 -6044 -5322 -5619 -5676 -5796 -5449
1302 -5449 -5641 -5724 -5253 -5078 -5000 -5046 -4771 -4937 -4571 -4541 -4907 -4140 -3942 -4052 -4145 -3971 -4355 -4229 -4471 -4381 -4080 -4046
1324 -4046 -4300 -3932 -4206 -4570 -4551 -4494 -4675 -4729 -4506 -4738 -4714 -4957 -5159 -4844 -4737 -4718 -5045 -4363 -4422 -4428 -4317 -4291 -4195
1347 -4195 -4034 -3786 -3495 -3168 -3274 -2811 -3253 -2894 -2631 -2795 -2610 -2172 -2306 -2454 -2349 -2337 -2094 -2182 -2085 -2246 -1776
1368 -1776 -1916 -2272 -1990 -2022 -2091 -1948 -2096 -2040 -2241 -2116 -2656 -2558 -2828 -3226 -2852 -3379 -3415 -3646 -3909 -4510 -4718
1389 -4718 -4943 -5297 -5612 -5950 -6178 -6576 -6850 -7103 -7731 -8140 -8471 -8780 -8988 -9407 -9879 -10051 -10151 -10582 -10769 -11678
1409 -11678 -11270 -11472 -11450 -11576 -12053 -12537 -12485 -12526 -13132 -12878 -13207 -13302 -13458 -13783 -14050 -14405 -14112 -14372 -14297 -14513 -14280
1430 -14280 -14814 -14748 -14838 -15542 -15445 -15465 -15458 -15100 -15262 -15103 -15305 -15367 -15119 -15148 -15290 -15010 -14830 -14968 -14979 -15081 -14984 -15115 -14560
1453 -14560 -14536 -14756 -14648 -14263 -14354 -14271 -13946 -13932 -13819 -14048 -13791 -13847 -13162 -13269 -13699 -13293 -12825 -12974 -12746 -12343 -12366
1474 -12366 -12272 -11917 -12025 -11454 -11340 -11291 -10842 -10780 -10610 -10301 -9855 -9495 -9344 -8851 -8462 -8067 -7508 -7576 -7303 -6970 -6549
1495 -6549 -6295 -5577 -5237 -4978 -4360 -4013 -3892 -3150 -2952 -2305 -2238 -1379 -1127 -593 184 481 827 1419 1685 2157
1515 2157 3007 3376 3682 4059 4823 4978 5336 6377 6704 6893 7448 7785 8075 8579 9164 9530 10240 10670 11075
1534 11075 11489 11779 12257 12789 12940 13648 14063 14682 14929 14978 15625 16118 16477 17027 17305 17653 18591 18644 19061 19597
1554 19597 19644 20249 20192 20608 21322 21386 22098 22254 22437 22682 22886 23225 23555 23780 24201 24418 24414 24765 24776 24798 25301 25725
1576 25725 25546 25505 25803 25785 26164 25818 25985 26012 26236 26078 26176 26122 25834 26214 25377 25680 25523 25566 25403 25240 25201 24925
1598 24925 24637 24654 24759 24413 23706 23510 23479 23237 23103 22443 22168 22015 21614 21291 21203 20429 20400 19679 19453 19361 18913
1619 18913 18884 18322 17800 17394 16909 16421 15983 15641 14932 14717 14278 13674 13407 12712 12132 11546 11500 10623 10164 9712
1639 9712 9194 8392 7781 7140 6714 6439 5632 4961 4288 3591 3140 2643 1605 1058 574 -176 -475 -1227 -1869
1658 -1869 -2410 -3290 -4060 -4209 -5049 -5409 -6030 -6723 -7276 -7951 -8986 -9322 -9817 -10192 -10688 -11270 -11893 -12219 -12338
1677 -12338 -13253 -13655 -14128 -14374 -14932 -15500 -15705 -16261 -16751 -16800 -16722 -17407 -17428 -17579 -18028 -18302 -18755 -19203 -19201 -19425 -19723
1698 -19723 -19635 -19686 -19889 -20083 -20480 -20750 -20330 -20828 -20722 -20819 -20915 -20923 -21407 -21210 -21414 -21330 -21583 -21203 -21670 -21397 -21624 -21657
1720 -21657 -21505 -21620 -21384 -21258 -21408 -21379 -21350 -21309 -21073 -21232 -21132 -21297 -21136 -20793 -20913 -20817 -20554 -20728 -20626 -20662 -20397
1741 -20397 -20235 -19828 -19895 -19545 -19426 -19240 -19183 -18973 -18547 -18579 -17964 -18160 -17896 -17852 -17158 -17082 -16561 -16122 -15928 -15571 -15315
1762 -15315 -14923 -14453 -14061 -13459 -13021 -12891 -12170 -11695 -11566 -10708 -10835 -10667 -9913 -9162 -8832 -8256 -7658 -7448 -6995
1781 -6995 -6554 -6180 -5912 -5240 -4703 -4405 -3700 -3878 -3541 -2692 -2361 -1693 -1535 -1125 -885 -475 -327 375 717 892
1801 892 1640 2050 1862 2203 2631 2991 3382 3868 4147 4380 4591 5179 5289 5658 5997 6192 6944 6773 7061 7691
1821 7691 8013 8007 8530 8689 8965 9218 9854 9959 10677 10477 10853 11338 11318 11760 11964 12182 12350 12621 12695 13103 13160
1842 13160 13297 13380 13952 13792 14090 14461 14087 14578 14400 14653 14938 14957 14768 15244 15230 15471 15380 14845 15268 14987 15054
1863 15054 14995 14988 15038 15202 14688 14389 14380 14588 14191 14287 13946 13994 13718 13617 13319 13197 13074 12879 12855 12163 12758 12089
1885 12089 11942 11668 11333 11297 10977 10936 10691 10221 10295 9950 9854 9370 9182 9118 8874 8669 8306 8072 8114 7727 7612
1906 7612 7424 7238 6693 6522 6424 6069 5874 5693 5513 5217 5115 5121 4689 4205 4419 3870 3672 3333 3628 3189 3003
1927 3003 2987 2377 2231 1936 1403 1673 1357 1067 815 678 338 269 -448 -380 -613 -1048 -960 -1253 -1652 -1836 -1770
1948 -1770 -2087 -2159 -2524 -2345 -2686 -3102 -2850 -3425 -3380 -3252 -3712 -3395 -3552 -3693 -4295 -3987 -3956 -4402 -4480 -4270 -4650
1969 -4650 -4272 -4373 -4609 -4704 -4768 -4959 -4994 -4818 -5052 -5141 -5062 -4854 -5102 -5225 -5099 -5199 -5004 -4898 -5186 -5020 -5008 -5386
1991 -5386 -5039 -4866 -5027 -4619 -5224 -5024 -4905 -4965 -5059 -5221 -4969 -5137 -5184 -5097 -4969 -5085 -5075 -5234 -5230 -5306 -5386 -5279 -5089
2014 -5089 -5291 -5322 -5511 -5247 -5319 -5318 -5050 -5042 -5134 -4859 -5180 -5001 -5079 -4988 -4515 -4327 -4667 -4442 -4390 -4257 -4724 -4390 -4145
2037 -4145 -3905 -4222 -3858 -3686 -3903 -3681 -3629 -3431 -3453 -3552 -3362 -3131 -2832 -2615 -3033 -2599 -2728 -2506 -2349 -2044 -2180
2058 -2180 -1960 -2093 -1860 -1772 -1605 -1627 -1495 -1776 -1017 -1216 -1352 -1326 -1219 -962 -1128 -854 -1036 -1078 -1209 -1342 -1086
2079 -1086 -866 -979 -1124 -974 -842 -860 -971 -940 -812 -1200 -644 -524 -765 -634 -587 -264 -752 -570 -470 -623 -73
2100 -73 -284 -284 -231 -114 -10 -123 253 -339 66 116 -131 82 103 100 94 358 452 374 239 314 232 418 554 251 261
2125 261 524 229 523 372 376 265 362 369 346 408 399 595 343 74 104 240 175 -134 -147 -49 -178 -469 -513 -393 -720
2150 -720 -437 -405 -669 -543 -947 -778 -935 -881 -1153 -1110 -981 -1345 -1210 -1181 -1475 -1367 -1215 -1422 -1445 -845 -1352 -1409
2172 -1409 -1354 -1344 -1451 -1261 -1333 -1127 -959 -915 -1338 -1091 -1258 -971 -1223 -888 -722 -842 -811 -901 -630 -767 -344 -679
2194 -679 -367 -450 -70 -8 -227 -106 -262 -38 -218 118 113 133 164 227 231 400 140 500 612 195 557 339 317
2217 317 203 480 485 511 640 592 318 699 491 289 575 567 976 572 775 703 665 649 802 823 849 1263 1063 1527
2241 1527 1221 1186 1418 1238 1381 1661 1597 1561 2030 2016 1659 2157 2089 1963 2281 2082 2004 2209 2364 2118 2067 2423
2263 2423 2597 2461 2439 2626 2597 2396 2295 2585 2528 2316 2723 2706 2685 2341 2408 2280 2355 2464 2390 2348 2182 1963 2123
2286 2123 1908 2224 2020 1891 1839 1639 1774 1761 1573 1297 1096 1566 1429 1436 1306 1194 1160 1297 1087 1415 1158
2307 1158 1403 1094 1079 1130 1027 1035 1126 741 999 884 940 1520 955 891 987 977 1037 1336 981 1131 683 1148 1273
2330 1273 733 1479 1224 968 1141 1070 868 600 926 838 1085 981 808 908 843 670 836 934 1010 513 840
2351 840 991 980 947 362 671 829 685 671 800 628 739 730 833 617 636 925 611 737 585 663 551 767
2373 767 724 817 643 876 666 806 1032 448 859 856 883 616 1119 1054 1331 1126 1056 1213 1402 1117 1189 1308 1392
2396 1392 1421 1243 1402 990 1389 1108 1127 1239 1294 1618 1698 1302 1624 1458 1710 1823 1972 1737 1734 1821 1587 1808
2418 1808 1748 1855 1727 1619 1676 2026 1909 1545 1559 1385 1382 1539 1150 1142 1658 1586 1429 1013 1098 1070 1166 1232 1118 903
2442 903 922 581 1244 1099 763 1066 1125 1173 1178 876 1185 1363 1330 1134 1297 1324 1332 1302 1277 1435 1259 1384 1182 1512
2466 1512 1305 1519 1196 1038 1077 1239 773 902 1019 845 607 646 576 758 594 405 636 416 45 94 152
2487 152 -20 -208 -106 53 194 -573 -424 -554 -629 -714 -914 -851 -1205 -1122 -1468 -1513 -1595 -1826 -2137 -1883 -1903 -2241
2509 -2241 -2245 -2158 -2120 -2517 -2457 -2458 -2713 -2711 -2930 -2653 -2667 -2917 -2800 -2952 -3240 -3008 -3359 -3375 -3569 -3597 -3663 -4048 -3929 -4209
2533 -4209 -4080 -4302 -4353 -4758 -4618 -5005 -5171 -4821 -4980 -5145 -5264 -5528 -5575 -5279 -5612 -5284 -5517 -5581 -5695 -5854 -5530
2554 -5530 -5702 -5953 -5909 -6104 -5781 -5910 -6181 -6208 -5759 -5921 -6429 -6546 -6390 -6403 -6496 -6618 -6719 -6876 -6718 -6743 -6994
2575 -6994 -6720 -7033 -6636 -6532 -6627 -6674 -6658 -6560 -6502 -6451 -6301 -6403 -6005 -6134 -6014 -6074 -5626 -5449 -5701 -5436 -5381 -5178
2597 -5178 -5032 -5036 -4998 -4778 -5093 -4709 -4276 -4367 -4250 -4072 -3690 -3982 -3850 -3481 -3701 -3306 -3051 -2872 -3039 -2610 -2615 -2368
2619 -2368 -2151 -2277 -1959 -1702 -1545 -1202 -1322 -1020 -882 -1300 -699 -714 -451 -131 -240 -221 96 319 323 400 395 459
2641 459 914 990 980 869 1376 1354 1487 1915 1945 1813 2444 2329 2658 2556 2881 3149 3482 3618 3779 3860 3684 4227
2663 4227 4212 4458 4254 4785 4754 4722 5099 5004 4955 5214 5281 5437 5448 5596 5949 5420 5887 5703 5855 6025 6408 5965
2685 5965 6355 6418 6422 6715 6580 6622 6725 6918 6737 6733 6977 6841 6940 6962 6868 6771 7020 6743 6704 6454 6926 6811 6903 6693
2709 6693 6366 6827 6501 6767 6298 6527 6591 6480 6406 6412 6086 6461 6365 6710 6245 6303 6332 6112 6186 6478 6097 6075 6030
2732 6030 6289 6103 5828 5833 5776 5645 5381 5428 5382 5404 5184 5206 5178 4909 4670 4510 4234 4080 4197 4309 3922 4352
2754 4352 3965 3636 3727 3774 3179 3153 3055 3244 2750 2816 3114 2514 2738 2476 2184 1860 1721 1516 1313 1425 1283
2775 1283 891 631 403 652 273 83 89 165 -237 -448 -364 -604 -604 -755 -910 -1141 -1012 -1208 -1412 -1549 -1521 -1666
2797 -1666 -1755 -1857 -2126 -2134 -2058 -2167 -2360 -2620 -2568 -2556 -3002 -2918 -2850 -3077 -3200 -3046 -3368 -3520 -3553 -3554 -3594 -3545 -3444 -3615
2821 -3615 -3456 -3748 -4024 -3764 -4071 -3812 -3915 -4135 -4168 -3915 -3995 -4193 -4057 -4182 -4147 -4351 -4317 -4916 -4433 -4445 -4252
2842 -4252 -4457 -4346 -4671 -4376 -4608 -4419 -4623 -4563 -4588 -4679 -4344 -4576 -4395 -4568 -4261 -4060 -3970 -4141 -4182 -3964 -4150
2863 -4150 -4145 -3891 -3719 -3791 -3692 -3653 -4001 -3676 -3295 -3280 -3104 -3239 -2868 -2955 -3198 -2499 -2903 -2586 -2281 -2525 -2202 -2418
2885 -2418 -2244 -2023 -2096 -2054 -1677 -1720 -1655 -1519 -1603 -1654 -1814 -1883 -1469 -1621 -1449 -1467 -1465 -1218 -1302 -1009 -1185 -893 -1209
2908 -1209 -879 -988 -1117 -679 -1020 -993 -1019 -711 -635 -789 -632 -608 -745 -542 -321 -635 -394 -410 -375 -267 -307 -115
2930 -115 -340 -68 -144 275 -194 20 392 84 90 47 115 149 263 150 -100 508 53 311 141 330 534 447
2952 447 257 253 425 490 241 468 306 353 576 475 795 618 617 642 705 472 462 561 705 510 530 600 902 579
2976 579 602 593 757 545 468 828 605 375 341 389 472 503 440 65 458 456 151 -27 258 371 314 -81 99 -206
3000 -206 296 71 -103 234 54 198 155 117 331 156 315 259 248 448 468 427 706 600 339 484 485 625 600
3023 600 458 720 423 304 754 287 188 330 501 507 521 461 352 342 431 176 422 323 149 233 229 230 65 76 171
3048 171 33 582 25 78 243 18 143 29 469 120 287 -79 194 130 136 203 242 331 586 444 434 656 205
3071 205 335 458 395 474 351 860 820 944 576 868 925 1003 996 745 1003 997 790 944 1174 983 1453 1211 1306
3094 1306 1006 1363 755 896 1115 790 788 1303 1354 1418 1054 1340 1279 1447 1488 1250 1820 1704 1608 1695 1555 1597 1976
3117 1976 1922 1782 1706 2074 2069 2051 1847 2085 2195 1913 1950 2080 1662 2062 2359 2019 2044 2023 1859 2001 1648 1864
3139 1864 1920 1683 1791 1725 2036 1637 2010 2035 1844 1902 1906 2252 1761 2324 1631 2093 1955 2126 2159 1947 1923 2053
3161 2053 1999 2125 1972 1771 1888 1534 1793 1797 1297 1519 1558 1393 1479 1024 1225 1525 1352 1303 1073 1299 1247 1052
3183 1052 999 689 766 821 885 164 508 105 90 -29 256 -317 -298 -727 -403 -194 -732 -724 -892 -1146 -1040 -833
3205 -833 -1089 -1203 -946 -1245 -1370 -1083 -1534 -1288 -1116 -1349 -1292 -1068 -1316 -898 -1141 -1210 -1538 -1696 -1423 -1474 -1720
3226 -1720 -1677 -1630 -1913 -2082 -1947 -2009 -2038 -2006 -1843 -2484 -2420 -2190 -2665 -2413 -2835 -2609 -2672 -2570 -2758 -2913 -2576 -2562
3248 -2562 -2723 -2752 -2775 -2591 -2785 -2545 -2686 -2802 -2725 -2843 -2832 -2742 -2566 -2934 -2624 -2934 -2946 -2919 -2799 -3055 -2960 -3123
3270 -3123 -2919 -3156 -3077 -3100 -2829 -3074 -2890 -3182 -2762 -2745 -2710 -2866 -3129 -2702 -2401 -2583 -2756 -2585 -2513 -2651 -2370
3291 -2370 -2486 -2225 -2284 -2373 -2264 -2315 -2043 -2322 -2527 -2565 -2167 -2020 -2105 -2172 -1766 -2156 -2074 -1986 -1855 -1958 -1801 -1960
3313 -1960 -1907 -1760 -1263 -1731 -1745 -1281 -1208 -1407 -1275 -1122 -1056 -1319 -1045 -1005 -1062 -758 -734 -920 -1056 -850 -664 -743
3335 -743 -917 -976 -877 -951 -670 -456 -717 -645 -403 -347 -214 102 -65 46 181 372 232 248 502 886 836 900 1029
3358 1029 1009 924 1363 1178 1550 1209 1278 1669 1561 1760 1609 1595 1767 2115 1699 1661 1566 2142 1998 2007 2247 2231 2020
3381 2020 2073 2230 2461 2363 2375 2466 2415 2482 2608 2646 2812 2678 2850 2772 2705 3013 2826 2779 2579 2833 2630 2822 2868
3404 2868 2494 2704 3007 2818 2773 2589 2701 2550 2629 2659 2732 2976 2715 2635 2948 2848 2959 2716 2688 2739 2592 2711
3426 2711 2895 2581 2852 2324 2448 2811 2395 2625 2435 2436 2150 2372 2202 2338 2055 2393 2044 2017 2073 1820 2008
3447 2008 1858 1695 1673 1671 1424 1654 1275 1189 1629 1456 1103 1287 1208 934 990 1044 1025 802 769 753 813 622 500
3470 500 566 308 297 370 337 373 391 106 128 275 -186 8 -95 -201 -5 -192 -252 -382 83 -284 -388 -312 -470
3493 -470 -402 -268 -233 -543 -358 -665 -304 -698 -643 -542 -610 -962 -516 -714 -714 -763 -820 -1006 -928 -725 -921 -807 -730
3516 -730 -1046 -923 -1215 -984 -974 -1030 -663 -985 -903 -1137 -856 -969 -921 -815 -1230 -878 -1033 -1105 -1068 -792 -1200 -1126
3538 -1126 -760 -953 -1016 -1293 -1172 -1007 -1327 -1235 -1197 -1061 -1124 -1150 -1087 -1121 -1339 -1352 -1139 -1179 -1264 -1320 -1404 -1020 -899 -1270
3562 -1270 -1215 -1135 -930 -886 -1232 -920 -1136 -895 -1261 -809 -981 -921 -966 -1054 -1013 -1090 -762 -843 -656 -1167 -492 -849 -778
3585 -778 -611 -1044 -793 -643 -607 -461 -749 -707 -800 -583 -964 -914 -804 -1013 -899 -936 -839 -1044 -1044 -943 -1001 -781 -958
3608 -958 -760 -655 -824 -742 -951 -636 -375 -679 -946 -610 -355 -638 -509 -523 -708 -370 -492 -583 -451 -308 -376
3629 -376 -238 -454 -429 -159 -104 -140 -92 -234 48 57 -105 -232 -67 112 137 -23 -122 90 75 -193 266 -18 114
3652 114 -202 -36 -207 -16 -259 -9 50 -29 -94 70 -39 -179 -113 102 -102 -225 30 202 -108 171 156 63
3674 63 -281 5 -204 246 152 305 391 140 -1 218 257 378 122 12 163 -474 93 -176 -3 79 -348 -627
3696 -627 -249 -405 -400 -368 -418 -117 -381 -601 -125 -298 90 -243 -301 -117 -377 -269 -737 -207 -232 -381 -162 -109
3718 -109 -183 1 -49 -70 -110 -296 -386 -204 -288 -290 -386 -115 -246 -399 -279 -59 -425 -266 -651 -806 -419 -580 -122
3741 -122 -244 -176 -249 -96 151 -360 -468 -175 -70 -360 -391 -239 -303 -226 -162 -140 -424 -267 -243 -560 -181 -370 -230
3764 -230 -278 71 -99 -116 214 -112 139 40 361 110 482 405 275 433 486 290 435 579 521 594 436 699
3786 699 554 430 716 361 486 730 718 781 689 499 434 639 473 505 326 237 459 750 237 844 386 370
3808 370 790 548 507 584 534 457 675 488 1162 404 617 736 618 607 467 285 922 623 719 508 766 807
3830 807 812 437 785 665 498 645 409 499 362 714 662 514 344 214 568 559 494 520 759 478 647 549 445
3853 445 513 483 546 403 41 348 45 515 359 453 502 193 206 64 143 222 528 504 150 204 353 391 70 242
3877 242 277 376 324 206 71 210 272 251 501 190 242 318 334 300 -84 -50 69 19 71 -3 -25 -34 -167 -133 -122 53
3903 53 -37 191 232 -102 -110 355 219 65 138 194 204 156 231 60 195 528 566 473 399 569 288 402 164 43
3927 43 176 568 530 426 723 622 289 120 126 573 435 331 -111 6 130 106 196 433 495 142 128 281 178
3950 178 153 249 13 264 115 187 123 179 -100 36 28 527 87 -45 -103 -339 64 190 102 107 76 44 338 34
3974 34 -244 233 93 7 84 470 351 102 364 201 312 201 4 82 182 252 137 167 230 337 141 161 244
3997 244 -121 245 216 17 62 69 -27 197 49 -202 -62 98 -67 300 25 93 93 -165 183 402 -112 192 -20
4020 -20 220 -58 -108 33 236 86 -13 -199 -43 214 -175 -96 -328 -148 -26 175 -111 126 -40 -62 271 -30
4042 -30 -238 -27 38 24 165 -171 54 -255 -138 -50 32 30 5 -17 18 -183 -300 -52 -81 76 -179 104 -184 -503
4066 -503 -304 -470 -350 -480 -370 -664 -563 -313 -126 -592 -735 -176 -505 -858 -580 -443 -623 -601 -745 -862
4086 -862 -628 -654 -550 -795 -776 -793 -1104 -636 -684 -765 -888 -886 -876 -875 -1085 -958 -947 -1107 -967 -864 -1212 -1236 -1508 -995
4110 -995 -1130 -1040 -1126 -1008 -898 -933 -920 -1459 -1035 -925 -1217 -988 -1087 -1082 -1091 -1038 -1185 -1233 -1034 -1168 -1202 -886 -1103 -1169
4134 -1169 -1029 -876 -1193 -819 -1266 -1078 -961 -1143 -833 -1113 -795 -805 -1076 -916 -626 -1094 -958 -917 -719 -869
4154 -869 -984 -614 -1081 -677 -751 -777 -790 -618 -508 -625 -802 -625 -574 -661 -522 -280 -649 -504 -421 -595 -353 -626
4176 -626 -395 -467 -192 -368 -81 85 -157 183 -115 298 -19 40 -81 49 176 224 157 286 521 519 618 594 199
4199 199 334 453 258 317 265 616 604 520 414 265 453 744 527 621 694 899 353 624 810 648 838 745
4221 745 794 874 698 722 773 1022 696 878 619 734 797 1000 1101 1230 759 963 1087 1202 907 1231 898 935
4243 935 1209 1017 1266 1134 1172 889 1037 1182 1203 997 1154 852 1089 976 1078 1037 842 1017 1373 1242 1045
4264 1045 1280 1084 1042 1236 903 1204 992 949 1216 1249 1306 1277 1300 1398 1448 1224 1331 1372 1176 1279 1130 1192 1231
4287 1231 1056 1285 1133 1283 920 1074 1028 980 968 913 1134 850 1107 778 752 885 1122 865 1031 774 759 515
4309 515 526 833 715 734 467 614 503 689 570 518 433 550 141 294 412 379 530 287 381 127 521 141
4331 141 210 213 371 30 306 157 -65 113 143 103 171 -75 -51 -149 -156 -74 -263 -282 -131 -219 -73 -565 -536 -558 -603
4356 -603 -464 -541 -818 -927 -509 -828 -863 -742 -991 -736 -779 -789 -751 -1009 -859 -891 -1004 -948 -965 -986 -1123 -974 -1047
4379 -1047 -979 -881 -973 -978 -963 -1132 -972 -1231 -1205 -1104 -1131 -1144 -1166 -1007 -1109 -894 -1190 -916 -1260 -1539 -1137 -1392 -1064
4402 -1064 -1358 -1105 -1154 -1216 -1067 -1196 -1043 -1057 -807 -1287 -1113 -1052 -1022 -1047 -991 -1085 -1034 -1198 -1069 -1190 -742 -1065 -1180
4425 -1180 -922 -736 -810 -935 -737 -660 -858 -793 -754 -821 -693 -238 -691 -445 -925 -509 -603 -557 -378 -516 -372 -694
4447 -694 -589 -733 -481 -573 -260 -564 -453 -296 -477 -289 -250 -134 -528 -662 41 -144 -240 -304 -235 200 -178 -55
4469 -55 -408 45 -131 155 -20 315 -123 -79 210 -79 -42 -42 79 -15 -108 41 -85 106 -79 293 252 464 -191
4492 -191 58 60 138 -105 85 7 42 11 84 251 176 241 130 273 153 300 307 307 729 338 142 426 256 57
4516 57 279 572 367 685 398 176 741 458 393 597 442 323 145 363 600 440 739 956 160 735 613
4537 613 777 574 542 627 629 636 615 887 637 602 877 732 671 587 717 515 623 621 722 451 799 578 845 524
4561 524 610 458 656 895 764 596 255 236 229 614 451 605 433 355 642 702 662 693 529 375 651 612 152
4584 152 503 503 662 380 404 226 308 566 485 440 428 503 235 459 -141 373 302 418 387 381 213 420 379 -87
4608 -87 200 59 141 171 -60 27 142 18 -62 128 240 30 -50 141 -341 -46 187 101 32 -1 62 -46 -248
4631 -248 -213 -228 -6 -536 -209 -190 82 -168 -459 -20 -31 25 -81 -400 -116 -169 -420 -50 -392 1 -21 -223
4653 -223 -468 -111 54 -146 -445 -215 -65 -141 -190 91 -157 -459 -168 -156 -260 -88 -143 -137 -198 409 -105 45
4675 45 -137 110 -111 -209 -290 5 145 -17 -178 18 -82 87 -80 120 282 -66 51 -113 -181 -113 48 -96
4697 -96 128 22 164 112 342 33 295 -9 -25 257 76 -81 283 208 40 198 249 44 -6 -44 -5 -200 -271
4720 -271 54 106 -84 307 -3 23 -88 -153 15 -51 296 41 64 -62 -124 55 -7 -112 337 -172 119 150 -54
4743 -54 16 -102 -61 -11 -63 -19 169 -323 -41 -319 132 -208 32 -37 -125 -100 -338 -515 -201 -188 -172 -295 -17 71
4767 71 -402 -326 -90 -121 -356 -142 -260 -290 -147 -186 7 -165 -311 -415 -208 -314 -494 -229 -518 -335 -306 -74
4789 -74 -342 -227 -359 -220 -255 -299 -184 -215 -355 -287 -310 -123 -258 -404 -331 -433 -198 -202 -268 -253 -122 -248 -93 -332
4813 -332 -457 -242 -290 -275 -395 -326 -487 -301 -200 -528 -420 -12 -502 -575 -213 -307 -153 -313 -437 -192 -308 69
4835 69 -339 -472 -205 -246 54 -77 -104 -110 -257 -93 -399 -500 -217 -316 -224 -106 -248 -285 -235 -287 -315 -506 -202 -408
4859 -408 -283 -67 -394 -372 -222 -374 -238 -154 -171 -327 -426 -307 23 -137 -296 -396 -346 -264 -28 -317 -105 -390
4881 -390 -184 -208 -280 -240 -136 -124 -402 -266 -125 -172 -159 -265 -202 75 -46 -332 -316 54 -159 -101 -50 2 -258 -92
4905 -92 -72 -235 -1 -159 -12 -339 24 243 97 108 16 101 -186 -195 -43 -89 18 101 -228 -216 143 223 189 124
4929 124 317 333 45 134 298 361 461 240 192 7 190 364 318 599 301 531 463 493 443 70 591 419 341
4952 341 550 207 361 522 449 610 452 314 581 344 148 179 349 435 393 412 268 360 650 398 277 505
4974 505 151 414 603 536 229 421 611 288 587 494 608 204 655 303 357 392 369 361 307 594 332 429 215
4997 215 85 214 604 616 717 338 483 254 368 362 223 329 239 346 514 219 105 191 250 -15 378 323
5019 323 451 320 63 246 -53 188 381 223 56 -59 527 -202 26 -31 175 102 9 100 13 93 -40 19
5041 19 -93 396 313 5 -4 211 -9 -366 -106 -242 81 175 276 131 -370 -271 91 -207 94 -118 -141 259
5063 259 -286 -242 -1 -36 -76 -40 -348 49 263 -46 79 -65 -247 -133 -232 129 -206 -460 41 -167 111 -100
5085 -100 -275 -183 189 -179 -60 -135 -120 -82 -30 -126 -76 -131 69 -208 -88 328 -65 46 -418 -276 -183 -184 -239 -118
5109 -118 -80 -162 -80 -136 -62 26 -57 194 -9 -383 -193 -177 -101 -264 194 -341 -17 270 -187 -276 114 -40 -89 142
5133 142 -287 -12 -10 -195 -269 -166 164 -11 67 -58 -259 101 -280 -240 -113 -141 -162 -90 -204 -227 -183 -67 -381
5156 -381 -170 -117 -115 222 78 -356 50 -184 -159 2 -59 -382 -6 -104 -8 -103 -233 -57 89 34 75 -33 -73 -35
5180 -35 -255 -104 22 -191 -101 -336 159 177 -104 131 88 98 -128 -14 56 30 -341 47 -119 -82 -99 115 73
5203 73 122 -82 -94 127 -313 152 -227 56 257 -107 -130 56 292 -243 25 146 192 -36 -257 -61 -442 21
5225 21 -219 26 -34 276 84 -247 31 97 -99 -20 164 41 -48 -180 -11 -92 -178 -255 237 -212 -97 -129 -38
5248 -38 -306 -191 -22 -208 -79 -44 -84 -25 -122 -574 -120 51 -185 -108 -111 -59 -111 -71 -387 13 -298 -100 -79 -236
5272 -236 -19 -50 -136 -102 138 45 -452 -128 -160 -137 -163 -303 -191 -34 -318 -214 -399 -262 -263 -352 -85 -458 -154
5295 -154 -102 -514 -182 -104 -303 -238 -138 -76 -45 -223 -193 -357 -248 170 81 -159 -116 -100 -98 -153 -236 111 104 -21 -172
5320 -172 -5 -69 90 -180 -85 -5 -39 -109 -43 168 -55 139 -29 -181 104 176 -18 -210 -65 242 -395 150
5342 150 210 194 192 147 -126 188 -69 -52 280 31 220 72 123 -54 174 67 118 -105 185 58 212 149 282
5365 282 -59 302 18 240 305 273 -15 269 63 282 -199 384 -34 329 307 32 111 220 88 59 291 71
5387 71 103 -9 155 103 64 -199 -217 275 190 149 131 310 256 114 -201 176 39 143 119 388 406 -69 -198 -58
5411 -58 158 43 -225 95 419 262 -108 27 212 29 179 161 -86 93 144 -79 61 88 192 -10 102
5432 102 389 136 246 469 29 52 80 58 -51 -26 -189 70 312 33 286 135 415 197 234 -122 -99 -247
5454 -247 -126 207 177 -379 34 164 130 241 -11 -288 0 83 250 143 -92 99 74 -228 86 253 -86
5475 -86 -43 207 167 206 129 -59 -61 -133 -162 9 355 91 10 159 168 250 -146 191 -48 208 14 54 -91 41 -3
5500 -3 139 90 121 -131 75 166 175 102 156 -12 -116 -21 95 -95 71 122 -52 114 270 158 -180 -54 -72 -279
5524 -279 -104 160 47 -311 -222 11 -70 23 -461 157 130 -24 43 -333 -101 83 27 -194 -123 -393 -1 -68 29
5547 29 -62 20 8 85 -186 -326 284 -31 -2 -371 -91 -53 55 149 -130 -127 58 -107 14 103 2 -204 -323 -176
5571 -176 -80 -48 -48 136 45 -349 -20 227 59 12 -191 118 -203 29 93 -91 -143 58 4 133 36 33 120 33 3
5596 3 -120 88 -221 101 0 237 312 -39 54 -43 -62 43 49 -239 17 42 -93 -1 48 87 -91 -99 110 32 203
5621 203 364 10 -100 -173 -104 -64 40 219 83 232 -226 -77 151 191 89 131 232 -147 190 -105 -442 -125
5643 -125 23 202 207 30 25 -78 -63 42 -263 -30 178 -376 -131 154 -29 133 51 94 -320 -255 -69 -104 -79
5666 -79 -5 -54 -189 -144 -236 -155 9 -183 -208 -289 -168 -117 -225 -88 -162 -11 -96 14 -608 -159 55 -132 -169 -54
5690 -54 -107 83 47 7 -337 -203 -77 -191 102 139 193 -45 -284 -188 -344 -195 -268 -302 -116 80 -181 -103 -87 -222
5714 -222 -57 -335 -327 -327 -167 159 -293 68 95 -181 17 -48 -233 19 -210 88 -93 -231 -45 62 -93 -198
5736 -198 2 -156 129 -16 -185 -30 -63 36 185 106 -25 -132 -292 32 81 289 -49 99 -151 -160 -119 -240
5758 -240 91 -196 80 -124 92 -203 69 267 136 1 45 -91 -275 -26 56 108 127 -67 208 -45 133
5779 133 200 157 329 109 101 156 -91 194 -139 282 34 -55 -138 30 -44 162 154 -112 426 74 241 48 -241
5802 -241 20 218 -225 -151 -198 158 -29 46 -121 -34 -144 156 225 113 148 239 329 358 -2 -94 -11 -372 261 176
5826 176 221 174 488 513 586 223 212 -42 343 247 81 277 209 366 148 394 173 189 346 328 515 165 397
5849 397 506 368 443 244 215 305 373 391 561 196 170 77 242 52 319 -40 223 143 56 419 320 248 299 419
5873 419 301 426 361 183 54 339 206 262 357 -167 260 157 154 289 150 30 315 128 410 356 270 374
5895 374 140 305 255 241 40 151 278 180 -311 231 -97 -120 48 186 -117 -148 -15 139 77 -87 186 -127
5917 -127 27 56 -149 -38 79 -168 -79 4 94 -141 -50 68 -366 -372 -77 -62 -249 -196 -156 -261 -503 -117 -294
5940 -294 46 -94 -252 -146 -54 -350 -370 23 -562 -384 -333 -403 -310 -374 -274 -355 -386 -385 -285 -186 -174 9 36 -102
5964 -102 -57 -429 -566 -405 -270 -199 -329 -355 -350 -205 -2 -347 -378 -535 -407 -211 -73 -303 -153 -122 -297 -167
5986 -167 -424 -249 -206 -406 -214 -250 -354 -282 -445 -215 -389 -134 -187 -277 -142 -374 -429 -176 34 -484 -271 -403
6008 -403 -178 -90 -507 -388 51 -271 -115 -93 -171 -479 -102 -203 52 -116 -139 -373 -191 149 -155 61 -107
6029 -107 45 18 -115 -224 -388 -97 28 -178 -82 -274 192 56 44 -155 -143 -61 -23 -226 67 -181 265 208
6051 208 -88 43 -214 -86 57 -92 -197 67 12 -215 99 22 -71 -601 -165 170 -27 28 -111 -288 107
6072 107 45 -25 -99 280 314 -110 -208 339 369 283 342 244 252 -8 -102 192 -3 -24 79 67 41 263 264 138 -30 422
6098 422 548 251 -4 225 274 71 -93 62 413 150 426 241 252 113 114 185 178 191 81 -52 209 262 148
6121 148 360 420 307 75 105 445 178 318 102 53 492 48 86 250 87 105 400 56 147 75 119 220 536
6144 536 45 190 298 134 402 299 111 246 272 307 200 217 303 254 0 518 139 228 127 195 -100 -104 244
6167 244 461 -24 290 -56 569 114 -21 324 118 63 404 347 94 291 134 184 -14 99 111 79 -57 -52
6189 -52 75 150 238 -258 -3 223 39 -105 -174 -295 -176 -164 -264 -132 -131 33 -127 -125 243 -222 -32 317 95
6212 95 -295 -30 45 -117 155 151 137 -177 -47 124 -9 47 119 -59 136 141 175 -145 45 -13 22 -7 4 339 -110
6237 -110 127 55 -31 -31 86 -105 -109 -5 -52 155 68 26 84 -77 243 -200 159 131 -113 -3 140 48 -14 -141
6261 -141 -184 -183 -92 82 -136 166 204 -140 -176 91 -243 -341 7 -107 38 28 -90 -30 -40 -236 23 -53 -61 -263
6285 -263 -187 -80 441 289 -197 -66 6 -7 31 24 -130 -277 88 -34 147 2 -144 14 -82 -380 -169 -127 5
6308 5 -216 154 0 246 -96 50 -95 120 101 -247 -399 -67 -4 -4 -66 51 -151 20 178 32 -277 -215 200
6331 200 -41 109 2 27 -43 10 -16 -76 -34 -25 -11 129 -129 -51 -210 111 -88 -21 -177 119 -244 -216 106 -173
6355 -173 195 -32 -13 -113 115 -278 171 -51 -149 -197 165 -413 -4 -131 -217 39 -6 228 340 -46 91 29
6377 29 252 70 -22 -100 -107 -13 26 158 -230 -115 199 119 -6 -234 164 -264 -84 1 -199 68 -266 -52 -150
6400 -150 -192 -163 202 -33 -101 95 25 408 -190 -94 43 214 27 -356 -174 -239 -24 292 -164 197 -233 73
6422 73 -174 -72 -221 -196 -437 -110 133 -115 -61 38 -257 -245 172 -95 38 -179 82 61 -452 21 118 -191
6444 -191 -193 -213 130 8 -91 193 -175 164 216 -106 -84 3 196 -30 16 2 127 -2 182 -74 -87 -305 171
6467 171 87 -143 -239 50 -124 -69 -45 22 258 -453 -75 -315 12 130 -40 -342 -181 -11 38 -239 -49 381
6489 381 -167 -155 -90 -22 -98 -89 -42 182 -91 -172 -299 88 439 33 -236 -58 93 59 -104 158 -44 110 284
6512 284 141 -12 -172 143 -43 -26 -34 -61 15 289 133 283 217 -14 -31 289 414 199 225 -17 -46 -56 226
6535 226 -146 -99 144 71 338 -138 218 198 -227 144 -48 311 -96 101 23 18 -5 238 45 44 143 112 280 183
6559 183 -74 168 57 63 -93 36 -119 -91 110 152 176 191 193 -61 250 208 46 -40 -185 55 396 59 93 343
6583 343 373 316 40 395 193 -195 141 -101 0 -14 309 234 250 42 -97 385 60 193 239 -91 -138 42
6605 42 265 26 326 113 298 -62 144 162 -122 73 -223 167 37 -261 -80 -61 5 -23 -175 -46 -151 238
6627 238 -174 -162 257 -129 125 -270 -20 10 98 277 -138 35 118 -101 44 -79 10 -231 99 94 -53 -71 -104
6650 -104 457 82 77 -183 126 19 132 79 247 82 -114 49 -201 -24 -88 51 -171 -88 50 -96 1 -85
6672 -85 -125 -420 24 57 -214 58 -78 103 94 -109 -105 -54 39 -14 -151 278 67 -19 -113 -9 -243 17 -269 163
6696 163 -136 -154 -325 5 -109 -235 -164 -18 -103 -209 71 -183 197 96 -66 56 327 -146 144 212 -59
6717 -59 54 37 -92 80 -33 -5 116 -67 -201 6 232 -172 -187 -50 -81 -55 -25 300 -92 184 -259 12
6739 12 -49 -22 -100 41 119 60 207 23 -135 325 -7 326 169 -62 80 -24 -17 -67 119 -87 122 401 -162
6762 -162 -63 -58 -261 -269 -66 296 -128 -24 19 122 60 -22 11 332 -151 233 -67 457 154 98 -71 379 118
6785 118 -171 -249 29 -27 -136 -18 51 -207 70 -191 -311 137 -99 58 7 -212 52 -55 -125 -50 -105 -176 143
6808 143 -47 -28 99 4 -77 261 -188 -17 92 108 11 -231 -205 -42 -7 -57 51 -224 84 -304 -217 -34 -6
6831 -6 -157 116 -10 -153 -520 43 21 -367 -215 -265 -54 19 27 -290 -57 -65 -280 -344 -53 -176 -103 -448 -182 87
6855 87 -250 -185 -185 79 141 -100 101 -97 12 111 -32 -118 13 -241 -160 -71 -188 77 -84 -259 142 -228 342
6878 342 -2 47 112 -82 -80 67 -131 -9 -77 -242 -52 -226 63 -146 260 -173 61 -103 -48 47 -126 -82 -70
6901 -70 36 -1 85 -136 -87 -63 -29 141 63 -47 310 212 -59 -66 63 198 165 288 -157 55 -4 43 -60 157
6925 157 251 104 130 160 -214 57 -102 24 190 217 72 -162 73 -55 -50 -208 287 -82 -391 34 -302 260
6947 260 -36 261 138 -252 -116 30 394 -43 -99 250 -59 -182 83 163 -49 50 58 128 36 -306 -51 -128 30
6970 30 -30 -196 -96 7 238 -115 43 -106 -11 -256 199 -80 -150 80 -18 130 0 -184 348 -212 207 161
6992 161 88 -13 90 150 231 8 294 130 -165 -181 244 -18 93 190 196 8 -128 210 -40 263 8 164
7014 164 39 -257 144 -23 -139 -50 152 -129 48 149 119 188 86 18 188 89 -35 -89 226 140 59 -50 -96
7037 -96 -102 215 113 149 -57 107 -316 -75 12 -17 76 26 -81 -12 174 245 -109 -138 -109 73 -293 -153 304 285
7061 285 -120 -30 -134 -116 -35 -243 -12 -125 194 67 -187 -250 59 -292 311 79 -140 87 228 -85 -56 -30
7083 -30 361 -79 -17 -95 122 -181 133 343 27 125 57 142 -140 40 -219 10 213 -110 48 -103 -255 34
7105 34 -131 -11 -357 -108 324 -307 -354 -120 -112 -31 -454 -127 -94 -262 178 -170 -36 -47 -331 -73 55 -61
7127 -61 -377 158 -29 -137 -231 -124 39 -405 -55 -65 -103 64 452 -22 101 -61 26 39 -89 -12 -473 -418 25
7150 25 256 -147 -144 -231 161 -10 41 141 -110 220 185 77 142 1 -76 194 -270 132 -138 161 211 -108 -149
7173 -149 160 -87 -24 -51 -95 -55 167 82 -92 -138 -5 -48 -59 44 -12 -169 226 33 149 15 88 -161 -16
7196 -16 -135 44 55 161 96 68 -2 -100 -44 137 -145 -265 -8 129 280 -206 52 135 -168 -78 135 -59 126
7219 126 -127 -46 134 -8 134 327 217 -173 -133 13 23 -263 -238 85 222 -18 85 206 -387 63 67 -22
7241 -22 69 -186 -44 -107 179 83 65 -26 327 25 -142 -125 -39 -333 281 87 64 -243 47 308 -11 334 56
7264 56 64 -52 -92 -111 0 -54 -102 -223 14 155 282 -45 232 -307 31 -37 22 -181 -85 142 143 234 -38 -82 9
7289 9 11 -48 280 155 52 -58 12 30 -91 1 601 40 -28 -76 15 22 22 224 272 358 -55 108 -198 165 88 20
7315 20 294 35 344 -32 -68 79 -45 -64 39 140 -167 80 -41 -113 181 -6 -1 87 -91 109 -70 212
7337 212 79 -183 61 -161 -153 -212 -34 -63 91 154 32 -245 354 77 -11 -373 70 -37 -195 215 46 -141
7359 -141 16 -32 29 317 -224 92 469 54 68 -106 -120 -159 -89 -160 -75 24 110 -97 -76 176 33 -7 193 32
7383 32 -235 152 -20 -124 51 46 24 -49 -34 -192 232 264 -96 46 178 150 128 56 184 59 69 -169 -264 217
7407 217 310 -66 -34 -59 -98 -165 -99 152 130 125 140 252 21 -13 197 341 -8 141 30 229 166 -107 286 237
7431 237 40 167 105 27 151 106 40 16 212 122 -5 201 -91 -135 16 100 202 181 212 -128 -167 295 10 -398
7455 -398 -116 174 -187 -164 -31 92 272 53 330 54 -10 342 -134 106 -403 57 -448 -184 -25 -380 -225
7476 -225 -102 -10 -152 258 443 65 106 302 150 173 168 234 -273 -328 -91 -261 -364 13 207 3 -94 215 -118
7499 -118 360 10 98 248 151 -191 105 -6 -336 -13 86 -31 -453 135 -216 -196 -99 -12 157 -14 -228 -34
7521 -34 196 -207 44 -112 -31 5 -39 -187 38 -44 -132 91 -123 -356 -138 -119 73 -308 -21 -227 152 -352
7543 -352 105 131 -279 -59 -77 -20 -47 -62 17 -175 -106 185 -224 20 8 89 -143 37 137 -45 15 -63 8 -120
7567 -120 -12 134 -336 -30 -204 -87 -323 14 -74 -188 15 127 161 10 -270 -127 -15 -332 -91 159 -67
7588 -67 -218 81 157 -265 -197 -5 112 93 -140 -192 86 201 39 -192 60 184 264 -10 4 41 114 -226 -117
7611 -117 -169 46 -186 346 -57 -70 1 -196 231 23 -208 -62 -177 -277 206 134 157 294 130 -75 115 30
7633 30 25 -138 -108 68 -241 227 98 146 100 -61 303 122 -87 166 -71 23 69 100 -230 130 -105 259 5
7656 5 -26 63 232 -217 162 74 -113 -70 15 -25 200 189 -146 101 -119 256 -109 140 83 168 251 232 193 430 -28
7681 -28 420 -25 112 88 -103 283 78 -58 338 303 162 195 -14 -81 285 -67 80 -31 -20 28 71 -112 -114
7704 -114 -17 -78 -68 78 -100 174 205 -62 139 -40 161 17 294 -379 -41 155 93 -130 -131 227 149 112 -59
7727 -59 85 271 162 -69 -169 141 95 172 -97 -12 247 -150 -106 -4 -123 -92 401 -69 26 27 150 -134 40
7750 40 -19 262 -156 -187 -137 -12 187 18 -133 64 60 -100 144 -144 260 -86 -252 -112 36 8 -142 -116 -55
7773 -55 -51 111 309 140 109 -131 146 38 -315 249 -60 101 -110 -211 -116 -256 -77 22 -43 34 70 -365 190
7796 190 105 -235 183 2 -382 -100 -33 99 205 154 -274 362 111 -59 -162 -90 -60 293 -47 27 34 -47 -236
7819 -236 347 88 -220 200 -311 64 131 -93 5 -76 182 10 91 -59 -248 121 -10 -269 -63 161 222 -196
7841 -196 8 -105 135 -377 -102 130 29 -148 137 -81 76 203 117 -155 -52 -295 -207 -51 -69 -118 -299
7862 -299 -116 -81 -346 -174 110 -130 459 23 153 -208 372 224 -162 284 -34 -263 -244 -132 14 -5 322
7883 322 -97 184 -98 32 -50 -172 -79 -220 -200 -23 174 188 255 202 -176 224 -232 -134 13 119 174 -143 56
7906 56 56 54 -149 113 -248 -156 -113 -7 46 26 414 110 98 280 340 -201 -160 -304 88 -166 -134 262 12 98 2
7931 2 -96 86 17 115 53 280 61 2 24 -70 -173 1 -31 -95 -165 128 -395 213 158 -200 -261 234 89 -17 152
7956 152 -211 -139 -109 215 336 3 -9 144 -350 -145 89 104 9 -62 -121 43 -79 268 -225 -65 -123 -85 -177
7979 -177 -115 74 88 -73 85 112 -412 -45 -239 246 114 -55 -30 119 47 -243 0 203 10 -92 -91 -36 96
8002 96 49 -124 -134 109 -66 -53 -17 -208 -216 -293 -1 -318 -99 -52 -54 130 -78 61 -448 -27 -56 -57 -174 -318 137
8027 137 -202 329 -252 44 150 -116 -26 -57 145 123 -263 269 -207 123 64 -377 -163 -50 82 -249 279
8048 279 164 -111 -112 182 -100 -20 -119 78 -15 192 -28 -40 175 25 53 -73 -343 -172 -142 -2 96 -68 84
8071 84 -226 171 93 -248 166 148 -184 -38 198 205 324 81 191 -28 163 205 46 -124 50 -114 308 131
8093 131 -58 -138 23 139 433 -100 -153 332 237 0 -280 -1 -138 -154 -187 129 -99 -229 -186 53 -61 78
8115 78 1 -28 -60 124 219 -65 167 249 354 27 -76 58 130 103 -165 -8 285 -82 13 -198 100 17 81 128
8139 128 -76 -36 -67 -98 2 49 -146 -51 142 99 275 393 -49 -120 117 -48 -100 -97 46 168 -97 15 148
8162 148 -186 -19 28 -210 71 66 65 -40 -33 111 -15 18 117 111 90 -161 -115 -134 -27 87 170 95 213 -121 17
8187 17 -115 -187 74 134
8191A34
$$ Imaginary data points
##PAGE= N=2
##DATA TABLE= (X++(I..I)), XYDATA
0 0 0 0 0 0 0 0 -8 8 -8 8 -16 16 -24 24 -32 38 -48 54 -66 75 -91 103 -122 138 -161 182 -210 235 -270 302
30 302 -342 383 -431 481 -537 598 -666 739 -822 909 -1010 1116 -1235 1368 -1516 1682 -1870
47 -1870 2082 -2327 2613 -2949 3354 -3851 4480 -5305 6439 -8107 10810 -15969 29470 -141888
61 -141888 -368829 -318839 -343208 -332579 -355697 -341934 -347103 -342085 -354229 -343017 -339026 -330001 -333444
74 -333444 -322711 -313611 -301583 -299363 -287343 -274957 -259390 -251646 -238625 -223288 -204441 -193087 -180477
87 -180477 -164671 -144684 -129842 -116181 -100560 -80411 -64595 -52216 -38795 -21105 -5413 5858
99 5858 16559 30874 44226 52518 58772 67742 76804 81390 82993 86252 90733 91021 87476 83802 81017
114 81017 77440 69398 59693 51363 44360 32458 17123 3035 -8332 -21985 -40559 -58357 -71871
127 -71871 -87018 -107463 -128357 -144558 -160234 -180511 -201960 -218119 -232415 -251479 -272828 -288700
139 -288700 -301687 -318032 -336502 -350679 -360149 -371388 -386715 -398077 -404336 -410601 -420755 -427957 -429124
152 -429124 -429323 -432237 -434740 -431896 -426348 -422717 -419406 -411574 -399934 -389231 -380891 -368658 -352944 -336539
166 -336539 -323255 -307915 -288002 -267010 -249381 -231700 -209424 -186450 -166836 -147631 -125844 -101128
178 -101128 -79730 -59919 -38263 -15496 5426 24130 43239 64472 84380 102104 118428 136015
190 136015 153339 168128 180994 194235 208426 220870 230046 238865 248073 256854 261983 265125 270232
203 270232 275115 276487 275689 275308 276223 273707 267864 263150 260342 255012 246444 238256 232012 224279 213171
218 213171 201643 193154 184517 173059 160616 150590 141686 130337 117406 106510 98507 89384 77773
231 77773 67427 60754 53284 43471 34472 28839 24286 17133 10169 7297 4919 992 -4060 -6162 -5275
246 -5275 -6372 -8006 -7585 -4784 -3133 -2747 -603 3985 8231 11089 14675 21097 27412 32031 36603 42991
262 42991 50148 56316 62012 68737 76128 82824 87947 93065 99589 105557 110540 114652 119586 124320 127968
277 127968 129922 132463 135312 136537 136977 137273 138483 138728 136580 133983 132282 130865 127617 123362 120062
292 120062 117419 112758 106675 101596 96952 91717 85160 78649 74198 68890 61736 54364 48802 43369 36198
307 36198 28954 23496 18765 12614 5530 -101 -4179 -9267 -15555 -20728 -23237 -26175 -31225 -35356 -37035
322 -37035 -38662 -42106 -44848 -44874 -44791 -45548 -46416 -45759 -44175 -43856 -42990 -41033 -37498 -35205 -33094 -30460 -26484
339 -26484 -23071 -20433 -17216 -12972 -8478 -5119 -1823 2348 6578 9621 12065 15674 19826 23404 25515
354 25515 27937 31051 33047 34184 35573 37143 38684 39359 39450 39826 39947 39365 37587 36685 35652 34551 32112
371 32112 29788 27547 25402 21858 18219 14719 12192 8598 4253 257 -3260 -7032 -12267 -16827 -20144
386 -20144 -23773 -28583 -32843 -36354 -39443 -44065 -48241 -51684 -53489 -56768 -60211 -62615 -63450 -65673 -68523
401 -68523 -70022 -69979 -70554 -71852 -72353 -70904 -69950 -70351 -69740 -67766 -65586 -63992 -62401 -59150 -55663 -53279 -50888
418 -50888 -47763 -43751 -40401 -37066 -33448 -28815 -24961 -21808 -18051 -13627 -9647 -6404 -2720 1860 5332
433 5332 8760 11507 14580 17952 20414 22901 25248 28011 30184 31427 32722 33408 34912 35373 35710 36339
449 36339 36380 36111 35439 34466 33684 31814 30553 28975 27491 25924 23723 21095 18487 16139 13104 9857
465 9857 7707 5317 2373 -1033 -4278 -6311 -9360 -12328 -15530 -17417 -19104 -22432 -24961 -27172 -28612
480 -28612 -30431 -32945 -33941 -34406 -35607 -37208 -38026 -38324 -38540 -39767 -39535 -39058 -38435 -38704 -38050 -37332 -36062 -35667
498 -35667 -35384 -33400 -32096 -30732 -29408 -27868 -25901 -24305 -23034 -21459 -18540 -16307 -15200 -12880 -10502
513 -10502 -8431 -6944 -5008 -2532 -83 1203 3420 5307 6872 8317 9352 10849 12337 13355 13915
528 13915 14741 15277 15616 15467 15223 15085 14918 14241 13377 12819 11525 10114 8297 6837 5402 4002 2165
545 2165 417 -1466 -2877 -5301 -7841 -9554 -11477 -12987 -15213 -16944 -18798 -20426 -22617 -24744 -25839
560 -25839 -27182 -28723 -29976 -31036 -31872 -33368 -34805 -35356 -35297 -35997 -36625 -36566 -35801 -35898 -36504 -36043 -34863 -34073
578 -34073 -33478 -32286 -30389 -28870 -27753 -26841 -24724 -22603 -20973 -19229 -16288 -14089 -12008 -10390 -8299
593 -8299 -5623 -4002 -1995 82 2439 4505 5865 7396 9366 10772 12222 13435 15381 16647 17903
608 17903 18523 19624 20522 21189 22386 23086 23774 24465 24829 25119 25374 25395 25545 25880 25511 25634 25563 24929 24343 23533
628 23533 22957 22165 21042 20230 19356 17938 16554 14834 13225 12014 10119 8385 7260 6050 4396 2604
644 2604 1302 -15 -1537 -2870 -3629 -4239 -5368 -6357 -6993 -6604 -7710 -8256 -7995 -7606 -7431 -7698 -7225 -6663
662 -6663 -5893 -5551 -5035 -3488 -2788 -1682 -851 210 1310 2420 3154 4889 6401 7420 8807 10315 11651
679 11651 13086 14049 15461 16911 18178 19386 20468 22014 22674 23690 24379 25648 26421 26961 27141 27693 28319
696 28319 28204 28277 27945 27628 27295 26589 26401 25922 24685 23869 22782 21715 20622 19292 18216 17064 15886
713 15886 14213 12907 11197 10128 9050 8065 7032 5680 4692 3469 2227 1058 353 -448 -1476 -2133
729 -2133 -3193 -3757 -4658 -5906 -6515 -7021 -7478 -8028 -8521 -9266 -9663 -10201 -10360 -10877 -10972 -10854 -11009 -10669 -10538 -10508
749 -10508 -10526 -9787 -9437 -8777 -7964 -7143 -6102 -5837 -4589 -3702 -2654 -1801 -945 323 1668 2385 2907 3752
767 3752 4654 5654 6072 6800 7868 8249 8136 8603 8884 9028 9382 9373 9652 9540 9418 9287 9019 8749 8383 8166
787 8166 7665 7556 6783 6500 6217 5610 4721 4042 3046 2457 2053 1517 932 -211 -653 -1658 -3021 -3363 -3938
806 -3938 -4623 -5269 -6574 -6706 -7422 -8103 -8815 -9370 -9295 -9614 -9903 -9853 -10458 -10121 -10381 -10113 -9896 -9765 -9035 -9125 -8851
827 -8851 -7623 -7592 -7150 -6739 -6055 -5358 -4639 -3959 -3397 -3008 -2585 -2225 -1975 -1120 -519 -384 790 987 689 1099
847 1099 1895 2256 2260 2641 3447 3577 4050 4091 4287 4642 4908 5260 5517 5649 5766 5605 5588 5644 5733 5726 5704 5551 5258
870 5258 4880 4757 4029 3570 3120 2616 2329 2080 1211 121 -85 -743 -1588 -2181 -2633 -3147 -3952 -4282 -5262 -5988
890 -5988 -6336 -6839 -7130 -7489 -8179 -8379 -8858 -9189 -9623 -10126 -10296 -10734 -10908 -10792 -11049 -11860 -12108 -11971 -12223 -12256
910 -12256 -12810 -12517 -12322 -12811 -12966 -13290 -12884 -12757 -13423 -12620 -12696 -12471 -12667 -12368 -12218 -12372 -12089 -11990 -11281 -11287 -11291 -11124
932 -11124 -11223 -11079 -11015 -10903 -10737 -10392 -10800 -10499 -10627 -10772 -10769 -10964 -11108 -10997 -11375 -10930 -11374 -11704 -12073 -12092 -12289
953 -12289 -12375 -12553 -12846 -12998 -13178 -13512 -13997 -14008 -14153 -14335 -14345 -14684 -14912 -15179 -15173 -15487 -15634 -15834 -16232 -16215 -16390 -16701
975 -16701 -16538 -16879 -17040 -17175 -17051 -16916 -16619 -16722 -17066 -16599 -16421 -16445 -16518 -16073 -15704 -15378 -15257 -14502 -14763 -14001
995 -14001 -13458 -12992 -12375 -11859 -11480 -10751 -10144 -9710 -8870 -8469 -7446 -6834 -6160 -5420 -4595 -3756 -3252 -2592 -1792
1014 -1792 -1070 -51 529 1725 2083 2675 3579 4119 4680 5601 6350 6780 7666 8257 8585 9003 9929 10472 10962
1033 10962 11608 12115 12477 12619 13303 13404 13603 14460 14817 15236 15237 15378 15677 15923 15750 15834 16404 16360 16769 16395 16717
1054 16717 16633 16305 16829 16766 16933 16908 17058 17249 16779 17123 16785 17096 16952 17345 17378 17264 17577 17733 17744 18133 18510
1075 18510 18685 19093 19652 19633 20157 20365 20543 21357 21426 21810 22331 22972 23352 23363 23889 24157 24335 24901 25310 25639
1095 25639 25735 26372 26250 26119 26606 26374 26829 27072 27074 26893 26989 27270 26676 26836 26763 26833 26746 26398 26308 26206 25792 25487
1117 25487 25108 24884 24648 24260 24194 23209 22558 22363 21680 21270 20612 19919 19744 19276 18295 17561 16802 16368 15338
1136 15338 14466 14281 13668 12990 12082 11301 10812 10018 9111 9102 8367 8030 7407 6664 6111 5535 4977 4325 3772 3374
1156 3374 2837 2440 1594 993 885 303 -186 -674 -1060 -1225 -1755 -2222 -2707 -2661 -3179 -3664 -3816 -4251 -3928 -4146
1176 -4146 -4891 -4850 -5239 -5307 -5243 -5796 -5659 -5886 -6313 -6518 -6644 -6821 -6894 -6916 -7407 -7717 -8284 -8360 -8858 -9459 -9920 -10014
1198 -10014 -10418 -10842 -11470 -12063 -12401 -12786 -13549 -13895 -14126 -14507 -14953 -15386 -15853 -16037 -16845 -17195 -17120 -17500 -17498 -17711
1218 -17711 -17609 -17980 -17938 -18267 -18512 -18442 -18495 -18334 -18752 -18606 -18785 -18655 -18820 -18825 -18415 -18563 -18460 -18375 -18259 -17755 -18457
1239 -18457 -17890 -17859 -17354 -17398 -17173 -17081 -16721 -16688 -16548 -16171 -15749 -15505 -15238 -14927 -14951 -14660 -14538 -14153 -13867 -13801 -13261
1260 -13261 -12888 -13142 -12484 -12585 -12548 -11985 -11842 -11704 -11175 -11321 -10846 -10771 -10392 -10515 -10212 -9914 -9280 -9158 -8960 -8687
1280 -8687 -8269 -8071 -8005 -7557 -7134 -6888 -6638 -6190 -6057 -5633 -5790 -5306 -5336 -4975 -4864 -5095 -4814 -4567 -4986 -4678
1300 -4678 -4703 -4470 -4445 -4288 -4171 -4320 -4170 -4253 -4096 -4081 -4057 -4124 -3932 -3488 -3709 -3706 -3690 -3656 -3588 -3205 -3047 -2761 -2584
1323 -2584 -2623 -2291 -2281 -2697 -2319 -2153 -2426 -1849 -1970 -2000 -2077 -2497 -2548 -2346 -2421 -2628 -2352 -2698 -2759 -2964 -2930 -2947 -3000
1346 -3000 -3086 -3149 -3029 -3303 -3239 -3522 -3556 -3455 -3737 -3743 -3830 -3653 -3946 -4398 -4555 -4211 -4298 -4740 -4617 -4554 -4812 -4887 -4776
1369 -4776 -5033 -5202 -4836 -5141 -5210 -5421 -5299 -5335 -5099 -5853 -5556 -5345 -5410 -5596 -5435 -5309 -5735 -5449 -5762 -5346 -5900
1390 -5900 -5336 -5509 -5438 -5563 -5468 -5543 -5698 -5685 -5215 -5641 -5592 -5515 -5667 -5412 -6043 -5467 -6005 -5853 -5835 -5469 -5599 -5119
1412 -5119 -5246 -4817 -4831 -4766 -4708 -4510 -4255 -3616 -3462 -3546 -3118 -2682 -2109 -2139 -1741 -1094 -943 -783 -193 -149 339 789
1434 789 1270 1610 2094 2409 2694 2850 3374 3865 4273 4243 4679 4650 5444 5692 5769 6326 6501 7024 7535 7707 8348
1455 8348 8334 8312 8610 9356 9646 9869 10214 10863 10924 11352 11288 11668 11831 12398 12582 12512 13059 12959 13598 13594 13848 14158
1477 14158 14400 14648 14880 15103 14952 15507 15865 15989 16151 16677 16933 17253 17052 17420 17678 17677 18338 18515 19042 19412
1497 19412 19044 19448 19698 19851 20103 20891 20884 20805 21257 21456 21454 21294 21616 21842 22262 22082 22606 22738 22920 22728 22844
1518 22844 23212 23409 23337 23393 23544 23298 23289 22950 23178 23096 22962 22913 23227 22841 22194 22576 21777 21797 21567 21105 20631 20898
1540 20898 20287 19853 19487 19437 18879 18475 18384 17809 17054 16754 16244 15754 15409 14884 14155 13995 13509 12629 12568 11782
1560 11782 11572 10779 10323 9831 9437 8926 8383 7786 6942 6512 6216 5715 5105 4593 4070 4218 3567 2689 2231
1579 2231 1385 1307 783 494 -236 -735 -1401 -1818 -2365 -3094 -3173 -3756 -4446 -5069 -5344 -5951 -5989 -7028 -7295 -7926
1599 -7926 -8380 -8885 -9550 -10190 -10508 -11327 -11757 -12358 -12860 -13020 -13488 -14241 -14869 -15522 -15756 -16465 -17066 -17214 -17577 -18040
1619 -18040 -18849 -19422 -19587 -20144 -21056 -20805 -21336 -21541 -22118 -22362 -22654 -23053 -23434 -23525 -24055 -24016 -24320 -24761 -24507 -24654
1639 -24654 -25238 -25555 -25649 -25483 -25444 -25704 -25578 -25978 -25882 -26103 -26119 -25823 -25797 -25777 -25769 -25540 -25858 -25462 -25726 -25337 -25069 -24899
1661 -24899 -24524 -24701 -24333 -24487 -23924 -24172 -23726 -23466 -23205 -23116 -22932 -22546 -22180 -21961 -21911 -21728 -21189 -21115 -20578 -19858
1681 -19858 -19996 -19565 -19486 -18652 -18549 -18593 -18041 -17466 -17007 -16707 -16404 -15959 -15507 -15219 -14916 -14533 -13977 -13501 -13220 -12610
1701 -12610 -12215 -11967 -11153 -10618 -10251 -9963 -9252 -8635 -8112 -7857 -7683 -6724 -6320 -6046 -5249 -4962 -4500 -4141 -3646
1720 -3646 -2862 -2400 -2001 -1130 -784 -395 361 680 884 1442 2344 2570 2892 3581 4285 4449 5064 5166 5695 6336
1740 6336 6991 7264 7963 8144 8245 8672 8963 9533 9895 10584 10382 10849 11081 11716 11681 11996 12439 13042 13159 13186
1760 13186 13596 13789 14081 14359 14390 15178 15299 15534 15591 15504 16156 15934 16068 16652 16529 16955 16944 17268 17421 17398 17690
1781 17690 17669 17787 18295 18330 18197 18079 18469 18466 18890 18500 18477 18788 18852 18604 18593 18692 18731 18762 18474 18758 18374 18627 18971
1804 18971 18294 18068 17980 17635 17611 17418 17105 17217 17057 16509 16279 15967 16302 15727 15413 15162 14958 14678 14611 14142
1824 14142 13934 13662 13294 12851 12707 12405 11896 11610 11496 11336 11030 10704 10496 10014 9845 9035 9192 8941 8576
1843 8576 8369 8047 7544 7341 6710 7022 6417 5808 5837 5718 5349 4496 4302 3978 3654 3509 3257 3124 2613 1988
1863 1988 2123 1811 1544 607 696 626 295 38 -416 -749 -1310 -1497 -1856 -2064 -2295 -2784 -2879 -3404 -3896 -4075 -4450
1884 -4450 -4567 -5041 -4934 -5289 -5649 -5748 -6186 -6472 -6844 -6975 -7130 -7440 -7742 -8182 -7970 -8229 -8179 -8619 -8646 -8978 -8963
1905 -8963 -9449 -9254 -9403 -9596 -9707 -9884 -10096 -9885 -10085 -10028 -9949 -10073 -10192 -10115 -10504 -10375 -9951 -10204 -10168 -10293 -9921
1926 -9921 -9971 -9961 -9671 -9652 -9785 -9771 -9758 -9239 -9195 -9269 -9117 -9060 -8925 -8820 -8737 -8598 -8748 -8289 -8187 -7968 -8154 -8123 -8186
1949 -8186 -7966 -7898 -8179 -7743 -7747 -7728 -7738 -7493 -7522 -7088 -7049 -7344 -6778 -7107 -6872 -6896 -6586 -6333 -6554 -6136 -6213 -5939 -5817
1972 -5817 -5594 -5614 -5273 -5370 -5119 -4997 -5108 -5094 -4717 -4592 -4454 -4175 -4305 -3924 -3796 -3501 -3669 -3554 -3476 -3296 -2975
1993 -2975 -2609 -2638 -2564 -2374 -2126 -2001 -2035 -1609 -1550 -1329 -1115 -986 -1075 -840 -547 -354 -487 -411 192 -142 -73 141
2015 141 392 125 560 353 702 726 509 679 577 554 1038 898 857 1091 1011 1069 1017 1292 1295 1511 1261 1292 1467
2038 1467 1608 1389 1594 1561 1760 1627 1436 1700 1908 1629 1972 1582 1848 2066 1894 2413 2151 2025 2129 1882
2058 1882 1999 1871 2304 2400 2489 2366 2306 2610 2620 2633 2816 2426 2769 3075 3069 3089 2851 2901 2752 2910 2623 2862 2461
2081 2461 2760 2610 2591 2447 2287 2672 2230 2452 2181 2400 2238 2056 2197 1804 2165 2051 1728 1832 1444 1521
2101 1521 1566 1763 1458 1275 1570 1421 1112 1099 1076 1298 1301 1138 1145 914 823 686 1061 733 640 516 549 781 629
2124 629 526 510 619 400 555 479 619 668 562 959 718 584 434 596 337 608 497 766 585 738 713
2145 713 414 742 1046 442 514 843 667 536 599 726 546 702 734 795 597 520 491 651 279 598 787 912
2167 912 720 874 736 735 884 874 925 879 840 1225 1127 897 735 919 757 965 1055 1031 1320 1286 1356 1289 1598 1452
2191 1452 1242 1572 1668 1400 1766 1686 1604 1921 1986 1920 1920 2199 2314 2026 2380 2287 2525 2363 2176 2519 2872 2611
2213 2611 2714 2675 2521 2496 2692 2738 2901 2621 2866 2452 2525 2842 2535 2559 2410 2525 2261 2463 2484 2442 2349 2090
2235 2090 2095 1711 2149 1781 1987 1815 1741 1448 1628 1294 1421 1759 1381 1195 1411 1282 1198 1362 1035 1114 858
2256 858 1120 808 914 937 787 1035 812 862 796 653 740 510 603 439 401 543 644 316 703 600 709 388
2278 388 271 375 534 437 341 283 371 277 359 280 189 84 91 -7 -121 -55 -307 129 337 -246 -533 -533 -645 -346 -477
2303 -477 -435 -656 -749 -591 -724 -512 -714 -860 -846 -668 -864 -1096 -1179 -1082 -1021 -978 -869 -1079 -1017 -815 -782 -923 -732
2326 -732 -1069 -1145 -1058 -800 -1176 -695 -588 -767 -614 -372 -563 -494 -651 -385 -431 -742 -213 -130 -312 -520 -241 -155
2348 -155 -435 -8 -550 115 -80 -555 -11 -177 -232 -285 -178 -47 193 16 -2 -142 159 -178 -246 -89 -183 -136
2370 -136 -294 -258 -538 -124 -288 -232 -534 -400 -228 -558 -500 -837 -500 -754 -382 -527 -518 -743 -620 -829 -686 -746
2392 -746 -719 -247 -949 -825 -693 -513 -534 -737 -456 -821 -889 -582 -377 -1079 -772 -1010 -1137 -1048 -785 -992 -731
2413 -731 -767 -618 -902 -1022 -809 -847 -640 -530 -830 -946 -908 -1241 -1003 -810 -1149 -810 -694 -996 -615 -1256 -894
2434 -894 -1176 -1306 -1399 -1210 -1112 -1361 -1442 -1959 -1895 -1891 -2033 -1973 -2148 -2077 -2360 -2457 -2382 -2348 -2291 -2439 -2824 -2703 -2546 -2654
2458 -2654 -2773 -2398 -2734 -2847 -2452 -2680 -3141 -2422 -2960 -2670 -2494 -2703 -2944 -2719 -2788 -3090 -3044 -3300 -2785 -3256
2478 -3256 -3281 -3524 -3247 -3613 -3361 -3329 -3359 -3435 -3459 -3428 -3378 -3333 -3559 -3587 -3261 -3580 -3929 -3430 -3790 -3567 -3704 -3675 -3735
2501 -3735 -3911 -3671 -3792 -3825 -4111 -3894 -3914 -4084 -4186 -3976 -3998 -4253 -4247 -4214 -4228 -4088 -4508 -4122 -4236 -4033 -3940 -4053
2523 -4053 -3931 -3976 -3854 -3299 -3753 -3483 -3902 -3652 -3361 -3307 -3173 -3507 -3351 -3341 -3021 -2736 -2776 -2744 -2609 -2487 -2636
2544 -2636 -2459 -2581 -2218 -2113 -2233 -1755 -1742 -1362 -1790 -1601 -1383 -1046 -613 -919 -718 -612 -381 419 234 212
2564 212 97 864 911 1054 1232 1391 1381 1377 1768 1829 2070 2044 2269 2081 2407 2519 2610 2993 2940 2568 3192 3041 3335
2587 3335 3333 3661 3846 3614 3807 3946 4264 4376 4498 4596 4814 4691 4705 5154 5257 5813 5580 5498 5913 5937 5908 6304
2609 6304 6311 6335 6327 6153 6460 6420 6344 6750 7219 6907 6825 6973 7234 7183 7188 7122 7489 7415 7826 7845 7484 7760 7936 7663
2633 7663 7733 7824 7807 7633 7707 7463 7549 7671 7301 7234 7544 7534 7259 7237 6992 6892 6983 6722 6332 6640 6259 6342 6511
2656 6511 6233 6109 6134 5758 5905 5965 5841 5888 5847 5732 5689 5395 5521 5596 5053 5385 5128 5164 5057 4546 4650 4361
2678 4361 4203 3930 4001 3482 3687 3352 3548 3333 3127 3128 2933 2688 2671 2642 2582 2225 2223 2271 1952 1802 1959 1593 1650
2701 1650 1164 1502 1088 1134 1106 920 625 425 76 -130 -4 -626 -620 -519 -1050 -1068 -1214 -1295 -1660 -1697 -1981 -2011
2723 -2011 -2277 -2340 -2385 -2747 -2528 -2701 -3109 -3047 -2995 -2763 -3311 -3663 -3687 -3481 -3654 -3867 -4171 -3976 -3973 -4311 -4131 -4663
2745 -4663 -4622 -4840 -4801 -5288 -5095 -5076 -5033 -5154 -5288 -5533 -5639 -5582 -5509 -5380 -5541 -5778 -5622 -5650 -5636 -5602 -6022 -5862 -5888
2768 -5888 -5611 -5471 -5627 -5633 -5824 -5832 -5248 -5791 -5780 -5976 -5588 -6151 -5993 -5455 -6344 -5998 -6024 -6180 -5892 -6369 -5671 -5870
2790 -5870 -5993 -6211 -5711 -5740 -5826 -5629 -5850 -5800 -5905 -5586 -5415 -5051 -5441 -4937 -5108 -4920 -5183 -4913 -4833 -4934 -4731
2811 -4731 -4269 -4529 -4230 -4505 -3870 -4019 -3805 -3875 -3358 -3598 -3169 -3474 -3267 -2880 -3259 -2846 -3015 -2578 -2474 -2373
2831 -2373 -2098 -1663 -2034 -1969 -1563 -1420 -1548 -1388 -1516 -825 -692 -1067 -806 -661 -631 -623 -441 -199 -492 -312 -9
2852 -9 -97 90 -27 438 220 283 388 651 375 197 612 665 644 793 579 755 1061 1043 815 1414 1492 1175 1517
2875 1517 1440 1581 1690 1601 1773 1749 1681 1903 1913 2125 1908 1836 2208 2073 2332 2254 2084 2332 2362 2206 2211 2178 2362
2898 2362 2015 2453 2184 2479 2380 2469 2217 2473 2210 2483 2284 2647 2286 2362 2255 2066 2243 2063 2197 2004 2248
2919 2248 2127 2055 1938 1848 2045 2038 1627 2033 1546 1490 1946 1679 1772 1495 1403 1839 1537 1442 1611 1728 1321 1488
2941 1488 1524 1454 1383 1492 1453 1469 1137 1249 1370 1305 1378 1310 1114 1117 1140 1108 1005 1064 1230 937 1226 791 988 717
2965 717 1197 819 827 1030 889 1161 1077 1086 607 831 1159 785 974 1050 1040 861 888 822 922 914 954 908 836 962 939
2990 939 992 697 1076 891 804 543 824 727 434 643 930 804 439 149 540 227 524 177 -138 197 304
3011 304 157 98 352 43 262 508 239 305 187 -23 597 651 385 381 444 734 836 281 435 952 607 474
3033 474 559 892 815 912 1126 809 955 993 818 598 852 694 446 487 817 824 767 685 826 510 667 947 419
3056 419 581 334 782 757 723 404 737 733 580 690 685 486 683 672 502 545 876 432 725 850 694 698 799
3079 799 585 880 818 700 876 640 460 1041 1124 734 989 1015 1223 975 1264 1443 815 980 1144 1071 1160 811
3101 811 1065 662 885 640 655 779 656 770 492 605 773 663 263 72 460 615 508 398 433 546 465
3122 465 133 357 454 526 226 426 231 -177 83 17 -14 -155 94 66 -78 -562 -701 -417 -365 -800 -658 -989
3144 -989 -883 -951 -1300 -1572 -1191 -1317 -1722 -1338 -1417 -1475 -1295 -1656 -1605 -1554 -1678 -1761 -2026 -1532 -1671 -1905 -1946 -2087
3166 -2087 -1831 -1740 -2099 -1925 -1733 -2140 -2472 -2437 -2318 -2277 -2671 -2434 -2343 -2446 -2239 -2331 -2503 -2707 -2631 -2448 -2587 -2584
3188 -2584 -2453 -2595 -2496 -2844 -2804 -2666 -2493 -2779 -2650 -2570 -2877 -2770 -2780 -2778 -2670 -2842 -2558 -2774 -3006 -2720 -3259 -2944
3210 -2944 -3172 -2962 -2825 -2927 -2953 -2913 -2734 -2475 -2647 -2783 -2484 -2275 -2239 -1903 -2047 -2436 -2081 -2188 -1967 -1691 -1936
3231 -1936 -1771 -1571 -1413 -1816 -1700 -1570 -1443 -1589 -1401 -1227 -1309 -1444 -1170 -1089 -1322 -954 -1125 -864 -883 -1308 -853
3252 -853 -1073 -610 -561 -527 -145 -460 -114 -328 -150 -302 -386 -222 291 200 252 304 245 -136 346 669 610 626 594
3275 594 606 303 653 720 595 402 598 842 950 782 911 865 981 859 944 1179 1250 1277 1535 1425 1506 1518 1779
3298 1779 1839 2096 1758 1804 1783 1790 2013 2055 1899 2139 2159 2480 2211 2236 2471 2427 2492 2617 2401 2516 2692 2824 2869
3321 2869 2576 2481 2754 2634 2832 2744 2771 2989 2935 3119 3227 3091 3344 3125 3161 3106 3004 3443 3180 3159 2834 3007
3343 3007 3087 2911 2837 2751 2865 3079 2744 2704 2858 2961 2840 2682 2833 2615 2896 2952 2663 2735 2545 2907 2822 2780
3365 2780 2776 2902 2481 2302 2826 2691 2473 2390 2445 2427 2120 2240 2004 2131 2077 1682 1898 1728 1926 1816 1810 1640
3387 1640 1772 1351 1513 1223 1405 1423 1659 1551 1236 1387 928 975 1043 790 903 901 564 778 482 599 719
3408 719 649 164 325 3 -1 390 -539 -677 -369 -490 -628 -604 -827 -560 -474 -842 -872 -935 -1119 -795 -1194 -1033
3430 -1033 -1264 -1382 -1360 -882 -1108 -1650 -1594 -1409 -1299 -1678 -1746 -1775 -1603 -1706 -1574 -1655 -1903 -1664 -1754 -1911 -2049 -1954
3452 -1954 -1977 -1978 -1864 -2059 -2068 -1899 -2080 -2281 -2290 -2144 -2021 -2098 -1976 -2009 -2025 -1775 -2064 -1999 -1879 -2187 -2232 -1913 -2412 -2020
3476 -2020 -2196 -2497 -2032 -1970 -2298 -1877 -1843 -1971 -1889 -2344 -2342 -2366 -2118 -2270 -1837 -1821 -1907 -1725 -1749 -1949 -2001 -1881 -1737
3499 -1737 -1936 -1422 -1876 -1780 -1580 -1639 -1730 -1573 -1450 -1473 -1252 -1272 -1385 -1420 -1328 -1167 -1080 -1109 -1149 -1548 -1268 -1076 -941
3522 -941 -977 -1029 -1048 -1050 -1014 -780 -990 -616 -652 -735 -897 -680 -650 -442 -876 -199 -286 -670 -378 -594 -524 -763 -499 -483
3546 -483 -377 -273 -547 -353 -348 -750 -330 -227 -485 -535 -445 -202 -21 -300 -337 -115 -187 -299 -601 -7 -182 31
3568 31 -27 -144 -176 -8 -181 -328 52 -265 -117 -38 188 181 334 423 206 103 244 98 506 531 110 373 232
3591 232 157 598 468 540 527 501 476 770 984 483 396 640 539 316 769 584 640 823 695 585 703 585
3613 585 518 403 522 810 605 454 379 468 224 326 465 367 444 559 562 623 395 677 514 663 756 330 271
3636 271 693 467 414 438 433 705 614 454 707 395 394 629 303 635 472 708 644 678 532 471 675 594 476 395
3660 395 432 381 319 627 326 418 56 169 102 -11 -24 365 328 195 2 -33 222 229 184 -273 76 -94 21 328
3684 328 286 230 141 334 267 250 94 37 199 455 46 51 271 -18 28 26 254 -89 -433 -94 97 -256 -59 47
3708 47 165 144 -206 14 -179 302 -69 228 -45 348 -94 214 189 390 102 145 529 433 230 346 382 250
3730 250 3 632 776 450 163 445 239 681 477 751 592 509 850 673 504 441 491 748 630 591 762
3751 762 613 837 915 956 597 483 759 586 723 621 826 521 627 869 675 783 413 517 508 523 597 763
3773 763 573 324 776 429 439 522 641 970 741 698 660 370 574 432 1309 858 731 815 644 894 734 510
3795 510 682 785 748 654 652 762 520 533 305 418 282 302 115 195 317 347 231 15 340 136 -146 169 -130
3818 -130 208 -107 12 -33 -201 -200 58 -162 73 111 15 270 67 175 187 -159 -38 -167 -181 -35 -314 -89
3840 -89 -386 -322 -151 0 -447 -146 -248 -494 -112 -403 -201 -451 -175 -101 -62 -216 -175 -159 -123 -189 -326 -208 2
3863 2 -53 -291 -414 -61 -94 -171 -326 -268 -126 -361 -91 -20 -308 -76 -163 -109 -144 134 -506 -276 12 261 -458
3886 -458 -187 -97 -110 -121 -77 -180 -313 188 -17 -185 -158 -151 173 -227 -362 -39 -238 -4 -245 15 -219 -155 -386
3909 -386 -249 -326 -568 -22 -737 -263 -342 -370 -163 -349 214 -120 123 -85 -157 -268 -290 -35 18 -255 158 157 -355
3932 -355 34 152 130 -240 -60 -317 -61 -148 -225 2 66 -375 -83 -158 -104 -135 -126 -272 -204 -310 -101 -133 -169 -165 -24
3957 -24 -330 -196 -39 -387 95 -67 -98 -117 -271 -160 -154 -147 -298 -603 -396 -218 -549 -455 -113 -519 -133 -177 -451
3980 -451 -286 -639 -345 -446 -331 -327 -27 -323 -103 -404 -477 -60 -406 -196 -366 -192 -131 -520 -366 -98 59
4001 59 -289 -421 -292 -331 -301 -348 -82 -406 -221 -264 -709 -337 -336 -398 -395 -589 -324 -429 -717 -465 -767 -8 -354
4024 -354 -377 -31 -401 -524 -274 -259 -188 -302 -572 -458 -519 -186 -332 -373 -436 -738 -642 -670 -427 -753 -379 -755 -540
4047 -540 -673 -884 -564 -754 -658 -489 -741 -577 -845 -654 -762 -604 -767 -1011 -588 -607 -606 -519 -504 -657 -809 -680
4069 -680 -1109 -671 -823 -806 -625 -807 -636 -931 -429 -835 -704 -545 -496 -598 -669 -986 -547 -548 -837 -489 -848 -465
4091 -465 -726 -482 -477 -496 -557 -411 -502 -671 -452 -670 -234 -469 -159 -435 -262 -302 -486 76 -465 -297 -154 -202
4113 -202 -16 172 -85 140 -58 -345 264 128 98 -122 70 -75 -10 197 135 302 104 469 550 256 51
4134 51 422 93 539 266 633 871 794 562 733 569 565 808 783 814 865 909 1021 972 704 1044 943 873 996
4157 996 972 973 1030 1182 1138 956 1233 1171 1086 1093 1087 984 1056 1095 913 943 1300 1153 830 1038 1157 1188 785 1062 1214
4182 1214 1180 1013 1225 1242 1072 1208 1080 1217 1159 1216 841 1317 1128 1293 1235 1224 881 1355 1267 1123 1483 1275
4204 1275 1457 1059 1240 958 1319 1128 1216 1173 864 1411 1216 942 1049 1319 1053 907 919 978 864 853 606
4225 606 1028 848 1046 697 761 951 516 784 614 657 751 651 466 463 742 516 679 393 495 431 710 613
4247 613 450 660 176 405 425 558 276 241 205 161 160 260 187 482 45 -35 245 507 10 -216 -296 -76 -125
4270 -125 -105 -438 -246 -420 157 -221 -572 -237 -375 -225 -522 -167 -384 -467 -480 -635 -360 -559 -456 -588 -823
4291 -823 -183 -482 -576 -445 -677 -620 -666 -695 -673 -934 -757 -630 -961 -1007 -924 -1078 -988 -881 -1065 -1033 -814 -755 -1059
4314 -1059 -1064 -1266 -1077 -1276 -1302 -1140 -1011 -1035 -1300 -1047 -1225 -1242 -1400 -1196 -1482 -1143 -1208 -1450 -1388 -1223 -1133 -1233
4336 -1233 -1113 -1426 -1420 -1404 -1221 -1342 -1120 -1183 -1318 -1281 -1169 -1264 -1112 -883 -901 -1276 -1155 -1190 -1214 -1156 -1233 -859 -775 -1178
4360 -1178 -1203 -1055 -982 -1021 -993 -981 -1069 -971 -881 -1150 -1017 -1469 -797 -838 -946 -916 -767 -805 -615 -691 -594 -740 -594 -979
4384 -979 -553 -580 -557 -621 -605 -452 -578 -337 -514 -399 -212 -213 -241 -352 -53 -194 146 -149 83 -32 169 138 -177
4407 -177 -77 -199 172 -127 167 -65 181 136 183 254 306 116 323 500 -168 507 440 317 546 742 538 481
4429 481 509 388 579 557 681 821 491 747 713 575 723 411 833 987 698 594 782 747 619 711 805 809 1066
4452 1066 778 1008 695 760 809 1084 824 849 886 973 982 881 564 758 826 703 587 514 882 872 637 706 551
4475 551 465 813 651 822 884 605 705 517 721 668 684 616 684 968 713 575 915 771 893 380 802 871
4497 871 887 603 444 666 703 835 619 602 437 488 458 728 521 800 764 512 679 569 671 531 652 511
4519 511 816 401 312 295 513 778 326 26 420 661 215 500 386 564 212 358 187 277 406 470 432 22
4541 22 266 2 359 60 82 220 247 233 223 137 124 -67 -10 188 123 334 275 133 -234 -174 13 131 -177 -216
4565 -216 398 -156 52 82 -38 -182 -240 -293 118 -419 -263 -231 -649 -497 -378 -351 -108 -212 -321 -549 -274 -87
4587 -87 -222 -446 -189 -352 -594 -294 -391 -555 -473 -265 -381 -593 -595 -691 -421 -480 -388 34 -571 -482 -925 -782 -271
4610 -271 -521 -516 -280 -641 -384 -537 -726 -335 -246 -588 -418 -490 -526 -455 -306 -158 -331 -328 -296 -431 -526 -464 -519 -452
4634 -452 -629 -564 -468 -427 -391 -151 -334 -264 -313 -419 -439 -284 -157 -256 -501 -192 3 -404 -330 233 56 30 -157
4657 -157 -242 -317 -324 -120 -26 -133 -156 -189 268 64 173 -78 -301 45 -66 397 -91 42 -259 -60 234 63
4679 63 -207 -373 -42 337 -529 -109 117 191 42 -12 -149 -226 -62 -259 -69 -165 196 -215 -176 -190 208 133 -308
4702 -308 -45 16 41 -84 -131 93 -174 -238 -65 102 203 95 144 0 -14 199 -449 -82 -74 75 -45 2 -182
4725 -182 -55 -152 -431 -401 -265 -185 37 -272 -428 -160 -370 -27 -314 -431 -240 -167 -292 -85 -292 -286 -171 -253
4747 -253 -349 -20 -262 -82 -248 -276 -165 -628 -272 -445 -230 -191 -138 -595 -333 -394 -382 -321 -127 -205 -442 -134 -237
4770 -237 97 -94 -221 -119 -280 56 -180 -563 -282 58 -7 -10 -88 -188 -379 4 -102 -81 70 116 -40 -73
4792 -73 -205 -83 -527 99 31 -23 -63 -224 382 -183 167 -207 -161 26 -98 -139 -59 130 -160 150 35 -39 35
4815 35 -176 -164 -170 82 253 -32 20 101 -227 -105 -146 -116 156 122 89 -169 -88 91 -94 131 264 104 -1 181
4839 181 241 302 4 203 157 6 128 294 294 130 384 277 338 413 31 -86 429 269 195 217 -96 359 319
4862 319 138 12 565 121 126 27 57 508 -46 414 253 1 202 100 205 139 245 193 357 370 173 296
4884 296 568 298 432 47 445 340 292 390 281 452 320 380 174 135 377 450 37 488 350 431 392 558
4906 558 526 510 428 525 258 490 461 817 206 401 636 342 195 356 511 584 415 929 555 413 809 420
4928 420 640 346 718 278 464 421 512 697 81 28 395 611 367 13 430 382 387 523 330 569 235 279
4950 279 356 326 102 449 306 257 194 302 187 193 435 236 178 128 289 349 341 124 164 27 -3 201 109 60 201
4975 201 -62 115 -29 -20 27 200 -64 -57 -284 -153 -58 -310 31 -302 -258 -191 -47 -297 -195 -196 -316 9 -459
4998 -459 129 -282 -112 207 -317 -449 -71 -4 -79 -68 -205 -126 -365 -151 -351 10 -392 -171 -159 -144 -8 -397
5020 -397 -360 -117 -218 -196 -509 -197 -409 -177 -183 -193 -267 -180 -302 126 -528 -250 -501 -543 -210 -219 -287 65 -195 -290
5044 -290 -105 -86 -265 -256 -364 -139 14 -41 -138 -411 -227 -185 -31 -188 -150 -171 -135 -263 -201 -103 162 -157 -33 -228
5068 -228 -60 -361 -128 -159 -144 -89 -365 -207 -164 -69 -283 -92 22 -48 -96 -186 -495 -20 9 121 -163 37 -306
5091 -306 -159 24 -402 -83 -38 313 -186 -134 -212 -33 -8 209 -52 -98 62 -207 90 -385 11 -354 -12 -203
5113 -203 -284 -81 -22 -398 28 -24 -200 -477 -64 -260 -190 -66 -139 -232 -219 -212 4 -593 -209 -219 -130 49 -149 -150
5137 -150 -171 146 -234 -229 118 -29 -20 -520 -106 136 80 61 -103 -6 -157 -123 227 -107 -214 -191 -36 240 156 110
5161 110 -71 -205 -275 -165 96 43 127 9 -229 195 -52 -70 273 165 -42 48 69 38 -371 159 130 281 -65
5184 -65 101 286 147 -172 126 241 42 -244 116 -143 119 195 -36 -128 73 -128 119 84 -135 44 -55 -51
5206 -51 152 341 -64 158 4 190 7 14 -52 -132 66 -179 9 -57 -370 -159 -241 -165 -64 -60 -111 -160 -76 65
5230 65 49 -271 36 90 -39 114 -204 -247 -297 270 4 41 -181 -402 20 -1 -140 -183 -251 -40 9 -41 -59 115
5254 115 40 88 288 134 -242 -80 -352 -251 -47 20 145 77 6 120 6 0 -106 -31 93 -216 -93 254 57
5277 57 130 177 153 -270 -2 -35 6 99 141 46 71 254 57 17 147 329 387 167 -36 262 64 -33 470 91
5301 91 179 235 218 257 188 257 286 459 185 203 5 -99 431 244 400 174 260 243 431 315 172 281 207 377
5325 377 403 285 -70 199 390 300 585 279 326 329 151 178 1 201 75 291 186 425 436 109 284 17
5347 17 -59 202 306 -17 75 37 149 50 22 -7 116 185 311 137 153 150 -13 75 136 254 -10 285 225 131 -95
5372 -95 -15 73 44 27 84 -230 207 295 -91 -38 -248 -341 -104 246 -114 86 6 -113 -191 -95 -224 18 143 27
5396 27 -57 61 248 124 166 -35 -3 -227 -75 -121 -15 -57 -41 -252 -2 57 -156 -32 171 -82 -166 -135 -260
5419 -260 42 -10 226 146 85 293 -165 -234 112 40 -54 199 -42 54 204 -2 -23 -70 -273 79 -109 143 126
5442 126 -39 38 155 26 -157 -185 70 104 -170 28 273 -85 25 -111 68 41 250 -91 -77 -27 -64 38
5464 38 -39 -63 -358 -152 -127 9 -73 -265 544 109 3 71 -309 98 -70 -123 -107 -5 -117 -141 -83 122 -166
5487 -166 -98 -344 -261 -105 -223 -103 22 -122 -426 60 -223 53 -191 -47 -32 -169 127 -199 27 -122 -118 -280
5509 -280 136 -123 -122 83 -221 -139 133 -34 -209 -80 -373 -128 -15 -352 -112 -356 -218 -31 -216 73 -157
5530 -157 19 -227 -140 -2 -141 -138 -197 26 187 -292 -28 -45 -132 -87 451 -108 -234 -36 -220 -174 20 198 2
5553 2 179 -347 -46 -26 91 -249 161 -23 19 3 -42 99 -5 -146 -55 78 -139 -99 22 -220 331 -2 -71
5576 -71 -218 146 -22 -76 -129 46 -73 -82 405 181 104 13 -68 -301 7 -18 100 -39 174 -123 155 316 124
5599 124 -17 36 -76 -90 -52 144 169 84 -146 -199 -141 244 -165 -103 41 -100 50 56 -351 -84 -228 -11 -102 -215
5623 -215 -15 176 -12 -149 49 8 -102 -8 -346 -135 -191 -269 -201 224 -62 -78 -79 -171 -90 -45 151 -122 133 -2
5647 -2 -125 -112 -21 -56 138 -321 -8 -11 -332 -488 -112 -19 91 -194 75 -155 7 192 64 -57 -340 3 94
5670 94 -70 -148 106 -240 -13 -14 154 -358 37 -110 142 -25 -411 -258 -222 -331 -142 -195 -185 49 -210 -161 19
5693 19 71 127 -192 158 207 291 -75 363 424 66 219 -80 152 96 143 40 191 96 46 55 263 356 74 8 120
5718 120 -91 84 -183 115 551 102 323 145 245 300 272 338 247 223 239 233 173 248 84 236 282 -42 22 292
5742 292 275 -7 22 363 -7 376 227 518 493 201 201 237 63 21 433 -26 33 141 288 69 -40 344 475
5765 475 240 236 269 5 -30 182 76 205 211 402 164 175 105 -23 -17 164 -64 440 117 192 -279 257 216 55
5789 55 134 272 237 28 341 37 405 89 -19 -9 264 117 0 166 289 78 -56 39 259 350 217 65
5811 65 238 70 137 -9 179 168 425 205 33 -177 192 -94 388 180 126 337 103 81 36 -120 145 60
5833 60 88 283 -44 -8 -31 268 170 -8 81 10 -49 -69 142 128 194 -13 -204 100 94 46 5 80 232 282 -197 125
5859 125 -136 87 -146 37 -57 -192 -175 237 -8 -58 -138 -3 14 -64 -90 -132 -76 -180 -285 -338 46 -190 -268 -271
5883 -271 -230 -255 -129 -145 -265 -259 -140 -294 -283 -174 -336 -668 -386 -588 -444 -346 -388 -396 -467 -188 -478 -648 -868 -410
5907 -410 -185 -262 -180 -392 -505 -360 -502 -337 -605 -410 -155 -286 -368 -350 -328 -289 -196 -140 -373 -287 -123 -336 -427
5930 -427 -590 -224 -441 -242 -286 -74 -315 -355 -384 -188 -405 -233 -339 -137 -97 -189 -175 -249 -181 -237 -206 -139 -202 -257
5954 -257 -165 -245 -4 241 30 24 -86 -127 -336 -46 99 -39 -152 -262 -394 -179 22 -14 235 268 -148 -217 43
5977 43 268 229 -213 -2 -22 169 92 -232 -261 -7 322 120 -35 118 -7 42 43 291 96 296 141 55 -185
6000 -185 -98 93 68 -139 159 155 237 199 -37 156 474 276 -1 277 -37 247 288 241 51 200 55 478 300
6023 300 116 565 70 543 177 172 215 164 405 98 316 -28 24 157 419 265 320 293 -26 403 212 357
6045 357 280 233 295 271 -105 121 452 255 262 367 34 248 354 162 255 194 401 295 199 311 85 702 -78
6068 -78 527 316 155 279 16 381 64 297 123 347 380 282 363 130 267 3 254 532 174 313 139
6089 139 170 255 -27 368 275 262 361 238 268 125 -139 -256 402 142 411 158 -96 310 117 359 -101 2
6111 2 182 151 224 149 331 -4 90 -146 -243 136 142 123 55 165 -68 16 116 94 1 248 196 187 -57 202 425 -37
6137 -37 28 105 -20 72 181 -302 -158 -145 -41 -173 -1 -385 -73 201 -241 25 -210 -280 113 74 -295 88
6159 88 -289 75 -2 -165 -174 -94 32 -92 77 -359 -200 36 -128 -97 -299 -137 182 33 -102 -279 -148 -108
6181 -108 -171 249 -397 -277 -304 -104 -373 -99 -393 -44 38 -98 22 -91 -256 -249 -377 -124 -158 22 -26 -279
6203 -279 -180 -60 -99 -27 34 109 -259 134 -125 -86 -51 -281 53 -22 -80 -73 151 -64 -103 33 44 -129 -193 -67 -127
6228 -127 -51 -37 293 154 -68 -85 -3 -243 -212 206 25 -105 -240 3 -91 -74 -112 -84 -255 195 -274 -85 212
6251 212 -111 86 -178 -171 -43 -145 -123 8 -52 19 217 -88 -8 -76 -233 180 12 -279 -169 112 150 210 13
6274 13 10 92 71 248 98 38 -51 2 -176 -253 300 101 23 -186 -222 -170 239 5 -1 -103 59 -121 -304 -4 -129
6299 -129 47 -246 292 98 25 38 160 184 41 64 35 253 206 -95 -17 -195 -245 -230 -12 -12 -131 -21 23 222
6323 222 -215 -6 -6 -62 -151 252 -221 -65 -40 172 -46 -82 590 -142 160 276 -11 -138 189 -26 415 -53
6345 -53 6 -53 226 217 -236 392 8 62 222 -99 9 -107 -261 -320 -197 -135 -53 165 -6 -10 -71 67 254 -78
6369 -78 56 19 77 45 101 -187 30 131 314 -43 13 -30 -249 273 -69 -138 137 34 49 147 -284 101 62 87
6393 87 -134 -29 135 289 -148 -126 85 -195 -69 80 50 -14 -360 -52 134 59 -87 57 249 230 217 -38
6415 -38 89 101 37 -85 -30 -167 -96 -8 -12 25 -35 -211 -15 -126 -155 346 -76 36 -78 -99 -128 319 328 123 88
6440 88 44 32 -126 -195 -230 31 175 104 -45 -56 -15 2 -94 4 179 161 -61 20 8 96 170 29 -105 343 359 230
6466 230 70 39 336 -5 12 80 -105 195 322 225 -56 -40 173 345 204 252 -114 167 463 214 94 169
6488 169 -72 252 138 486 386 345 54 471 79 -105 -203 239 245 178 306 -142 351 -174 182 125 302 66
6510 66 157 -250 133 222 -5 110 -129 167 18 -42 404 -74 48 -77 -217 -48 227 248 131 61 -40 301
6532 301 -149 110 113 149 18 -12 55 -7 165 -82 154 -38 265 43 67 -6 -127 -39 -67 -247 17 31 113 263
6556 263 137 -117 -310 188 0 41 -176 227 -123 -344 163 19 -285 22 11 -154 -157 -322 -144 -328 -362 -257
6578 -257 -172 -145 -199 -238 6 -358 10 238 -82 -9 120 -26 -75 130 24 -34 -274 -48 120 -85 3 -66 371
6601 371 110 -205 -78 -59 -118 147 140 -220 -174 -18 -62 -124 -315 -188 -117 176 -264 -107 129 197 -259 -32 -32 151
6625 151 -178 -127 -170 10 342 -121 153 -58 -96 70 -22 -103 318 -59 -7 -108 -64 157 -59 82 -44 105
6647 105 -181 40 109 342 54 113 133 -269 -88 -62 -105 -64 -142 -119 11 -260 -63 -141 -253 5 -9 -103 46 35
6671 35 16 -38 143 -47 -137 542 -46 -105 -48 -41 -322 -208 -79 51 42 102 -35 -50 -127 360 -67 -245 -28 -63 51
6696 51 -9 -229 -88 147 34 352 75 -83 103 38 159 -27 -55 -169 -27 60 -123 -95 -165 -145 151 -206 131
6719 131 -255 0 104 -43 -145 -171 13 -343 6 -149 -187 -142 164 -211 -158 -145 180 398 45 154 -170 -34
6741 -34 244 -176 277 18 163 38 -307 -64 306 -138 -83 178 365 -63 -191 -39 60 354 7 48 -135
6762 -135 145 102 -161 163 250 143 -1 -248 -85 203 97 45 -62 87 101 -48 -322 -82 -56 -394 -144 -4
6784 -4 -70 -226 267 -105 -18 53 -314 45 186 -118 -339 -177 -268 278 -15 -128 24 -109 -433 -239 362 -108
6806 -108 4 -100 -103 -17 146 -98 -218 -239 74 -170 -219 -207 -170 -10 -291 -125 -122 -301 -76 -51 -381 227 -178
6829 -178 -61 -13 -205 176 298 175 99 9 -274 -121 146 158 -1 69 -42 3 161 159 101 219 -118 -212 -144 -287
6853 -287 158 123 99 -126 147 -26 14 -133 -28 151 -43 93 32 24 -33 231 -8 207 -210 -39 -35 -13 2 144
6877 144 111 -95 17 223 221 92 96 153 71 142 120 336 434 56 -159 240 -58 72 221 336 54 499 262
6900 262 86 -257 -122 89 228 -10 257 204 -126 186 -72 4 46 -147 134 111 -113 83 84 47 94 15 -257
6923 -257 -44 167 334 59 21 138 63 94 36 87 -42 -90 112 190 -85 93 388 -220 -41 372 -36 -92 80
6946 80 417 -129 -48 -82 88 201 -24 -138 -390 73 -70 10 -144 -52 47 -196 82 -38 131 -117 -32 99
6968 99 140 120 108 -165 16 183 76 15 50 -157 -187 -193 -24 -215 -234 -143 60 -289 142 40 -165 180 58 -326
6992 -326 -142 -207 26 -265 105 66 -214 -94 26 -36 63 188 -215 61 -275 329 -43 14 106 -99 -45 -31 -124
7015 -124 63 -232 43 54 125 -198 471 -146 -77 62 33 131 240 -97 -22 198 -38 155 49 90 0 -31 -60
7038 -60 -299 -100 -100 207 25 -142 -165 -245 -20 90 -155 -153 -373 -31 -226 -154 -109 190 -349 -282 59 -74 -404
7061 -404 -283 256 -102 -158 43 -321 -99 -57 -56 -226 -188 -50 41 -216 -273 -69 247 -371 -48 201 -494 -60
7083 -60 -175 -179 -97 -30 -245 -252 -77 151 -10 -335 -74 11 -211 -118 -101 84 -86 185 -120 17 -277 -149 -48
7106 -48 129 -171 16 31 -68 59 72 46 -221 -278 -426 -136 110 89 -53 -252 55 59 335 -209 61 -205 276
7129 276 28 129 -17 -139 143 164 -184 265 55 48 -70 278 -208 -117 287 37 -76 14 -219 115 21 -19
7151 -19 144 100 263 143 207 -16 -251 407 93 202 59 -223 249 189 -121 109 357 -193 229 182 136 -101
7173 -101 330 -76 153 106 51 232 203 4 -53 162 53 125 117 -8 149 -32 42 76 -225 -55 -29 -92 -155 91
7197 91 133 130 -151 -14 -202 159 -202 -122 -74 -230 150 35 101 -169 -227 -102 8 134 -4 -98 85 261 95
7220 95 275 -188 72 64 -303 171 -28 -6 214 -54 -31 -96 251 -112 -47 -5 -24 233 290 323 32 38 178 -75
7244 -75 -186 151 3 -163 -60 231 -70 72 7 46 24 164 -120 80 131 24 -12 -82 326 73 165 24 38
7267 38 -150 -100 56 178 123 5 -8 136 -57 128 499 -258 82 -61 29 62 91 -11 88 24 35 196 -399
7290 -399 84 145 68 -103 -99 -60 434 -567 -292 -184 -252 115 -259 200 108 65 -14 -50 214 -165 -188 -25 -72 53
7314 53 145 90 -49 -12 -365 121 -115 88 -33 -103 -9 39 -17 107 55 155 195 90 68 -61 -3 -331 -210 19
7338 19 -63 254 224 336 66 -185 293 53 134 114 -66 11 170 10 124 243 86 302 -165 -148 248 421
7360 421 -131 22 109 219 108 266 568 -41 205 103 -78 142 78 -166 60 48 119 220 54 -57 -375
7381 -375 64 269 186 94 -92 -51 -220 -134 -28 18 330 -83 128 -72 -72 -121 3 32 -155 -1 -34 236 -228
7404 -228 47 5 -228 -10 360 -2 -92 -29 -33 -170 181 1 230 -53 -145 -94 -203 -37 -87 -34 185 -121 -314
7427 -314 160 -374 174 -114 235 126 92 100 -154 23 -38 100 -33 359 177 137 -247 -398 -48 -227 219 111
7449 111 -51 -380 -204 174 20 -121 -239 63 -4 -47 -343 -319 -72 135 -406 7 -62 121 -197 -148 -6 -147
7471 -147 -263 -83 -313 -122 -177 2 23 -20 -108 -238 -89 -253 -61 -128 -218 -27 17 -265 -105 -360 -220 132
7493 132 -231 80 -17 -45 -309 72 225 -250 -161 -94 -165 -274 -188 -5 -86 17 27 22 -120 58 -374 4 -163
7516 -163 -281 510 -237 2 -92 59 113 92 -287 -292 81 -160 201 3 2 -15 173 -412 -103 10 -53 100 18
7539 18 -249 -127 227 268 -63 -310 11 -85 359 -325 -65 -55 50 -63 5 342 200 -237 -78 319 -15 440
7561 440 -70 -105 -313 33 -69 139 -9 -81 -520 -159 -82 79 349 114 74 -53 181 21 -188 201 408
7582 408 86 -67 131 -276 334 91 -76 6 148 77 -21 -96 -19 -71 372 -47 129 -341 82 223 159 14
7604 14 95 3 -49 -159 -328 101 -62 89 267 -80 -98 79 5 18 221 -38 -97 -107 285 27 -158 -57 -59 23
7628 23 296 -16 -88 269 254 403 254 243 144 -4 21 -2 217 154 36 47 106 77 35 194 307 85 195 166
7652 166 -24 152 86 109 163 36 80 111 73 80 -390 54 -107 237 -268 -1 349 367 92 -37 -94 89 45 -161
7676 -161 86 1 -74 70 60 -137 36 88 281 75 131 348 152 -38 44 -167 168 -252 -241 259 36 -52 188
7699 188 195 62 53 -77 240 106 79 -80 140 -25 225 -5 -15 18 -124 18 97 90 -61 -139 -173 -409 56 36
7723 36 63 -157 -136 66 17 -78 -316 -101 -171 -50 -363 -258 65 -103 -316 202 -134 150 99 4 -171 -83 93
7746 93 -28 176 -10 237 -72 -6 3 -322 70 -8 56 -197 -197 -278 -141 -210 58 12 -116 198 48 -7 -330 -284
7770 -284 53 -235 -130 -448 -90 42 107 83 196 51 -63 29 -177 40 67 -282 -147 14 -56 -72 -167 94
7792 94 26 -183 187 -54 -266 340 -57 -74 -37 109 -74 -15 -77 72 -231 108 -156 53 -109 26 170 -185
7814 -185 -115 -161 -75 23 -1 -416 20 226 -159 -33 -132 5 -116 123 -64 -108 94 -31 14 123 12 -234 -176
7837 -176 -64 -4 -119 144 -67 230 -442 79 -194 -63 54 -109 254 -65 48 -143 122 -38 -163 -15
7857 -15 210 -150 -95 -47 -42 35 -162 -48 -177 -236 -291 249 116 57 -3 -210 -229 58 79 153 67 165 189 -206 -36
7882 -36 39 39 -111 14 230 297 59 66 -1 82 82 -1 200 -48 183 -260 -23 -247 145 127 29 -47 -33 29 38 5 -9
7909 -9 -19 -220 435 -85 29 164 19 236 216 164 -17 -283 -171 -428 329 -97 128 144 295 313 42 -9 142
7932 142 387 -124 -60 -113 95 -120 -155 -142 -119 -30 -273 -166 -22 -137 -142 -20 66 255 -269 -39 38 -58 -52 101
7956 101 -169 -190 -193 -107 121 -128 -170 313 -9 -25 104 -92 19 66 2 84 -94 -28 93 -82 23 -109 45
7979 45 102 53 -56 360 101 -69 -28 199 7 -278 121 0 35 375 54 -324 -42 -153 154 -117 197 -244
8001 -244 2 164 -61 -197 99 5 -62 -87 125 -217 85 57 300 -164 3 110 2 -155 -135 -39 -34 -107 128
8024 128 -39 -227 -25 155 185 110 -48 17 136 170 254 -213 -71 -169 -61 51 -94 -264 -145 -156 42 -153
8046 -153 -109 -21 172 -146 95 101 15 125 156 222 -71 194 -150 177 -137 110 210 31 92 -36 0 337 44
8069 44 -3 195 -95 356 77 -49 241 182 107 256 103 114 31 46 172 102 168 -70 127 -281 -38 84 91 142
8093 142 -200 34 88 6 -211 140 86 -38 56 -91 37 -275 79 64 -15 -151 -119 277 -133 37 -80 -452
8115 -452 -71 -61 5 -152 21 -119 33 -111 88 -124 203 114 19 -129 -79 168 -55 -92 208 -109 -160 159
8137 159 -28 113 -319 26 -187 22 -3 -220 -187 -179 47 38 -74 48 233 -44 9 215 -286 -230 190 172 19
8160 19 182 -113 -39 -103 38 6 26 -37 -216 131 -117 5 115 -12 268 159 -362 277 153 84 265 96
8182 96 59 -25 61 -62 -146 -190 -152 -266 162
8191A62
##END NTUPLES=NMR FID
##END=
