##TITLE=1H_IAMT-125
 CDCl3, 8 sc, 
 5.4.2019
##JCAMPDX= 6.0         $$ Bruker NMR JCAMP-DX V2.0
##DATA TYPE= NMR FID
##DATA CLASS= NTUPLES
##ORIGIN= UXNMR, Bruker Analytische Messtechnik GmbH
##OWNER= root
$$ XWIN-NMR		Version 3.5
$$ Fri Apr  5 15:57:18 2019 Russian Standard Time (UT+4h)  she@DPX200
##.OBSERVE FREQUENCY= 200.1315
##.OBSERVE NUCLEUS= ^1H
##.DELAY= (6, 6)
##.ACQUISITION MODE= SIMULTANEOUS
##.ACQUISITION SCHEME= undefined
##.AVERAGES= 8
##.DIGITISER RES= 18
##SPECTROMETER/DATA SYSTEM= spect
##.PULSE SEQUENCE= zg30
##.SOLVENT NAME= DMSO
##.SHIFT REFERENCE= (INTERNAL, DMSO, 0, 15.7039)
##AUDIT TRAIL= $$ (NUMBER, WHEN, WHO, WHERE, WHAT)
$$ ##TITLE= Audit trail, XWIN-NMR		Version 3.5
$$ ##JCAMPDX= 5.01
$$ ##ORIGIN= Bruker BioSpin GmbH
$$ ##OWNER= she
$$ F:/spectra/data/she/nmr/H-F/1/audita.txt
$$ ##AUDIT TRAIL=  $$ (NUMBER, WHEN, WHO, WHERE, WHAT)
(   1,<2019-04-05 15:56:06.09 +0400>,<she>,<DPX200>,
      <created by zg, POWCHK disabled, PULCHK disabled
       configuration hash MD5:
       00 E9 B6 7A A2 85 ED C7 34 08 36 98 17 FE 4E 26
       data hash MD5: 16K
       41 D1 86 F3 44 2F 86 2F BF 71 96 FE E2 9C 99 7D>)
$$ ##END=
$$ 
$$ hash MD5
$$ 28 BA EE CA 06 60 D8 16 48 67 C0 33 88 FF 22 D0
##$RELAX= 
##$RELAX= 
##$RELAX= 
##$RELAX= 
##$RELAX= 
##$RELAX= 
$$ Bruker specific parameters
$$ --------------------------
##$DU= <F:/spectra>
##$EXPNO= 1
##$NAME= <H-F>
##$PROCNO= 1
##$TYPE= <nmr>
##$USER= <she>
##$AMP= (0..31)
100 100 100 100 100 100 100 100 100 100 100 100 100 100 100 100 100 100 
100 100 100 100 100 100 100 100 100 100 100 100 100 100 
##$AQSEQ= 0
##$AQ_mod= 1
##$AUNM= <au_zg>
##$AUTOPOS= <>
##$BF1= 200.13
##$BF2= 200.13
##$BF3= 200.13
##$BF4= 200.13
##$BF5= 200.13
##$BF6= 200.13
##$BF7= 200.13
##$BF8= 200.13
##$BYTORDA= 1
##$CFDGTYP= 0
##$CFRGTYP= 5
##$CHEMSTR= <none>
##$CNST= (0..31)
1 1 145 1 1 1 1 1 1 1 1 1 1 1 1 1 1 1 1 1 1 1 1 1 1 1 1 1 1 1 1 1 
##$CPDPRG= <>
##$CPDPRG1= <>
##$CPDPRG2= <>
##$CPDPRG3= <>
##$CPDPRG4= <mlev>
##$CPDPRG5= <mlev>
##$CPDPRG6= <mlev>
##$CPDPRG7= <mlev>
##$CPDPRG8= <mlev>
##$CPDPRGB= <>
##$CPDPRGT= <>
##$D= (0..31)
0 1.2 0 0 0 0 0 0 0 0 0 0.03 0 0 0 0 0 0 0 0 0 0 0 0 0 0 0 0 0 0 0 0 
##$DATE= 1554465365
##$DBL= (0..7)
120 120 120 120 120 120 120 120 
##$DBP= (0..7)
150 150 150 150 150 150 150 150 
##$DBP07= 0
##$DBPNAM0= <>
##$DBPNAM1= <>
##$DBPNAM2= <>
##$DBPNAM3= <>
##$DBPNAM4= <>
##$DBPNAM5= <>
##$DBPNAM6= <>
##$DBPNAM7= <>
##$DBPOAL= (0..7)
0.5 0.5 0.5 0.5 0.5 0.5 0.5 0.5 
##$DBPOFFS= (0..7)
0 0 0 0 0 0 0 0 
##$DE= 6
##$DECBNUC= <off>
##$DECIM= 24
##$DECNUC= <off>
##$DECSTAT= 4
##$DIGMOD= 1
##$DIGTYP= 9
##$DL= (0..7)
0 120 120 120 120 120 120 120 
##$DP= (0..7)
150 150 150 150 150 150 150 150 
##$DP07= 0
##$DPNAME0= <>
##$DPNAME1= <>
##$DPNAME2= <>
##$DPNAME3= <>
##$DPNAME4= <>
##$DPNAME5= <>
##$DPNAME6= <>
##$DPNAME7= <>
##$DPOAL= (0..7)
0.5 0.5 0.5 0.5 0.5 0.5 0.5 0.5 
##$DPOFFS= (0..7)
0 0 0 0 0 0 0 0 
##$DQDMODE= 0
##$DR= 18
##$DS= 0
##$DSLIST= <SSSSSSSSSSSSSSS>
##$DSPFIRM= 0
$$ [...]
##$SUBNAM2= <"">
##$SUBNAM3= <"">
##$SUBNAM4= <"">
##$SUBNAM5= <"">
##$SUBNAM6= <"">
##$SUBNAM7= <"">
##$SUBNAM8= <"">
##$SUBNAM9= <"">
##$SW= 24.9337058887773
##$SWIBOX= (0..15)
0 0 2 0 0 0 0 0 0 0 0 0 0 0 0 0 
##$SW_h= 4990.01996007984
##$TD= 16384
##$TD0= 1
##$TE= 0
##$TE2= 300
##$TE3= 300
##$TEG= 300
##$TL= (0..7)
0 120 120 120 120 120 120 120 
##$TP= (0..7)
150 150 150 150 150 150 150 150 
##$TP07= 0
##$TPNAME0= <>
##$TPNAME1= <>
##$TPNAME2= <>
##$TPNAME3= <>
##$TPNAME4= <>
##$TPNAME5= <>
##$TPNAME6= <>
##$TPNAME7= <>
##$TPOAL= (0..7)
0.5 0.5 0.5 0.5 0.5 0.5 0.5 0.5 
##$TPOFFS= (0..7)
0 0 0 0 0 0 0 0 
##$TUNHIN= 0
##$TUNHOUT= 0
##$TUNXOUT= 0
##$USERA1= <user>
##$USERA2= <user>
##$USERA3= <user>
##$USERA4= <user>
##$USERA5= <user>
##$V9= 5
##$VALIST= <valist>
##$VCLIST= <CCCCCCCCCCCCCCC>
##$VD= 0
##$VDLIST= <DDDDDDDDDDDDDDD>
##$VPLIST= <PPPPPPPPPPPPPPP>
##$VTLIST= <TTTTTTTTTTTTTTT>
##$WBST= 1024
##$WBSW= 4
##$XGAIN= (0..3)
0 0 0 0 
##$XL= 0
##$YL= 0
##$YMAX_a= 174450
##$YMIN_a= -328027
##$ZGOPTNS= <>
##$ZL1= 120
##$ZL2= 120
##$ZL3= 120
##$ZL4= 120
##$ABSF1= 10
##$ABSF2= 0
##$ABSG= 5
##$ABSL= 3
##$ALPHA= 0
##$AQORDER= 0
##$ASSFAC= 0
##$ASSFACI= 0
##$ASSFACX= 0
##$ASSWID= 0
##$AUNMP= <proc_1d>
##$AZFE= 0.1
##$AZFW= 0.1
##$BCFW= 1
##$BC_mod= 2
##$BYTORDP= 1
##$COROFFS= 0
##$CY= 11.3945322036743
##$DATMOD= 1
##$DC= 2
##$DFILT= <>
##$DTYPP= 0
##$F1P= 18.9103706918063
##$F2P= -1.10871071338519
##$FCOR= 0.5
##$FTSIZE= 0
##$FT_mod= 4
##$GAMMA= 1
##$GB= 0.15
##$INTBC= 1
##$INTSCL= 1
##$ISEN= 128
##$LB= 0.24
##$LEV0= 0
##$LPBIN= 0
##$MAXI= 10000
##$MC2= 0
##$MEAN= 0
##$ME_mod= 0
##$MI= 1.114404
##$NCOEF= 0
##$NC_proc= 0
##$NLEV= 6
##$NOISF1= 3.799351
##$NOISF2= 2.8
##$NSP= 1
##$NTH_PI= 0
##$NZP= 0
##$OFFSET= 15.70392
##$PC= 1
##$PHC0= -8861.795
##$PHC1= 23.60028
##$PH_mod= 1
##$PKNL= yes
##$PPARMOD= 0
##$PSCAL= 0
##$PSIGN= 0
##$REVERSE= no
##$SF= 200.130013532006
##$SI= 16384
##$SIGF1= 3
##$SIGF2= 2
##$SINO= 400
##$SIOLD= 16384
##$SREGLST= <1H.CDCl3>
##$SSB= 0
##$STSI= 0
##$STSR= 0
##$SW_p= 3612.71676300578
##$SYMM= 0
##$S_DEV= 0
##$TDeff= 0
##$TDoff= 0
##$TI= <>
##$TILT= no
##$TM1= 0
##$TM2= 0
##$TOPLEV= 0
##$USERP1= <user>
##$USERP2= <user>
##$USERP3= <user>
##$USERP4= <user>
##$USERP5= <user>
##$WDW= 1
##$XDIM= 8192
##$YMAX_p= 0
##$YMIN_p= 0
$$ End of Bruker specific parameters
$$ ---------------------------------
##NTUPLES= NMR FID
##VAR_NAME=  TIME,          FID/REAL,        FID/IMAG
##SYMBOL=    X,             R,               I
##VAR_TYPE=  INDEPENDENT,   DEPENDENT,       DEPENDENT
##VAR_FORM=  AFFN,          ASDF,            ASDF
##VAR_DIM=   8192,          8192,            8192
##UNITS=     SECONDS,       ARBITRARY UNITS, ARBITRARY UNITS
##FACTOR=    0.0002004,     1,               1
##FIRST=     0,             0,               0
##LAST=      1.6414764,     0,               0
##MIN=       0,             -328027,         0
##MAX=       1.6414764,     174450,          0
$$ Real data points
##PAGE= N=1
##DATA TABLE= (X++(R..R)), XYDATA
$$ plain form
0 0 0 0 0 0 8 -8 8 -8 8 -16 16 -24 26 -32 40 -48 58 -71 82 -97 114 -131 154 -178 203 -233 266 -303 343
29 343 -386 437 -492 549 -616 689 -768 852 -948 1053 -1166 1292 -1431 1582 -1753 1943
45 1943 -2153 2393 -2665 2975 -3337 3763 -4276 4900 -5685 6708 -8102 10117 -13317 19195
59 19195 -33586 144147 85419 -212790 -7311 174450 110496 -29506 46643 91385 11128
70 11128 -52894 18303 41248 8352 19882 64148 -3460 -90268 -56824 49041 59495 -7533
82 -7533 -57888 -53344 -20968 23701 14978 -53570 -79229 3470 64736 -1259 -88510 -48390 55784
95 55784 73727 -3154 -60584 -36211 33546 73416 41046 -24930 -36697 17728 53631 27800
107 27800 -56 15484 38127 26633 -2861 -17434 3055 56321 85911 25600 -76033 -80755
$$ packed form
0@%%%%Qj6J6j6J6k4L2m0N0n8P2q8J06j29J53j79K11k45K85l32L81m36M99n69O46
29C43p29Q23r29J041j165J305j457J620j800K001k219K458k723L013l335L696
45A943m096M546n058N640o312P100q039R176j0585J2393j4810J8219k3434L2512
59A9195n2781J77733n8728k98209K05479J81761o3954j40002P6149M4742q0257
70A1128o4022P1197K2945l2896J1530M4266o7608q6808L3444J05865J0454o7028
82g533n0355M544L2376M4669q723o8548k5659Q2699O1266o5995q7251M0120J04174
95E5784J7943p6881n7430K4373O9757L9870l2370o5976j1767N4425L5903k5831
107B7800k7856J5540K2643j1494k9494j4573K0489N3266K9590o0311j01633m722
$$ plain form
119 -80755 31164 105018 41801 -59945 -70820 -10440 25127 10657 -16823 -24917 -8671 8345
131 8345 -8464 -49527 -45239 20429 55644 -3689 -79466 -62855 16976 48494 4301 -40470
143 -40470 -31920 6536 27209 11033 -16968 -15500 24240 52514 22103 -32078 -33164 29325 78904
156 78904 50333 -23670 -54533 -3478 64346 61643 -4076 -33395 10901 47380 13477 -27348
168 -27348 2897 58321 45544 -22458 -52062 -13799 36866 48910 16915 -33543 -56233 -19111
180 -19111 37200 41010 -11406 -46257 -21846 19816 21421 -12324 -30310 -4613 30492 17219
192 17219 -37183 -52774 5679 57061 23615 -45945 -47610 12723 42908 10895 -24810 -16829
204 -16829 16000 28499 7395 -22969 -22393 16120 46006 21914 -32931 -48430 -4552 44877
$$ packed form
119h0755J11919P3854o3217j01746j0875O0380L5567j4470k7480q094J6246J7016
131H345j6809m1063M288O5668L5215n9333p5777J6611P9831L1518m4193m4771
143d0470Q550L8456K0673j6176k8001J468L9740K8274l0411n4181j086O2489M9579
156G8904k8571p4003l0863N1055O7824k703o5719k9319M4296L6479l3903m0825
168b7348L0245N5424j2777o8002k9604L8263N0665J2044l1995n0458k2690L7122
180a9111N6311L810n2416l4851K4411M1662J605l3745j7986K5697L5105j3273
192A7219n4402j5591N8453N1382l3446o9560j665O0333L0185l2013l5705P981
204a6829L2829J2499k1104l0364N76L8513K9886k4092n4845j5499M3878M9429
$$ plain form
216 44877 41492 -8544 -43201 -23916 20084 29894 -743 -20432 -1655 16544 -1245 -29117
228 -29117 -21256 17190 35232 4289 -44489 -51980 -1634 47278 32443 -27327 -51274 -13088
240 -13088 30609 25220 -7330 -22047 -6731 12707 11869 -6775 -17131 1138 26632 18537 -16716
253 -16716 -29439 1163 34755 28101 -5579 -23165 -5133 25798 29230 -1839 -23751 -963
265 -963 34315 23184 -24397 -36517 7939 46301 25391 -24485 -40359 -9384 26175 27895 863
278 863 -21641 -16591 3227 9563 -620 -7928 -886 6810 -1068 -19446 -25344 -1786 29231 25503
292 25503 -18863 -48206 -18215 33972 37117 -8281 -36423 -13970 19080 17582 -6151 -15109 -1412
305 -1412 12956 7577 -11026 -17917 -943 21607 20262 -6120 -23289 -10511 15595 21701 2210
$$ packed form
216D4877l385n0036l4657J9285M4000R810l0637j9689J8777J8199j7789k7872
228b9117P861L8446J8042l0943m8778p491N0346M8912j4835n9770k3947L8186
240a3088M3697n389l2550j4717J5316J9438q38j8644j0356J8269K5494q095l5253
253a6716j2723L0602L3592o654l3680j7586J8032L0931L432l1069k1912K2788
265i63L5278j1131m7581j2120M4456L8362k0910m9876j5874L0975L5559J720k7032
278H63k2504N050J9818O336j0183p308P042P696p878j8378n898K3558L1017l728
292B5503m4366k9343K9991N2187L145m5398k8142K2453L3050j498k3733q958J3697
305a412J4368n379j8603o891J6974K2550j345k6382j7169J2778K6106O106j9491
$$ plain form
318 2210 -15785 -10796 9171 14068 -4155 -18764 -4009 21876 19006 -15705 -35052 -8327 30912
331 30912 31955 -4975 -31476 -18215 13242 23986 7861 -10874 -10767 1723 5970 -2599 -5984
344 -5984 5541 17255 8050 -15418 -23054 -1727 26618 27041 -2377 -27583 -18748 12644 27013
357 27013 7884 -17099 -15586 5753 13281 -2069 -14876 -4309 14533 14777 -6678 -22681 -11173
370 -11173 14249 21985 3105 -16759 -13274 5272 11988 1169 -7999 -1736 8378 6470 -7963
383 -7963 -14865 -1692 18959 22098 -1702 -25146 -18805 11693 29087 12524 -15452 -20834 -1462
396 -1462 14289 9200 -4846 -6148 3546 4418 -7643 -13555 507 18320 14146 -9047 -23998 -12088
410 -12088 12159 20047 4083 -15648 -17477 -1054 12134 5803 -8440 -10071 2306 8402 -2356
$$ packed form
318B210j7995M989J9967M897j8223j4609J4755K5885k870l4711j9347K6725L9239
331C0912J043l6930k6501J3261L1457J0744j6125j8735J07J2490M247q569l385
344e984J1525J1714r205k3468p636K1327K8345M23k9418k5206Q835L1392J4369
357B7013j9129k4983J513K1339P528j5350j2807J0567J8842K44k1455j6003J1508
370a1173K5422P736j8880j9864L485J8546O716j0819r168O263J0114j908j4433
383g963o902J3173K0651L139k3800k3444O341L0498J7394j6563k7976n382J9372
396a462J5751n089j4046j302R694Q72j2061n912J4062J7813m174k3193j4951J1910
410a2088K4247P888j5964j9731j829J6423J3188o331j4243j631J2377O096j0758
$$ plain form
423 -2356 -14872 -9275 9500 16412 1690 -16892 -16518 1582 13924 6283 -8474 -10823 -538
436 -538 5526 -1663 -9120 -2596 9653 9436 -6442 -18257 -8554 12641 20251 4643 -15109 -17216
450 -17216 -395 14252 12233 -1958 -10782 -5800 4404 5838 -216 -2157 5021 8416 -1691 -12895
464 -12895 -6939 12128 18915 3523 -14925 -13037 4159 13975 6027 -6515 -8480 -95 6337 2667
478 2667 -5358 -5477 3862 10066 2344 -10950 -11984 2305 13973 8000 -6691 -11766 -2849 7181
492 7181 5522 -2169 -4618 1538 5545 -810 -8360 -3546 9063 13333 507 -13659 -11583 3989
506 3989 15307 9422 -6237 -12732 -4251 7178 7963 -279 -5434 -2293 1562 119 -3867 -2553 3446
521 3446 6221 143 -9444 -10407 547 10599 5988 -7446 -11587 -1957 7412 4933 -4138 -6342 -246
$$ packed form
423b356j2516N597J8775O912j4722j8582L74J8100J2342p641j4757k349J0285
436e38O064p189p457O524J2249k17j5878j1815R703K1195P610j5608j9752k107
450a7216J6821J4647k019j4191q824M982J0204J434o054j941P178L395j0107j1204
464a2895N956J9067O787j5392j8448J888J7196R816p948j2542j965Q385O432l670
478B667q025j19R339O204p722j3294j034J4289J1668n973j4691n075Q917J0030
492G181j659p691k449O156M007o355p550M814J2609M270j2826j4166K076J5572
506C989J1318n885j5659o495Q481J1429P85q242n155L141L855j443l986J314N999
521C446K775o078r587r63J0954J0052m611j3434m141R630R369k479r071k204O096
$$ plain form
536 -246 5301 2343 -4969 -6644 1492 9709 5853 -6293 -10923 -1364 8432 7173 -1804 -5572 -1343
551 -1343 2817 2627 473 135 2334 3873 776 -4722 -4950 4286 12066 6640 -7165 -11797 -847
566 -847 11208 9922 -1059 -7829 -3628 4517 6130 2074 -902 1417 3418 410 -3534 -1173 5634
581 5634 7408 2665 -3075 -5226 -895 6100 8084 624 -7319 -4277 5513 6111 -2330 -5312 1662
596 1662 5365 198 -5528 -4649 954 5281 4731 -1412 -7762 -5557 3236 6420 483 -4163 -2269 233
612 233 -853 -1192 869 2538 2351 84 -4555 -6644 74 9978 7970 -4239 -9701 -2779 5221 5951
628 5951 1905 -1615 -3631 -2526 2061 2784 -238 39 3333 1497 -5027 -5737 3098 7165 2657 -3009
644 -3009 -4078 -1818 1839 4891 3017 -1939 -2833 1994 3272 -410 -1892 3771 7157 2339 -3274
$$ packed form
536b46N547k958p312j675Q136Q217l856j2146m630R559R796j259q977l768M229
551a343M160j90k154l38K199J539l097n498k28R236P780n426j3805m632J0950
566h47J2055j286j0981o770M201Q145J613m056k976K319K001l008l944K361O807
581E634J774m743n740k151M331O995J984p460p943L042R790N98q441k982O974
596A662L703n167n726Q79N603M327n50o143o350K205Q793L184n937m646J894K502
612B33j086l39K061J669j87k267m639k089O718R904k008j2209n462O922Q000P30
628E951m046l520k016J105M587P23l022K77L294j836o524p10Q835M067m508n666
644c009j069K260L657L052j874m956q94M827J278l682j482N663L386m818n613
$$ plain form
659 -3274 -2844 920 4717 6814 4771 -1499 -4376 706 7549 6304 1527 740 3103 993 -2228 210
675 210 6359 7813 2258 -4229 -5198 -825 5282 7037 2400 -4470 -5602 -235 3512 2291 491 -797
691 -797 -1405 -2553 -2296 -739 -48 2037 1859 -3037 -7864 -4683 3082 3780 -2320 -4559 -1459 -538 -1988
708 -1988 -528 2214 1412 -1474 -982 -835 -2858 -1407 4416 6302 -571 -5987 -3478 2455 4785 3783
724 3783 1346 -1053 -1769 73 3014 3446 3402 3262 -189 -4310 -2919 2605 5935 3798 -196 -3269
740 -3269 -4180 73 5521 5278 -191 -2849 -1174 714 280 841 3459 2376 -1021 -3169 -2043 111
756 111 2088 3737 2188 -2102 -3157 51 2839 2719 1137 1145 711 -1327 -1901 559 2707 3263 1402
773 1402 -1683 -3776 -2449 1809 5311 3321 -1449 -2961 -768 1151 1589 1711 2072 -538 -3941 -3888
$$ packed form
659c274M30L764L797K097k043o270k877N082O843j245m777p87K363k110l221K438
675B10O149J454n555o487r69M373O107J755m637o870j132N367L747j221j800j288
691g97o08j148K57J557O91K085j78m896m827L181P765O98o100k239L100R21j450
708a988J460K742q02k886M92J47k023J451N823J886o873n416K509N933K330j002
724C783k437k399p16J842K941M32m4j40l451m121J391N524L330k137l994l073
740c269r11M253N448k43n469k658J675J888m34N61K618j083l397k148J126K154
756A11J977J649j549m290j055L208K788j20j582Qm34k038n74K460K148N56j861
773A402l085k093J327M258L502j990m770j512K193J919M38J22L61k610l403N3
$$ plain form
789 -3888 667 2914 1118 -938 -1812 -2925 -3553 -93 3807 2591 -2074 -4119 -1489 618 604 316
805 316 232 -1340 -2508 -2269 -1198 368 1602 1352 -295 -1767 -1237 95 1695 2626 1952 -422 -1959
822 -1959 -23 1299 790 95 1172 881 -2906 -3826 601 3902 2570 -293 -921 -1260 -1214 1137 3314
839 3314 2325 -942 -1828 -887 -566 79 1861 1177 -1950 -3029 -1216 617 1393 1886 1603 -611 -2217
856 -2217 -233 1732 1117 -146 -14 77 -1208 -1333 702 1491 -100 -1009 -384 -544 -902 14 2276 2259
874 2259 156 -1415 -1111 49 319 767 472 -938 -2055 -1733 -273 1202 929 601 -925 -1853 -1565
891 -1565 994 2562 1293 -133 -870 -1720 -1591 630 1732 -72 -2283 -1978 9 80 -234 1351 2120
908 2120 -646 -2261 -261 2322 1112 -591 375 551 -1484 -1574 516 1311 -7 -1354 -682 -80 -53
$$ packed form
789c888M555K247j796k056q74j113o28L460L900j216m665k045K630K107j4k88
805C16q4j572j168K39J071J566J234k50j647j472N30J332J600R31o74k374j537
822a959J936J322n09o95J077k91l787r20M427L301j332k863o28l39M6K351K177
839C314r89l267q86R41L21O45J782o84l127j079J813J833P76M93k83k214j606
856b217J984J965o15j263J32R1j285j25K035P89j591r09O25j60l58R16K262j7
874B259k103j571L04J160K70M48k95j410j117L22J460J475k73l28j526r28K88
891a565K559J568j269j426p37q50J29K221J102j804k211L05J987P1l14J585P69
908B120k766j615K000K583j210j703R66J76k035r0K090P95j318j347O72O02K7
$$ plain form
925 -53 909 1811 1694 -6 58 -111 -341 564 1901 1014 -720 -1190 -341 -506 406 1201 1366 -914 -1213 855
945 855 1774 1314 1129 1301 -22 -1590 -803 1556 1595 -1 -1521 -1039 -1131 -40 1093 1232 -128 -1579
963 -1579 -842 -234 745 1360 1539 268 -1502 -953 -293 259 421 746 -112 -679 -900 550 1265 1365 995
982 995 801 -2 -521 545 1162 1418 383 -114 -942 -1542 -768 388 985 110 -1148 -1168 -714 398 1189
1001 1189 1234 38 -1161 -1447 -855 -183 189 51 -664 -2284 -2581 -719 799 756 -167 -1189 -1002 -791
1019 -791 227 1284 1284 -212 -1131 -725 -659 -317 -89 778 125 -869 -1713 -298 843 938 335 187 -17 -787
1039 -787 -630 527 1201 1013 -445 -1509 -1841 -912 262 667 822 -356 -1429 -1691 -79 1503 1927
1056 1927 616 -399 -1180 -574 208 1347 1461 212 -1646 -1387 -860 592 1220 1308 800 -534 -774 208
$$ packed form
925e3R62R02j17j700O4j69k30R05J337q87j734m70Q49j65R12P95J65k280k99K068
945H55R19m60j85J72j323j568P87K359L9j596j520M82r2J091J133J39j360j451
963a579P37O08R79O15J79j271j770N49O60N52J62L25q58n67k21J450P15J00l70
982I95j94q03n19J066O17K56j035m97q28o00P74J156N97q75j258k0M54J112P91
1001A189M5j196j199k86N92O72L72j38p15j620k97J862J518m3r23j022J87K11
1019g91J018J057%j496r19M06O6L42K28Q67o53r94q44J415J141R5o03j48k04p70
1039g87J57J157O74j88j458j064l32R29J174M05J55j178j073k62J612J582M24
1056A927j311j015p81O06P82J139J14j249j858K59N27J452O28Q8n08j334k40R82
$$ plain form
1074 208 1870 1976 625 -292 -698 -958 -534 548 1220 563 -711 -1293 -1386 -311 976 999 980 -349 -712
1093 -712 -340 505 838 596 396 -629 -1737 -1504 -241 985 1158 69 -1475 -1718 -1154 143 1284
1110 1284 641 -353 -1152 -1050 -541 444 813 352 -956 -2132 -1790 -491 774 940 55 -857 -1157 -900
1128 -900 17 760 908 492 -886 -967 -422 354 1110 759 43 -539 -1190 -471 605 2000 1482 403 -244
1147 -244 -519 -155 1183 1792 882 -45 -600 -599 -81 230 1198 1284 -147 -1074 -1225 403 1419 1301 787 -122
1167 -122 -909 -301 550 825 478 -1 -791 -1359 -1209 -52 889 837 -113 -936 -1287 -86 1013 935 553 -35
1187 -35 -280 -288 -313 -53 806 1040 -235 -545 -631 173 860 1455 1317 423 -66 -58 812 1614 1261 759 421 -294
1209 -294 -257 230 747 821 435 -556 -966 -179 453 1068 497 -926 -1222 -1273 -471 589 454 155 -673 -777
$$ packed form
1074B08J662J06j351r17m06k60M24J082O72o57j274n82r3J075J287K3j9j329l63
1093g12L72Q45L33k42k00j025j108K33J263J226J73j089j544k43N64J297J141
1110A284o43r94p99J02N09R85L69m61j308j176L42J299J265J66q85r12l00K57
1128i00R17P43J48m16j378q1N45P76P56l51p16n82o51P19J076J395n18j079o47
1147b44k75L64J338O09r10r27n55JN18L11R68Q6j431r27j51J628J016j18n14r09
1167a22p87O08Q51K75l47m79p90n68J50J157R41n2r50q23l51J201J099p8l82n88
1187c5k45qk5K60Q59K34j275l10q6Q04O87N95j38q94m89QQ70Q02l53n02l38p15
1209b94L7M87N17P4l86r91m10P87O32O15n71j423k96n1Q02J060j35k99q28j04
$$ plain form
1229 -777 -1054 -900 -520 328 158 -551 -1115 -813 290 831 728 -46 -119 -759 -307 175 808 488 336 668
1249 668 289 -101 607 1582 1523 785 295 607 736 1346 1821 1203 488 16 -12 395 461 501 656 533 -356
1270 -356 -709 386 743 260 398 -269 -808 -318 230 677 117 -1015 -791 -644 -676 -567 -42 -169 -576 -638
1290 -638 -412 -375 -73 400 143 -758 -712 0 216 -22 288 155 -377 -236 40 469 -372 -170 756 422 -429
1311 -429 -463 728 949 208 -604 -253 96 190 -108 295 51 -614 -439 -468 105 5 -354 -173 -264 -347 -121
1332 -121 86 603 -9 -591 -522 -571 375 219 97 -10 -141 -120 75 446 689 486 478 -324 65 171 421 867
1354 867 809 98 -756 -507 395 672 336 -46 4 164 116 160 707 500 -155 -7 -353 -228 123 992 805
1375 805 -120 -805 -648 -31 303 185 107 168 -412 -290 -38 300 478 376 65 -651 -926 9 491 792 -352
$$ packed form
1229g77k77J54L80Q48j70p09n64L02J103N41j03p74p3o40M52M82O33l20j52L32
1249F68l79l90P08R75n9p38m90L12J29O10M75o18p15m72k8M07O6M0J55j23q89
1270c56l53J095L57m83J38o67n39M90N48M47n60j132K24J47l2J09N25j27m07o2
1290f38K26L7L02M73k57r01M6P12K16k38L10j33n32J41K76M29q41K02R26l34q51
1311d29l4J191K21p41q12L51L49R4k98M03k44o65J75k9N73j00l59J81r1q3K26
1332a21K07N17o12n82O9m9R46j56j22j07j31K1J95L71K43k03qq02L89J06K50M46
1354H67n8p11q54K49R02K77l36l82N0J60m8M4N47k07o55J48l46J25L51Q69j87
1375H05r25o85J57O17L34j18p8O1n80J22K52L38J78j02l11p16k75R35M82L01j144
$$ plain form
1396 -352 -547 -814 -633 -48 597 262 -144 -433 -302 40 164 473 -42 -289 -406 -751 -52 567 803 303
1416 303 -603 -603 -451 -79 322 511 10 7 -136 -571 -168 821 517 441 -194 -674 -615 43 878 1002 -14 -1084
1438 -1084 -195 211 374 339 596 311 -415 -1011 183 853 757 302 148 -1139 -1008 -105 1137 767 -297
1457 -297 -561 -228 -218 -254 361 615 96 -402 -538 -447 -70 831 1042 -244 -767 -756 295 44 236 600 116
1478 116 -809 -447 440 769 27 158 367 -375 -1087 53 968 434 139 -334 -340 -393 107 994 751 -286
1498 -286 -565 -92 -97 8 375 723 65 -983 -568 -81 210 577 809 34 -1195 -832 180 707 67 -323
1518 -323 180 -320 -519 -396 329 450 -136 -418 -695 -459 307 479 593 19 -562 -709 -457 -234 725 373
1538 373 -83 -220 -332 -135 153 377 514 196 -1055 -385 295 632 510 236 35 -541 -480 47 644 584
$$ packed form
1396c52j95k67J81N85O45l35m06k89J31L42J24L09n15k47j17l45O99O19K36n00
1416C03r06%J52L72M01J89n01lj43m35M03R89l04p6o35m80N9O58Q35J24j016j070
1438a084Q89M06J63l5K57k85p26n96J194O70r6m55j54j287J31R03J242l70j064
1457b97k64L33J0l6O15K54n19m98j36R1L77R01K11j286n23J1J051k51J92L64m84
1478A16r25L62Q87L29p42J31K09p42p12J140R15n34k95m73on3N00Q87k43j037
1498b86k79M73nJ05L67L48o58j048M15M87K91L67K32p75j229L63J012N27o40l90
1518c23N03n00j99J23P25J21n86k82k77K36P66J72J14n74n81j47K52K23R59l52
1538C73m56j37j12J97K88K24J37l18j251O70O80L37j22k74k01n76O1N27N97o0
$$ plain form
1558 584 -201 22 -348 -351 -236 207 522 31 -754 -571 -370 123 300 177 -489 -922 -438 -18 39 -71 168
1579 168 -53 -601 -664 -7 358 450 254 -161 -925 -593 138 1005 739 -123 -130 97 160 170 557 612 -22 -246
1601 -246 -107 150 73 728 643 -206 -759 -376 436 611 82 73 -49 -304 84 300 134 -115 -295 -342 -591 -604
1623 -604 -240 359 -262 -489 -944 -570 -362 163 276 -523 -623 -382 -169 -75 -69 110 -455 -266 -528 -416 113
1644 113 188 648 158 -805 -208 313 432 449 28 443 83 147 222 470 685 -22 -168 -149 -165 466 952 619
1666 619 175 -582 -80 303 458 463 169 182 -267 -265 170 -1 424 80 -576 -742 3 335 273 126 79 -517
1688 -517 -211 -191 82 144 35 -142 -519 -538 -434 28 27 150 86 -165 -186 -43 569 681 387 -126 -389 -205
1710 -205 208 394 482 -172 -779 -659 -453 79 447 879 102 -347 -566 -297 357 775 232 -235 -88 -370
$$ packed form
1558E84p85K23l70lJ15M43L15m91p85J83K01M93J77j23o66m33M84M20N7j10K39
1579A68k21n48o3O57L65R2j96m15p64L32P31Q67k66q62pK27O3J0L87N5o34k24
1601b46J39K57p7O55q5q49n53L83Q12J75n29rj22k55L88K16j66k49j80m7k49j3
1623f04L64N99o21k27m55L74K08N25J13p99j00K41K13R4OJ79n65J89k62J12N29
1644A13P5M60m90r63N97N21J19J7m21M15l60O4P5K48K15p07j46J9j6O31M86l33
1666F19m44p57N02L83J55Nk94J3m49KM35j71M25l44o56j66P45L32o2j47m7n96
1688e17L06K0K73O2j09j77l77j9J04M62jJ23o4k51k1J43O12J12k94n13k63J84
1710b05M13J86Q8o54o07J20K06N32L68M32p77m49k19K69O54M18n43m67J47k82
$$ plain form
1730 -370 -94 31 346 302 -283 -789 -486 -137 54 273 8 -535 -323 -167 186 396 414 55 -450 -719 -225
1751 -225 67 468 306 -206 -385 -537 88 426 1150 508 3 -27 -50 -91 747 562 467 -81 -548 -167 262
1772 262 556 810 391 -383 -166 -271 332 640 697 -130 -574 -515 -465 224 364 22 -127 -733 -751 -419 279
1793 279 580 39 -80 -849 -709 34 424 408 -324 -602 -677 -377 -22 158 592 242 -291 -723 308 705
1813 705 773 704 159 -644 -514 -114 511 377 507 53 -454 -599 34 228 656 428 -249 -322 -335 158 401
1834 401 597 -84 -481 -616 -494 -90 196 433 -201 -759 -703 -492 -179 297 88 -126 -473 -698 -274 222
1854 222 121 362 -233 -340 -638 -247 293 130 107 -26 -17 -171 393 1050 1028 407 -54 -342 0 393 639
1875 639 484 280 -527 -491 -178 277 596 392 -30 -304 -819 -220 259 330 218 -302 -607 -592 -166 50 209
$$ packed form
1730c70K76J25L15m4n85n06L03L49J91K19k65n43K12J56L53K10J8l59n05k69M94
1751b25K92M01j62n12j79j52O25L38P24o42n05l0k3m1Q38j85r5n48m67L81M29
1772B62K94K54m19p74K17j05O03L08N7q27m44N9N0O89J40l42j49o06j8L32O98
1793B79L01n41j19p69J40P43L90j6p32k78p5L00L55J80M34l50n33m32J031L97
1813G05O8o9n45q03J30M00O25j34J30m54n07j45O33J94M28k28o77p3j3M93K43
1834D01J96o81l97j35J22M04K86K37o34n58N6K11L13M76k09k14l47k25M24M96
1854B22j01K41n95j07k98L91N40j63k3j33Rj54N64O57k2o21m61k88L42L93K46
1875F39j55k04q07L6L13M55L19k04m22k74n15N99M79P1j12n20l05J5M26K16J59
$$ plain form
1896 209 -224 -458 -844 -708 -432 70 335 -13 -232 -817 -85 226 390 133 -62 -571 -715 -211 -139 312
1916 312 140 -129 -359 -320 -99 654 768 188 201 -26 -347 20 549 350 114 -297 -565 -72 175 233 626
1937 626 109 -371 -398 8 -32 335 379 -86 -138 -439 -236 206 246 212 -159 -478 -48 -264 510 435 153 -4
1959 -4 -263 118 324 336 103 235 -267 -50 -299 63 827 99 218 -157 -284 24 1 237 53 78 -421 -227
1981 -227 -134 595 261 85 -300 -268 -132 77 13 330 -108 -438 -161 154 38 252 230 30 -244 7 43 58
2003 58 167 239 -176 -454 -333 -354 -94 389 196 -50 17 -348 101 197 41 -2 -63 -268 -251 206 280 -146 -255
2026 -255 -333 63 -394 158 548 38 -248 -558 -80 224 592 386 278 2 -597 7 243 -110 122 -153
2046 -153 -175 -258 176 26 702 477 -93 -353 -125 -74 355 101 448 -267 -43 -39 36 115 245 342 132 -386 -178
$$ packed form
1896B09m33k34l86J36K76N02K65l48k19n85P32L11J64k57j95n09j44N04P2M51
1916C12j72k69k30L9K21P53J14n80J3k27l21L67N29j99k36m11k68M93K47N8L93
1937F26n17m80k7M06m0L67M4m65n2l01K03M42M0l4l71l19M30k16P74p5k82j57
1959dk59L81K06J2k33J32n02K17k49L62P64p28J19l75j27L08k3K36j84K5m99J94
1981b27R3P29l34j76l85L2J36K09o4L17m38l30K77L15j16K14k2k00k74K51L6J5
2003E8J09P2m15k78J21k1K60M83j93k46O7l65M49R6j56m3o1k05J7M57P4m26j09
2026b55p8L96m57N52L90n10k86l10M78L04L68k06j08k76n99O04K36l53K32k75
2046a53k2q3M34j50O76k25n70k60K28N1M29k54L47p15K24MP5P9J30R7k10n18K08
$$ plain form
2069 -178 425 257 145 -80 132 -591 169 561 139 246 -173 -48 -194 -213 165 422 52 62 -53 -123 34
2090 34 382 326 250 -214 -603 3 179 0 253 -371 19 -165 -475 40 -111 420 250 -89 -656 72 194
2111 194 873 52 -80 -117 -235 146 131 141 -18 -417 -101 2 -170 -30 273 374 -325 -430 -399 122 431
2132 431 256 -249 -540 -333 -77 343 214 -248 81 142 -551 -176 208 627 540 -301 -609 -353 94 135 189
2153 189 -275 -293 -109 38 150 70 47 53 5 -95 -388 77 403 122 124 -84 -319 74 -23 404 -227 -378 -155
2176 -155 22 188 202 132 209 192 -171 -461 -197 525 482 126 -82 -561 -98 252 186 -24 40 -261 -207 4 -101
2199 -101 278 394 218 -46 -607 -49 143 525 -137 -422 -37 -105 125 125 -207 180 267 267 30 -154 34 341
2221 341 76 -177 -535 -338 70 330 67 -444 -465 -293 261 -107 -162 148 35 202 -276 -430 -229 277 222
$$ packed form
2069a78O03j68j12k25K12p23P60L92m22J07m19J25j46j9L78K57l70J0j15p0J57
2090C4L48n6p6m64l89O06J76j79K53o24L90j84l10N15j51N31j70l39n67P28J22
2111A94O79q21j32l7j18L81j5J0j59l99L16J03j72J40L03J01o99j05L1N21L09
2132D31j75n05k91K07K56M20j29m62L29O1o93L75L84M19q7q41l08K56M47M1N4
2153A89m64j8J84J47J12q0k3Om8j00k93M65L26k81Kk08k35L93r7M27o31j51K23
2176a55J77J66J4p0P7j7l63k90K64P22m3l56k08m79M63L50o6k10O4l01N4K11j05
2199a01L79J16j76k64n61N58J92L82o62k85L85o8K30%l32L87Q7%k37j84J88L07
2221C41k65k53l58J97M08K60k63n11k1J72N54l68n5L10j13J67m78j54K01N06n5
$$ plain form
2242 222 -123 -385 -693 -33 8 182 -340 -304 28 213 43 -427 -95 79 -96 -46 -299 56 327 658 368
2263 368 -307 -333 -41 617 537 -92 -209 300 168 175 152 151 -150 96 437 12 -14 122 472 179 -553 -572 -118
2286 -118 280 298 -109 -213 177 -326 -258 -23 -312 -42 165 65 -295 -465 64 445 -9 -375 -426 -132 291
2307 291 56 -331 -300 140 214 -164 -318 -95 18 134 -189 -311 -395 227 297 -242 -224 -411 265 14 421 -66
2329 -66 -420 -72 412 73 -75 -460 123 440 349 -327 -119 -63 448 211 -118 -277 -183 347 77 123 -404 -24
2351 -24 395 359 337 -176 70 363 67 -464 -218 164 771 500 -4 -58 -75 623 544 -127 -329 -203 44 226
2373 226 -483 86 -61 377 82 -268 -553 -137 393 489 -55 -209 -19 217 212 -100 -177 -92 61 265 177 -484
2395 -484 211 302 198 -305 -587 -141 628 561 -420 -454 -142 36 430 153 -268 23 362 190 -303 -106 312
$$ packed form
2242B22l45k62l08O60M1J74n22L6L32J85j70m70L32J74j75N0k53L55K71L31k90
2263C68o75k6K92O58q0o29j17N09j32Pk3jl01K46L41m25k6J36L50k93p32j9M54
2286a18L98J8m07j04L90n03O8K35k89K70K07j00l60j70N29L81m54l66n1K94M23
2307B91k35l87L1M40P4l78j54K23J13J16l23j22q4O22P0n39J8j87O76k51M07m87
2329f6l54L48M84l39j48l85N83L17r1o76K08N6N11k37l29j59R4N30k70M6n27L80
2351b4M19l6k2n13K46K93k96n31K46L82O07k71n04n4j7O98p9o71k02J26K47J82
2373B26p09N69j47M38k95l50k85M16N30R6n44j54J90K36nl12p7Q5J53K04q8o61
2395d84O95R1j04n03k82M46P69o7r81l4L12J78L94k77m21K91L39j72m93J97M18
$$ plain form
2416 312 333 17 -683 -516 -62 508 378 26 -536 -142 101 360 96 -441 24 195 -199 -204 -443 92 275
2437 275 551 -528 -319 -159 348 572 -91 -112 -169 194 313 30 -333 -105 -20 1 -377 -271 179 540 149
2458 149 -256 -527 -367 291 420 426 -176 -141 345 194 217 -343 87 156 170 -407 -621 1 288 442 -174 -694
2480 -694 -308 462 701 32 -545 -340 299 -44 -117 38 -174 404 497 -326 -323 -145 484 658 -48 -266 -301 -84
2502 -84 42 302 -449 -252 384 377 33 -172 280 386 258 -171 -800 -292 654 683 131 -248 -313 198 533 58
2524 58 -499 -312 131 178 -322 12 -30 297 477 -334 -539 -26 506 878 338 -745 -339 25 319 138 -340
2545 -340 -161 318 293 138 -309 -172 756 354 189 -464 -281 484 536 450 -273 -365 11 313 62 -217 29
2566 29 482 -44 -67 -410 -79 321 430 89 -637 -199 82 836 300 -380 -608 -124 201 128 -377 -285 164
$$ packed form
2416C12K1l16p00J67M54N70j30l52n62L94K43K59k64n37M65J71l94nk39N35J83
2437B75K76j079K09J60N07K24o63k1n7L63J19k83l63K28Q5K1l78J06M50L61l91
2458A49m05k71J60O58J29Oo02L5M86j51K3n60M30O9J4n77k14O22K87J54o16n20
2480f94L86P70K39o69n77K05O39l43p3J55k12N78R3q23LJ78O29J74p06k18l5K17
2502h4J26K60p51J97O36pl44k05M52J06j28m29o29N08R46K9n52l79o5N11L35m75
2524E8n57J87M43M7n00L34m2L27J80q11k05N13N32L72n40j083M06L64K94j81m78
2545c40J79M79k5j55m47J37R28m02j65o53J83P65N2q6p23r2L76L02k51k79K46
2566B9M53n26k3l43L31M00J09l41p26M38K81P54n36o80k28M84L25p3n05R2M49
$$ plain form
2587 164 498 -25 -473 -275 244 667 -28 -346 -674 362 447 464 -220 -333 302 342 8 -306 -119 322 462
2608 462 77 -756 -345 374 451 315 -362 -154 41 369 -125 -275 -254 22 216 95 -299 -123 84 401 -69
2629 -69 -306 -305 -157 462 318 -619 -503 -24 550 452 -247 -378 -12 424 -83 -163 -195 111 448 181 -472 -411
2651 -411 148 182 422 -486 -487 -64 135 439 -94 -368 317 200 107 -384 -621 42 447 157 -390 -337 111 624
2673 624 359 -419 -542 106 432 229 -494 -399 -425 488 39 -283 -372 201 451 365 -320 -363 101 456 188 -417
2695 -417 -271 -177 507 352 -40 -177 206 197 241 -42 -553 -52 716 -38 -107 -763 -77 462 142 -384 -343 -207
2717 -207 278 152 -459 -424 23 -4 80 -130 -401 199 135 -23 -144 -541 -29 338 358 -39 -373 -50 234 475
2739 475 82 -454 329 512 117 -339 163 -131 184 181 -375 -245 -95 378 489 76 -266 133 568 142 -192
$$ packed form
2587A64L34n23m48J98N19M23o95l18l28J036Q5J7o84j13O35M0l34l14J87M41J40
2608D62l85q33M11P19P7j36o77K08J95L28m94j50K1K76J94j21l94J76K07L17m70
2629f9k37JJ48O19j44r37J16M79N74r8o99j31L66M36n07q0l2L06L37k67o53O1
2651d11N59L4K40r08jM23J99L04n33k74O85j17r3m91k37O63M05k90n47N3M48N13
2673F24k65p78j23O48L26k03p23R5k6R13m49l22q9N73K50q6o85m3M64L55k68o05
2695d17J46R4O84j55l92j37L83rM4k83n11N01P68p54o9o56O86N39l20n26M1J36
2717b07M85j26o11L5M47k7Q4k10k71O00o4j58j21l97N12L67K0l97l34L23K84K41
2739D75l93n36P83J83l95m56N02k94L15ln56J30J50M73J11m13l42L99M35m26l34
$$ plain form
2760 -192 -305 -183 285 43 -245 -309 -216 409 458 -485 -749 -130 525 224 23 -315 -9 182 281 -394 -465 -102
2782 -102 325 541 -247 -347 -192 457 470 -282 -404 -512 257 391 -59 -302 -189 120 184 127 -208 -38 247
2803 247 176 -115 -129 11 749 617 145 -323 -372 402 17 47 -375 144 -73 -46 -400 -287 89 397 544 -272
2825 -272 -449 -334 72 232 -211 -344 -533 369 116 -57 -141 29 88 -108 -254 -422 -300 331 604 29 -456
2846 -456 -212 306 176 154 -5 -87 200 -31 86 -125 -116 331 435 -215 -175 48 250 301 27 -726 -420 158
2868 158 274 -15 79 -327 200 73 21 72 -298 360 40 -241 -492 314 141 289 -7 127 -365 137 405
2889 405 12 -138 -191 194 272 -150 -156 -17 45 189 160 -102 -52 191 205 269 95 -279 356 76 -33 -97 -175 -31
2913 -31 29 53 -452 -12 372 271 -171 -5 3 369 133 197 -358 12 -61 114 242 169 -240 -22 146 148 -114
$$ packed form
2760a92j13J22M68k42k88o4R3O25M9r43k64O19O55l01k01l38L06J91R9o75p1L63
2782a02M27K16p88j00J55O49J3p52j22j08P69J34m50k43J13L09O4n7l35J70K85
2803B47p1k91j4J40P38j32m72m68m9P74l85L0m22N19k17K7l54J13L76L08J47q16
2825b72j77J15M06J60m43j33j89R02k53j73q4J70N9j96j46j68J22O31K73n75m85
2846d56K44N18j30k2j59q2K87k31J17k11RM47J04o50M0K23K02N1k74p53L06N78
2868A58J16k89R4m06N27j27n2N1l70O58l20k81k51Q06j73J48k96J34m92N02K68
2889D05l93j50n3L85P8m22oJ39O2J44k9k62N0K43J4O4j74l74O35k80j09o4p8J44
2913c1O0K4n05M40L84j01m42J66QL66k36O4n55L70p3J75J28p3m09K18J68Kk62
$$ plain form
2936 -114 10 319 56 174 -409 -122 -35 485 77 -205 60 53 51 3 252 -238 23 321 -192 -39 -290 187
2958 187 341 90 -403 -250 100 -46 439 -98 -418 -2 220 -32 -604 -145 -11 333 -76 -20 -187 478
2978 478 159 151 -233 -314 41 143 158 48 -228 -217 254 246 70 -88 262 -39 264 12 -200 -303 -69 -29 -164
3001 -164 -96 -373 131 25 -73 -176 177 39 154 -103 154 -109 10 -133 -251 -20 -15 112 315 -354 -286 -17
3023 -17 28 317 63 -110 -87 437 122 -231 -517 -84 79 57 -345 -87 278 189 -20 -174 -77 182 -42 314
3045 314 -166 21 139 -145 113 137 -305 21 206 -183 -280 146 -41 107 -99 -252 -425 -202 307 377 -262
3066 -262 -24 -194 166 5 144 -356 -25 288 190 -200 -323 274 -8 99 -257 -9 100 253 157 -238 -278
3087 -278 -132 44 133 138 17 162 105 314 -322 -61 272 205 219 -159 -399 -260 137 254 -40 -62 139 -43
$$ packed form
2936a14J24L09k63J18n83K87Q7N20m08k82K65pkm8K49m90K61K98n13J53k51M77
2958A87J54k51m93J53L50j46M85n37l20M16K22k52n72M59J34L44m09N6j67O65
2978D78l19ql84q1L55J02J5j10k76J1M71qj76j58L50l01L03k52k12j03K34M0j35
3001a64O8k77N04j06r8j03L53j38J15k57K57k63J19j43j18K31NJ27K03o69O8K69
3023a7M5K89k54j73K3N24l15l53k86M33J63k2m02K58L65q9k09j54R7K59k24L56
3045C14m80J87J18k84K58K4m42L26J85l89r7M26j87J48k06j53j73K23N09P0o39
3066b62K38j70L60j61J39n00L31L13r8l90j23N97k82J07l56K48J09J53r6l95m0
3087b78J46J76Q9Nj21J45n7K09o36K61L33o7J4l78k40J39L97J17k94k2K01j82
$$ plain form
3109 -43 104 -259 -123 -19 132 247 -172 89 -63 -35 322 -467 -265 -81 139 99 -344 -247 -131 172 274
3130 274 164 8 -15 109 -34 -158 -171 71 79 3 -384 -103 -80 -216 65 -161 -168 77 -191 -7 14 -108 -95
3153 -95 -32 51 -171 -31 -25 433 36 -45 -238 -66 128 309 65 -93 -77 63 -109 -290 135 535 223 -10
3175 -10 -76 -183 -185 119 275 -172 -253 -127 -101 6 247 128 73 54 -60 -368 -149 -17 142 -151 8 -45 130
3198 130 101 133 175 148 73 175 -99 -339 26 231 -92 128 14 -279 106 -28 363 327 -148 -335 -100 -33
3220 -33 50 167 -291 39 71 95 -17 -298 99 55 170 -196 -3 -161 81 74 -98 -200 -35 394 -326 -62
3242 -62 129 83 36 -428 -375 158 -8 -328 -124 183 -362 258 163 -450 -211 -165 -28 -98 -37 -186 250 -323 -29
3265 -29 -175 -442 80 28 -36 -160 -183 153 296 195 50 -81 3 1 -48 141 -127 63 -269 -174 87 -145 52
$$ packed form
3109d3J47l63J36J04J51J15m19K61j52K8L57p89K02J84K20m0m43R7J16L03J02
3130B74j10j56k3J24j43j24j3K42Qp6l87K81K3j36K81k26pK45k68J84K1j22J3
3153i5O3Q3k22J40OM58l97q1j93J72J94J81k44j58J6J40j72j81M25M00l12k33
3175a0o6j07kL04J56m47q1J26K6J07K41j19n5j9j14l08K19J32J59k93J59n3J75
3198A30k9L2M2k7p5J02k74k40L65K05l23K20j14k93L85j34L91l6m75j87K35O7
3220c3Q3J17m58L30L2K4j12k81L97m4J15l66J93j58K42pj72j02J65M29p20K64
3242f2J91m6m7m64N3N33j66l20K04L07n45O20r5o13K39M6J37p0O1j49M36n73K94
3265b9j46k67N22n2o4j24k3L36J43j01j45j31Q4km9J89k68J90l32R5K61k32J97
$$ plain form
3288 52 105 -100 50 336 -235 -147 -77 151 125 110 253 263 -100 -37 67 67 78 -26 -148 -76 146 438 275 -8
3312 -8 -87 88 83 -276 -104 -85 -68 -48 -120 -134 152 251 114 -122 80 -8 -120 -125 106 150 328 -10 149 -19 89
3337 89 118 145 -103 -272 29 -63 443 165 84 217 -292 116 159 -81 129 150 214 -165 -133 78 -41 252 34
3360 34 179 -100 130 156 -79 110 -146 59 208 -131 -272 -289 30 106 165 -118 62 -211 -336 -216 144 -232
3382 -232 -126 103 -318 1 18 25 67 -96 -63 -159 -283 377 -62 -190 -146 184 283 -146 115 -154 64 10 -189
3405 -189 -215 104 127 121 108 151 -212 -69 -59 79 21 48 126 9 49 -161 72 4 61 -51 -43 270 -81 -87 -36 83
3431 83 59 103 32 180 134 261 46 50 -7 -57 -150 -163 150 -94 41 119 2 -134 40 86 131 -203 25 154 -3
3456 -3 -289 1 -62 93 -54 -67 -61 -18 -91 141 310 69 -231 -130 -77 -24 -33 -385 -133 15 230 -177 -183 322 -327
$$ packed form
3288E2N3k05J50K86n71Q8P0K28k6j5J43J0l63O3J04%J1j04j22P2K22K92j63k83
3312hp9J75nl59J72J9J7K0p2j4K86R9j37k36K02q8j12nK31M4J78l38J59j68J08
3337H9K9K7k48j69L01r2N06k78q1J33n09M08M3k40K10K1O4l79L2K11j19K93k18
3360C4J45k79K30K6k35J89k56K05J49l39j41j7L19P6N9k83J80k73j25J20L60l76
3382b32J06K29m21L19J7PM2j63L3r6j24O60m39j28M4L30R9m29K61k69K18n4j99
3405a89k6L19K3oj3M3l63J43J0J38n8K7P8j17M0k10K33o8N7j12QL13l51oN1J19
3431H3k4M4p1J48m6J27k15Mn7n0r3j3L13k44J35P8j17j36J74M6M5l34K28J29j57
3456ck86K90o3J55j47j3OM3p3K32J69k41l00J01N3N3rl52K52J48K15m07oN05o49
$$ plain form
3481 -327 213 -136 -7 175 -31 345 -397 120 -102 186 -1 127 149 12 -292 416 -184 33 125 -293 435
3502 435 113 364 -17 99 7 -57 -178 -99 286 -22 3 18 -75 102 68 330 -22 354 176 142 148 116 187 13
3526 13 17 -129 -450 -209 -65 -108 -71 -96 -104 -128 -5 -163 -19 45 -331 49 -220 -105 474 -107 -293 -62 3 91
3550 91 236 -288 8 232 52 74 180 -418 -203 105 -166 -488 -7 492 215 -295 199 4 -257 210 -31
3571 -31 -174 -111 -13 33 -176 229 -186 14 10 -188 -135 157 368 -307 -143 284 194 -266 75 -60 8 41 -347
3594 -347 -58 -205 -190 -35 136 220 75 302 315 -74 151 -156 -135 382 179 -35 -184 240 242 -231 20 -94
3616 -94 -366 -134 118 246 7 437 260 10 -14 83 9 44 54 78 25 -326 42 185 43 -249 225 -161 -86
3639 -86 108 -188 83 -612 -133 -13 25 42 -31 -60 -364 60 -54 384 -21 -142 60 84 -35 31 -5 -96 -2
$$ packed form
3481c27N40l49J29J82k06L76p42N17k22K88j87J28K2j37l04P08o00K17R2m18P28
3502D35l22K51l81J16r2o4j21P9L85l08K5J5r3J77l4K62l52L76j78l4Ol2P1j74
3526A3Mj46l21K41J44m3L7k5qk4J23j58J44O4l76L80k69J15N79n81j86K31O5Q8
3550I1J45n24K96K24j80K2J06n98K15L08k71l22M81M99k77n10M94j95k61M67k41
3571c1j43O3R8M6k09M05m15K00mj98N3K92K11o75J64M27r0m60L41j35O8L3l88
3594c47K89j47J5J55J71Q4j45K27J3l89K25l07K1N17k03k14j49M24Km73K51j14
3616i4k72K32K52J28k39M30j77k50k4R7p4L5J0K4n3l51L68J43j42k92M74l86P5
3639h6J94k96K71o95M79J20L8J7p3k9l04M24j14M38m05j21K02K4j19O6l6r1R4
$$ plain form
3662 -2 149 36 174 89 -63 -41 -70 246 371 124 17 -73 18 164 51 -19 88 88 -143 197 -8 -161 -30
3685 -30 222 84 -86 46 -134 -34 -199 -165 -115 -117 -148 11 148 -99 237 -49 95 -76 -107 -179 -147 77 79 -207
3709 -207 -238 7 -161 122 -35 394 -102 253 190 213 54 -85 100 -85 79 141 22 -260 -92 -161 21 67
3731 67 -31 85 -122 -98 177 -281 -211 -166 -138 86 154 -421 5 50 -271 217 157 239 -55 -5 1 60 -123 -83 229
3756 229 287 36 51 340 -19 -178 -80 -28 121 -40 -142 -51 -160 -27 204 -127 -122 248 -90 -54 -61 150 6
3779 6 -279 285 87 162 -48 -213 -164 -194 -66 -276 -96 229 -91 -267 -195 -308 -60 104 10 -257 -2 92 -241
3802 -241 63 285 130 -11 52 137 124 -27 105 203 100 244 -230 78 -429 -189 -43 10 311 335 27 -95
3824 -95 -153 -21 -132 -99 84 128 -24 67 -35 -272 -59 -33 -98 76 -90 -445 118 12 96 117 130 -115 94
$$ packed form
3662bJ51j13J38q5j52K2k9L16J25k47j07r0R1J46j13p0J07%k31L40k05j53J31
3685c0K52j38j70J32j80J00j65L4N0kl1J59J37k47L36k86J44j71l1p2L2K24Kk86
3709b07l1K45j68K83j57M29m96L55o3K3j59j39J85j85J64O2j19k82J68o9J82M6
3731F7r8J16k07K4K75m58P0M5K8K24O8n75M26M5l21M88o0Q2k94N0ON9j83M0L12
3756B29N8k51J5K89l59j59R8N2J49j61j02R1j09J33K31l31NL70l38L6pK11j44
3779Fk85N64j98P5k10j65M9l0J28k10J80L25l20j76P2j13K48J64r4k67K55R4l33
3802b41L04K22j55j41O3Q5j3j51J32R8j03J44m74L08n07K40J46N3L01K4l08j22
3824i5n8J32j11L3J83M4j52R1j02k37K13K6o5J74j66l55N63j06Q4K1J3k45K09
$$ plain form
3847 94 -239 -26 193 102 -246 138 -8 175 90 -38 -39 -174 298 -166 -185 159 -207 24 17 -22 326 -229 51
3870 51 -33 -141 -17 333 -7 -105 64 28 -39 105 38 214 71 -48 -171 -453 -289 -221 -188 -225 90 230 -280
3893 -280 47 -111 -100 -22 47 76 26 -67 -173 119 78 113 -114 215 94 -183 -92 204 84 305 35 -19 194
3916 194 29 7 292 121 -45 -146 112 -25 -147 51 -129 -141 201 -21 -39 214 -72 70 134 1 -24 -226
3938 -226 185 -233 124 -38 -124 112 139 -43 -295 -26 277 77 -45 116 34 -215 -106 -237 216 238 -149
3959 -149 -35 -84 -42 -141 277 220 58 184 -85 -192 54 93 77 68 75 -61 39 -157 -114 67 156 64 -132 -17
3983 -17 51 1 167 -120 -41 -144 142 -51 291 229 -220 -146 67 -267 185 -8 -5 -60 -139 381 -282 -28 -218
4006 -218 -93 -84 70 167 -264 31 -303 114 -47 -27 136 -6 -2 179 24 168 63 58 -140 113 226 -150 12
$$ packed form
3847I4l33K13K19r1l48L84j46J83q5j28jj35M72m64j9L44l66K31pl9L48n55K80
3870E1q4j08J24L50l40r8J69l6o7J44o7J76j43j19j23k82J64O8L3l7L15J40n10
3893b80L27j58J1P8O9K9n0r3j06K92m1L5k27L29j21k77R1K96j20K21k70n4K13
3916A94j65k2K85j71j66j01K58j37j22J98j80j2L42k22j8K53k86J42O4j33k5k02
3938b26M11m18L57j62q6K36K7j82k52K69L03k00j22J61q2k49J09j31M53K2l87
3959a49J14m9M2r9M18n7j62J26k69j07K46L9j6rPj36J00j96M3J81Q9r2j96J15
3983a7O8n0J66k87P9j03K86j93L42o2m49P4K13l34M52j93Ln5p9N20o63K54j90
4006b18J25RJ54R7m31K95l34M17j61K0J63j42MJ81j55J44j05nj98K53J13l76J62
$$ plain form
4029 12 -177 387 -117 -284 -120 65 -303 -443 -9 193 -20 169 -17 -57 -259 -186 120 50 330 -187 -38
4050 -38 59 -115 -141 74 159 127 29 -158 82 -15 -84 104 -142 44 64 217 2 163 175 -641 -50 -100 -96 -39 65
4075 65 13 213 -214 -62 -152 39 167 -191 -77 -326 24 167 -93 165 -210 -52 -268 91 159 253 -210 8
4097 8 52 -219 -32 -98 -101 -138 21 -420 -58 53 157 -123 182 192 74 -55 -64 -184 -36 -17 -128 78 242 -156
4121 -156 -266 -96 132 -325 113 240 -100 224 8 70 -139 41 27 -138 -241 -296 -9 358 -41 -181 -350
4142 -350 -186 -178 156 -2 -188 147 94 89 140 111 -76 -160 25 67 151 -47 -202 241 -62 -324 243 425 235
4165 235 292 -21 126 -101 -28 -193 -42 117 42 -138 161 74 -69 -101 -13 136 -139 -186 -163 128 159 -284 89
4188 89 -54 -14 -75 -381 64 158 93 220 156 -49 -17 -120 -15 15 271 345 -77 88 -222 -245 -145 -114 242 -64
$$ packed form
4029A2j89N64n04j67J64J85l68j40M34K02k13J89j86m0k02P3L06p0K80n17J49
4050c8R7j74k6K15Q5l2r8j87K40r7o9J88k46J86K0J53k15J61J2q16N91n0MN7J04
4075F5n2K00m27J52r0J91J28l58J14k49L50J43k60K58l75J58k16L59O8R4m63K18
4097HM4k71J87o6ll7J59m41L62J11J04k80L05J0j18j29rj20J48J9j11K06J64l98
4121a56j10J70K28m57M38J27l40L24k16O2k09J80j4j65j03n5K87L67l99j40j69
4142c50J64QL34j58j86L35n3nN1k9j87q4J85M2Q4j98j55M43l03k62N67J82j90
4165B35N7l13J47k27P3j65J51J59p5j80K99q7j43l2Q8J49k75m7K3K91L1m43L73
4188H9j43M0o1l06M45R4o5J27o4k05L2j03J05L0K56P4m22J65l10k3J00L1L56l06
$$ plain form
4212 -64 -39 144 116 415 -231 -72 -119 183 -65 62 20 52 121 -314 -14 186 282 58 61 -88 -96 61 4 180
4236 180 24 5 -117 -91 129 -32 -111 -356 -160 140 85 -143 329 -166 -3 -163 -251 -255 -117 141 159 55 -174
4259 -174 84 -13 199 -107 113 33 107 106 -34 35 50 131 95 -186 -103 -135 -60 -47 -116 66 -12 156 27 142 -28
4284 -28 223 -300 -126 73 -31 -171 79 -186 168 -70 -147 70 25 -1 1 103 -196 57 150 -94 122 10
4306 10 131 -83 291 157 -7 132 18 266 -146 256 146 -202 -3 -2 110 -131 109 -160 -102 128 -212
4327 -212 378 -123 282 1 186 -9 -10 -324 -10 -158 -279 70 -64 -186 -140 224 22 -13 -157 120 -301
4348 -301 69 -30 -377 350 112 224 -222 25 294 195 99 189 -40 1 82 -130 74 266 72 8 76 -137 138
4371 138 177 158 -48 -26 227 54 164 -21 -104 109 -268 -209 -234 172 112 342 92 -16 330 -45 -63 -80 -214
$$ packed form
4212f4K5J83k8K99o46J59m7L02k48J27m2L2O9m35L00K00R6k24Lj49qJ57n7J76
4236A80j56j9j22K6K20j61p9k45J96L00n5k28M72m95J63j60q8mJ38K58J8j04k29
4259a74K58r7K12l06K20q0P4jj40O9J5Q1l6k81Q3l2P5J3o9J82p8J68j29J15j70
4284b8K51n23J74J99j04j40K50k65L54k38p7K17m5k6KJ02k99K53R3k44K16j12
4306A0J21k14L74j34j64J39j14K48m12M02j10l48J99JJ12k41K40k69N8K30l40
4327b12N90n01M05k81J85j95jl14L14j48j21L49j34j22M6L64k02l5j44K77m21
4348c01L70r9l47P27k38J12m46K47K69r9r6R0k29M1Q1k12K04J92j94o4O8k13K75
4371A38L9j9k06K2K53j73J10j85q3K13l77N9k5M06o0K30k50j08L46l75j8j7j34
$$ plain form
4394 -214 -87 -73 25 134 148 113 -90 -115 -134 -28 59 246 -86 -153 -164 -58 181 201 -213 -121 86 -242 116 65
4418 65 -45 -2 24 94 -166 -290 84 -134 156 92 -315 -152 -47 291 90 -288 -98 209 -7 -39 78 243
4440 243 149 -33 -90 -403 171 11 -84 76 153 337 79 -174 90 -68 -209 9 -48 -177 150 -75 232 -115
4462 -115 165 -10 -57 -9 196 -10 68 -262 -17 271 -2 -86 -263 125 -180 -288 69 -111 -42 206 110 -71
4484 -71 -159 -149 -188 161 33 -119 6 -168 -82 10 3 100 63 218 -94 115 -205 197 224 -16 -27 -103 -35 -252 33
4509 33 150 -196 -35 -95 152 371 -38 -109 -195 -178 235 -63 -18 19 -253 -74 -41 -74 -3 19 -97 35 192 -265
4533 -265 -238 150 188 145 33 152 -131 144 134 122 165 -27 -162 -71 -34 -11 39 -240 9 68 443 -102 -372 -232
4557 -232 85 161 -238 24 -378 -160 -220 -687 -85 72 -343 168 -14 -138 -84 -133 -13 -42 164 -98 -134 -159
$$ packed form
4394b14J27J4R8J09J4l5k03k5j9J06Q7J87l32o7j1J06K39K0m14R2K07l28L58n1
4418F5j10M3K6P0k60j24L74k18K90o4m07J63J05L38k01l78J90L07k16l2J17J65
4440B43r4j82n7l13N74j60r5J60P7J84k58k53K64j58j41K18n7j29L27k25L07l47
4462a15K80j75m7M8K05k06P8l30K45K88k73q4j77L88l05j08L57j80O9K48r6j81
4484g1q8J0l9L49j28j52J25j74Q6R2pR7l7J55l12K09l20M02K7k40j1p6O8k17K85
4509C3J17l46J61o0K47K19m09p1q6J7M13k98M5L7k72J79L3l3P1K2j16J32J57m57
4533b65K7L88L8m3j12J19k83K75j0j2M3j92j35R1L7K3N0k79K49N9L75n45k70J40
4557b32L17P6l99K62m02K18o0m67O02J57m15N11j82j24N4m9J20k9K06k62l6k5
$$ plain form
4579 -159 27 105 -71 -280 52 -57 -30 44 -113 -98 215 126 13 115 251 138 25 17 -148 -75 90 226 -20
4602 -20 -443 84 -5 217 -78 -66 -186 79 -6 192 -389 125 -215 169 -232 -41 96 -115 356 -99 -358
4623 -358 264 9 -1 61 112 -371 -456 -49 91 -37 126 -45 6 -26 200 210 26 -360 -55 127 -341 -304 45
4646 45 -268 -2 276 174 -140 -188 -62 -163 46 -99 61 -130 -52 66 -154 41 -46 419 -168 94 -50
4667 -50 -13 192 -83 400 -131 -93 -205 -214 42 -343 -130 252 -119 -15 -31 171 0 -125 -52 92 33 20 41
4690 41 106 107 -106 126 -102 -84 105 -278 -186 111 -204 136 -89 -137 112 220 179 79 150 37 -80 189 -194
4713 -194 12 246 202 -223 -3 0 -145 150 -71 94 388 -93 163 46 -189 66 134 -191 318 -48 -146 135
4735 135 387 -47 178 -98 -58 -59 -109 -66 -33 -177 -185 -185 -321 327 -16 131 247 -204 -126 -90 -66 70 -119 143
$$ packed form
4579a59J86P8j76k09L32j09K7P4j57J5L13q9j13J02J36j13j13qj65P3J65J36k46
4602b0m23N27q9K22k95J2j20K65q5J98n81N14l40L84m01J91J37k11M71m55k59
4623c58O22k55j0O2N1m83q5M07J40j28J63j71N1l2K26J0j84l86L05J82m68L7L49
4646D5l13K66K78j02l14m8J26j01K09j45J60j91P8J18k20J95q7M65n87K62j44
4667e0L7K05k75M83n31L8j12rK56l85K13L82l71J04j6K02j71j25P3J44n9j3K1
4690D1O5Jk13K32k28J8J89l83R2K97l15L40k25m8K49J08m1j00P1j13j17K69l83
4713a94K06K34m4m25K20Lj45K95k21J65K94m81K56j17k35K55O8l25N09l66r8K81
4735A35K52m34K25k76M0jn0M3L3j44q%j36O48l43J47J16m51P8L6K4J36j89K62
$$ plain form
4759 143 139 -58 -33 197 -114 -85 191 -165 -133 142 8 -147 -104 -133 357 174 204 8 107 316 -125 123 276
4782 276 114 -183 -124 -73 -294 214 -37 14 -191 153 -62 315 231 36 -34 -137 -103 -104 60 -119 334 93 -56
4805 -56 -104 -25 -89 -42 -33 165 218 31 213 113 120 -123 -18 55 254 -36 -39 17 201 73 5 -249 76 -15 150
4830 150 232 -30 48 81 132 -165 -18 88 -52 -13 -146 -170 167 57 -90 -234 -232 127 -185 -90 93 -135 19
4853 19 63 -247 95 199 248 151 -156 222 -79 43 -49 -273 360 15 -99 -14 222 -256 34 -86 90 -233
4875 -233 69 116 -190 -12 -38 267 25 -63 -138 -122 9 -61 95 65 367 159 46 -106 232 43 295 94
4897 94 -65 303 18 -168 -47 361 -197 -55 102 150 208 47 -48 70 64 116 -204 27 69 -464 302 201 250
4920 250 242 135 -41 276 23 -166 -57 55 -179 -90 -100 -12 48 -87 -64 46 -67 -36 86 40 -61 -197 171
$$ packed form
4759A43mj97K5K30l11K9K76l56L2K75j34j55M3k9M90j83L0j96R9K09m41K48J53
4782B76j62k97N9N1k21N08k51N1k05L44k15L77q4j95p0j03L4jJ64j79M53k41j49
4805e6m8P9o4M7RJ98N3j87J82j00Pk43J05P3J99k90lN6J84j28o8k54L25r1J65
4830A50Q2k62P8L3N1k97J47J06j40L9j33k4L37j10j47j44KL59l12R5J83k28J54
4853A9M4l10L42J04M9r7l07L78l01J22r2k24O33l45j14Q5K36m78K90j20J76l23
4875b33L02M7l06J78k6L05k42q8p5J6J31p0J56l0L02k08j13j52L38j89K52k01
4897I4j59L68k85j86J21M08n58J42J57M8N8j61r5J18oN2l20K31M2n33P66j01M9
4920B50qj07j76L17k53j89J09J12k34Q9j0Q8O0j35K3J10j13L1J22m6j01j36L68
$$ plain form
4943 171 46 -129 -364 -42 174 -25 -79 209 -49 -64 31 21 11 -12 -210 134 -131 -135 -56 142 355 -329 -123
4966 -123 58 -270 -15 -354 -50 180 193 99 106 -241 -163 -24 -105 311 125 40 278 2 40 179 153 1 191
4989 191 208 73 88 0 140 -119 157 -209 180 41 -253 -46 -98 47 -223 107 -122 -210 213 21 1 119
5011 119 -185 29 -63 4 93 -213 -120 412 -84 71 102 136 138 182 -40 17 117 -98 47 -30 214 -59 -626 -52
5035 -52 133 104 51 197 -210 -114 -37 310 294 75 21 -357 -218 -102 -108 53 -392 16 -38 26 241 -419 -282 -144
5059 -144 -40 49 -151 27 -44 94 -75 -224 102 98 -141 -220 -7 -306 -131 -30 -80 -98 10 24 -10 -139 10
5082 10 -129 -60 -150 -129 189 -289 100 143 168 -168 -67 24 135 -221 -363 -85 -168 232 201 52 -310 -89 -35
5105 -35 177 110 -9 -61 -59 69 -98 -12 30 91 -191 -145 -28 -252 75 60 128 14 -382 -181 2 157 -95 -76
$$ packed form
4943A71j25j75k35L22K16j99n4K88k58j5R5j0j0k3j98L44k65mP9J98K13o84K06
4966a23J81l28K55l39L04K30J3r4Pl47P8J39q1M16j86q5K38k76L8J39k6j52J90
4989A91J7j35J5q8J40k59K76l66L89j39k94K07n2J45k70L30k29q8M23j92k0J18
5011A19l04K14r2O7Q9l06R3N32m96J55L1L4KM4k22N7J00k15J45p7K44k73n67N74
5035e2J85k9n3J46m07R6P7L47j6k19n4l78J39J16oJ61m45M08n4O4K15o60J37J38
5059a44J04Q9k00J78p1J38j69j49L26mk39p9K13k99J75J01n0j8J08J4l4j29J49
5082A0j39O9r0K1L18m78L89M3K5l36J01R1J11l56j42K78q3M00l1j49l62K21N4
5105c5K12o7j19n2KJ28j67Q6M2O1k82M6J17k24L27j5O8j14l96K01J83J55k52J9
$$ plain form
5129 -76 110 -409 0 185 168 -338 250 -100 144 187 12 388 -17 96 -92 -41 -295 27 164 -174 -128 25
5151 25 -129 -8 -15 -140 -14 98 -308 -119 -292 19 62 78 -238 153 -26 -144 140 145 175 50 -119 -229 -92
5174 -92 69 -17 77 -16 -187 34 106 155 -56 164 319 -11 -101 305 -176 29 -180 63 -443 -20 141 9
5196 9 26 40 -68 31 -157 -27 234 -122 40 309 -75 -91 239 27 -57 -138 -23 -174 74 58 -48 66 -20
5219 -20 193 -145 -100 152 -186 150 -37 38 189 55 93 207 289 -68 65 275 185 -108 -367 -292 -216 122 2
5242 2 -41 -147 -245 28 7 154 -151 130 67 105 -11 4 168 187 72 204 -58 15 132 -271 275 -61 80
5265 80 23 30 -18 -7 147 0 0 30 -14 -126 -14 -196 -62 211 -72 32 104 16 207 54 170 -120 -170 76
5289 76 -170 -50 -110 -73 -81 -158 33 -96 186 -60 99 -39 -58 -12 -256 222 -146 -178 -3 127 336 127 -139
$$ packed form
5129g6J86n19M09J85j7n06N88l50K44M3j75L76m05J13j88N1k54L22J37l38M6J53
5151B5j54J21pj25J26J12m06J89j73L11M3J6l16L91j79j18K84NL0j25j69j10J37
5174i2J61q6R4r3j71K21P2M9k11K20J55l30r0M06m81K05k09K43n06M23J61j32
5196IJ7J4j08R9j88J30K61l56J62K69l84j6L30k12q4q1J15j51K48j6j06J14q6
5219b0K13l38M5K52l38L36j87P5J51j34L8J14Q2l57J33K10r0k93k59P5P6L38j20
5242Bm3j06r8K73k1J47l05K81o3L8j16J5J64J9j15J32k62P3J17m03N46l36J41
5265H0n7Pm8J1J54j47%L0m4j12J12j82J34K73k83J04P2q8J91j53J16k90n0K46
5289G6k46J20o0L7qp7J91j29K82k46J59j38j9M6k44M78l68l2J75J30K09k09k66
$$ plain form
5312 -139 109 22 -297 43 19 -4 -96 111 28 -47 -318 157 144 -25 0 80 255 34 -7 -300 42 66 -60 35
5336 35 -89 -30 61 -282 121 -172 52 -166 45 194 50 64 152 -100 174 -179 182 61 111 118 299 -296 -19
5359 -19 151 -207 -116 -206 -39 -138 -18 -143 389 -5 298 -1 143 -50 -199 46 -192 68 -35 -58 -26 -148
5381 -148 -100 140 256 154 64 -183 20 -83 197 125 80 167 5 90 119 186 72 60 -34 150 -36 233 338
5404 338 337 -51 -165 -87 -56 -121 -211 -54 -226 -45 118 307 -179 -395 399 -176 34 -34 -139 -95 114 -75 -58
5427 -58 -134 292 155 -27 23 22 -91 -163 -272 36 -60 94 -15 -9 -29 197 -202 -243 16 123 45 20 -190 9
5451 9 -275 -150 -146 -273 -406 177 -19 338 -77 -112 22 -168 24 137 -31 28 -53 189 150 -29 178 145 -102
5474 -102 44 -182 -81 -235 95 -10 -24 8 200 -81 -167 114 -210 176 -258 -9 5 -37 193 259 104 -109
$$ packed form
5312a39K48q7l19L40k4k3r2K07q3p5k71M75j3j69K5Q0J75k21m1k93L42K4j26R5
5336C5j24N9R1l43M03k93K24k18K11J49j44J4Q8k52K74l53L61j21N0PJ81n95K77
5359a9J70l58R1r0J67r9J20j25N32l94L03k99J44j93j49K45k38K60j03k3L2j22
5381a48M8K40J16j02r0k47K03j03K80p2m5Q7j62Q5K9O7j14j2r4J84j86K69J05
5404C38jl88j14P8L1o5r0J57j72J81J63J89m86k16P94n75K10o8j05M4K09j89J7
5427e8p6M26j37j82N0jj13p2j09L08r6J54j09Ok0K26l99m1K59J07p8k5k10J99
5451Ik84J25Mj27j33N83j96L57m15l5J34j90J92J13j68N9q1K42l9j79K07l3k47
5474a02J46k26J01j54L30j05j4L2J92k81q6K81l24L86m34K49J4m2K30O6j55k13
$$ plain form
5496 -109 126 -80 13 75 185 194 1 114 -179 -199 -49 -6 -70 193 74 -122 204 -63 -14 89 28 295 -11
5519 -11 -7 175 -159 -103 58 32 393 75 128 -73 -360 179 37 93 80 290 134 -60 2 87 -10 262 -81 265
5543 265 -63 33 108 -106 -207 75 5 11 -90 -94 -171 66 61 -200 159 -218 -103 266 106 446 9 -42 -139 -46
5567 -46 -22 -233 62 -266 -110 -78 -242 109 257 0 41 301 -27 -105 -55 -118 472 94 150 49 92 61 -93
5590 -93 20 160 -266 111 39 -27 -120 106 127 -92 -237 -135 212 176 305 -13 -126 103 153 -279 80 -359
5612 -359 -76 215 346 12 -130 148 58 -130 115 -71 41 -316 46 133 105 -154 -90 79 12 188 -38 135
5634 135 32 -116 -49 -30 -87 180 397 -99 412 -32 53 -23 103 -4 89 -94 -103 45 -64 39 -84 102 17
5657 17 -40 -46 -98 -67 -419 252 256 -36 242 -198 -274 -40 -182 -151 -9 371 286 161 -121 -56 307 52 -152 -142
$$ packed form
5496a09K35k06R3O2J10Rj93J13k93k0J50M3o4K63j19j96L26k67M9J03o1K67l06
5519a1MJ82l34N6J61k6L61l18N3k01k87N39j42N6j3K10j56j94O2Q5r7K72l43L46
5543B65l28R6P5k14j01K82p0Oj01mp7K37nk61L59l77J15L69j60L40m37n1r7R3
5567d6K4k11K95l28J56L2j64L51J48k57M1K60l28p8N0o3N90l78N6j01M3l1j54
5590i3J13J40m26L77p2o6r3K26K1k19j45J02L47l6J29l18j13K29N0m32L59m39
5612c59K83K91J31l34j42K78r0j88K45j86J12l57L62Q7k8k59O4J69o7J76k26J73
5634A35j03j48O7J9n7K67K17m96N11m44Q5p6J26j07R3j83rJ48j09J03j23J86q5
5657A7n7on2L1l52O71Mk92K78m40p6K34j42L1J42L80q5j25k82O5L63k55k04J0
$$ plain form
5681 -142 175 -586 -34 -32 -159 96 -212 193 70 167 -188 -165 -328 256 98 -3 -316 269 206 -155 -40 -119
5703 -119 122 135 -34 306 -292 -228 -109 -95 89 60 154 231 121 125 106 144 26 33 132 26 9 -224 43 -159 5
5728 5 269 -139 -22 -129 30 -144 -161 221 -107 -35 34 18 178 114 -87 -117 -35 51 -43 92 -157 259 -107 -145
5752 -145 154 -320 69 171 -87 169 186 -51 278 200 -100 18 -189 -104 -78 -238 94 -134 -109 -206 74 216
5774 216 3 -103 351 -217 -176 -57 63 116 188 152 -12 -108 338 88 -133 -68 -63 -53 304 58 105 -155 121
5797 121 -154 -12 -9 240 335 -27 93 299 -264 -168 -360 -73 208 -308 -45 -233 234 -348 266 542 -244
5818 -244 8 -294 278 -28 58 74 147 55 57 197 128 -115 -184 -177 -102 54 178 223 -105 -6 -58 -32 185 92 -374
5843 -374 -324 94 147 55 -197 -222 -52 -146 121 68 58 -241 157 -70 200 65 129 -44 81 319 -109 149 125
$$ packed form
5681a42L17p61N52Kj27K55l08M05j23R7l55K3j63N84j58j01l13N85o3l61J15p9
5703a19K41J3j69L40n98O4J19J4J84k9R4P7j10Mj9L8j18PR9j06j7k33K67k02J64
5728EK64m08J17j07J59j74j7L82l28P2O9j6J60o4k01l0Q2Q6r4J35k49M16l66l8
5752a45K99m74L89J02k58K56J7k37L29p8l00J18k07Q5K6j60L32k28K5r7K80J42
5774B16k13j06M54n68M1J19J20N3P2l6j64r6M46k50k21O5NJ0L57k46M7k60K76
5797A21k75J42LK49R5l62J20K06n63R6j92K87K81n16K63j88M67n82O14K76p86
5818b44K52l02N72l06Q6J6P3r2KJ40o9k43o9PP5J56J24M5l28R9n2K6K17r3m66
5843c74N0M18N3r2k52k5J70r4K67n3j0k99L98k27K70j35O4j73J25K38m28K58k4
$$ plain form
5866 125 -211 95 -138 -92 55 71 27 -97 195 -21 238 10 32 105 -46 130 49 -178 166 305 60 -8
5888 -8 -191 9 -109 -34 -41 19 237 18 8 -12 -179 -291 222 -209 -12 -244 31 -121 0 25 -68 -209 -243 -15
5912 -15 -166 1 47 29 167 146 35 -62 165 -91 37 105 133 118 -187 64 370 -54 -156 52 141 6 -27
5935 -27 37 -131 107 -23 241 -60 117 174 -151 -93 -107 -190 103 -55 230 287 -6 139 -225 289 -81 -144 -132
5958 -132 70 321 -22 -18 163 -173 88 68 515 -172 137 -147 147 34 -58 -131 -164 164 149 -87 -43 27 -263
5981 -263 0 -87 99 -58 102 -81 -57 -67 -321 304 70 74 195 -278 -171 75 -56 -69 -21 -188 85 -3 39
6004 39 -167 -4 32 -40 -200 134 67 -94 -79 -136 135 -118 203 -151 131 -95 -137 38 -7 -146 -178 61 50
6027 50 69 -127 255 -47 59 22 16 -43 -81 -2 -37 197 4 -144 -115 75 -44 -73 73 217 277 -55 -324 -34
$$ packed form
5866A25l36L06k33M6J47J6m4j24K92k16K59k28K2P3j51J76q1k27L44J39k45o8
5888hj83K00j18P5pO0K18k19j0k0j67j12N13m31J97k32K75j52J21K5r3j41l4K28
5912a5j51J67M6j8J38k1j11r7K27k56J28O8K8j5l05K51L06m24j02K08Q9j35l3
5935b7O4j68K38j30K64l01J77N7l25N8j4q3K93j58K85N7k93J45l64N14l70o3J2
5958a32K02K51l43MJ81l36K61k0M47o87L09k84K94j13r2p3l3L28j5k36M4P0k90
5981b63K63q7J86j57J60j83K4j0k54O25k34MJ21m73J07K46j31j3M8j67K73q8M2
6004C9k06J63L6p2j60L34o7j61J5n7K71k53L21l54K82k26m2J75m5j39l2K39j1
6027E0J9j96L82l02J06l7on9l8P9l5K34j93j48K9J90j19k9J46J44O0l32k69K90
$$ plain form
6051 -34 145 93 -2 81 143 39 30 -13 -23 13 -73 -336 125 398 240 -54 71 308 -140 196 53 103 -126 5
6075 5 -341 -117 -191 156 95 8 -89 -64 188 187 -96 -5 113 81 263 125 -15 190 -63 -119 80 11 -29 5 139
6100 139 54 12 -250 -184 105 124 -176 -129 5 30 -118 76 -115 188 79 342 -3 -256 115 166 -13 -292
6122 -292 63 131 21 -366 184 138 -132 -96 -75 230 -33 169 -32 -25 -93 -118 42 91 24 -147 -176 8 121 -186
6146 -186 -139 -194 -94 -274 192 77 174 100 73 60 -90 -99 -233 251 22 -69 -14 -167 138 -3 132 300 -126
6169 -126 -202 -9 171 -323 159 -157 262 -28 -196 52 -234 199 66 143 -2 -155 -175 189 107 -167 265
6190 265 75 -35 184 -127 -184 -107 223 259 23 290 -120 170 -66 -26 -44 53 198 -12 193 307 -310 -17
6212 -17 -193 180 204 -115 9 60 42 -292 -108 152 43 28 -6 88 -16 -253 -128 131 -63 199 307 -168
$$ packed form
6051c4J79n2r5Q3O2j04rm3j0L6q6k63M61K73j58k94J25K37m48L36j43N0k29J31
6075El46K24p4L47o1q7r7K5K52jk83R1J18l2J82j38j40K05k53n6J99o9m0L4J34
6100A39q5m2k62O6K89J9l00M7J34K5j48J94j91L03j09K63l45k53L71N1j79k79
6122b92L55O8j10l87N50m6k70L6K1L05k63K02k01Po8k5J60M9o7j71k9J84J13l07
6146a86M7n5J00j80M66j15R7p4k7j3j50rj34M84k29r1N5j53L05j41J35J68m26
6169a26p6J93J80m94M82l16M19k90j68K48k86M33j33P7j45j53k0L64q2k74M32
6190B65j90j10K19l11n7P7L30L6k36K67m10K90k36M0j8R7J45k10K05J14o17K93
6212a7j76L73K4l19J24N1j8l34J84K60j09j5l4R4j04k37J25K59j94K62J08m75
$$ plain form
6234 -168 -232 33 -161 27 -82 -79 -213 -258 48 33 163 -318 240 -40 27 -87 -91 243 -4 -211 28 346 -88
6257 -88 238 -175 -65 242 160 -5 10 25 91 -59 51 -95 -62 184 95 83 -43 -223 53 -180 94 17 -22
6280 -22 122 -395 -244 -25 -68 117 -271 -124 322 -43 -25 218 -157 118 53 189 -40 161 13 47 -355 304
6302 304 173 -48 -45 130 156 -229 55 -38 316 -302 394 143 -17 9 76 101 -56 -43 -109 87 -112 -274 -147
6325 -147 -333 42 -28 383 -146 -182 96 55 -167 -11 216 142 -24 -95 80 -3 -97 -26 51 -49 167 162 -291 -196
6349 -196 -134 -109 2 -336 170 71 -405 27 -210 -17 -73 51 73 91 129 7 -145 154 195 204 -64 -230 37
6372 37 48 74 148 306 -1 -86 230 -113 127 215 -1 -117 26 5 31 234 108 130 -123 -53 29 -48 -221 72
6396 72 -171 187 113 -131 -15 -102 -139 417 -131 295 -5 13 55 160 -18 -218 207 -180 -117 -82 222 -123 34
$$ packed form
6234a68o4K65j94J88j09Lj34m5L06j5J30m81N58k80O7j14mL34k47k07K39L18m34
6257h8L26m13J10L07q2j65J5J5O6j50J10j46L3K46q9j2j26j80K76k33K74p7l9
6280b2J44n17J51K19m3J85l88J47M46l65J8K43l75K75o5J36k29K01j48L4m02O59
6302C04j31k21LJ75K6l85K84r3L54o18O96k51j60K6O7K5j57J3o6J96j99j62J27
6325a47j86L75p0M11n29l6K78m1k22J56K27p4j66p1J75q3r4P1P7j00K16nm53R5
6349a96O2K5J11l38N06r9m76M32k37J93n6J24K2J8L8j22j52K99M1Rk68j66K67
6372C7J1K6P4J58l07q5L16l43K40Q8k16j16J43k1K6K03j26K2k53P0Q2p7j73K93
6396G2k43L58p4k44J16q7l7N56n48M26l00J8M2J05j78k00M25l87O3L5L04l45J57
$$ plain form
6419 34 66 -174 -42 49 229 -154 -227 -54 -101 179 48 70 113 180 237 -286 -114 -57 289 -62 12 47 188 498
6443 498 203 -140 -58 -84 118 -7 -77 -73 -16 -104 -333 11 -56 -177 127 -126 101 34 -100 459 97 102 -135 -178
6467 -178 -275 -129 -76 -88 172 -95 118 -3 -11 -38 -112 9 12 53 180 3 -13 29 119 191 -103 -80 168 -269 61
6492 61 132 -163 221 203 106 -165 136 42 -130 294 -20 155 66 164 29 -132 -168 270 39 -255 36 -336 -282
6515 -282 46 46 26 -207 75 77 91 201 80 6 8 19 -16 -265 -237 -16 28 -107 -53 -43 -465 -134 222 -85 -386
6540 -386 -304 94 95 -105 121 -176 -30 97 -59 41 150 -58 -4 299 -194 444 -10 2 -114 86 301 -117
6562 -117 -103 -29 -160 86 73 208 41 293 -167 166 91 82 91 291 15 -150 415 -35 119 -180 -148 70 -64
6585 -64 -103 241 -143 -40 -129 137 -215 -274 -85 24 -54 112 -336 44 -21 210 116 -110 30 52 23 -9 105
$$ packed form
6419C4L2k40J32R1J80l83p3J73m7K80j31K2M3O7N7n23J72N7L46l51P4L5J41L10
6443D98k95l43Q2k6K02j25p0MN7q8k29L44o7j21L04k53K27o7j34N59l62Nk37m3
6467a78r7J46N3j2K60k67K13j21qk7p4J21LM1J27j77j6M2R0P2k94K3K48m37L30
6492F1P1k95L84j8r7k71L01r4j72M24l14J75q9R8j35j61l6M38k31k94K91l72N4
6515b82L28%k0k33K82KJ4J10j21p4KJ1l5k49K8K21M4j35N4J0m22L31L56l07l01
6540c86Q2L98Jk00K26k97J46J27j56J00J09k08N4L03m93O38m54J2j16K00K15m18
6562a17J4P4j31K46j3J35j67K52m60L33p5rRK00k76j65N65m50J54k99L2K18j34
6585f4l9L44l84J03q9K66l52n9J89J09p8J66m48L80o5K31r4k26J40K2k9l2J14
$$ plain form
6608 105 -188 3 68 -93 45 -72 -32 103 242 143 -86 305 -312 144 233 543 -18 98 50 -110 -10 -150
6630 -150 131 -95 -119 -17 -50 -76 111 -118 69 -14 -61 -58 -87 52 313 -78 38 127 -156 253 -212 103 -127
6653 -127 279 153 -135 143 98 -23 -36 96 -273 -175 250 -56 238 62 90 20 -172 95 23 -157 79 285
6675 285 -129 0 -220 -65 182 54 -65 193 53 138 -79 -28 198 -259 112 272 -30 160 8 -93 36
6696 36 247 104 -87 -227 73 -204 360 -204 101 90 -114 -329 205 412 376 241 -3 -26 -106 258 -107 17
6718 17 -198 -54 -82 -112 -103 -210 2 -37 -55 52 108 -74 -162 234 25 -245 177 230 -125 94 33 185 32 -45
6742 -45 188 -47 -97 -293 -39 81 63 35 109 -42 -152 121 -87 -54 330 -32 231 41 -25 28 -144 129 299
6765 299 -26 74 103 239 109 208 283 159 -174 -103 60 -111 -100 -38 -141 -190 202 86 91 -91 -168 -251 -91 212
$$ packed form
6608A05k93J91O5j61J38j17M0J35J39r9k29L91o17M56Q9L10n61J16m8j60J00j40
6630a50K81k26k4J02l3k6J87k29J87q3m7Lk9J39K61l91J16Q9k83M09m65L15k30
6653a27M06j26k88K78m5j21j3J32l69R8M25l06K94j76K8p0j92K67p2j80K36K06
6675B85m14J29k20J55K47j28j19K58j40Q5k17N1K26m57L71J60l02J90j52j01J29
6696C6K11j43j91j40L00k77N64n64L05j1k04k15N34K07l6j35k44k3q0L64l65J24
6718A7k15J44k8l0Rj07K12l9j8J07N6j82q8L96k09k70M22N3l55K19o1J52j53p7
6742d5K33k35n0j96K54J20j8k8P4j51j10K73k08L3L84l62K63j90o6N3j72K73J70
6765B99l25J00K9J36j30R9P5j24l33P1J63j71J1O2j03m9L92j16Nj82p7q3J60L03
$$ plain form
6789 212 71 84 171 -70 -94 103 -29 270 21 -175 -98 100 1 15 102 46 -271 -74 -85 -68 324 -374 -20
6812 -20 -174 266 142 -52 -207 19 -13 -100 -98 35 63 208 -68 65 10 -204 171 -170 -24 262 -116 109
6834 109 -55 -13 55 41 96 -211 122 183 196 -69 -26 200 -156 -55 -135 -266 -32 208 7 155 -26 -196 21
6857 21 126 12 104 -140 -132 145 -39 35 99 -59 -6 -91 335 140 -121 -176 73 190 -183 223 -39 -99 34
6880 34 -144 214 -325 -440 -126 -159 -157 -113 -17 64 245 -54 -139 -128 19 -77 36 -9 -193 -132 130 -101 96 175
6904 175 -8 151 108 -192 114 54 -90 24 -2 -252 -121 9 -86 -115 115 14 18 -179 -331 88 293 -60
6926 -60 56 60 33 -2 -24 -40 192 -178 -44 205 176 245 283 -9 107 -70 -164 -13 73 -102 -171 98 -47 160
6950 160 -129 26 17 123 81 -40 -67 11 128 148 -50 -125 18 149 -46 -115 -16 -229 -88 -156 171 28 -10 29
$$ packed form
6789B12j41J3Q7k41k4J97j32K99k49j96P7J98r9J4Q7n6l17J97j1J7L92o98L54
6812b0j54M40j24j94j55K26l2q7KJ33K8J45k76J33n5k14L75l41J46K86l78K25
6834A09j64M2O8j4N5l07L33O1J3k65M3K26l56J01q0j31K34K40k01J48j81j70K17
6857B1J05j14R2k44QK77j84P4O4j58N3q5M26j95k61n5K49J17l73M06k62o0J33
6880C4j78L58n39j15L14l3KM4R6Q1J81k99q5J1J47r6J13m5j84O1K62k31J97P9
6904A75j83J59m3l00L06o0j44J14k6k50J31J30r5k9K30j01Mj97j52M19K05l53
6926f0J16Mk7l5k2j6K32l70J34K49k9O9L8k92J16j77r4J51Q6j75o9K69j45K07
6950A60k89J55rJ06m2j21k7P8J17K0j98p5J43J31j95o9R9k13J41o8L27j43l8L9
$$ plain form
6974 29 -154 -77 446 65 103 -246 338 -155 -74 203 -212 130 36 76 -111 -207 -164 37 72 -293 110 -286 -28
6997 -28 241 42 -147 103 -40 -230 31 -256 352 104 388 -71 36 164 -237 44 106 -59 30 -266 126
7018 126 -158 42 -54 139 -145 226 -44 181 53 -241 38 86 22 48 64 -203 79 -165 -128 -238 116 -65
7040 -65 46 164 -152 -8 -43 65 -98 11 -11 30 -278 -93 -141 493 -114 -103 -126 31 150 137 299 -180 82
7063 82 -296 -155 -66 -63 -328 49 226 92 -53 -112 162 -13 47 -47 -295 -61 307 188 199 -124 -136 -250 -211
7086 -211 118 -185 7 -21 0 -53 33 163 -137 8 -231 -22 30 -57 293 79 -60 77 135 -62 -67 223 17
7109 17 -254 -74 -5 12 35 -69 -256 -182 -183 -154 94 88 -58 -101 -263 135 35 25 146 184 93 -36 125 -12 81
7134 81 135 209 -116 188 87 -102 -54 -178 -34 -138 -201 -162 -99 -135 18 20 -20 -40 -219 211 29 31 124 148 -9
$$ packed form
6974B9j83P7N23l81L8l49N84m93Q1K77m15L42r4M0j87r6M3K01L5l65M03l96K58
6997b8K69j99j89K50j43j90K61k87O08k48K84m59J07J28m01K81O2j65Q9k96L92
7018A26k84K00r6J93k84L71k70K25j28k94K79M8o4K6J6k67K82k44L7j10L54j81
7040f5J11J18l16J44l5J08j63J09k2M1l08J85m8O34o07J1k3J57J19j3J62m79K62
7063H2l78J41Q9Lk65L77J77j34j45n9K74j75O0r4k48K34L68j19J1l23j2j14L9
7086b11L29l03J92k8K1n3Q6J30l00J45k39K09N2q7L50k14j39J37N8j97nK90k06
7109A7k71J80O9J7K3j04j87P4jK9K48oj46m3j62L98j00j0J21L8r1j29J61j37R3
7134H1N4P4l25L04j01j89M8j24J44j04o3L9O3l6J53Km0k0j79M30j82KR3K4j57
$$ plain form
7159 -9 131 250 -135 -39 103 145 -51 240 -21 12 256 284 -101 224 -50 89 -98 13 73 198 189 12 83
7182 83 -102 71 15 204 -100 -121 170 -49 68 -52 55 -191 33 -280 9 -59 -45 -77 299 -148 80 198
7204 198 206 -57 -37 -108 -91 -6 -15 8 -58 298 34 -196 -95 185 -177 -108 -199 -134 222 45 -180 94 88 -350 68
7229 68 138 -260 -124 -208 277 -181 -85 172 -214 -14 65 -70 359 -202 -164 -47 68 57 -102 -158 74 -144 -18
7252 -18 21 62 223 153 -161 31 194 52 50 -196 52 -96 -21 -81 127 -88 143 -364 2 -36 74 110 110 4
7276 4 -154 313 -20 112 -130 33 -312 121 72 -17 147 -83 -203 -288 9 66 -42 26 -27 -100 -98 38 260 96
7300 96 226 -72 -82 178 282 -121 -235 59 127 3 -256 255 25 57 316 80 -230 131 -65 -171 90
7321 90 -239 259 -133 -38 5 32 10 -607 -9 -131 -18 -88 47 -276 -38 -45 95 -116 -121 18 -43 -196 -172 -71
$$ packed form
7159iJ40J19l85R6J42M2j96K91k61L3K44K8l85L25k74J39j87J11O0J25rj77P1
7182H3j85J73n6J89l04k1K91k19J17j20J07k46K24l13K89o8J4l2L76m47K28J18
7204A98Qk63K0p1J7Q5rK3o6L56k64k30J01K80l62O9r1O5L56j77k25K74om38M18
7229F8P0l98J36q4M85m58R6K57l86K00P9j35M29n61L8J17J15j1j59n6K32k18J26
7252a8L9M1J61p0l14J92J63j42kk46K48j48P5o0K08k15K31n07L66l8J10L6%j06
7276Dj58M67l33J32k42J63l45M33m9q9J64k30j20q5K97N7j08O8n3p3KJ36K22j64
7300I6J30k98j0K60J04m03j14K94O8j24k59N11k30L2K59k36l10L61j96j06K61
7321I0l29M98l92R5M3K7k2o17N98j22J13p0J35l23K38pJ40k11nJ39o1j53K4J01
$$ plain form
7345 -71 -215 -260 108 -92 11 -460 94 68 126 -8 -137 68 259 -65 97 255 106 -149 104 112 -39 13
7367 13 -74 24 82 116 -219 -303 233 -184 -9 -149 -364 -194 -19 -121 -149 143 -60 8 -145 136 -94 21 -58
7390 -58 44 -192 187 -310 25 106 65 137 179 134 71 -28 37 202 -48 182 -82 79 -170 68 -126 154 -287
7413 -287 94 54 84 54 -32 76 71 -199 185 176 -69 -62 109 64 197 123 61 84 128 64 -205 229 253 -200 61 10
7439 10 67 -168 -133 107 -53 -168 119 20 -176 47 217 101 76 271 -160 129 171 19 -129 -65 -163 3 -191
7462 -191 -258 -21 236 209 -168 39 31 -135 159 -224 -205 3 25 -219 -155 -29 -174 77 71 44 -28 -211 88 -84
7486 -84 7 38 124 57 -18 -161 210 -133 -55 -151 -209 86 222 -321 -91 -212 278 79 113 -60 136 -123 88
7509 88 67 69 -19 -277 116 36 -180 152 234 -255 -55 -253 -103 65 267 -6 137 116 189 189 2 262 -204 262
$$ packed form
7345g1j44m5L68k00J03m71N54k6N8j34j29K05J91l24J62J58j49k55K53Qj51N2
7367A3q7R8N8L4l35q4N36m17J75j40k15J70J75j02k8K92k03O8j53K81k30J15p9
7390e8J02k36L79m97L35Q1m1P2M2m5o3r9O5J65k50K30k64J61k49K38j94K80m41
7413b87L81m0L0l0q6J08nk70L84rk45PJ71m5J33p4o2K3M4o4k69M34K4m53K61n1
7439A0N7k35L5K40j60j15K87r9j96K23J70j16k5J95m31K89M2j52j48O4r8J66j94
7462a91o7K37K57k7l77K07qj66K94l83J9K08K2k44O4J26j45K51ok7p2j83K99j72
7486h4R1L1Q6o7p5j43L71l43P8r6n8K95J36n43K30j21M90j99L4j73J96k59K11
7509H8k1Kq8k58L93q0k16L32Q2m89K00j98J50J68K02k73J43k1P3%j87K60m66M66
$$ plain form
7533 262 -94 -256 35 60 124 -229 -96 133 179 -309 227 -13 -113 -96 36 -160 44 174 49 58 -66 -161
7555 -161 65 135 -77 56 41 10 294 80 -12 -42 -169 127 -349 233 -147 -99 286 -161 -28 219 -259 88
7577 88 -196 9 -25 83 -23 -333 124 189 334 -74 -38 -209 -64 321 -3 -168 -1 122 -109 -23 75 -89
7599 -89 -91 -49 79 290 239 -12 39 42 -119 58 -34 130 31 56 340 126 135 283 109 90 -24 -150 10 -83 194
7624 194 325 0 103 -93 -260 191 96 0 140 -24 110 -15 -169 49 14 -183 143 161 -150 -50 -17 -212
7646 -212 -244 155 95 3 -235 60 181 -88 -34 -335 -84 298 -183 -122 -124 43 -209 -212 -138 -38 -210 -196 293 -216
7670 -216 19 28 79 -73 117 146 -180 -211 -186 29 -120 -180 -88 68 29 -281 210 -25 -157 22 -30 16 -62 -277
7694 -277 -90 87 25 -7 310 51 -310 141 -24 -156 -233 -86 -200 -305 -21 77 193 89 -324 -111 154
$$ packed form
7533B62l56j62K91K5O4l53J33K29M6m88N36k40j00J7J32j96K04J30j25Rj24r5
7555a61K26P0k12J33j5l1K84k14r2l0j27K96m76N82l80M8L85m47J33K47m78L47
7577H8k84K05l4J08j06l10M57O5J45m08L6j71J45L85l24j65J67J23k31Q6R8j64
7599h9kM2J28K11n1k51N1Lj61J77r2J64r9K5K84k14RJ48j74j9j14j26J60r3K77
7624A94J31l25J03j96j67M51r5r6J40j64J34j25j54K18l5j97L26J8l11J00L3j95
7646b12l2L99o0r2k38K95J21k69N4l01K51L82m81O1kJ67k52lP4J00j72J4M89n09
7670b16K35RN1j52J90K9l26l1K5K15j49o0R2J56l9l10M91k35j32J79n2M6p8k15
7694b77J87J77o2l2L17k59l61M51j65j32p7J47j14j05K84R8J16j04m13K13K65
$$ plain form
7715 154 -64 82 108 -27 -107 90 136 -121 162 -252 114 -42 -54 -86 205 -37 -73 -165 99 53 341 -64 -394
7738 -394 -41 24 -160 -129 -74 340 235 96 13 -64 -40 -34 -359 109 -231 -37 -36 -125 -116 -52 -101 201 115 313 159
7763 159 -232 246 23 -166 -438 105 -250 64 30 97 7 128 -85 -214 181 -93 -55 -46 58 -121 -103 -104 43
7786 43 342 -100 294 107 -78 11 230 165 76 -52 10 -248 -81 -218 5 -41 -273 -263 -264 -181 -62 -139 75 65
7810 65 182 -242 84 -164 123 41 41 -72 -197 -109 65 153 100 -149 46 82 22 -33 312 123 169 -221 161 190
7834 190 -231 39 -99 -50 -172 -104 -8 112 143 -34 154 -109 173 75 201 -172 -125 232 150 84 -117 126 -95
7857 -95 43 -42 55 -84 -33 -104 23 62 -133 -185 62 309 156 35 -171 -166 74 185 98 -59 -224 -8 116
7880 116 145 -37 59 26 -269 61 161 -334 -51 -43 48 84 333 -74 -57 155 90 -125 -61 170 -91 -43 178 9
$$ packed form
7715A54k18J46K6j35q0J97M6k57K83m14L66j56j2l2K91k42l6r2K64m6K88m05l30
7738c94L53O5j84L1N5M14j05j39q3p7K4Ol25M68l40J94Jq9RO4m9L02q6J98j54
7763A59l91M78k23j89k72N43l55L14l4O7r0J21k13j29L95k74L8RJ04j79J8jJ47
7786D3K99m42L94j87j85Q9K19o5q9j28O2k58J67j37K23m6k32J0jQ3J19p7K14j0
7810F5J17m24L26k48K87q2%j13j25Q8J74Q8n3k49J95L6o0n5L45j89M6l90L82K9
7834A90m21K70j38M9j22O8R6J20L1j77J88k63K82r8J26l73M7L57q2o6k01K43k21
7857i5J38q5R7j39N1p1J27L9j95n2K47K47j53j21k06NK40J11q7j57j65K16J24
7880A16K9j82R6l3k95L30J00m95K83QR1L6K49m07J7K12o5k15O4K31k61M8K21j69
$$ plain form
7904 9 5 -63 222 133 183 -238 94 -132 -61 138 131 161 -8 93 -49 -75 191 -23 -168 -161 -185 -133 -245 -117 -7
7929 -7 18 -188 206 172 -91 -138 -382 298 -61 10 -258 -160 264 -216 20 -131 24 60 -32 70 -270 -48 188
7952 188 218 74 8 178 19 16 -250 238 27 -14 112 306 65 149 107 130 17 306 116 -107 -20 -81 54
7975 54 176 210 -14 -166 148 -35 27 64 126 -436 -66 -189 137 -95 -234 -319 166 14 103 -265 -286 -116 -278
7998 -278 46 -134 163 -109 61 200 -100 148 207 46 49 -44 -85 -331 -92 -112 108 -6 -210 -16 61 -200
8020 -200 -45 51 11 52 -85 -36 161 176 -143 -77 55 -19 -1 -225 -127 -165 127 -41 246 93 8 278 -122 -244
8044 -244 -60 -357 -154 -4 -73 98 254 217 58 191 -171 207 -1 -49 -180 -212 -56 -39 -149 74 -133 -406
8066 -406 -207 -260 157 29 59 -190 138 -75 -47 -159 37 7 -90 -144 -59 105 210 47 133 147 52 -22 100 319
$$ packed form
7904Imo8K85q9N0m21L32k26P1J99pL0j69J01j42k6K66k14j45Pk4N2j12J28J10
7929gK5k06L94l4k63m7k44O80l59P1k68R8M24m80K36j51J55L6r2J02l40K22K36
7952A88L0j44o6J70j59lk66M88k11m1J26J94k41Q4m2K3j13K89j90k23Q7o1J35
7975E4J22L4k24j52L14j83O2L7O2n62L70j23L26k32j39q5M85j52Q9l68k1J70j62
7998b78L24j80K97k72J70J39l00K48N9j61Lr3m1k46K39k0K20j14k04J94P7k61
8020b00J55R6m0M1j37M9J97J5l19O6J32p4J8k24R8l8K92j68K87j53q5K70m00j22
8044b44J84k97K03J50o9J71J56l7j59J33l62L78k08m8j31l2J56J7j10K23k07k73
8066d06J99n3M17j28L0k49L28k13K8j12J96l0r7n4Q5J64J05j63Q6J4r5p4J22K19
$$ plain form
8090 319 59 117 166 244 -79 16 -141 100 -102 -99 -120 -33 74 298 18 454 -276 233 99 45 51 24 78 -160
8114 -160 134 -162 -102 68 57 9 -3 36 109 -79 -302 45 -45 -5 138 -263 -311 -145 196 -45 -140 -128 -278 -179
8138 -179 48 -104 301 -53 73 267 121 139 409 -237 55 241 -83 30 -141 -304 -42 25 163 258 -160
8159 -160 282 -42 -76 -56 -83 -425 -270 330 159 -109 118 24 36 -457 -143 92 -146 28 -112 -12 -21 304
8181 304 245 172 -89 70 -170 346 -80 65 162 -42
$$ packed form
8090C19k60N8M9P8l23R5j57K41k02Lk1Q7J07K24k80M36p30N09j34n4Ok7N4k38
8114a60K94k96O0J70j1m8j2L9P3j88k23L47r0M0J43m01m8J66L41k41r5J2j50R9
8138a79K27j52M05l54J26J94j46J8K70o46K92J86l24J13j71j63K62O7J38R5m18
8159a60M42l24l4K0k7l42J55O00j71k68K27r4J2m93L14K35k38J74j40J00rL25
8181C04n9p3k61J59k40N16m26J45R7k04
8191d2
$$ Imaginary data points
##PAGE= N=2
##DATA TABLE= (X++(I..I)), XYDATA
$$ plain form
0 0 0 0 0 0 0 0 0 7 -8 8 -8 8 -9 16 -16 20 -24 28 -32 40 -47 52 -60 72 -81 92 -106 118 -134 153 -171 192
32 192 -215 241 -266 295 -330 367 -406 448 -498 552 -609 676 -749 832 -926 1033 -1157 1302
50 1302 -1477 1687 -1950 2288 -2741 3379 -4346 5976 -9245 18322 -93491 -328027 -70818
63 -70818 157335 47799 -123938 -54694 24831 -49343 -103464 -15557 32712 -11029 -19494 16403
75 16403 -29106 -89192 -31731 74777 64092 -24682 -58511 -18266 29151 55825 35969 -20219
87 -20219 -27009 52567 97038 22295 -51478 6337 105421 93317 -2868 -44703 6762 74047
99 74047 82934 25991 -33733 -25486 37857 65342 24520 -11725 3917 24902 7217 -19909 -20465
112 -20465 7584 40731 37646 -28959 -99309 -67110 47100 87682 -7805 -104707 -80764 6158
$$ packed form
0@%%%%%%%Pj5J6j6J6j7K5l2L6m4N2o0P2q7R9j12J32j53J73j98K24k52K87l24L63
32A92m07M56n07N61o25O97p73Q54r46J050j161J285j425J581j758J959k190K459
50A302k779L164l637M238n029O120p725J0322j5221K7567j11813k34536K57209
63g0818K28153j09536j71737O9244P9525p4174n4121Q7907M8269m3741q465L5897
75A6403m5509o0086N7461J06508j0685q8774l3829M0245M7417K6674j9856n6188
87b0219o790P9576M4471p4743p3773N7815R9084j2104r6185m1835N1465O7285
99G4047Q887n6943n9724Q247O3343K7485m0822l6245J5642K0985j7685k7126n56
112b0465K8049L3147l085o6605p0350L2199J14210M0582r5487r6902K3943Q6922
$$ plain form
124 6158 37186 2462 -30599 -30380 -10710 1353 -15012 -41545 -26658 30180 44966 -21085 -77638
137 -77638 -35082 49527 60655 -3506 -44673 -17575 27968 37723 11598 -12491 -3318 31420
149 31420 42368 3933 -39575 -22366 40537 65593 14619 -52379 -53220 14050 67306 38893
161 38893 -33235 -50365 3263 38589 1568 -36588 -4295 41854 15655 -50478 -58820 -1271
173 -1271 43652 30472 -16276 -51258 -43302 7435 52399 35309 -23272 -45290 -4946 37073
185 37073 28129 -8638 -18320 11605 38153 17005 -28325 -27047 32107 66613 18274 -44279 -27424
198 -27424 40799 59226 11383 -24501 -6029 27835 28834 285 -22353 -10391 25521 39080
210 39080 2728 -43478 -38383 14766 49244 23121 -31976 -50355 -13440 29791 26144 -13171
$$ packed form
124F158L1028l4724l3061K19J9670J2063j6365k6533J4887N6838J4786o6051n6553
137g7638M2556Q4609J1128o4161m1167K7098M5543R755k6125k4089R173L4738
149C1420J0948l8435m3508J7209O2903K5056n0974o6998q41O7270N3256k8413
161C8893p2128j7130N3628L5326l7021l8156L2293M6149k6199o6133q342N7549
173a271M4923j3180m6748l4982P956N0737M4964j7090n8581k2018M0344M2019
185C7073q944l6767r682K9925K6548k1148m5330J278N9154L4506m8339o2553J6855
198b7424O8223J8427m7843l5884J8472L3864R99k8549k2638J1962L5912J3559
210C9080l6352m6206N095N3149L4478k6123n5097j8379L6915M3231l647l9315
$$ plain form
222 -13171 -31136 -9032 9108 -9081 -30890 -15088 20229 23498 -14633 -49356 -34838 20053
234 20053 50123 15052 -43495 -48645 4401 42795 21974 -18379 -25395 -1796 15962 9036 -9647
247 -9647 -13676 6150 24712 10786 -20607 -21895 14358 38341 17843 -18113 -24696 3204 29595
260 29595 22082 -10307 -23699 2986 30812 12499 -29825 -29456 19106 45289 10238 -36889 -34416
273 -34416 8955 37765 22255 -13046 -28352 -12207 10645 13373 -870 -8895 -1301 4243 -3770
286 -3770 -16824 -13760 9837 28263 12220 -27726 -40162 1081 45000 30727 -22202 -40516
298 -40516 -5067 28387 18201 -10198 -14952 3810 15859 5741 -11123 -11593 7458 23003 12350
311 12350 -13748 -22121 -826 22521 18245 -6528 -20806 -9171 10742 11104 -7641 -17635 -74
$$ packed form
222a3171j7965K2104J8140j8189k1809J5802L5317L269l8131l4723J4518N4891
234B0053L0070l5071n8547n150N3046L8394k0821m0353p016K3599J7758o926j8683
247i647m029J9826J8562j3926l1393j288L6253K3983k0498l5956o583K7900K6391
260B9595p513l2389j3392K6685K7826j8313m2324L69M8562K6183l5051m7127K473
273c4416M3371K8810j5510l5301j5306J6145K2852K728j4243q025P594N544q013
286c770j3054L064K3597J8426j6043l9946j2436M1243M3919j4273n2929j8314
298d0516L5449L3454j0186k8399m754J8762J2049j0118j6864m70J9051J5545j0653
311A2350k6098q373K1295K3347m276k4773j4278J1635J9913L62j8745r994J7561
$$ plain form
324 -74 20323 9522 -22832 -30168 3000 33892 19481 -21785 -36917 -9898 22433 22561 -2956
337 -2956 -20608 -13409 3433 7076 -1604 -4505 6148 12907 1163 -16660 -14314 10189 29003
350 29003 16862 -15086 -28989 -7524 23542 27450 32 -21953 -12476 11421 14865 -3513 -13368
363 -13368 -32 16001 9803 -11367 -19923 -2512 19333 16870 -7353 -22583 -11069 10159 13273
376 13273 -1548 -10248 -2718 6583 2118 -9859 -11152 4324 19191 13117 -11355 -24854 -8158
389 -8158 21853 27413 1972 -23576 -18163 7594 20929 9002 -7094 -6104 4702 5255 -5338
402 -5338 -7303 6668 18173 7585 -15144 -20460 -871 20212 17671 -4666 -20809 -13872 6290
415 6290 15459 4432 -9925 -8521 5103 8416 -3670 -12782 -3776 13000 13264 -4932 -18371 -9579
$$ packed form
324g4K0397j0801l2354p336L3168L0892j4411m1266j5132K7019L2331J28k5517
337b956j7652P199J6842L643q680k901J0653O759j1744j7823K346K4503J8814
350B9003j2141l1948j3903K1465L1066L908k7418k1985R477K3897L444j8378r855
363a3368J3336J6033o198k1170q556J7411K1845k463k4223j5230J1514K1228L114
376A3273j4821q700P530R301m465j1977j293J5476J4867o074k4472j3499J6696
389h158L0011N560k5441k5548N413K5757J3335j1927j6096R90J0806N53j0593
402e338j965J3971J1505j0588k2729n316J9589K1083k541k2337j6143O937K0162
415F290R169j1027j4357J404J3624L313j2086r112R006J6776K64j8196j3439Q792
$$ plain form
429 -9579 10398 16543 3201 -12010 -9768 3722 8364 947 -5673 1682 10921 6309 -9002 -14890
443 -14890 -639 17138 14882 -5443 -20645 -12599 7027 16600 5923 -10762 -15350 -5695 4875
456 4875 4304 -3616 -5820 468 2158 -6736 -14085 -4940 11349 11046 -7667 -21066 -11265 8497 13592
471 13592 498 -12125 -9423 1391 6407 798 -5715 -3188 5697 8659 -556 -10484 -6364 8531
485 8531 14788 3824 -9919 -9748 3163 11923 6790 -2602 -3696 2729 5364 -867 -5715 131 11126
500 11126 9645 -4361 -14234 -6382 9893 14365 2571 -12269 -13032 206 10549 6936 -3792
513 -3792 -7794 -2634 1794 -262 -4058 -2034 2891 3038 -3695 -9990 -6809 4388 9610 1251 -11565
528 -11565 -11584 1105 8822 2981 -6444 -6284 657 3960 -218 -7090 -6037 2557 7236 820 -9942
$$ packed form
429i579J9977O145j3342j5211K242J3490M642p417o620P355R239m612j5311n888
443a4890J4251J7777k256k0325j5202Q046J9626R573j0677j6685m588R655J0570
456D875n71p920k204O288J690q894p349R145J6289l03j8713j3399R801J9762N095
471A3592j3094j2623K702J0814N016n609o513K527Q885K962r215r928M120J4895
485H531O257j0964j3743J71J2911Q760n133r392j094O425K635o231m848N846J0995
500A1126j481j4006r873P852J6275M472j1794j4840p63J3238J0343l613j0728
513c792m002N160M428k056l796K024M925J47o733o295L181J1197N222q359j2816
528a1565j9J2689P717n841r425J60O941L303m178o872J053Q594M679o416j0762
$$ plain form
543 -9942 -10193 1676 9382 3251 -7299 -8396 -1972 2898 1353 -1565 -1866 109 173 -2745 -6171 -4415
559 -4415 3741 7487 -370 -12119 -11000 2661 11436 5261 -7723 -11004 -3430 4905 4951 -812 -3720
574 -3720 -998 1619 -903 -3428 -463 4391 4389 -1619 -5775 -3343 2592 7413 5969 -2221 -7862 -2405
590 -2405 7176 6154 -2712 -4630 3177 5997 -300 -5389 -2138 4087 5318 1571 -3943 -7163 -2479
605 -2479 5996 6930 -969 -6094 -3004 971 39 -897 881 1269 103 -2603 -4901 -4665 2065 8063
621 8063 2727 -9581 -11197 -88 7465 4490 -2616 -5355 -4746 -2105 1662 1554 -1814 -2354 217
636 217 -937 -6062 -4866 3150 5205 -1970 -7591 -5834 -1029 2291 2755 -420 -4175 -4526 582 1827
652 1827 -2473 -3333 1579 3953 -1363 -5764 -2977 2514 4668 3772 42 -4338 -4660 2143 7604 5108
$$ packed form
543i942k51J1869P706o131j0550j097O424M870j545k918l01J975O4k918l426J756
559d415Q156L746p857j1749J119J3661Q775o175j2984l281P574Q335M6n763k908
574c720K722K617k522k525K965M854ko008m156K432N935M821j444q190n641N457
590b405R581j022q866j918P807K820o297n089L251O225J231l747n514l220M684
605b479Q475R34p899n125L090L975r32r36J778L88j166k706k298K36O730N998
621H063n336j2308j616J1109P553k975p106k739O09K641L767j08l368n40K571
636B17j154n125J196Q016K055p175n621J757M805L320M64l175l755l51N108J245
652A827m300q60M912K374n316m401K787N491K154q96l730m380l22O803N461k496
$$ plain form
668 5108 -1409 -1695 1243 819 -1848 569 5964 5240 -1532 -5974 -3076 3078 6979 4972 -1278 -6696
684 -6696 -4463 2084 5077 1952 -1052 -1509 -1999 -2042 -651 561 839 770 -120 -3646 -5429 -638 6026
701 6026 5167 -2510 -4543 108 1975 354 1075 3552 1801 -1414 -1182 28 -479 346 4584 4415 -2808
718 -2808 -6501 -1051 5166 5143 1202 -1986 -3408 -2861 -225 2023 1396 -585 -1698 -3649 -5375 -2338
734 -2338 2239 3562 -902 -4916 -5711 -3310 1464 5042 2866 -3644 -5830 -1679 1229 308 541 2224
750 2224 968 -2282 -2926 -215 2134 3264 2940 849 -2466 -1784 2764 5229 3191 721 364 143
766 143 -790 -572 2033 3543 2654 86 -1901 -2364 283 3983 4776 940 -3626 -3470 251 2699 1917
783 1917 1181 148 -1993 -4018 -2291 2087 3317 163 -2053 -1883 -1056 -363 2203 4300 1486 -3223
$$ packed form
668E108o517k86K938m24k667K417N395p24o772m442K898O154L901k007o250n418
684f696K233O547K993l125l004m57m90m3J391J212K78o9q90l526j783M791O664
701F026q59p677k033M651J867j621P21K477j751l215K32J210n07Q25M238j69p223
718b808l693N450O217k3l941l188j422N47K636K248o27j981j113j951j726L037
734b338M577J323m464m014p95K401M774L578k176o510k186M151K908r21K33J683
750B224j256l250o44K711K349J130l24k091l315O82M548K465k038k470l57k21
766A43r33K18K605J510q89k568j987m63K647L700P93l836m566J56L721K448p82
783A917p36j033k141k025J727M378J230l154k216J70Q27O93K566K097k814m709
$$ plain form
799 -3223 -3395 729 2778 1476 695 -72 -431 -1879 -740 833 1832 1920 775 -913 -1319 -220 1644
816 1644 2587 1609 -288 -2591 -3121 -626 1550 203 -602 -113 -379 -3455 -2941 1306 3820 902 -2405
833 -2405 -2260 -893 -453 1349 2075 -372 -3700 -3253 -954 248 996 1665 380 -1770 -2238 247 2729
850 2729 1611 1039 345 -1072 -1554 859 2980 1445 -471 -955 -150 -775 -222 1903 2536 854 -455
867 -455 697 901 595 919 2314 1815 -912 -1457 -669 884 942 479 -287 -1271 -2023 -950 980 1455 1116
886 1116 42 -1046 -1256 -609 1094 1406 -162 -2189 -2010 -1447 -369 1165 1403 -784 -2821 -1790 724
903 724 1416 311 697 1417 -1244 -2222 481 2618 747 -1692 -900 -183 -1326 -1031 991 1578 -208
920 -208 -1241 -463 95 48 419 1226 220 -1257 -1112 -264 -790 -283 611 -791 -2483 -1477 -75 404
$$ packed form
799c223j72M124K049j302p81p67l59j448J139J573R99Q8j145j688m06J099J864
816A644R43r78j897k303n30K495K176j347q05M89k66l076N14M247K514k918l307
833b405J45J367M40J802P26k447l328M47K299J202P48O69j285k150m68K485K482
850B729j118n72o94j417m82K413K121j535j916m84Q05o25N53K125O33j682j309
867d55J152K04l06L24J395m99k727n45P88J553N8m63p66r84p52J073J930M75l39
886A116j074j088k10O47J703L12j568k027J79N63J078J534K38k187k037J031K514
903G24O92j105L86P20k661r78K703K137j871k439P92P17j143K95K022N87j786
920b08j033P78N58m7L71Q07j006j477J45Q48n26N07Q94j402j692J006J402M79
$$ plain form
938 404 410 1343 745 -1374 -1065 931 1596 887 -648 -205 -930 -1527 -560 1610 1204 -946 -1819 -884 268
957 268 1316 1823 1956 -88 -876 168 768 770 821 326 -667 -1592 -691 583 1036 586 111 51 -922 -109
977 -109 1577 1560 766 136 -84 -672 -972 367 519 62 -706 -1125 -933 -274 395 1430 1225 217 -1046
996 -1046 -675 500 1355 1811 1029 -710 -1225 -620 -63 518 753 15 -1136 -1241 -917 1353 2212 1093
1014 1093 53 -905 -699 170 869 1255 806 -732 -1390 -739 230 130 261 530 9 -1154 -1041 711
1032 711 1747 1141 283 -418 -799 -832 -762 456 908 -75 -1415 -1812 -1282 149 770 426 -300 -1515 -1344
1051 -1344 -830 514 1455 341 -1052 -2218 -1790 -984 68 494 177 -1194 -2009 -1429 161 1232 551
1068 551 337 -526 -1066 -764 596 1870 804 -450 -1218 -1245 -541 -43 901 1008 144 -955 -1054 -24 918
$$ packed form
938D04OR33n98k119L09J996O65p09j535M43p25n97R67K170m06k150q73R35J152
957B68J048N07J33k044p88J044O00KN1m95r93r25R01J274M53m50m75o0r73Q13
977a09J686j7p94o30k20n88l00J339J52m57p68m19J92O59O69J035k05j008j263
996a046L71J175Q55M56p82j739n15O05N57N81K35p38j151j05L24K270Q59j119
1014A093j040r58K06Q69O99L86m49j538o58O51R69j00J31K69n21j163J13J752
1032G11J036o06q58p01l81l3P0J218M52r83j340l97N30J431O21l44p26j215J71
1051a344N14J344R41j114j393j166M28Q06J052M26l17j371q15N80J590J071o81
1068E51k14q63n40L02J360J274j066j254p68k7P04M98R44J07q64j099r9J030R42
$$ plain form
1087 918 1456 857 336 -1146 -1041 -317 913 800 88 -501 -865 -1170 -903 438 1643 412 -414 -1198
1105 -1198 -914 609 1511 946 -108 -1803 -1993 -1094 -182 758 363 -170 -1497 -1870 -851 339 1230 839
1123 839 -172 -1154 -1229 -27 705 915 254 -930 -1364 -1439 -376 321 537 338 -180 -1040 -884 -215 855
1142 855 1498 276 -701 -1523 -583 256 780 675 -589 -1332 -1502 -935 -298 254 401 142 -805 -1407 -689
1161 -689 515 1008 -67 -696 -1756 -1426 -63 527 462 -244 -1150 -1338 -1340 -666 829 978 682 -439 -469
1180 -469 -192 519 1354 1073 -100 -186 -623 226 650 673 1272 840 -190 -442 135 837 1313 1363 669 -122
1200 -122 -597 214 903 800 346 -592 -993 -1096 -754 181 701 242 -892 -1232 -1224 -289 560 543 146 -683 -1792
1221 -1792 -943 -8 -208 -85 -937 -1211 -1313 -362 -129 441 450 190 -628 -784 -460 476 1069 409 -335 -552
$$ packed form
1087I18N38n99n21j482J05P24J230j13p12n89l64l05K67J341J205j231q26p84
1105a198K84J523R02n65j054j695j90Q99R12R40l95n33j327l73J019J190Q91l91
1123H39j011r82p5J202P32K10o61j184m34p5J063O97K16j99n18q60J56O69J070
1142H55O43j222r77q22R40Q39N24j05j264p43j70N67O37N52J47k59r47o02P18
1161f89J204M93j075o29j060L30J363N90o5p06r06j88kO74J495J49k96j121l0
1180d69K77P11Q35k81j173q6m37Q49M24K3N99m32j030k52N77P02M76N0o94p91
1200a22m75Q11O89j03m54r38m01j03L42R35N20m59j134l40QR35Q49j7l97q29j109
1221a792Q49R35k00J23q52k74j02R51K33N70Rk60q18j56L24R36N93o60p44k17
$$ plain form
1241 -552 -115 164 434 415 -351 -573 -186 -244 -131 244 1001 729 -544 -625 -106 86 269 100 25 -1099 -870
1262 -870 29 426 95 -255 43 -562 -394 315 598 1277 682 -414 -207 -5 278 669 1066 -319 -710
1281 -710 99 664 611 425 989 370 -249 -115 288 990 679 844 435 -683 -237 209 338 125 -118 -291
1301 -291 -384 -342 90 317 -159 -522 -200 -143 -737 -398 128 432 -462 -1073 -501 171 -170 -793 -163 -566 -670
1322 -670 -368 31 226 406 170 54 -294 -342 -238 260 217 96 -626 -635 16 427 461 -309 -491 -183 -316 363
1344 363 783 356 279 -7 -285 -265 -136 86 300 45 -191 -765 -247 318 546 -45 -269 -209 14 -482 208
1365 208 168 279 -425 -650 -413 -369 106 474 189 -260 -986 -585 34 617 569 207 -497 -729 -138 349 928
1386 928 437 160 -163 -954 71 540 773 293 -311 -397 17 522 758 801 445 -364 -587 99 183 647 436
$$ packed form
1241e52M37K79K70j9p66k22L87n8J13L75P57k72j273q1N19J92J83j69p5j124K29
1262h70Q99L97l31l50K98o05J68P09K83O79n95j096K07K02K83L91L97j385l91
1281g10Q09N65n3j86N64o19o19J34M03P02l11J65m09j118M46M46J29k13k43j73
1301b91r3M2M32K27m76l63L22N7n94L39N26L04q94o11N72O72l41o23O30m03j04
1322f70L02L99J95J80k36j16l48m8J04M98m3j21p22rO51M11L4p70j82L08j33O79
1344C63M20m27p7k86k78K0J29K22K14k55k36n74N18N65K28n91k24O0K23m96O90
1365B08m0J11p04k25K37M4M75L68k85m49p26M01O19N83m8l62p04k32N91M87N79
1386I28m91k77l23p91J025M69K33m80o04q6M14N05K36M3l56q09k23O86Q4M64k11
$$ plain form
1407 436 22 -591 -528 -576 27 645 497 4 -641 -449 -123 579 292 38 -33 -488 -459 -261 103 485 255
1428 255 -57 -631 -575 -399 237 585 219 -755 -1170 -158 725 497 227 -132 -343 -912 -767 153 1193 608
1448 608 -150 -318 -451 -67 421 1110 415 -581 -1002 89 226 103 695 625 -32 -668 -359 -145 538 886
1468 886 436 -395 -906 -205 1129 678 395 239 -29 -776 -258 829 959 178 -231 203 -640 -814 272
1487 272 908 389 -538 -592 -299 -30 176 1164 280 -806 -809 109 326 1 364 432 -257 -850 -603 457 258
1508 258 499 192 -110 -767 -492 1022 957 -165 -729 188 61 -244 -446 810 503 -199 -697 -489 -77
1527 -77 315 773 544 -469 -667 -185 -190 676 464 229 -202 -418 -445 233 561 679 314 -348 -828 -262 522
1548 522 666 295 -299 -309 -249 -103 106 906 -132 -349 -556 -271 -164 50 474 383 -234 -898 -598 -126 346
$$ packed form
1407D36m14o13O3m8O03O18j48m93o45J92L26P02k87k54p1m55K9J98L64L82k30
1428B55l12n74N6J76O36L48l66r74m15J012Q83k28k70l59k11n69J45R20J040n85
1448F08p58j68j33L84M88O89o95r96m21J091J37j23N92p0o57o36L09K14O83L48
1468H86m50q31n11P01J334m51k83j56k68p47N18J087J30p81m09M34q43j74J086
1487B72O36n19r27n4K93K69K06R88q84j086lR18K17l25L63O8o89n93K47J060j99
1508B58K41l07l02o57K75J514o5j122n64R17j27l05k02J256l07p02m98K08M12
1527g7L92M58k29j013j98M82nQ66k12k35m31k16k7O78L28J18l65o62m80N66P84
1548E22J44l71n94j0O0J46K09Q00j038k17k07K85J07K14M24r1o17o64L00M72M72
$$ plain form
1569 346 1 -181 -519 -722 -67 348 352 -26 -278 -288 -348 -384 250 540 196 -149 -298 -322 24 653 702 112
1591 112 -648 -300 -18 378 396 579 630 -128 -751 -299 164 477 162 344 -601 -669 236 519 538 -42 -274
1612 -274 -188 -431 -426 115 141 41 -693 -444 -564 -435 158 188 -28 -374 -595 -13 224 186 97 -227 -428 -28
1634 -28 -118 101 108 -46 131 -367 -96 -234 387 628 251 -347 -476 -188 254 561 69 -484 -553 -291 -167 -81
1656 -81 125 205 -88 -273 -484 -260 160 482 -1 -438 -547 -290 119 72 119 -457 -478 -331 -208 9 -189 318
1678 318 -294 -756 -548 87 388 372 63 71 -23 -109 313 482 389 -167 153 -69 -439 238 440 545 35 -128
1700 -128 -400 -5 244 682 364 44 -552 -791 400 205 544 -18 -377 -542 -350 -98 285 242 426 -219
1720 -219 -445 -541 42 267 379 -178 -500 -615 -137 314 371 92 -334 -468 -368 -228 26 538 174 -4 -891
$$ packed form
1569C46l45j82l38k03O55M15Ml78k52j0o0l6O34K90l44l45j49k4L46O29M9n90
1591A12p60L48K82L96J8J83N1p58o23M52M63L13l15J82r45o8R05K83J9n80k32
1612b74Q6k43NN41K6j00p34K49j20J29N93L0k16l46k21N82K37l8q9l24k01M00
1634b8r0K19Pj54J77m98K71j38O21K41l77n98j29K88M42L07m92n53o9K62J24Q6
1656h1K06Q0k93j85k11K24M20L22m83m37j09K57M09m7M7n76k1J47J23K17j98N07
1678C18o12m62K08O35L01j6l09Qr4q6M22J69r3n56L20k22l70O77K02J05n10j63
1700a28k72L95K49M38l18l20n96k39J191j95L39n62l59j65J92K52L83m3J84o45
1720b19k26r6N83K25J12n57l22j15M78M51N7k79m26j34J00J40K54N12l64j78q87
$$ plain form
1741 -891 -143 410 209 922 31 -184 -564 -831 199 535 278 88 -223 -341 -394 262 688 422 -252 -464
1761 -464 -690 -478 230 567 334 -444 -685 -444 -284 322 537 281 -187 -691 -277 -282 401 197 -88 -331 -955
1782 -955 -544 200 479 293 -155 -318 -331 -288 352 890 668 51 -254 -338 -63 540 643 318 -275 -537 -195
1803 -195 171 698 769 479 248 -68 -352 299 668 987 373 -524 -600 -214 394 512 -19 -293 -682 -522 -295
1824 -295 164 365 552 -16 -381 -863 -268 322 248 277 -480 -1035 -600 -220 49 438 164 -661 -994 -474 -62
1845 -62 192 847 207 -532 -637 -594 174 366 436 82 -370 -540 -201 266 756 668 -177 -713 -585 212 760
1866 760 721 829 150 -169 -446 5 388 725 9 -317 -585 -410 237 352 102 210 -183 -345 -7 139
1886 139 489 549 -173 -401 -864 -361 408 372 208 -27 -637 -206 -17 436 595 495 -246 -461 -156 137 119
$$ packed form
1741h91P48N53k01P13q91k15l80k67J030L36k57j90l11j18n3O56M26k66o74k12
1761d64k26K12P08L37k33p78k41K41J60O06K15k56m68n04M14nO83k04k85k43o24
1782i55M11P44K79j86m48j63j3M3O40N38k22o17l05q4K75O03J03l25n93k62L42
1803a95L66N27P1k90k31l16k84O51L69L19o14q97p6L86O08J18n31k74l89J60K27
1824b95M59K01J87n68l65m82N95N90p4K9p57n55M35L80K69L89k74q25l33N20M12
1845f2K54O55o40p39j05M3P68J92P0l54m52j70L39M67M90q8q45n36J28P97N48
1866G60l9J08o79l19k77M51L83L37p16l26k68J75O47J15k50J08l93j62L38J46
1886A39L50O0p22k28m63N03P69l6j64k35o10M31J89M53J59j00p41k15L05K93j8
$$ plain form
1907 119 120 450 -225 -274 -304 57 414 489 -29 -214 -290 -2 123 671 290 -11 -591 -656 -218 214 -104 155
1929 155 -343 -452 -565 -191 209 328 -53 -108 -636 -274 -30 440 -19 201 -295 -373 -276 239 458 213 29
1950 29 -385 -262 -79 217 219 264 -545 -59 -180 294 153 602 208 -371 -206 -151 54 435 13 86 -237 -407
1972 -407 -6 208 458 224 -193 -371 -226 -478 301 279 195 13 -459 -416 -218 213 234 393 -32 -320 -173
1993 -173 163 382 264 278 -269 -454 -57 169 312 66 63 87 -285 -184 60 348 203 -232 -246 -457 108 254
2015 254 371 30 -132 -226 -251 9 -224 101 -41 -109 -249 115 -7 111 -51 -29 -347 -389 239 169 193 -9
2037 -9 -187 -230 -36 -525 491 17 137 -240 2 -82 -189 364 683 266 -622 -288 -28 -104 347 51 -252
2058 -252 -466 -390 169 207 -66 110 160 -264 -241 -52 354 320 -101 72 -350 -98 231 326 -87 -267 -227 -457
$$ packed form
1907A19JL30o75m9l0L61L57P5n18j85p6K88J25N48l81l01n80o5M38M32l18K59
1929A55m98j09j13L74M00J19l81n5n28L62K44M70m59K20m96p8R7N15K19k45j84
1950B9m14J23J83K96KM5q09M86j21M74j41M49l94n79J65N5K05L81m22P3l23j70
1972d07M01K14K50k34m17j78J45k52P79k2q4j82m72M3J98M31K1J59m25k88J47
1993a73L36K19j18J4n47j85L97K26J43k46lK4l72J01K44K88j45m35j4k11N65J46
2015B54J17l41j62r4k5K60k33L25j42o8j40L64j22J18j62K2l18m2O28p0K4k02
2037ij78m3J94m89J016m74J20l77K42q4j07N53L19m17q88L34K60p6M51k96l03
2058b52k14P6N59L8k73J76N0m24K3J89M06l4m21J73m22K52L29R5m13j80M0k30
$$ plain form
2080 -457 -255 -224 430 475 139 -80 -54 -88 177 404 201 85 -288 -379 13 523 204 56 -82 -59 181 221
2102 221 236 641 46 79 -69 -203 -110 502 92 -504 -543 -164 168 338 8 276 141 -108 -84 145 305 388
2124 388 504 -15 -104 -549 11 249 147 197 -438 -165 -104 43 325 141 -18 -100 11 -19 -114 119 420 299
2146 299 -206 -237 -49 228 692 244 -356 -321 40 43 405 128 242 149 -264 -135 -428 451 404 -13 -366 -664
2168 -664 -281 -29 194 96 -240 -385 -256 -13 232 212 89 42 -50 -408 -404 112 378 321 -14 -704 -374 411
2190 411 635 374 163 -2 108 50 -103 296 191 131 71 -293 -529 -60 367 357 250 -451 -19 232 496
2211 496 261 -49 0 -11 1 20 -290 204 298 362 46 -702 -282 389 54 -320 -396 -273 190 292 43 -19 -157
2234 -157 12 103 -306 51 -117 97 122 -399 -552 -167 -47 388 316 -255 -24 109 209 -122 -267 -41 296
$$ packed form
2080d57K02L1O54M5l36k19K6l4K65K27k03j16l73r1L92N10l19j48j38K3K40M0
2102B21J5M05n95L3j48j34R3O12m10n96l9L79L32J70l30K68j35k49K4K29J60Q3
2124C88J16n19q9m45N60K38j02N0o35K73O1J47K82j84j59q2J11l0r5K33L01j21
2146B99n05l1J88K77M64m48o00L5L61LL62k77J14r3m13J29k93Q79m7m17l53k98
2168f64L83K52K23r8l36j45J29K43K45k0j23m7r2l58MN16K66n7l35o90L30P85
2190D11K24k61k11j65J10n8j53L99j05o0o0l64k36M69M27j0j07p01M32K51K64
2211D96k35l10M9j1J2J9l10M94R4O4l16p48M20O71l35l74p6J23M63J02k49o2j38
2234a57J69R1m09L57j68K14K5n21j53L85J20M35p2n71K31J33J00l31j45K26L37
$$ plain form
2255 296 -96 43 -222 48 195 105 53 -342 -609 141 472 258 -143 -269 -286 353 157 -189 76 246 -160
2276 -160 -23 -522 -407 95 329 -261 -381 -624 -32 393 291 -112 -228 271 181 78 -381 -51 294 421
2296 421 175 -460 -131 100 125 196 -120 -176 104 574 203 -280 -461 -146 82 -62 -542 57 101 247 61
2317 61 -269 -210 538 366 -136 -330 -332 48 324 2 -282 -199 7 325 -219 -57 -370 72 323 -23 -315 -218
2339 -218 367 355 -93 -306 -532 285 373 219 -325 -349 20 247 141 -48 -219 218 582 0 -243 -325 296
2360 296 484 152 -173 -519 293 387 209 -369 -105 -11 -5 -88 -358 -481 170 -73 -96 -413 -256 277 386 -122
2382 -122 -351 -467 333 318 301 -309 -133 48 216 183 112 -319 246 409 16 -570 -13 522 835 198 -482
2403 -482 -271 370 711 501 -44 -132 -123 447 358 -353 -172 -35 714 -231 -435 -358 99 514 178 -461 -474 -436
$$ packed form
2255B96l92J39k65K70J47r0n2l95k67P50L31k14m01j26j7O39j96l46K65J70m06
2276a60J37m99J15N02K34n90j20k43N92M25j02m03j16M99r0j03m59L30L45J27
2296D21k46o35L29K31K5P1l16n6K80M70l71m83j81L15K28j44m80N99M4J46j86
2317F1l30N9P48j72n02j94kL80K76l22k84Q3K06L18n44J62l13M42K51l46k92R7
2339b18N85j2m48k13k26Q17Q8j54n44k4L69K27j06j89j71M37L64n82k43q2O21
2360B96J88l32l25l46Q12R4j78n78K64R4Oq3k70j23O51k43k3l17J57N33J09n08
2382a22k29j16Q00j5j7o10J76J81J68l3p1m31N65J63l93n86N57N35L13o37o80
2403d82K11O41L41k10n45q8RN70q9p11J81J37P49r45k04P7M57M15l36o39j3L8
$$ plain form
2425 -436 308 235 -99 -230 -120 238 171 -182 -407 76 318 126 -534 -791 -23 693 372 -338 -448 -279 218
2446 218 215 152 -263 15 383 115 -344 -317 144 259 139 -486 -630 -72 665 201 -172 -98 -452 630 319
2467 319 132 79 127 391 244 -3 -357 203 676 72 -634 -517 -263 312 792 282 -414 -56 369 167 -125
2488 -125 -255 -219 303 9 -419 -461 356 518 563 -274 -623 -263 385 568 -65 -382 -73 162 134 -176 -583
2509 -583 78 187 -127 -389 -341 183 298 326 -687 -654 -570 297 221 80 -450 -365 -63 32 157 -118 121 154
2531 154 339 -334 -481 -121 295 812 -339 -883 -174 -119 590 -80 -690 -182 28 217 -208 -519 61 505
2551 505 596 -186 -691 -192 397 237 -169 -886 -353 91 80 -256 -120 -402 343 384 -392 -285 70 595 454
2572 454 -310 -718 -495 464 485 -51 -206 -194 59 478 228 -404 -114 210 179 -347 -334 40 558 339 -79
$$ packed form
2425d36P44p3l34j31J10L58o7l53k25M83K42j92o60k57P68P16l21p10j10J69M97
2446B18lo3m15K78L68k68m59K7M61J15j20o25j44N58P37m64l73P4l54J082l11
2467C19j87n3M8K64j47k47l54N60M73o04p06J17K54N75M80n10o96L58M25k02k92
2488a25j30L6N22k94m28m2Q17J62M5q37l49L60O48J83o33l17L09K35k8l10m07
2509e83O61J09l14k62M8N24J15K8j013L3Q4Q67p6j41n30Q5L02R5J25k75K39L3
2531A54J85o73j47L60M16N17j151n44P09N5P09o70o10N08K10J89m25l11N80M44
2551E05R1p82n05M99N89j60m06p17N33M44j1l36J36k82P45M1p76J07L55N25j41
2572D54p64m08K23R59K1n36j55J2K53M19k50o32K90L24l1n26J3L74N18k19m18
$$ plain form
2593 -79 -592 -258 201 632 34 -434 -528 13 316 -42 -619 -137 149 330 -252 -331 -344 595 992 23 -567
2614 -567 -175 252 704 -101 -399 -410 131 111 -113 -219 -249 368 212 -47 -599 -269 464 542 -44 -397 -456 -317
2636 -317 499 466 -363 -226 326 298 87 -326 1 282 492 9 -603 -577 68 226 174 -529 -119 296 543
2657 543 394 -390 -215 88 181 74 -118 -355 160 482 260 -534 -200 193 498 -86 -446 -460 111 315 -26
2678 -26 -317 -227 79 233 143 -207 -175 122 668 -32 -754 -470 165 588 82 -389 -604 203 537 86 -191
2699 -191 -371 -170 181 127 -472 -272 -129 28 157 -295 -170 354 513 192 -131 -472 -117 757 14 -303
2719 -303 -448 -230 183 425 -407 -307 302 144 -227 -257 -380 -27 584 64 -226 -453 153 318 -40 -510
2739 -510 -358 272 452 140 -117 -157 81 200 9 -407 -390 199 317 202 -384 -435 1 75 86 106 -369 -148
$$ packed form
2593g9n13L34M59M31n98m68r4N41L03l58n77M82K86J81n82p9j3R39L97r69n90
2614e67L92M27M52q05k98j1N41k0k24j06l0O17j56k59n52L30P33P8n86l53n9J39
2636c17Q16l3q29J37N52k8k11m13L27K81K10m83o12K6O45J58n2p03M10M15K47
2657E43j49p84J75L03R3j07j92k37N15L22k22p94L34L93L05n84l60j4N71K04l41
2678b6k91R0L06J54r0l50L2K97N46p00p22K84O35M23n06m71k15Q07L34m51k77
2699a91j80K01L51n4n99K00J43J57J29m52J25N24J59l21l23l41L55Q74p43l17
2719c03j45K18M13K42q32J00O09j58l71l0j23L53O11n20k90k27O06J65l58m70
2739e10J52O30J80l12k57m0K38J19j91m16J7N89J18j15n86n1M36P4J1K0m75K21
$$ plain form
2761 -148 113 71 -287 -194 12 598 467 -412 -382 -315 331 157 -141 -382 -260 329 -109 -115 -185 154 425 96
2783 96 -270 -212 210 235 161 -328 -267 -71 466 303 -67 -508 -240 287 263 -319 -305 168 488 126 -134 -300
2805 -300 338 582 239 -457 -448 -261 227 407 -48 -340 85 32 -70 -28 -210 -61 383 214 -313 -260 -122 278
2827 278 425 -272 -480 -141 -49 200 -91 -76 -58 155 170 -263 -356 226 106 210 -380 -362 106 589 218 204
2849 204 -292 -243 84 137 45 -130 -134 116 38 -566 -15 -215 -92 265 -204 -358 -164 140 362 -123 -238 -41
2871 -41 155 -86 54 -150 133 -14 476 -107 -130 -209 385 113 -58 -714 -131 355 22 -8 -264 -188 204 669
2893 669 -19 -353 221 -61 240 -263 3 85 485 75 -103 -404 -154 176 241 5 -307 -315 522 73 -319
2914 -319 -79 403 397 310 -246 -323 137 268 423 -197 -563 -23 223 83 -186 -337 -105 -97 62 -155 19 44
$$ packed form
2761a48K61m2l58R3K06N86j31q79L0O7O46j74k98k41J22N89m38op0L39K71l29
2783I6l66N8M22K5p4m89O1J96N37j63l70m41K68N27k4n82J4M73L20l62k60j66
2805c00O38K44l43o96RJ87M88J80m55k92M25n3j02M2j82J49M44j69n27N3J38M00
2827B78J47o97k08L39R2K49k91J5J8K13J5m33r3N82j20J04n90J8M68M83l71j4
2849B04m96M9L27N3r2j75mK50p8o04N51k00J23L57m69j54J94L04K22m85j15J97
2871d1J96k41J40k04K83j47M90n83k3p9N94k72j71o56N83M86l33l0k56P6L92M65
2893F69o88l34N74k82L01n03K66Q2M00m10j78l01K50L30O5k36l12qQ37m49l92
2914c19K40M82oq7n56p7M60J31J55o20l66N40K46j40k69j51K32QJ59k17J74K5
$$ plain form
2936 44 153 370 -187 -402 89 94 439 -65 151 -89 -119 457 120 -13 202 -66 -76 221 -306 39 136 174
2958 174 -270 33 -210 269 43 -199 -471 -24 37 113 -111 -2 -168 126 -71 -315 -49 42 91 176 -124 -169
2980 -169 -104 262 205 -130 0 263 286 402 -123 -332 -263 318 33 3 -153 -176 185 213 122 31 -149 156 75
3003 75 -217 -88 24 44 112 -3 123 103 -63 124 -175 27 -197 329 31 -197 -688 -37 342 48 -65
3024 -65 -254 -203 151 47 151 -155 -359 246 183 -1 -299 -224 91 299 79 -217 42 39 12 -41 -224 26 -67
3047 -67 250 -12 -193 -17 219 294 -28 49 83 118 227 -114 121 -218 25 111 -143 -210 -273 -87 118 -29 -133
3070 -133 -14 102 -68 288 63 -37 39 30 53 51 2 118 206 -131 15 -203 -258 28 -309 128 -15 -32 28 -236
3094 -236 -364 -81 208 6 91 45 -111 145 105 403 136 -248 -67 152 -79 -133 66 -175 40 -52 2 -28
$$ packed form
2936D4J09K17n57k15M91NL45n04K16k40l0N76l37j33K15k68j0K97n27L45R7L8
2958A74m44L03k43M79k26k42k72M47O1P6k24J09j66K94j97k44K66R1M9Q5l00m5
2980a69O5L66n7l35J30K63K3J16n25k09O9N81k85l0j56k3L61K8r1r1j80L05q1
3003G5k92J29J12K0O8j15J26k0j66J87k99K02k24N26k98k28m91O51L79k94j13
3024f5j89N1L54j04J04l06k04O05o3j84k98P5L15K08k20k96K59lk7n3j83K50r3
3047f7L17k62j81J76K36P5l22P7L4L5J09l41K35l39K43Q6k54o7o3J86K05j47j04
3070a33J19J16j70L56k25j00P6rK3km9J16Q8l37J46k18n5K86l37M37j43j7O0k64
3094b36j28K83K89k02Q5m6j56K56m0K98k67l84J81K19k31n4J99k41K15r2N4l0
$$ plain form
3116 -28 106 78 -10 -295 8 -250 448 292 -119 -138 -308 -19 97 -337 84 -80 -199 69 37 -19 -50 50
3138 50 145 -196 -173 5 -49 -187 -43 -155 -52 63 239 -606 -186 -86 118 227 -217 -462 -211 135 52 -174
3160 -174 -103 -31 -48 57 159 -9 -193 -196 109 -47 106 134 -125 -130 36 19 -9 266 161 226 -69 -296 -51 -37
3184 -37 -173 -22 258 -14 6 214 -108 241 257 302 75 -684 -216 -191 -86 48 -27 -225 -73 141 276 172
3206 172 26 344 268 -94 39 -75 346 187 -249 -56 2 -37 16 -407 -140 -1 256 236 -228 -67 269 86
3228 86 -206 161 213 -1 249 108 -174 16 -217 -15 -6 184 -102 -8 183 108 -43 -9 282 -98 -17 165 -116
3251 -116 -95 84 190 -45 -226 -148 79 -94 -88 -170 -5 -318 88 -16 -78 -155 83 296 84 51 -56 399 134
3274 134 290 -21 -184 -78 -26 -90 93 -111 186 -161 -24 -14 257 224 67 168 -7 47 -206 -37 332 -125
$$ packed form
3116b8J34k8q8k85L03k58O98j56m11j9j70K89J16m34M21j64j19K68l2n6l1J00
3138E0R5l41K3J78n4j38J44j12J03J15J76q45M20J00K04J09m44k45K51L46q3k26
3160a74P1P2j7J05J02j68j84lL05j56J53K8k59nJ66j7k8K75j05O5k95k27K45J4
3184c7j36J51K80k72K0K08l22L49J6M5k27p59M68K5J05J34p5j98J52K14J35j04
3206A72j46L18p6l62J33j14M21j59m36J93N8l9N3m23K67J39K57k0m64J61L36j83
3228H6k92L67N2k14K50j41k82J90k33K02RJ90k86R4J91p5j51L4K91l80Q1J82k81
3251a16K1J79J06k35j81P8K27j73Oq2J65l13M06j04o2p7K38K13k12l3j07M55k65
3274A34J56l11j63J06N2o4J83k04K97l47J37J0K71l3j57J01j75N4k53J69L69m57
$$ [...]
8191A51
##END NTUPLES=NMR FID
##END=
