##TITLE=1H_IAMT-124
 CDCl3, 108 sc, 
 13.3.2019
##JCAMPDX= 6.0         $$ Bruker NMR JCAMP-DX V2.0
##DATA TYPE= NMR FID
##DATA CLASS= NTUPLES
##ORIGIN= UXNMR, Bruker Analytische Messtechnik GmbH
##OWNER= root
$$ XWIN-NMR		Version 3.5
$$ Wed Mar 13 15:20:55 2019 Russian Standard Time (UT+4h)  she@DPX200
##.OBSERVE FREQUENCY= 200.1315
##.OBSERVE NUCLEUS= ^1H
##.DELAY= (6, 6)
##.ACQUISITION MODE= SIMULTANEOUS
##.ACQUISITION SCHEME= undefined
##.AVERAGES= 108
##.DIGITISER RES= 18
##SPECTROMETER/DATA SYSTEM= spect
##.PULSE SEQUENCE= zg30
##.SOLVENT NAME= CDCl3
##.SHIFT REFERENCE= (INTERNAL, CDCl3, 0, 15.7039)
##AUDIT TRAIL= $$ (NUMBER, WHEN, WHO, WHERE, WHAT)
$$ ##TITLE= Audit trail, XWIN-NMR		Version 3.5
$$ ##JCAMPDX= 5.01
$$ ##ORIGIN= Bruker BioSpin GmbH
$$ ##OWNER= she
$$ F:/spectra/data/she/nmr/H-F/1/audita.txt
$$ ##AUDIT TRAIL=  $$ (NUMBER, WHEN, WHO, WHERE, WHAT)
(   1,<2019-03-13 15:17:01.84 +0400>,<she>,<DPX200>,
      <continue with go, POWCHK disabled, PULCHK disabled
       configuration hash MD5:
       00 E9 B6 7A A2 85 ED C7 34 08 36 98 17 FE 4E 26
       data hash MD5: 16K
       9B 6F AB B8 EE E6 F9 14 5B 48 6F 6D 94 23 87 1E>)
$$ ##END=
$$ 
$$ hash MD5
$$ 79 37 AA 86 22 5D 54 08 DB 59 F8 12 2B 38 05 2B
##$RELAX= 
##$RELAX= 
##$RELAX= 
##$RELAX= 
##$RELAX= 
##$RELAX= 
$$ Bruker specific parameters
$$ --------------------------
##$DU= <F:/spectra>
##$EXPNO= 1
##$NAME= <H-F>
##$PROCNO= 1
##$TYPE= <nmr>
##$USER= <she>
##$AMP= (0..31)
100 100 100 100 100 100 100 100 100 100 100 100 100 100 100 100 100 100 
100 100 100 100 100 100 100 100 100 100 100 100 100 100 
##$AQSEQ= 0
##$AQ_mod= 1
##$AUNM= <au_zg>
##$AUTOPOS= <>
##$BF1= 200.13
##$BF2= 200.13
##$BF3= 200.13
##$BF4= 200.13
##$BF5= 200.13
##$BF6= 200.13
##$BF7= 200.13
##$BF8= 200.13
##$BYTORDA= 1
##$CFDGTYP= 0
##$CFRGTYP= 5
##$CHEMSTR= <none>
##$CNST= (0..31)
1 1 145 1 1 1 1 1 1 1 1 1 1 1 1 1 1 1 1 1 1 1 1 1 1 1 1 1 1 1 1 1 
##$CPDPRG= <>
##$CPDPRG1= <>
##$CPDPRG2= <>
##$CPDPRG3= <>
##$CPDPRG4= <mlev>
##$CPDPRG5= <mlev>
##$CPDPRG6= <mlev>
##$CPDPRG7= <mlev>
##$CPDPRG8= <mlev>
##$CPDPRGB= <>
##$CPDPRGT= <>
##$D= (0..31)
0 1.2 0 0 0 0 0 0 0 0 0 0.03 0 0 0 0 0 0 0 0 0 0 0 0 0 0 0 0 0 0 0 0 
##$DATE= 1552475509
##$DBL= (0..7)
120 120 120 120 120 120 120 120 
##$DBP= (0..7)
150 150 150 150 150 150 150 150 
##$DBP07= 0
##$DBPNAM0= <>
##$DBPNAM1= <>
##$DBPNAM2= <>
##$DBPNAM3= <>
##$DBPNAM4= <>
##$DBPNAM5= <>
##$DBPNAM6= <>
##$DBPNAM7= <>
##$DBPOAL= (0..7)
0.5 0.5 0.5 0.5 0.5 0.5 0.5 0.5 
##$DBPOFFS= (0..7)
0 0 0 0 0 0 0 0 
##$DE= 6
##$DECBNUC= <off>
##$DECIM= 24
##$DECNUC= <off>
##$DECSTAT= 4
##$DIGMOD= 1
##$DIGTYP= 9
##$DL= (0..7)
0 120 120 120 120 120 120 120 
##$DP= (0..7)
150 150 150 150 150 150 150 150 
##$DP07= 0
##$DPNAME0= <>
##$DPNAME1= <>
##$DPNAME2= <>
##$DPNAME3= <>
##$DPNAME4= <>
##$DPNAME5= <>
##$DPNAME6= <>
##$DPNAME7= <>
##$DPOAL= (0..7)
0.5 0.5 0.5 0.5 0.5 0.5 0.5 0.5 
##$DPOFFS= (0..7)
0 0 0 0 0 0 0 0 
##$DQDMODE= 0
##$DR= 18
##$DS= 0
##$DSLIST= <SSSSSSSSSSSSSSS>
$$ [...]
##$SUBNAM2= <"">
##$SUBNAM3= <"">
##$SUBNAM4= <"">
##$SUBNAM5= <"">
##$SUBNAM6= <"">
##$SUBNAM7= <"">
##$SUBNAM8= <"">
##$SUBNAM9= <"">
##$SW= 26.0245555214113
##$SWIBOX= (0..15)
0 0 2 0 0 0 0 0 0 0 0 0 0 0 0 0 
##$SW_h= 5208.33333333333
##$TD= 16384
##$TD0= 1
##$TE= 0
##$TE2= 300
##$TE3= 300
##$TEG= 300
##$TL= (0..7)
0 120 120 120 120 120 120 120 
##$TP= (0..7)
150 150 150 150 150 150 150 150 
##$TP07= 0
##$TPNAME0= <>
##$TPNAME1= <>
##$TPNAME2= <>
##$TPNAME3= <>
##$TPNAME4= <>
##$TPNAME5= <>
##$TPNAME6= <>
##$TPNAME7= <>
##$TPOAL= (0..7)
0.5 0.5 0.5 0.5 0.5 0.5 0.5 0.5 
##$TPOFFS= (0..7)
0 0 0 0 0 0 0 0 
##$TUNHIN= 0
##$TUNHOUT= 0
##$TUNXOUT= 0
##$USERA1= <user>
##$USERA2= <user>
##$USERA3= <user>
##$USERA4= <user>
##$USERA5= <user>
##$V9= 5
##$VALIST= <valist>
##$VCLIST= <CCCCCCCCCCCCCCC>
##$VD= 0
##$VDLIST= <DDDDDDDDDDDDDDD>
##$VPLIST= <PPPPPPPPPPPPPPP>
##$VTLIST= <TTTTTTTTTTTTTTT>
##$WBST= 1024
##$WBSW= 4
##$XGAIN= (0..3)
0 0 0 0 
##$XL= 0
##$YL= 0
##$YMAX_a= 89117
##$YMIN_a= -95758
##$ZGOPTNS= <>
##$ZL1= 120
##$ZL2= 120
##$ZL3= 120
##$ZL4= 120
##$ABSF1= 10
##$ABSF2= 0
##$ABSG= 5
##$ABSL= 3
##$ALPHA= 0
##$AQORDER= 0
##$ASSFAC= 0
##$ASSFACI= 0
##$ASSFACX= 0
##$ASSWID= 0
##$AUNMP= <proc_1d>
##$AZFE= 0.1
##$AZFW= 0.1
##$BCFW= 1
##$BC_mod= 2
##$BYTORDP= 1
##$COROFFS= 0
##$CY= 11.3945322036743
##$DATMOD= 1
##$DC= 2
##$DFILT= <>
##$DTYPP= 0
##$F1P= 18.9103706918063
##$F2P= -1.10871071338519
##$FCOR= 0.5
##$FTSIZE= 0
##$FT_mod= 4
##$GAMMA= 1
##$GB= 0.15
##$INTBC= 1
##$INTSCL= 1
##$ISEN= 128
##$LB= 0.24
##$LEV0= 0
##$LPBIN= 0
##$MAXI= 10000
##$MC2= 0
##$MEAN= 0
##$ME_mod= 0
##$MI= 1.114404
##$NCOEF= 0
##$NC_proc= 0
##$NLEV= 6
##$NOISF1= 3.799351
##$NOISF2= 2.8
##$NSP= 1
##$NTH_PI= 0
##$NZP= 0
##$OFFSET= 15.70392
##$PC= 1
##$PHC0= -9018.039
##$PHC1= 19.60026
##$PH_mod= 1
##$PKNL= yes
##$PPARMOD= 0
##$PSCAL= 0
##$PSIGN= 0
##$REVERSE= no
##$SF= 200.130013532006
##$SI= 16384
##$SIGF1= 3
##$SIGF2= 2
##$SINO= 400
##$SIOLD= 16384
##$SREGLST= <1H.CDCl3>
##$SSB= 0
##$STSI= 0
##$STSR= 0
##$SW_p= 3612.71676300578
##$SYMM= 0
##$S_DEV= 0
##$TDeff= 0
##$TDoff= 0
##$TI= <>
##$TILT= no
##$TM1= 0
##$TM2= 0
##$TOPLEV= 0
##$USERP1= <user>
##$USERP2= <user>
##$USERP3= <user>
##$USERP4= <user>
##$USERP5= <user>
##$WDW= 1
##$XDIM= 8192
##$YMAX_p= 0
##$YMIN_p= 0
$$ End of Bruker specific parameters
$$ ---------------------------------
##NTUPLES= NMR FID
##VAR_NAME=  TIME,          FID/REAL,        FID/IMAG
##SYMBOL=    X,             R,               I
##VAR_TYPE=  INDEPENDENT,   DEPENDENT,       DEPENDENT
##VAR_FORM=  AFFN,          ASDF,            ASDF
##VAR_DIM=   8192,          8192,            8192
##UNITS=     SECONDS,       ARBITRARY UNITS, ARBITRARY UNITS
##FACTOR=    0.000192,      1,               1
##FIRST=     0,             0,               0
##LAST=      1.572672,      0,               0
##MIN=       0,             -95758,          0
##MAX=       1.572672,      89117,           0
$$ Real data points
##PAGE= N=1
##DATA TABLE= (X++(R..R)), XYDATA
$$ [...]
$$ plain form
2062 -1189 -1341 -1398 -1022 -1183 -1473 -1520 -1402 -1423 -1504 -1439 -1604 -1282 -1377 -1621 -2062 -1690 -1520 -1685 -1574 -1440 -1584 -1784
2084 -1784 -1668 -1467 -1442 -1513 -1728 -1556 -1400 -1519 -1148 -1019 -1044 -1391 -1231 -1217 -873 -997 -1057 -665 -883 -744 -616
2105 -616 -413 -121 -335 -344 -503 -311 -12 320 -200 76 -47 -103 429 519 630 554 398 494 649 752 743 804 1045
2128 1045 1145 1000 1132 1116 1063 1182 1516 1611 1416 1332 1334 1394 1846 1543 1376 1463 1637 1602 1541 1870 1994 1653 1168
2151 1168 1341 1610 1597 1715 1497 1404 1535 1307 1312 1475 1336 1359 872 951 987 1067 936 1037 889 845 647 454 628
2174 628 910 484 168 390 -28 126 -104 -149 376 -203 -432 -370 -109 -223 -413 -562 -621 -833 -960 -1042 -952 -672
2196 -672 -1019 -1457 -1195 -1053 -1180 -1365 -1188 -1085 -1155 -1536 -1625 -1243 -1319 -1603 -1755 -1401 -1468 -1578 -1601 -1239 -1412 -1711
2218 -1711 -1562 -1525 -1204 -1413 -1487 -1379 -1290 -1516 -1318 -1375 -861 -703 -1313 -1028 -1093 -1219 -814 -915 -470 -546 -801 -1114
$$ packed form
2062a189j52n7L76j61k90m7J18k1q1O5j65L22r5k44m41L72J70j65J11J34j44k00
2084a784J16K01K5p1k15J72J56j19L71J29k5l47J60J4L44j24o0L92k18J39J28
2105f16K03K92k14rj59J92K99L32n20K76j23n6N32R0J11p6j56R6J55J03rO1K41
2128A045J00j45J32j6n3J19L34R5j95q4KO0M52l03j67Q7J74l5o1L29J24l41m85
2151A168J73K69j3J18k18r3J31k28NJ63j39K3m87P9L6Q0j31J01j48m4j98j93J74
2174F28K82m26l16K22m18J54k30m5N25n79k29O2K61j14j90j49n9k12j27q2R0K80
2196f72l47m38K62J42j27j85J77J03p0l81q9L82p6k84j52L54o7j10k3L62j73k99
2218a711J49L7L21k09p4J08Q9k26J98n7N14J58o10K85o5j26M05j01M45p6k55l13
$$ plain form
2240 -1114 -470 -265 -242 -534 -317 -71 -383 -183 116 361 317 105 -147 114 559 699 654 600 673 676 647 963
2262 963 1202 1133 1036 1019 1158 1150 1413 1104 1333 1295 1004 1163 1408 1765 1670 1286 1546 1554 1582 1231 1604 1856 1667
2285 1667 1399 1423 1530 1454 1271 1404 1597 1464 862 1163 1153 1584 1210 980 880 974 729 756 979 1025 685 348
2307 348 370 713 534 568 333 415 191 -350 -108 21 -4 -117 -292 -437 -503 -823 -422 -607 -593 -591 -728 -777 -688
2330 -688 -966 -799 -801 -1112 -1226 -1232 -1035 -1147 -815 -1173 -1265 -1127 -1223 -1271 -1435 -1440 -1264 -1434 -1347 -1365 -1456 -1222 -1446 -1468
2354 -1468 -1431 -1694 -1506 -1178 -1195 -1149 -1388 -1298 -978 -1045 -1119 -1103 -1317 -997 -1184 -892 -956 -555 -535 -438 -648 -598 -248
2377 -248 -738 -442 -52 -21 -85 -16 -104 274 243 324 266 329 289 554 719 711 513 771 431 638 913 823 1171 958
2401 958 1089 968 1018 1351 1316 1350 949 1012 1193 1304 1147 1588 1550 1110 1241 1473 1381 1369 1245 1136 1187 1023 1234
$$ packed form
2240a114O44K05K3k92K17K46l12K00K99K45m4k12k52K61M45J40m5n4P3Lk9L16
2262I63K39o9r7j7J39qK63l09K29l8k91J59K45L57r5l84K60QK8l51L73K52j89
2285A667k68K4J07p6j83J33J93j33o02L01j0M31l74k30j00R4k45K7K23M6l40l37
2307C48K2L43j79L4k35Q2k24n41K42J29k5j13j75j45o6l20M01j85J4Kj37m9Q9
2330f88k78J67kl11j14oJ97j12L32l58r2J38r6m8j64nJ76j70Q7j8r1K34k24k2
2354a468L7k63J88L28j7M6k39R0L20o7p4J6k14L20j87K92o4M01K0R7k10N0L50
2377b48m90K96L90L1o4O9q8L78l1Q1n8O3m0K65J65qj98K58l40K07K75r0L48k13
2401I58J31j21N0L33l5L4m01O3J81J11j57M41l8m40J31K32r2j2j24j09N1j64K11
$$ plain form
2424 1234 1012 1581 1265 1121 1051 1104 1122 1219 896 1058 1024 989 863 576 972 929 690 639 461 316 457 446 440
2447 440 565 -136 -256 -12 104 56 48 -61 -269 -308 -567 -563 -332 -357 -557 -869 -736 -549 -934 -918 -572 -1037 -998
2470 -998 -1131 -776 -815 -1137 -1135 -1274 -1099 -1353 -1299 -1047 -971 -1251 -1420 -1267 -1327 -1062 -1432 -1366 -1170 -1458 -1576 -1515 -1063
2493 -1063 -817 -826 -1177 -1133 -1014 -994 -1091 -685 -666 -928 -997 -745 -738 -104 -755 -620 -335 -362 -383 -499 -240 29 -221
2516 -221 -15 -26 175 80 46 179 251 204 238 426 634 559 518 550 645 748 561 709 996 1094 837 1101 734 1158
2540 1158 1200 939 1188 1328 1003 953 1137 1452 1336 1344 1156 984 1277 1247 1290 1502 1238 1093 1145 1042 1531 1247
2562 1247 1207 1024 1070 941 1078 1168 1080 966 716 628 604 995 481 466 756 495 174 196 404 574 175 110 161
2585 161 72 -236 -365 -224 -225 -21 -579 -383 -523 -347 -631 -516 -776 -976 -725 -1037 -646 -687 -850 -1129 -939
$$ packed form
2424A234k22N69l16j44p0N3J8R7l23J62l4l5j26k87L96m3k39n1j78j45J41j1o
2447D40J25p01j20K44J16m8qj09k08l9k59MK31k5k00l12J33J87l85J6L46m65L9
2470i98j33L55l9l22Kj39J75k54N4K52P6k80j69J53o0K65l70O6J96k88j18O1M52
2493a063K46rl51M4J19K0r7M06J9k62o9K52PO34o51J35K85k7k1j16K59K69k50
2516b21K06j1K01r5l4J33P2m7L4J88K08p5m1L2R5J03j87J48K87R8k57K64l67M24
2540A158M2k61K49J40l25n0J84L15j16Qj88j72K93l0M3K12k64j45N2j03M89k84
2562A247m0j83M6j29J37R0q8j14k50q8k4L91n14j5K90k61l21K2K08J70l99o5N1
2585A61q9l08j29J41jK04n58J96j40J76k84J15k60k00K51l12L91m1j63k79J90
$$ plain form
2606 -939 -956 -1069 -932 -993 -1024 -1163 -1162 -1268 -1118 -1190 -1170 -1228 -1390 -1358 -1291 -1147 -1165 -1033 -971 -1111 -1227 -1158 -1207 -953 -975
2631 -975 -723 -1165 -1020 -725 -692 -716 -733 -599 -621 -901 -679 -560 -293 -532 -729 -417 -273 -431 -237 -333 -287 -189
2653 -189 -70 -291 337 9 390 384 244 609 434 527 658 725 544 383 545 700 653 828 757 542 726 1271
2675 1271 900 1144 1008 908 917 836 923 1192 1095 982 1285 1027 913 1089 1307 1455 1408 819 1069 974 1028 986 1090
2698 1090 1190 972 886 619 941 1154 673 771 600 624 270 889 717 539 565 259 -17 436 340 179 132 243
2720 243 116 95 -125 -33 -76 -149 -315 -500 -618 -602 -457 -595 -464 -668 -793 -799 -766 -608 -914 -901 -836 -1038 -1196
2743 -1196 -798 -896 -972 -1113 -1246 -1176 -1296 -1046 -955 -908 -903 -1402 -1344 -1000 -919 -843 -1024 -904 -1054 -1023 -977 -927 -599 -682
2767 -682 -719 -876 -791 -865 -710 -631 -278 -441 -776 -736 -532 -300 34 -577 -423 -314 -308 -381 148 -126 128 -49 66
$$ packed form
2606i39j7j13J37o1l1j39Jj06J50p2K0n8j62L2O7J44j8J32O2j40j16O9m9K54k2
2631i75K52m42J45K95L3k4j7J34k2k80K22J19K67k39j97L12J44j58J94r6M6R8
2653a89J19k21O28l28L81oj40L65j75R3J31O7j81j61J62J55m7J75p1k15J84N45
2675A271l71K44j36j00Rq1Q7K69r7j13L03k58j14J76K18J48m7n89K50r5N4m2J04
2698A090J00k18q6k67L22K13m81R8j71K4l54O19j72j78K6l06k76M53r6j61m7J11
2720B43j27k1k20R2m3p3j66j85j18J6J45j38J31k04j25oL3J58l06J3O5k02j58
2743a196L98r8p6j41j33P0j20K50R1M7Nm99N8L44Q1P6j81J20j50L1M6N0L28q3
2767f82l7j57Q5p4J55P9L53j63l35M0K04K32L34o11J54J09Op3N29k74K54j77J15
$$ plain form
2790 66 -88 245 149 214 381 363 224 309 383 636 653 633 515 748 504 723 1031 871 932 677 616 714 911 1083
2814 1083 1080 1111 1033 1110 928 1154 1263 1315 1130 851 951 1090 1080 1000 1270 1050 920 846 833 1055 1018 879 773
2837 773 811 556 559 893 900 646 313 327 344 407 621 412 315 7 79 69 219 195 339 -327 -13 -280 -455 -165
2861 -165 -483 -355 -547 -703 -556 -431 -710 -430 -523 -501 -807 -696 -823 -482 -908 -658 -769 -938 -990 -1090 -961
2882 -961 -895 -969 -1044 -1144 -953 -888 -925 -781 -882 -1032 -1171 -1132 -966 -746 -931 -942 -781 -957 -962 -867 -676 -602 -884 -702
2906 -702 -728 -489 -584 -612 -327 -693 -517 -462 -551 -271 -327 -243 -397 -373 -302 -21 -36 -40 104 198 140 239 237 537 414 -19
2932 -19 388 555 195 372 948 744 722 661 463 848 854 808 753 679 876 1027 996 1024 1044 1174 920 899 841 887 993
2957 993 1191 1102 740 888 917 963 1065 885 1017 987 854 680 441 641 697 796 578 769 754 540 263 379
$$ packed form
2790F6j54L33r6O5J67j8j39Q5P4K53J7k0j18K33k44K19L08j60O1k55o1R8J97J72
2814A083lL1p8P7j82K26J09N2j85k79J00J39j0q0K70k20j30p4j3K22l7j39j06
2837G73L8k55LL34Pk54l33J4J7O3K14k09r7l08P2j0J50k4J44o66L14k67j75K90
2861a65l18J28j92j56J47J25k79K80r3K2l06J11j27L41m26K50j11j69n2j00J29
2882i61O6p4p5j00J91O5l7J44j01j50j39L9J66K20j85j1J61j76nR5J91P4k82J82
2906g02k6K39r5k8K85l66J76N5q9K80n6Q4j54K4P1K81j5mJ44R4n8R9kL00j23m33
2932a9M07J67l60J77N76k04k2o1j98L85Om6n5p4J97J51l1K8K0J30k54k1n8M6J06
2957I93J98q9l62J48K9M6J02j80J32l0j33j74k39K00N6R9k18J91j5k14k77J16
$$ plain form
2979 379 587 451 413 293 380 164 395 86 133 100 -33 149 -56 -336 -190 -345 -107 -413 -327 -355 -427 -290
3001 -290 -397 -635 -639 -569 -447 -570 -584 -603 -637 -768 -798 -605 -816 -1017 -857 -718 -728 -807 -796 -1044 -746 -858 -945 -927
3025 -927 -795 -769 -1088 -1070 -680 -652 -670 -845 -587 -969 -1019 -850 -703 -329 -774 -789 -576 -669 -661 -604 -432 -198 -603
3048 -603 -411 -420 -321 -247 -263 -303 133 -203 46 -8 39 -22 284 137 38 92 385 419 627 265 278 332 656 399 712
3073 712 646 690 775 480 700 784 929 909 834 868 802 1110 903 988 1025 1002 1027 967 862 566 731 612 849 786 876
3098 876 689 781 648 665 802 646 849 478 596 731 746 507 688 534 531 412 465 271 254 474 561 101 82
3121 82 321 42 70 -129 5 0 -148 -337 -339 -236 -330 -179 -289 -434 -367 -512 -243 -515 -729 -397 -546 -623 -616 -734
3145 -734 -770 -723 -763 -572 -555 -726 -853 -907 -791 -732 -742 -752 -732 -782 -404 -761 -891 -638 -775 -834 -703 -779 -843 -828 -688
$$ packed form
2979C79K08j36l8j20Q7k16K31l09M7l3j33J82k05k80J46j55K38l06Q6k8p2J37
3001b90j07k38mP0J22j23j4j9l4j31l0J93k11k01J60J39j0p9J1k48K98j12q7J8
3025i27J32K6l19J8L90K8j8j75K58l82n0J69J47L74m45j5K13r3QN7J72K34m05
3048f03J92rR9P4j6m0M36l36K49n4M7o1L06j47r9N4K93L4K08l62J3N4L24k57L13
3073G12o6M4Q5k95K20Q4J45k0p5L4o6L08k07Q5L7k3K5o0j05k96J65j19K37o3R0
3098H76j87R2j33J7J37j56K03l71J18J35J5k39J81j54lj19N3j94j7K20Q7m60j9
3121H2K39k79K8j99J34nj48j89kJ03r4J51j10j45O7j45K69k72k14L32j49p7Pj18
3145g34l6M7m0J91J7j71j27n4J16N9j0j0K0n0L78l57j30K53j37n9J31p6o4J5J40
$$ plain form
3170 -688 -774 -627 -594 -723 -766 -578 -301 -559 -620 -436 -501 -401 -261 -344 -445 -147 -145 -264 -17 94 13 -135 -85
3193 -85 175 192 21 274 215 442 403 229 246 327 477 507 644 555 629 330 527 595 566 657 691 735 656 823 817 749
3219 749 822 691 1055 880 1014 805 802 665 862 985 915 817 911 956 652 737 559 633 363 589 611 399 881
3242 881 686 407 306 60 313 555 516 411 99 129 336 2 391 193 222 26 12 -224 -30 -50 -56 -154 -61
3265 -61 -1 -50 -128 -312 38 -365 -257 -462 -400 -514 -494 -637 -694 -626 -592 -538 -672 -483 -667 -877 -695 -451 -585
3288 -585 -836 -808 -652 -1006 -564 -842 -721 -561 -735 -869 -679 -742 -694 -626 -508 -501 -644 -994 -586 -469 -522 -558 -621
3311 -621 -434 -464 -698 -618 -504 -465 -345 -279 -127 -251 -324 -161 -246 -268 -121 -331 -110 -101 279 -63 164 94 186 202
3335 202 266 397 306 380 497 469 385 627 506 678 541 639 707 727 810 638 811 675 667 643 694 705 789 695 716 671
$$ packed form
3170f88q6J47L3j29m3J88K77k58o1J84o5J00J40q3j01K98Kj19K47J11q1j48N0
3193h5K60J7j71K53n9K27l9j74J7Q1J50L0J37q9P4k99J97O8k9R1L4M4p9J67oo8
3219G49P3j31L64j75J34k09lj37J97J23p0r8R4M5l04Q5j78P4k70K26K2k12M82
3242H81j95k79j01k46K53K42l9j05l12L0K07l34L89j98K9j96j4k36J94k0or8R3
3265f1O0m9p8j84L50m03J08k05O2j14K0j43n7O8L4N4j34J89j84k10J82K44j34
3288e85k51K8J56l54M42k78J21J60j74j34J90o3M8O8J18Pj43l50M08J17n3l6o3
3311f21J87l0k34Q0J14L9J20O6J52j24p3J63q5k2J47k10K21RL80l42K27p0R2J6
3335B02O4J31r1P4J17k8q4K42j21J72j37R8O8K0Q3j72J73j36qk4N1J1Q4r4K1m5
$$ plain form
3361 671 811 729 753 517 614 559 468 632 745 879 707 591 612 553 326 476 494 379 243 426 287 496 453
3384 453 226 240 -64 94 101 74 -21 44 226 -44 175 93 -108 -62 -190 -238 25 -316 -207 -502 -36 -39 -278 -567
3408 -567 -587 -496 -440 34 -483 -489 -516 -678 -589 -738 -366 -630 -756 -817 -769 -848 -597 -609 -718 -917 -711 -947 -838 -587
3432 -587 -562 -616 -772 -666 -791 -634 -793 -650 -487 -530 -675 -639 -415 -441 -397 -559 -558 -714 -673 -328 -273 194 -263
3455 -263 -178 -108 -191 -131 -83 -187 -34 55 78 102 141 201 247 43 248 135 219 166 152 653 202 634 691 435 681
3480 681 597 326 497 701 316 714 659 920 660 571 633 665 875 612 705 708 614 655 632 720 674 640 717 385 738
3505 738 487 556 391 591 700 461 594 367 588 560 262 361 404 283 302 382 291 302 232 112 286 209 111 44
3529 44 235 115 -106 -184 -94 -320 -393 -165 -92 -546 -223 -504 -274 -191 -572 -378 -282 -343 -180 -493 -402 -486 -268
$$ packed form
3361F71J40q2K4k36R7n5r1J64J13J34j72j16K1n9k27J50J8j15j36J83j39K09m3
3384D53k27J4l04J58Pk7r5O5J82k70K19q2k01M6j28m8K63l41J09k95M66lk39k89
3408e67k0R1N6M74n17ok7j62Q9j49L72k64j26o1M8p9K51j2j09j99K06k36J09K51
3432e87K5n4j56J06j25J57j59J43J63m3j45L6K24k6M4j62Jj56M1L45N5M67m57
3455b63Q5P0q3O0M8j04J53Q9K3K4L9O0M6k04K05j13Q4n3j4N01m51M32N7k56K46
3480F81q4k71J71K04l85L98n5K61k60q9O2L2K10k63R3Lr4M1k3Q8m6l4P7l32L53
3505G38k51O9j65K00J09k39J33k27K21k8k98R9M3j21J9Q0r1J1p0j20J74p7r8o7
3529D4J91j20k21p8R0k26p3K28P3m54L23k81K30Q3l81J94R6o1J63l13R1q4K18
$$ plain form
3552 -268 -668 -710 -616 -754 -682 -683 -616 -775 -568 -625 -979 -1076 -730 -798 -672 -609 -696 -587 -679 -458 -461 -768 -697 -680 -484
3577 -484 -605 -753 -772 -674 -367 -371 -361 -326 -439 -384 -264 -487 -8 -259 -159 -108 8 -101 -136 -53 176 170 239 69
3601 69 34 243 -15 104 378 146 473 451 588 343 240 350 589 500 486 404 457 809 717 579 410 652 652
3624 652 609 659 627 598 750 510 739 668 709 390 692 526 380 772 688 343 547 673 461 347 587 43
3646 43 416 362 507 390 401 504 543 220 230 126 211 375 44 13 -10 61 256 113 91 137 -75 144 -6 -61
3670 -61 -373 -201 -281 -207 -157 -239 -409 -372 -445 -165 -212 -331 -620 -487 -408 -628 -622 -733 -650 -561 -142 -615 -645 -783 -641
3695 -641 -737 -628 -499 -569 -715 -706 -540 -419 -578 -804 -475 -524 -481 -568 -484 -345 -419 -517 -399 -323 -231 -449 -369 -231
3719 -231 -411 -151 -119 -169 -144 -238 -47 -149 -307 51 158 -99 -34 -156 177 115 -59 344 277 59 197 270 329
$$ packed form
3552b68m00m2R4j38P2jO7j59K07n7l54r7L46o8J26O3q7J09r2K21ll07P1J7J96
3577d84j21j48j9R8L07mJ0L5j13N5J20k23M79k51J00N1J16j09l5Q3K29oO9j70
3601F9l5K09k58J19K74k32L27k2J37k45j03J10K39q9j4q2N3L52r2j38j69K42%
3624F52m3N0l2k9J52k40K29p1M1l19L02j66j46L92q4l45K04J26k12j14K40n44
3646D3L73n4J45j17J1J03L9l23J0j04Q5J64l31l1k3P1J95j43k2M6k12K19j50n5
3670f1l12J72q0P4N0q2j70L7p3K80m7j19k89J33P9k20Oj11Q3Q9M19m73l0j38J42
3695f41r6J09J29p0j46RJ66J21j59k26L29m9M3q7Q4J39p4r8J18P6R2k18Q0J38
3719b31j80K60L2n0K5r4J91j02j58L58J07k57O5j22L33o2j74M03o7k18J38P3N9
$$ plain form
3742 329 350 436 437 442 306 635 344 647 613 453 524 471 541 664 680 530 513 486 508 871 606 575 669 532 432
3767 432 504 456 379 578 482 720 723 441 380 474 524 510 310 343 335 235 354 733 587 137 365 161 152 289 117
3792 117 320 96 275 99 -95 127 -159 239 49 -81 13 105 -126 -194 40 -262 -417 -444 -337 -321 -202 -264
3814 -264 -387 -401 -267 -457 -286 -552 -586 -484 -628 -318 -354 -303 -442 -454 -429 -512 -453 -566 -485 -362 -485 -523 -393
3837 -393 -587 -342 -319 -266 -530 -768 -434 -371 -458 -617 -171 -306 -521 -347 -402 -166 -134 -167 -89 -247 -142 -373 -69
3860 -69 -110 -32 -102 -133 -36 86 -17 90 -122 -169 45 11 291 384 276 58 183 179 84 126 251 505 263 403
3884 403 420 417 523 493 436 412 371 346 527 618 676 504 843 546 554 336 544 706 530 414 425 647 444 399 674
3909 674 575 318 463 219 344 424 309 573 212 291 475 660 389 247 113 -15 249 287 73 167 120 67
$$ packed form
3742C29K1Q6JNj36L29k91L03l4j60P1n3P0J23J6j50j7k7K2L63k65l1R4j37j00
3767D32P2m8p7J99r6K38Lk82o1R4N0j4k00L3qj00J19L79j46m50K28k04rJ37j72
3792A17K03k24J79j76j94K22k86L98j90j30R4R2k31o8K34l02j55k7J07J6J19o2
3814b64j23j4J34j90J71k66l4J02j44L10l6N1j39j2K5q3N9j13Q1J23j23l8J30
3837c93j94K45K3N3k64k38L34O3q7j59M46j35k15J74n5K36L2l3P8j58J05k31L04
3860f9m1P8p0l1R7J22j03J07k12m7K14l4K80R3j08k18J25mr5M2J25K54k42J40
3884D03J7lJ06l0n7k4m1k5J81R1N8j72L39k97Qk18K08J62j76j16J1K22k03m5K75
3909F74r9k57J45k44J25Q0j15K64l61P9J84J85k71j42j34j28K64L8k14R4m7n3
$$ plain form
3931 67 132 -71 -256 182 44 -111 -135 -123 68 136 -312 -186 -60 -108 -483 -662 -97 -542 -155 -496 -217 -508
3953 -508 -378 -384 -826 -548 -482 -497 -548 -572 -208 -308 -370 -482 -384 -442 -516 -431 -433 -641 -489 -485 -332 -379 -444 -708 -587 -437
3979 -437 -584 -288 -125 -518 -145 -304 -267 -227 -295 -190 -314 -168 -214 -9 2 -279 38 110 25 129 -151 122
4001 122 52 217 0 216 270 77 312 67 271 293 366 114 359 585 243 194 315 368 181 170 365 341 387
4024 387 351 496 473 456 396 623 559 313 550 273 602 613 578 562 323 272 565 597 311 554 333 637 374
4047 374 469 426 249 483 306 333 329 562 220 423 310 18 162 515 -45 -131 18 164 26 161 -9 113
4069 113 -358 -87 -131 -17 -163 -223 6 -280 -147 -573 -114 -215 -295 -375 -365 -192 -471 -190 -518 -256 -281 -401
4091 -401 -449 -484 -359 -575 -311 -429 -574 -277 -154 -375 -331 -227 -372 -288 -364 -395 -420 -518 -522 -411 1 -343 -394 -475
$$ packed form
3931F7O5k03j85M38j38j55k4J2J91O8m48J26J26m8l75j79N65m45L87l41K79k91
3953e08J30om42K78O6j5n1k4L64j00o2j12R8n8p4Q5kk08J52MJ53m7o5k64J21J50
3979d37j47K96J63l93L73j59L7M0o8J05j24J46m6K05J1k81L17P2q5J04k80K73
4001A22p0J65k17K16N4j93K35k45K04K2P3k52K45K26l42m9J21N3j87j1J95k4M6
4024C87l6J45k3j7o0K27o4k46K37k77L29J1l5j6k39n1K93L2k86K43k21L04k63
4047C74R5m3j77K34j77K7mK33l42K03j13k92J44L53n60q6J49J46j38J35j70J22
4069A13m71K71m4J14j46o0K29k86J33m26M59j01q0q0J0J73k79K81l28K62k5j20
4091d01m8l5J25k16K64j18j45K97J23k21M4J04j45Q4p6l1k5r8mJ11M12l44n1q1
$$ plain form
4115 -475 -300 -368 -518 -179 -122 -376 -191 -342 -484 -383 -305 -350 53 -153 -102 -357 -314 62 194 -38 -135 47
4137 47 -19 5 -35 69 18 31 81 160 91 122 128 125 320 342 258 509 292 467 392 365 387 357 391 363 293 569 587 335
4165 335 515 456 638 562 455 652 504 398 514 358 438 259 427 236 458 409 326 380 260 256 533 326 267
4188 267 258 557 255 129 201 217 116 362 2 200 126 -26 99 154 -282 146 -66 -211 -194 2 -116 -198 -159
4211 -159 -136 -15 -403 -365 -286 -183 -278 -430 -152 -167 -378 -454 -362 -344 -613 -441 -364 -345 -472 -430 -478 -381 -430 -252 -355
4236 -355 -344 -331 -397 -416 -549 -387 -460 -217 -572 -160 -467 -291 -531 -316 -196 -142 -328 -230 -13 -319 -245 1 -295
4259 -295 -157 -2 -370 -138 -118 -33 -206 -86 73 -131 -65 46 229 122 -285 99 -203 -60 190 244 150 361
4281 361 280 185 355 348 233 376 285 266 159 419 408 330 444 498 413 291 492 382 467 357 265 451 492 416 419
$$ packed form
4115d75J75o8j50L39N7k54J85j51j42J01P8m5M03k06N1k55M3L76J32k32r7J82
4137D7o6K4m0J04n1J3N0P9o9L1OlJ95K2q4K51k17J75p5k7K2l0L4k8p0K76J8k52
4165C35J80n9J82p6j07J97j48j06J16j56Q0j79J68j91K22m9q3N4j20mK77k07n9
4188B67rK99l02j26P2J6j01K46l60J98p4j52J25N5m36M28k12j45J7J96j18q2L9
4211a59K3J21l88L8P9J03r5j52K78j5k11p6R2J8k69J72P7J9j27M2m8R7m9J78j03
4236c55J1J3o6j9j33J62p3K43l55M12l07J76k40K15J20N4j86R8K17l06P4K46k96
4259b95J38J55l68K32K0Q5j73J20J59k04O6J11J83j07m07L84l02J43K50N4r4K11
4281C61q1r5J70pj15J43r1j9j07K60j1p8J14N4q5j22K01j10Q5j10r2J86M1p6L
$$ plain form
4306 419 476 342 477 362 313 164 343 418 446 263 233 289 287 416 414 -3 251 59 106 243 367 113 198 53
4330 53 30 337 170 72 23 -136 178 -25 174 -44 -50 -158 -232 -244 -325 -24 -187 -50 -319 -148 -263 -259 -195 -297
4354 -297 -90 -281 -250 -367 -398 -418 -101 -271 -311 -208 -337 -444 -440 -260 -415 -294 -471 -386 -614 -68 -290 -299 -378
4377 -378 -438 -191 -455 -544 -466 -437 -278 -287 -427 -194 -399 -562 -165 -349 -230 -299 -235 -254 -216 -423 47 172 18
4400 18 -92 -168 121 -153 241 175 43 -49 61 -102 193 217 257 79 193 117 225 269 370 67 273 45 436
4423 436 357 99 292 537 388 437 454 388 661 377 476 376 314 437 587 176 464 220 313 521 233 132
4445 132 606 403 467 404 439 193 269 333 392 245 335 214 172 171 511 256 134 298 142 107 194 63 295 60
4469 60 240 -129 195 284 5 -142 -55 -252 -56 53 -145 -22 -212 -65 -29 -308 58 -46 -355 -373 -409 16
$$ packed form
4306D19N7j34J35j15m9j49J79P5K8j83l0N6kJ29km17K54j92M7J37J24k54Q5j45
4330E3k3L07j67r8m9j59L14k03J99k18oj08p4j2q1L01j63J37k69J71j15MO4j02
4354b97K07j91L1j17l1k0L17j70m0J03j29j07MJ80j55J21j77Q5k28N46k22rp9
4377c78o0K47k64q9P8K9J59rj40K33k05j63L97j84J19o9O4j9L8k07M70J25j54
4400A8j10p6K89k74L94o6j32r2J10j63K95K4M0j78J14p6J08M4J01l03K06k28L91
4423D36p9k58J93K45j49M9J7o6K73k84R9j00o2J23J50m11K88k44R3K08k88j01
4445A32M74k03O4o3L5k46P6O4N9j47R0j21m2jL40k55j22J64j56l5Q7j31K32k35
4469F0J80l69L24Q9k79j47Q7j97J96J09j98J23j90J47L6k79L66j04l09j8l6M25
$$ plain form
4491 16 -290 -389 -303 -172 -675 -129 -152 -175 -302 -346 -410 -358 -236 -140 -182 -362 -303 -370 -168 -369 -402 -299 -382 -523 -319
4516 -319 -367 -332 -338 -257 -249 -556 -313 -156 -365 -258 -123 -454 -243 -332 -128 -69 -389 -212 123 75 46 -167 -111 -7
4540 -7 -17 -132 113 47 81 -91 78 179 182 291 269 407 309 149 255 299 187 123 237 421 552 324 -53 288
4564 288 342 623 533 448 294 352 420 348 473 439 609 298 479 677 395 515 462 309 504 217 163 -15 237
4587 237 298 166 207 46 215 155 239 95 18 96 110 46 281 -25 210 195 203 -176 -85 -216 87 79 -58 -116 -1
4612 -1 -229 -103 -106 -89 -84 -24 -110 84 -189 -238 -108 -178 -182 -352 -404 -344 -271 -90 -58 -71 -448 -121 -321 -129 -194 -554
4638 -554 -212 -210 -260 -305 -254 -407 -89 -318 -149 -238 -521 -307 -134 -157 115 -227 -253 -276 -390 -135 -417 -168 -228
4661 -228 -164 -107 -91 -100 16 -95 -76 -120 -142 -58 108 87 10 126 286 36 120 136 45 53 92 115 -69 172 357 286
$$ packed form
4491A6l06r9Q6J31n03N46k3k3j27m4o4N2J22R6m2j80N9o7K02k01l3J03q3j41K04
4516c19m8L5oQ1Ql07K43J57k09J07J35l31K11q9K04N9l20J77L35m8k9k13N6J04
4540gj0j15K45o6L4j72J69J01LJ09k2J38r8j60J06M4j12o4J14J84J31k28l77L41
4564B88N4K81r0q5j54N8O8p2J25l4J70l11J81J98k82J20n3j53J95k87n4j78K52
4587B37O1j32M1j61J69o0Q4j44p7P8J4o4K35l06K35j5Ql79R1j31L03qj37n8J15
4612ak28J26lJ7NO0q6J94k73m9J30p0mj70n2O0P3J81L2j3l77L27k00J92o5l60
4638e54L42Kn0m5N1j53L18k29J69q9k83K14J73k3K72l42k6k3j14K55k82K49o0
4661b28O4N7J6rJ16j11J9m4k2Q4J66k1p7J16J60k50Q4J6r1QL9K3j84K41J85p1
$$ plain form
4687 286 185 21 110 120 161 275 493 228 316 374 272 147 512 371 442 355 211 449 381 38 514 264 425
4710 425 402 449 522 272 340 166 318 171 596 130 321 211 264 92 325 80 146 337 156 428 240 138
4732 138 155 -96 102 -118 69 -39 123 -159 -141 -100 -129 -19 -244 -175 4 -181 99 14 -300 120 -219 -164
4754 -164 109 -329 -231 -280 40 -45 -115 -106 -37 -358 -210 -414 -302 -228 -315 -396 -359 -116 -159 -178 -294 -142 -126 -271 -311
4779 -311 -349 -225 -311 -9 -239 -228 -506 -176 -205 -189 -296 -489 -231 -196 -134 107 -121 -592 -337 -240 -49 -45 55
4802 55 -123 -88 -44 54 -177 151 -4 -172 -117 -290 53 211 503 531 8 64 66 82 161 218 156 70 317 45 321
4827 321 220 134 270 547 96 281 303 448 426 125 -66 437 108 180 130 339 67 530 313 168 253 336
4849 336 345 199 482 459 129 71 521 146 -122 274 255 398 248 181 111 173 128 113 215 386 196 -32 92
$$ packed form
4687B86j01j64Q9J0M1J14K18k65Q8N8j02j25L65j41P1q7j44K38o8l43M76k50J61
4710D25k3M7P3k50O8j74J52j47M25m66J91j10N3j72K33k45O6J91j81K72j88j02
4732A38J7k51J98k20J87j08J62k82J8M1k9J10k25O9J79j85K80q5l14M20l39N5
4754a64K73m38R8m9L20q5p0RO9l21J48k04J12P4q7q1L7K43m3j9j16J52J6j45m0
4779c11l8J24q6L02k30J1k78L30k9J6j07j93K58L5O2K41k28m71K55R7J91MJ00
4802E5j78L5M4R8k31L28j55j68N5j73L43J58K92K8n23N6KJ6P9N7o2q6K47k72K76
4827C21j01q6J36K77m51J85K2J45k2l01j91N03l29P2n0K09k72M63k17j45Q5Q3
4849C36Rj46K83k3l30n8M50l75k68L96j9J43j50o7p0O2m5j5J02J71j90k28J24
$$ plain form
4872 92 -125 -126 60 17 164 183 -49 -232 -134 67 -164 49 89 -148 -85 -211 -156 -210 -23 112 -192 -274 -251 -168
4896 -168 -67 -38 -265 -470 -77 6 -116 -289 -417 -409 -261 -95 -296 -260 -219 -397 -93 -87 -406 -428 -247 -294 -343 -3
4920 -3 -84 107 -284 -358 -235 -242 -144 -66 -82 -133 -147 -145 11 -369 -87 -348 -82 -92 31 60 90 37 42 -55 107 25 87
4947 87 52 380 51 237 66 -3 254 182 11 31 119 163 252 242 264 77 79 419 169 95 277 126 106 286 617
4972 617 233 422 89 150 361 297 146 226 436 411 215 299 262 210 255 -100 67 218 296 155 392 162 68
4995 68 73 101 -29 9 78 317 50 322 330 50 43 -57 -110 93 -89 -147 -26 -140 120 -3 189 -222 -189 -285 -23
5020 -23 -14 -138 -136 -233 18 -60 97 -185 -130 -334 -185 -41 -242 -149 -231 -240 -91 -183 -319 -225 -395 -422 -375 -212 -128 -305
5046 -305 -151 95 -224 -306 -386 -159 -56 -180 -112 -367 -213 -398 -269 -275 -26 -180 -184 -126 -361 -294 -35 -14 -20 -37
$$ packed form
4872I2k17jJ86m3J47J9k32j83R8K01k31K13M0k37O3j26N5n4J87J35l04q2K3Q3
4896a68J01K9k27k05L93Q3j22j73j28QJ48J66k01L6M1j78L04Ol19k2J81m7m9L40
4920cq1J91l91p4J23pR8P8j6n1j4KJ56l80K82k61K66j0J23K9L0n3Nr7J62q2O2
4947H7l5L28l29J86j71o9K57p2j71K0Q8M4Q9j0K2j87KL40k50p4J82j51k0J80L31
4972F17l84J89l33O1K11o4j51Q0K10k5j96Q4l7n2M5l55J67J51P8j41K37k30r4
4995F8NK8j30L8O9K39k67K72Qk80pj00n3K03j82n8J21j14K60j23J92m11L3r6K62
5020b3Rj24Kr7K51p8J57k82N5k04J49J44k01R3q2rJ49r2j36R4j70k7M7J63Q4j77
5046c05J54K46l19q2q0K27J03j24O8k55J54j85J29oK49j54mN8k35O7K59K1oj7
$$ plain form
5070 -37 -110 -294 -14 -95 -308 -188 -40 101 75 32 158 -7 67 -203 153 189 256 128 288 103 223 -10 239
5093 239 198 123 347 271 245 127 284 325 95 87 92 107 116 644 201 74 482 368 369 419 265 116 -23 400 321
5118 321 287 409 316 162 31 76 108 251 77 20 61 189 185 7 244 -57 23 256 36 300 26 133 209
5141 209 119 23 45 210 -52 147 -121 -27 -123 -47 -186 57 -270 -189 -99 -96 118 -189 -299 -184 -252 -470 -116 -332
5165 -332 -128 -273 -300 -97 -279 -147 -91 -343 -149 -39 -236 -100 -351 -158 45 -278 -104 18 -157 -91 -168
5186 -168 155 -387 -401 -142 -189 47 -376 -241 -215 -100 -277 -161 -75 -162 -136 -46 -145 -97 -117 -265 -230 -66 -141 5
5210 5 35 2 144 139 359 -70 -140 278 216 -69 123 -229 124 136 227 363 235 157 -112 142 227 153 154 255 344
5235 344 373 -8 247 293 457 436 213 347 350 359 136 130 309 57 174 135 259 195 184 108 -96 254 458 410 12
$$ packed form
5070c7p3j84K80q1k13J20J48J41k6m3J26j65P4k70L56L6O7j28J60j85J20k33K49
5093B39m1p5K24p6k6j18J57M1k30qNJ5RN28m43j27M08j14JN0j54j49j39M23p9
5118C21l4J22r3j54j31M5L2J43j74n7M1J28mj78K37l01Q0K33k20K64k74J07P6
5141B09r0r6K2J65k62J99k68R4r6P6j39K43l27Q1R0LK14l07j10J15o8k18L54k16
5165c32K04j45k7K03j82J32N6k52J94J10j97J36k51J93K03l23J74J22j75O6p7
5186a68L23n42j4K59m7K36m23J35K6J15j77J16Q6q7K6R0r9M8k0j48L5J64p5J46
5210EL0l3J42nK20m29p0M18o2k85J92l52L53J2R1J36j28p8k69K54Q5p4JJ01Q9
5235C44K9l81K55M6J64k1k23J34LRk23oJ79k52J17l9J24o4j1p6k04L50K04m8l98
$$ plain form
5260 12 189 200 116 215 138 214 164 135 318 88 141 269 172 -51 -74 107 -131 153 198 286 176 47 -4 -11 -52 76
5286 76 -69 -92 -157 -353 34 96 -62 -2 63 -266 -90 10 -160 -429 -229 -142 -273 -120 -261 -190 -168 -105 -75 -249
5310 -249 -203 -202 -75 -248 -398 -221 -172 -215 -253 -241 -275 -437 -407 -270 -62 -142 -46 -135 -29 -69 -367 -42 -152 131
5334 131 242 -256 -163 1 -111 -92 -62 -58 110 186 29 -269 142 -85 193 80 71 -3 218 46 148 76 86 90
5358 90 161 -55 212 13 128 208 55 230 186 135 -9 119 44 123 -25 249 282 100 226 125 264 350 167
5381 167 302 505 140 282 281 -132 126 297 141 191 264 135 138 198 92 38 224 6 421 156 252 50 182
5404 182 -87 221 219 86 174 -177 147 9 195 184 226 -20 -70 -218 80 9 -32 -12 -48 -130 -2 -161 -88 -46
5428 -46 -86 -108 38 -221 -256 -153 -94 -114 -249 -105 10 -206 -537 -230 -324 -131 -190 -244 -273 -259 -417 -249 -152 -225
$$ packed form
5260A2J77J1q4R9p7P6n0k9J83k30N3J28r7k23k3J81k38K84M5Q8j10j29n1pm1J28
5286G6j45k3o5j96L87O2j58O0O5l29J76J00j70k69K00Q7j31J53j41P1K2O3L0j74
5310b49M6JJ27j73j50J77M9m3l8J2l4j62L0J37K08q0R6q9J06m0k98L25j10K83
5334A31J11m98R3J64j12J9L0MJ68P6j57k98M11k27K78j13rp4K21j72J02p2J0M
5358I0P1k16K67j99J15Q0j53J75m4n1j44J28p5P9j48K74L3j82J26j01J39Q6j83
5381A67J35K03l65J42jm13K58J71j56N0P3j29LO0j06n4J86k18M15k65R6k02J32
5404A82k69L08kj33Q8l51L24j38J86j1M2k46n0j48K98p1m1K0l6q2J28j59P3M2
5428d6m0k2J46k59l5J03N9k0j35J44J15k16l31L07r4J93n9n4k9J4j58J68R7p3
$$ plain form
5452 -225 -248 2 -41 -100 -117 -380 -349 35 -63 28 -174 18 -252 -229 -289 -116 -173 -254 1 -139 168 31 42 -94
5476 -94 -44 -109 43 105 128 15 -50 -30 161 24 196 29 147 151 -168 189 155 12 397 246 45 139 -73 -82
5500 -82 100 97 223 408 -82 43 209 174 99 232 315 435 164 26 149 347 404 79 311 389 255 105 24
5523 24 180 367 182 151 -107 195 139 164 190 337 199 239 216 277 85 74 47 -129 151 85 24 104 227 71
5547 71 -78 106 61 -97 288 -113 -27 -62 51 -223 -69 235 -96 -55 60 -392 -165 -217 -291 -46 -277 -290 -151
5570 -151 160 -78 -10 -168 -497 -106 -187 -303 2 -189 130 -84 -229 -111 -182 -469 -81 -272 -216 -131 -123 -84 9
5593 9 235 -275 -84 -229 -80 14 -110 24 58 128 -47 -124 -15 -41 -242 8 -44 32 195 -37 -31 51 -165 -67
5617 -67 91 -56 312 173 34 127 -75 -161 -78 -13 -161 113 198 109 222 -139 142 77 -31 239 59 192 110
$$ packed form
5452b25k3K50m3n9j7k63L1L84r8R1k02J92k70K3o0J73n7q1K55j40L07j37J1j36
5476i4N0o5J52O2K3j13o5K0J91j37J72j67J18Ml19L57l4j43L85j51k01R4k12r
5500h2J82lJ26J85m90J25J66l5p5J33Q3J20k71j38J23J98N7l25K32P8j34j50q1
5523B4J56J87j85l1k58L02n6K5K6J47j38M0k3O1j92j1k7j76K80o6o1Q0J23j56
5547G1j49J84m5j58L85m01Q6l5J13k74J54L04l31M1J15m52K27n2p4K45k31j3J39
5570a51L11k38O8j58l29L91q1j16L05j91L19k14j45J18p1k87L88j91N6Q5QL9R3
5593IK26n10J91j45J49R4j24J34L4P0j75p7J09k6k01K50n2P6J63k32OQ2k16R8
5617f7J58j47L68j39j39R3k02q6Q3O5j48K74Q5q9J13l61K81o5j08K70j80J33q2
$$ plain form
5640 110 237 76 263 486 139 -38 404 188 273 320 401 81 120 211 248 76 61 218 -72 394 61 302
5662 302 230 454 228 41 89 -146 33 113 346 19 369 -96 33 150 -102 10 14 -86 125 6 -132 -6
5684 -6 -30 131 261 10 3 -119 -90 -170 -1 -4 -102 -187 -122 -34 -115 -299 -296 -272 -130 -383 -11 -110 -131 -95 -93 -249 -329 -148
5712 -148 -37 -236 -315 -221 -228 -116 -102 -53 -10 -88 138 -4 -247 -201 -83 -194 -243 -170 -492 -192 29 -144 -230 -65
5736 -65 80 -342 -158 169 -205 -267 -9 -23 -15 80 3 -66 -220 29 -301 -51 -50 11 -132 145 23 88 122 33 219
5761 219 168 141 151 -2 458 49 60 164 -14 251 98 -139 74 196 -25 237 -40 159 203 349 241 -22
5783 -22 102 363 205 371 238 1 -181 110 172 221 196 2 -49 302 372 104 195 435 273 200 72 -26 85
5806 85 126 -145 93 36 170 -57 -37 -15 196 132 -132 -34 41 153 -133 -22 -159 9 139 -55 -209 155 14
$$ packed form
5640A10J27j61J87K23l47j77M42k16Q5M7Q1l20L9R1L7j72j5J57k90M66l33K41
5662C02p2K24k26j87M8k35J79Q0K33l27L50m65J29J17k52J12Mj00K11j19j38J26
5684fk4J61J30k51pj22K9q0J69lr8q5O5Q8q1j84LK4J42k53L72r9k1L6Kj56q0J81
5712a48J11j99p9R4pJ12J4M9M3p8K26j42k43M6J18j11m9P3l22L00K21j73q6J65
5736f5J45m22J84L27l74o2K58j4QR5p7o9j54K49l30K50JO1j43K77j22O5L4q9J86
5761B19n1k7J0j53M60m09J1J04j78K65j53k37K13J22k21K62k77J99M4J46j08k63
5783b2J24K61j58J66j33k37j82K91O2M9k5j94n1L51P0k68R1K40j62p3j28r8J11
5806H5M1k71K38n7J34k27K0K2K11o4k64R8P5J12k86J11j37J68J30j94j54L64j41
$$ plain form
5829 14 -92 -115 195 -344 -118 -41 -21 -102 -164 -27 -75 -66 -34 -301 -289 7 204 -16 50 -50 126 97 75 -96 -117
5854 -117 37 -299 -180 -75 -298 -182 -226 -132 -356 30 81 -261 71 -308 -6 111 12 87 -167 -150 -248 -77
5876 -77 -182 72 -260 67 162 -70 -155 130 7 7 38 18 30 41 98 117 36 185 126 119 -38 -10 140 -16 345
5901 345 120 62 109 167 -77 88 57 63 111 214 375 251 271 270 243 232 5 145 131 162 62 -89 0 235 137
5926 137 294 66 239 266 124 153 83 11 63 159 172 70 -36 -90 131 -64 -72 -34 83 120 69 109 -25 -14 -141
5951 -141 -80 92 109 -15 -42 -204 -6 -87 -19 25 -364 60 43 -127 64 -124 22 55 -53 -128 27 -241 -170
5974 -170 -146 -266 -327 -41 -33 -67 -154 -245 -39 -306 20 -247 -137 -116 53 -35 -234 -23 -148 -51 -283 9 -45 -254
5998 -254 -100 -418 -254 -85 -71 -74 -148 -40 -246 -117 -167 126 56 32 39 -211 -115 26 -264 -52 -116 54 349 130
$$ packed form
5829A4j06k3L10n39K26P7K0q1o2J37m8RL2k67J2K96J97k20O6j00J76k9k2j71k1
5854a17J54l36J19J05k23J16m4R4k24L86N1l42L32l79L02J17r9P5k54J7r8J71
5876g7j05K54l32L27R5k32q5K85j23%L1k0J2J1N7J9q1J49n9pj57K8J50j56L61
5901C45k25n8M7N8k44J65l1OM8J03J61j24K0jk7j1k27J40j4L1j00j51Q9K35r8
5926A37J57k28J73K7j42K9p0p2N2R6J3j02j06n4K21j95qL8J17L7n1M0j34J1j27
5951a41O1J72J7j24k7j62J98q1O8M4l89M24j7j70J91j88J46L3j08p5J55k68P1
5974a70K4j20o1K86Ql4q7r1K06k67L26k67J10K1J69q8j99K11j25R7k32K92n4k09
5998b54J54l18J64J69J4lp4J08k06J29n0K93p0k4Pk50R6J41k90K12o4J70K95k19
$$ plain form
6022 130 104 -113 -282 -10 59 -160 164 74 257 -66 32 -41 217 219 319 167 88 92 83 122 206 208 108 -81 263
6047 263 79 -40 -15 281 193 -171 188 -6 35 97 160 118 209 92 177 218 17 138 1 -43 114 77 41 236
6071 236 173 54 22 123 -33 175 248 -16 -111 1 50 129 -4 37 39 60 -118 -26 -169 27 -15 20 128 -103
6095 -103 -110 -123 -183 165 -132 25 -161 -48 39 -208 43 -33 -372 -10 -201 -281 -39 -141 -284 -136 87 -274
6117 -274 -234 -44 -55 -167 -174 -239 -152 -154 -95 -113 -203 -19 -38 -80 -80 -98 -94 87 -12 -1 -114 -3 -139 -191 -111 -65 87 122
6145 122 -72 -87 367 52 -81 -155 81 -54 78 193 162 36 -153 29 -27 71 119 136 -246 3 45 118 381
6168 381 -66 87 26 95 -23 211 329 144 207 -69 369 105 233 201 303 249 247 -139 145 176 240 162 61
6191 61 217 227 153 189 264 218 -84 9 158 161 6 93 22 -101 255 264 111 253 194 -33 -15 -121 -99 -42 -97 -122
$$ packed form
6022A30k6k17j69K72O9k19L24r0J83l23R8p3K58KJ00j52p9MrL9Q4Kj00j89L44
6047B63j84j19K5K96q8l64L59j94M1O2O3m2R1j17Q5M1k01J21j37m4J57l7l6J95
6071B36o3j19l2J01j56K08P3k64r5J12M9P9j33M1KK1j78R2j43J96m2L5J08k31
6095a03pj3o0L48k97J57j86J13Q7k47K51p6l39L62j91q0K42j02j43J48K23l61
6117b74M0J90j1j12po5Q7kN9j8r0J84j9m2%j8MJ81r9J1j13J11j36n2Q0M6J52L5
6145A22j94j5M54l15j33p4K36j35J32J15l1j26j89J82n6R8M8J7l82K49M2P3K63
6168C81m47J53o1O9j18K34J18j85O3k76M38k64J28l2J02n4kl86K84L1O4p8j01
6191F1J56J0p4L6P5m6l02R3J49Lj55Q7p1j23L56Rj53J42n9k27J8j06K2N7n5k5
$$ plain form
6217 -122 184 -71 -124 -69 119 148 -165 -60 243 123 -95 -75 17 -53 40 -152 -135 -139 6 -52 -197 -35 78 -200
6241 -200 -38 200 -227 -111 -298 -56 115 -272 -90 218 125 -195 -144 -332 -13 -256 -81 -103 -28 63 -80 -122
6263 -122 -57 -60 80 24 -456 -144 -344 -139 -29 -150 -198 -100 26 0 -261 -143 75 40 -203 -89 -245 127 120
6286 120 167 151 267 -105 170 133 160 180 152 454 69 172 140 -101 -3 42 236 89 79 230 71 211 82
6309 82 131 114 151 104 219 228 137 114 148 79 136 194 87 -31 37 251 237 90 -118 299 49 -4 244 27 57 127
6335 127 38 48 15 -34 -96 -110 170 134 64 32 180 211 125 -9 173 -98 240 -160 10 -37 212 5 72 -65
6359 -65 -159 -177 135 47 193 51 99 -30 -249 -131 38 -115 96 215 5 -71 -221 -83 130 -56 -243 204
6381 204 -100 -141 -287 -316 17 -298 -266 -279 -66 -315 -66 -189 -101 -274 -161 -178 -34 -115 22 -101 113 -145
$$ packed form
6217a22L06k55n3N5J88K9l13J05L03j20k18K0R2p0R3j92J7mJ45n8j45J62J13k78
6241b00J62K38m27J16j87K42J71l87J82L08r3l20N1j88L19k43J75k2P5R1j43m2
6263a22O5lJ40n6m80L12k00K05J10j21m8R8J26k6k61J18K18l5k43J14j56L72p
6286A20M7j6J16l72K75l7K7K0k8L02l85J03l2k41R8M5J94j47j0J51j59J40j29
6309H2M9j7L7m7J15Rr1k3L4o9N7N8j07j18O8K14j4j47k08M17k50n3K48k17L0P0
6335A27q9J0l3m9o2j4K80l6p0l2J48L1q6j34J82k71L38m00J70m7K49k07O7j37
6359f5r4j8L12q8J46j42M8j29k19J18J69j53K11J19k10p6j50J38K13j86j87M47
6381B04l04m1j46k9L33l15L2j3K13k49K49j23Q8j73J13j7J44q1J37j23K14k58
$$ plain form
6403 -145 -81 151 -211 50 62 54 -138 -188 -177 -6 200 -146 -157 -94 218 -50 -273 260 63 13 187 86 41
6426 41 93 -19 6 -26 41 159 150 39 135 193 130 52 111 -51 200 116 43 177 102 126 111 150 31 336 160 105
6452 105 254 -78 150 29 103 168 -107 222 -9 92 -29 152 38 154 116 -73 -41 239 159 -59 168 261
6474 261 167 -134 88 175 31 205 154 -94 11 -144 -69 -55 24 -165 -20 -152 27 90 -1 4 -91 87 -146 -381
6498 -381 31 239 -49 -33 -145 -178 -312 -174 100 -96 -226 -185 21 -70 88 -11 1 -105 1 -157 -139 -187 -129
6521 -129 -83 -332 -446 25 -148 -183 -206 -189 -144 -125 -131 -115 -42 51 -17 -112 -83 -231 -48 -27 -96 -41 -201 -166 -70 -75 -29
6548 -29 -28 183 -51 1 76 -50 -206 140 -51 -274 -116 -5 48 -14 10 142 269 145 15 214 228 88 200
6571 200 78 43 -92 82 127 19 29 -69 83 360 67 159 -202 201 156 143 251 213 128 -32 216 121 -15
$$ packed form
6403a45O4K32l62K61J2qj92n0J1J71K06l46j1O3L12k68k23N33j97n0J74j01m5
6426D1N2j12K5l2O7J18rj11R6N8o3p8N9j62K51q4p3J34p5K4j5L9j19L05j76n5
6452A05J49l32K28j21P4O5k75L29k31J01j21J81j14J16l8j89L2K80q0k18K27R3
6474B61r4l01K22Q7j44J74n1k48J05j55P5J4P9j89J45j32J79O3r1Nr5J78k33k35
6498c81M12K08k88J6j12l3j34J38K74j96j30M1K06r1J58r9J2j06J06j58J8m8N8
6521a29M6k49j14M71j73l5k3J7M5J9oJ6P3R3o8r5K9j48J83K1o9N5j60L5R6nM6
6548b9JK11k34N2P5j26j56L46j91k23J58J11N3o2K4J32J27j24j30J99J4j40J12
6571B00j22l5j35J74M5j08J0r8J52K77k93R2l61M03m5j3J08l8q5j60K48r5j36
$$ plain form
6594 -15 167 280 136 -172 370 128 129 -147 -150 228 213 275 -79 -178 125 140 151 -96 307 18 -20 91 147 -68
6618 -68 -5 -132 49 48 -104 98 10 146 11 -108 -274 -47 -32 -34 99 160 12 -100 -57 -228 -217 -185 -250 -54
6642 -54 -153 -27 -112 -424 -6 -89 22 87 -195 -134 -171 -90 -15 -115 -45 28 -250 -329 -143 -173 -118 -44 -38 -104 -215 -17
6668 -17 -198 113 11 -98 76 27 115 -20 -102 -2 -84 -181 -217 2 -138 -198 -178 199 210 -121 158 -73 -74 -62
6692 -62 -6 12 340 147 118 19 200 -60 -17 69 -132 -47 -44 115 22 -14 178 185 137 76 151 133 27 11 323 85
6718 85 -30 59 206 -93 266 156 74 106 175 86 79 150 240 37 296 33 59 14 107 -107 118 -167 -121 182 69
6743 69 166 138 127 283 184 -121 145 153 3 61 160 -323 138 132 138 251 -2 49 31 -36 -75 -191 -158 -68 -103 -11 69
6770 69 61 -276 -1 31 -277 159 -54 -8 -169 49 -215 -292 -244 -104 -13 -22 56 -81 -285 -254 -83 -40 -50 -16 -162
$$ packed form
6594a5J82J13j44l08N42k42Jk76lL78j5O2l54r9L03J5J1k47M03k89l8J11N6k15
6618f8O3j27J81jj52K02q8J36j35j19j66K27J5kJ33O1j48j12M3j71J1L2o5J96
6642e4r9J26q5l12M18q3J11O5k82O1l7Q1P5j00P0P3k78p9J86l0N5P4Oo6j11J98
6668a7j81L11j02j09J74m9Q8j35q2J00q2r7l6K19j40o0K0L77J1l31K79k31jJ2
6692f2N6J8L28j93k9r9J81k60M3Q6k01Q5LJ59r3l6J92Pm8o1P5j8j06j6L12k38
6718H5j15Q9J47k99L59j10q2L2O9q9pP1R0k03K59k63K6m5R3k14K25k85M6L03j13
6743F9R7k8j1J56r9l05K66Qj50N8R9m83M61oOJ13k53N1j8o7l9j16L3R0l5R2Q0
6770F9ql37K75L2l08M36k13M6j61K18k64p7M8J40R1rP8j37k04L1J71M3j0L4j46
$$ plain form
6795 -162 -127 -150 -155 115 -253 109 -35 -173 -88 30 -58 108 -19 24 140 -28 -124 -171 -158 -9 69 256 93 167
6819 167 -70 47 -185 60 20 -57 177 45 -213 168 -44 152 -249 46 34 -101 -139 29 128 25 -50 268
6841 268 -10 54 245 -38 5 -185 134 203 12 38 371 -108 84 25 82 15 51 251 75 165 93 291 -36
6864 -36 364 93 140 263 122 169 166 146 65 352 117 218 38 122 194 313 51 139 75 31 -33 211 191 -21 -78
6889 -78 157 -202 132 2 25 -74 58 -79 -256 -11 143 74 58 -179 -203 -71 -248 -74 -82 38 4 27 -159
6912 -159 44 -146 -67 -230 -62 -333 -35 -154 -71 -60 44 4 -282 -217 -125 -8 -97 -174 -140 -30 -105 -224 -2
6935 -2 -76 -97 242 -200 -35 44 320 46 -6 -148 -129 -1 148 123 -26 85 35 -91 73 -160 -225 -17 -35 -70
6959 -70 132 165 131 24 26 35 -79 61 159 19 -10 62 -13 166 -136 -154 61 96 89 104 -4 158 137 -105 251 -110
$$ packed form
6795a62L5k3nK70l68L62j44j38Q5J18q8J66j27M3J16j68r6m7J3J49P8J87j63P4
6819A67k37J17k32K45m0p7K34j32k58L81k12J96m01K95j2j35l8J68R9j03p5L18
6841B68k78O4J91k83M3j90L19O9j91K6L33m79J92n9N7o7L6K00j76R0p2J98l27
6864c6M00k71M7J23j41M7lk0q1K87k35J01j80Q4P2J19k62Q8o4m4o4K44k0k12n7
6889g8K35l59L34j30K3r9J32j37j77K45J54o9j6k37k4J32j77J74qJ20l4K3j86
6912a59K03j90P9j63J68k71K98j19Q3J1J04m0k86O5R2J17q9p7L4J10p5j19K22
6935bp4k1L39m42J65P9K76k74n2j42J9J28J49k5j49J11n0j26J64k33o5K08j8l5
6959g0K02L3l4j07KRj14J40R8j40k9P2p5J79l02j8K15L5pJ5j08J62k1k42L56l61
$$ plain form
6985 -110 28 244 61 24 113 42 -13 -50 31 92 -59 179 327 228 -12 11 -41 12 -161 232 239 51 104 -135 171
7010 171 -82 -57 105 104 29 235 213 133 -1 255 111 53 54 100 3 142 -10 -59 -82 -108 131 -90 -78 -225 4
7035 4 -268 8 -60 52 -139 74 120 -188 -241 -278 6 -28 162 9 6 109 44 -221 -86 -45 1 -189 -434 22
7059 22 -173 180 73 -58 188 77 -50 -38 -126 54 70 -92 -43 -248 29 5 -160 43 -66 -115 -318 26
7081 26 57 -19 226 -130 48 85 -184 -122 -81 -297 -191 -229 -68 183 -22 144 84 -90 -120 46 64 -10 -14 188
7105 188 75 129 158 102 61 357 -94 237 113 279 32 -163 98 80 99 221 140 64 -22 -203 162 94 119 -28
7129 -28 203 3 29 141 51 26 158 295 31 103 -21 40 -223 255 -151 -31 204 83 208 131 71 -96 -59
7152 -59 -14 -218 18 -211 -49 -41 123 96 14 -245 -40 -160 77 212 61 119 -157 47 -32 -67 -18 -199 -234 -27
$$ packed form
6985a10J38K16j83l7Q9p1n5l7Q1O1j51K38J48r9k40K3n2N3j73L93Pj88N3k39L06
7010A71k53K5J62jp5K06k2q0j34K56j44n8JM6r7J39j52m9k3k6K39k21J2j47K29
7035Dk72K76o8J12j91K13M6l08n3l7K84l4J90j53lJ03o5k65J35M1M6j90k45M56
7059B2j95L53j07j31K46j11j27J2q8J80J6j62M9k05K77k4j65K03j09m9k03L44
7081B6L1p6K45l56J78L7k69O2M1k16J06l8J61K51k05J66o0j74l0J66J8p4mK02
7105A88j13N4K9n6m1K96m51L31j24J66k47j95K61j8J9J22q1p6q6j81L65o8K5j47
7129b8K31k00K6J12r0k5J32J37k64P2j24O1k63M78m06J20K35j21J25p7o0j67L7
7152e9M5k04K36k29J62QJ64k7q2k59K05j20K37J35j51N8k76K04p9l5M9j81l5K07
$$ plain form
7176 -27 40 -5 -212 -57 -152 -165 -305 -87 -332 -390 -118 24 89 -208 -144 -15 -23 -213 -74 -82 -105 13 -33 -262 -299
7201 -299 -232 58 -128 -117 -199 108 167 62 -113 7 -70 34 124 -172 74 -70 143 -59 172 15 32 -223
7223 -223 -93 -57 -154 -92 30 90 -75 127 -134 18 13 -29 42 97 -285 -183 42 -129 59 -50 -117 -95 52 221
7247 221 -115 -9 -22 93 79 306 127 140 45 34 9 133 63 313 200 60 133 298 20 97 39 168 185 102
7271 102 188 -26 98 168 76 -120 -181 -90 88 37 251 -89 206 -180 -117 -25 140 -75 3 54 217 -1 123
7294 123 -17 -5 194 201 6 -107 -155 -240 -181 -4 -116 -170 336 -57 -178 -59 59 -48 -44 -154 -115 98 -14
7317 -14 -126 103 -75 184 -291 -418 48 143 -101 48 -231 -77 -373 45 -118 -84 -137 -75 98 -203 -119 -56
7339 -56 94 -10 -3 -222 -98 -73 -89 47 -1 -307 -91 -101 -2 -180 -142 -402 -301 -19 -124 120 -146 237 10
$$ packed form
7176b7O7m5k07J55r5j3j40K18k45n8K72J42O5k97O4J29qj90J39qk3J18m6k29l7
7201b99O7K90j86J1q2L07N9j05j75J20p7J04R0k96K46j44K13k02K31j57J7k55
7223b23J30L6r7O2J22O0j65K02k61J52nm2P1N5l82J02K25j71J88j09o7K2J47J69
7247B21l36J06j3J15j4K27j79J3r5j1k5J24p0K50j13j40P3J65k78P7n8J29J7q3
7271A02Q6k14J24P0r2j96o1R1J78n1K14l40K95l86O3R2J65k15P8N1J63k18J24
7294A23j40J2J99Pj95j13m8q5N9J77j12n4N06l93j21J19J18j07Mj10L9K13j12
7317a4j12K29j78K59m75j27M66R5k44J49k79J54k96M18j63L4n3O2J73l01Q4O3
7339e6J50j04Pk19J24K5j6J36m8l06K16j0R9j78L8k60J01K82j05K44k66L83k27
$$ plain form
7362 10 -36 -192 -29 -9 -137 73 1 29 -19 -52 33 -63 111 89 -211 -101 232 108 -42 32 -59 256 -66 58
7386 58 -24 377 -218 -51 -100 233 -65 -76 31 14 201 30 19 174 130 -158 17 104 298 -48 177 139 -55
7409 -55 -140 -40 166 -62 -173 -16 -97 -185 -67 -100 22 -126 6 -23 -2 101 -39 11 161 102 -143 -79 -102 84
7433 84 -170 -42 19 93 -271 -205 31 -313 181 21 -280 79 -130 -204 -72 -119 -78 -104 -135 6 -100 -115 -11
7456 -11 -207 -72 -1 -51 -133 -50 16 -49 52 -142 -58 -176 -121 -129 -146 -122 -1 -75 32 -142 -344 -72 46 -81 109
7481 109 -187 -67 117 -82 77 44 -49 -114 -13 159 100 15 -122 -81 34 -221 44 -2 -26 -107 -151 186 110 -113
7505 -113 36 -74 157 23 194 -14 90 70 -68 184 128 267 123 159 165 -41 -314 -116 18 118 43 166
7527 166 209 188 26 34 413 2 -80 99 -24 81 109 164 -64 -121 -86 93 -138 -4 145 -8 159 -118 -13
$$ packed form
7362A0m6j56J63K0j28K10p2K8m8l3Q5r6J74k2l00J10L33j24j50P4r1L15l22J24
7386E8q2M01n95J67m9L33k98j1J07j7J87j71j1J55m4k88J75Q7J94l46K25l8j94
7409e5q5J00K06k28j11J57q1q8J18l3J22j48J32k9K1J03j40N0J50n9k45O4k3J86
7433H4k54J28O1P4l64O6K36l44M94j60l01L59k09p4J32m7M1k6l1J41j06j5J04
7456a1j96J35P1n0q2Q3O6o5J01j94Q4j18N5qj7K4J21p4J07j74k02K72J18j27J90
7481A09k96J20J84j99J59l3r3o5J01J72n9q5j37M1J15k55K65m6k4q1m4L37p6k23
7505a13J49j10K31j34J71k08J04k0j38K52n6J39j44L6Ok06k73J98J34J00p5J23
7527A66M3k1j62QL79m11q2J79j23J05K8N5k28n7L5J79k31J34J49j53J67k77J05
$$ plain form
7550 -13 115 95 163 8 -405 -251 74 -64 -60 40 158 -49 68 -194 -100 -181 -91 96 75 -13 16 -128 -31 -151
7574 -151 8 63 80 156 24 -131 119 -69 -62 -137 -28 -204 -59 -106 -68 -26 -103 -221 -208 -133 -55 -131 50 -172 -150
7599 -150 71 87 -88 -62 -68 -116 -31 -103 -153 -111 18 -150 131 -264 -211 12 -168 94 17 -30 93 -200 -183 -18
7623 -18 -15 -44 -251 -37 -85 17 45 99 54 320 -77 26 35 171 93 -36 -236 58 -78 -210 204 28 106 -158
7647 -158 95 159 -67 51 101 -122 264 163 340 338 -36 191 143 209 -27 -10 195 80 -101 -137 163 109 140
7670 140 -41 48 306 -14 304 -265 -109 -190 -98 95 4 70 6 27 -5 16 -58 -43 176 -10 -141 147 147 149 31
7695 31 108 252 -56 -63 58 -92 -20 -101 -122 -72 191 -141 31 19 -137 -197 -31 -94 51 -91 -85 -59 -152 -10 43
7720 43 -40 -220 -138 -216 245 90 -67 -45 -86 -2 -12 -183 119 -45 124 -62 -156 18 -151 17 -97 -193 -41
$$ packed form
7550a3J28k0O8j55m13J54L25j38MJ00J18k07J17k62R4q1R0J87k1q8K9j44R7j20
7574a51J59N5J7P6j32j55K50j88Pp5J09j76J45m7L8M2p7j18J3P5P8p6J81k22K2
7599a50K21J6j75K6om8Q5p2n0M2J29j68K81l95N3K23j80K62p7m7J23k93J7J65
7623a8Lk9k07K14m8J02K8N4m5K66l97J03RJ36p8j29k00K94j36j32M14j76P8k64
7647a58K53O4k26J18N0k23L86j01J77kl74K27m8O6k36J7K05j15j81l6L00n4L1
7670A40j81Q9K58l20L18n69J56q1R2J93r1O6o4K1l2K1p4J5K19j86j31K88%Kj18
7695C1P7J44l08pJ21j50P2q1k1N0K63l32J72j2j56o0J66o3J45j42OK6r3J42N3
7720D3q3j80Q2p8M61j55j57K2m1Q4j0j71L02j64J69j86r4J74j69J68j14r6J52
$$ plain form
7743 -41 -130 -219 -130 -85 -72 -42 -170 -110 10 -141 44 -70 -121 37 243 -34 -153 -176 51 95 131 -46 -117 92
7767 92 193 -235 -107 -138 -119 -77 192 108 197 -85 87 98 225 56 33 44 -171 203 -92 85 236 298 27
7790 27 162 111 -25 -59 4 159 35 69 102 34 -78 150 -98 138 -147 -37 1 -13 148 123 49 21 292 -10
7814 -10 -103 98 -31 39 196 83 264 -46 -45 -97 -108 -74 -3 -14 -117 190 -46 -25 105 -52 87 -133 -10 168
7838 168 -86 -34 32 -353 189 36 -145 0 -142 -131 233 92 44 48 -56 -26 93 -74 -177 38 -67 -72 77
7861 77 17 76 169 242 -229 20 -185 -159 -175 193 -18 -107 83 -13 14 -304 -139 52 -155 -118 -221 -115 -32 106
7885 106 51 138 -117 -204 -184 -31 -93 -149 37 61 157 -21 -26 -3 -11 75 -46 173 -21 170 271 55 83 29 217
7910 217 -31 -195 16 -31 146 -109 349 279 48 20 -11 -44 199 65 133 49 -124 -3 264 185 98 230 105
$$ packed form
7743d1q9q9Q9M5J3L0j28O0J20j51J85j14n1J58K06k77j19k3K27M4L6j77p1K09
7767I2J01m28J28l1J9M2K69q4Q9k82J72J1J27j69k3J1k15L74k95J77J51O2k71
7790B7J35n1j36l4O3J55j24L4L3o8j12K28k48K36k85J10L8j4J61k5p4k8K71l02
7814a0r3K01j29P0J57j13J81l10Jn2j1L4P1j1j03L07k36K1J30j57J39k20J23J78
7838A68k54N2O6l85N42j53j81J45j42J1L64j41m8Mj04L0J19j67j03K15j05nJ49
7861G7o0N9R3P3m71K49k05K6j6L68k11q9J90r6K7l18J65J91k07L7j03J06Q3J38
7885A06n5Q7k55q7K0J53o2n6J86K4R6j78nK3qQ6j21K19j94J91J01k16K8n4J88
7910B17k48j64K11m7J77k55M58p0k31k8l1l3K43j34O8q4j73J21K67p9q7J32j25
$$ plain form
7933 105 160 37 47 146 79 64 -76 35 19 89 -92 44 89 154 28 131 0 182 260 18 51 11 80 96 151
7958 151 10 187 -74 -106 158 147 60 37 192 -177 175 112 28 -35 -53 38 -5 118 -101 -160 115 25 163 -81
7982 -81 -18 -223 -178 -43 113 99 -264 77 210 -158 -176 -1 -46 87 -5 96 132 -45 57 -227 -60 -2 -146
8005 -146 158 88 56 -92 -15 103 -312 -37 -14 -117 -89 14 -26 18 123 -480 -235 -28 86 -88 -178 -196 -2
8028 -2 -11 -21 9 299 144 -232 58 -233 275 4 -133 185 -9 -144 -32 -30 82 0 -50 -7 -47 -38 124 31 -39
8053 -39 -120 128 -113 126 -187 193 218 -75 144 188 54 -29 -68 35 -136 180 -99 158 -5 117 59 -78
8075 -78 178 158 149 186 -2 39 -68 -6 -3 -57 63 -66 -80 21 74 162 -210 248 -34 -4 30 -99 -51 -23 -12 -183
8101 -183 49 -79 -5 -73 12 -235 35 -67 -218 -380 306 128 -110 25 56 -77 49 -6 -49 -28 -208 53
$$ packed form
7933A05N5j23J0R9o7j5j40J11j6P0j81J36M5O5j26J03j31J82P8k42L3m0O9J6N5
7958A51j41J77k61l2K64j1q7k3J55l69L52o3q4o3j8R1m3J23k19n9K75r0J38k44
7982h1O3k05M5J35J56j4l63L41J33l68j8J75m5J33r2J01L6j77J02k84J67N8j44
8005a46L04p0l2j48P7J18m15K75K3j03K8J03m0M4J05o03K45K07J14j74r0j8J94
8028brj0L0K90j55l76K90k91N08k71j37L18j94j35J12KJ12q2n0M3m0RJ62r3p0
8053c9q1K48k41K39l13L80K5k93K19M4j34q3l9J03j71L16k79K57j63J22n8j37
8075g8K56k0rL7j88M1j07O2Ln4J20j29j4J01N3Q8l72M58k82L0L4j29M8K8J1j71
8101a83K32j28P4o8Q5k47K70j02j51j62O86j78k38J35L1j33J26n5m3K1j80K61
$$ plain form
8123 53 -107 -181 -96 -315 223 -37 -25 -113 -36 -164 -155 136 -337 78 -127 -295 -116 0 5 -164 -120 -51 -128 -190 -68
8148 -68 -297 156 -264 140 -60 111 65 -11 -100 154 -138 73 -156 223 177 -49 -167 13 97 -26 -20 149 -121
8171 -121 44 230 35 174 129 57 -9 -29 0 73 58 -147 29 238 -182 12 -273 -20 123 184
$$ packed form
8123E3j60p4Q5k19N38k60J2q8P7j28RK91m73M15k05j68J79J16Nj69M4O9p7o2J22
8148f8k29M53m20M04k00J71m6p6q9K54k92K11k29L79m6k26j18J80Q4j23OJ69k70
8171a21J65J86j95J39m5p2o6k0K9P3j5k05J76K09m20J94k85K53J43O1
8191A84
$$ Imaginary data points
##PAGE= N=2
##DATA TABLE= (X++(I..I)), XYDATA
$$ plain form
0 0 0 0 0 0 0 0 0 0 0 0 0 0 0 0 0 0 0 0 0 0 0 0 0 0 0 0 0 0 0 0 0 0 1 -4 5 -8 13 -18 22 -24 29 -31 38 -41 48 -54 57 -67
48 -67 79 -89 100 -118 136 -167 204 -263 360 -536 924 -2125 7451 89117 59748 -16364 -38630
65 -38630 -7957 11339 -3292 -575 29368 30776 -5254 -28683 -8484 26895 29439 7409 1402
78 1402 6676 4312 -3148 -1330 13923 22651 8544 -8184 -8332 5716 21505 23014 15865 11433
92 11433 5622 -2486 -4681 947 15267 23803 15072 583 -5990 1128 16209 20717 9902 -1994
106 -1994 -6238 -1979 5109 10497 17335 18289 6094 -7139 -5202 8777 16681 7872 -2313 -1117
120 -1117 1300 -1615 -790 6894 11250 1975 -7174 -825 5705 -2137 -10713 -3570 8053 2743 -13538
135 -13538 -13924 1502 7219 -1541 -7562 -3524 -3240 -13089 -15991 -2426 9580 3893 -8923 -12935
$$ packed form
0@%%%%%%%%%%%%%%%%%%%%%%%%%%%%%%%%JnRj3K1l1M0m6N3o0O9p9Q9j02J11j24
48f7J46j68J89k18K54l03L71m67O23q96J460l049R576Q1666k9369p6112k2266
65c8630L0673J9296j4631K717K9943J408l6030k3429K0199L5379K544k2030o007
78A402N274k364p460J818J5253Q728j4107j6728j48J4048J5789J509p149m432
92A1433n811q108k195N628J4320Q536q731j4489o573P118J5081M508j0815j1896
106a994m244M259P088N388O838R54j2195j3233J937J3979P904q809j0185J196
120a117K417k915Q25P684M356r275r149O349O530p842q576P143J1623n310j6281
135a3538l86J5426N717q760o021M038K84r849k902J3565J2006n687j2816m012
$$ plain form
149 -12935 -8175 -6100 -8460 -6241 -1627 -3919 -11297 -13937 -7338 -2554 -6043 -10619 -8462 -3766 -3888
164 -3888 -7449 -8015 -6463 -6791 -8808 -6184 -2648 -4817 -9859 -8776 -2284 -1048 -7936 -11014 -5730 -1596
180 -1596 -5058 -7832 -3238 2422 -781 -8027 -7185 -1060 100 -4606 -4610 1158 3870 175 -2440 48
196 48 1525 354 1231 4041 4456 1498 18 2380 4075 2895 3540 5545 4327 1211 1874 7385 8946
213 8946 3081 323 5348 9988 7598 2762 4557 9370 6955 1522 3656 11231 12609 4701 -1729
228 -1729 2738 9590 8979 5428 6382 9272 6046 352 2206 10845 12784 5528 -286 1973 6351 6104
244 6104 6215 8925 9347 2976 -2581 -313 6030 7712 3814 1996 2501 390 -2299 216 5393 5143
260 5143 -858 -4266 -2144 -819 -1584 -1159 1886 1819 -2959 -6416 -3861 304 -1397 -4604 -4546 -3142 -3669
$$ packed form
149a2935M760K075k360K219M614k292p378k640O599M784l489m576K157M696j22
164c888l561n66J552l28k017K624L536k169n042J083O492J236o888l078N284M134
180a596l462k774M594N660l203p246Q42O125J160m706mN768K712l695k615K488
196D8J477j171Q77K810M15k958j480K362J695j180O45K005j218l116O63N511J561
213H946n865k758N025M640k390m836J795M813k415n433K134P575J378p908o430
228a729M467O852o11l551R54K890l226n694J854Q639J939p256n814K259M378k47
244F104J11K710M22o371n557K268O343J682l898j818N05k111k689K515N177k50
260E143o001l408K122J325p65M25L045o7m778l457K555M165j701l207N8J404n27
$$ plain form
277 -3669 -5660 -3658 -838 -3064 -7670 -8610 -4806 -2120 -3278 -5153 -4798 -5764 -7865 -6905 -2682 -1335
293 -1335 -4909 -9231 -8547 -5874 -4998 -4948 -3281 -2706 -5705 -9923 -8692 -3046 -2454 -5733 -7489 -5139 -4566
310 -4566 -6871 -6853 -2176 -29 -3641 -7279 -5136 -750 -1683 -4974 -3122 1457 1355 -3679 -5014 -727
326 -727 1996 -229 -1759 795 2268 -812 -3112 128 4540 4061 1425 1698 3420 3009 1189 2395
342 2395 4842 4726 1805 1661 4817 6026 4101 3023 4962 6070 4551 3752 5651 6899 3926 2375
358 2375 4597 7931 7109 4120 4663 6609 5941 3121 3580 7428 8335 5319 3448 5834 6664 4550 3790
375 3790 6208 7832 5030 1118 1414 4198 4130 2986 3567 4759 2796 -1080 -580 3366 4969 2626
391 2626 216 311 651 -1314 -1294 2170 3363 -278 -4546 -3596 -220 453 -1600 -1784 -1005 -2286 -5274
$$ packed form
277c669j991K002K820k226m606r40L804K686j158j875L55r66k101R60M223J347
293a335l574m322O84K673Q76N0J667N75k999m218J231N646N92l279j756K350N73
310d566k305J8M677K147l612l638K143M386r33l291J852M579j02n034j335M287
326g27K723k225j530K554J473l080k300L240M412m79k636K73J722m11j820J206
342B395K447j16k921j44L156J209j925j078J939J108j519p99J899J248k973j551
358B375K222L334q22k989N43J946o68k820M59L848R07l016j871K386Q30k114p60
375C790K418J624k802l912K96K784o8j144N81J192j963l876N00L946J603k343
391B626k410R5L40j965K0L464J193l641m268R50L376O73k053j84P79j281k988
$$ plain form
408 -5274 -5001 -1720 -702 -3467 -4982 -3036 -2464 -4813 -6595 -4839 -2609 -3444 -5574 -4788 -3016 -4369
424 -4369 -6358 -5552 -2707 -3355 -6583 -7563 -5083 -3540 -5234 -6733 -5059 -4090 -5598 -6580 -4710 -3238
440 -3238 -5076 -5946 -4289 -1726 -2618 -4722 -5221 -3519 -2777 -3032 -2166 -935 -1763 -4421 -4553 -2005 -75
457 -75 -1311 -2039 -755 448 -273 -1265 -86 1090 139 -538 1304 3836 2519 -666 -617 2040 4078
474 4078 3151 2830 3420 3093 605 418 4230 6668 4704 1476 2005 4402 4591 4003 5062 6156 4473
491 4473 1750 2615 5637 7016 5046 4243 5899 6591 4230 2712 4486 6122 5237 4188 4833 5630 3790
508 3790 2082 3219 5507 5872 3390 2028 3181 3395 2561 2709 4001 3813 1027 -20 1694 3157
524 3157 2082 922 1263 1884 81 -1550 -838 910 565 -1107 -900 190 -429 -2551 -2760 -701 -499
$$ packed form
408e274K73L281J018k765j515J946N72k349j782J756K230q35k130P86J772j353
424d369j989Q06K845o48l228r80K480J543j694j499J674R69j508r82J870J472
440c238j838q70J657K563q92k104m99J702P42k55Q66J231q28k658j32K548J930
457g5j236p28J284J203p21r92J179J176r51o77J842K532j317l185M9K657K038
474D078r27l21N90l27k488j87L812K438j964l228N29K397J89n88J059J094j683
491D473k723Q65L022J379j970q03J656O92k361j518J774J636q85j049O45P97j840
508C790j708J137K288L65k482j362J153K14q34J48J292j88k786j047J714J463
524C157j075j160L41O21j803j631P12J748l45j672K07J090o19k122k09K059K02
$$ plain form
541 -499 -2655 -4036 -2411 -1348 -2421 -4234 -3082 -1549 -2640 -4595 -3685 -1889 -2676 -5805 -6776 -4397
557 -4397 -2818 -4041 -4506 -3377 -3885 -6033 -6657 -4174 -2411 -3586 -6154 -6392 -4688 -4287 -4170 -2577 -1602
574 -1602 -3689 -6116 -6019 -3493 -2757 -3509 -3541 -2609 -2967 -4382 -4189 -1748 -509 -1946 -3072 -1722 -528
591 -528 -1838 -2992 -1056 993 473 -1171 -555 1285 1271 -584 -329 1791 1997 172 -629 1558 3672
608 3672 2797 258 1444 3367 3535 2278 2306 3090 3116 1838 3045 5480 5931 3474 1737 3069 4715
625 4715 4918 4735 5112 4666 2605 2160 4425 6853 5873 3445 2716 3463 3661 3456 4807 5904 4573 1845
643 1845 1858 3999 5275 3242 2236 3185 3924 2316 1435 2370 3745 2239 49 587 2507 2408 558
660 558 -81 726 911 -336 -265 1575 1252 -761 -2178 -1596 -612 -1364 -1508 -109 464 -1808 -3878 -2763
$$ packed form
541d99k156j381J625J063j073j813J152J533j091j955R10J796p87l129r71K379
557d397J579j223m65J129n08k148o24K483J763j175k568k38J704M01J17J593R75
574a602k087k427R7K526P36p52l2R32l58j415J93K441J239j437j126J350J194
591e28j310j154J936K049n20j644O16J840j4j855K55K120K06j825q01K187K114
608C672q75k539J186J923J68j257K8P84K6j278J207K435M51k457j737J332J646
625D715K03j83L77m46k061m45K265K428r80k428p29P47J98k05J351J097j331k728
643A845J3K141J276k033j006R49P39j608q81R35J375j506k190N38J920r9j850
660E58o39Q07J85j247P1J840l23k013j417N82R84p52j44J399N73k272k070J115
$$ plain form
678 -2763 -900 -1397 -3105 -3402 -1950 -2724 -4474 -4203 -1827 -1161 -3593 -5722 -4902 -3342 -3292 -4102 -3821 -2920
696 -2920 -4015 -5863 -5274 -3520 -2627 -3247 -3849 -3746 -4236 -5022 -5032 -3407 -2638 -3287 -3397 -3492 -3798 -4272 -4008
715 -4008 -2266 -1433 -2691 -3469 -2732 -1562 -2034 -2438 -1415 213 -669 -2952 -2207 144 1231 -680 -1929
732 -1929 -232 1553 787 -476 -146 1241 860 -52 1010 2858 3135 1017 264 1804 2946 2915 3078
749 3078 3745 3293 1973 1589 2988 4521 4493 3740 3789 3237 2872 3084 4226 5225 4067 2654 3261 4490
767 4490 4470 3456 3626 4756 4341 2694 2689 3930 4638 3424 2975 3650 3600 2623 2177 3072 3562 2470 1316
786 1316 1389 2679 2422 1452 1608 1719 882 19 542 2544 2485 55 -1601 -728 770 619 -432 -105 123
805 123 -1544 -3032 -2289 385 768 -1800 -3881 -3343 -1938 -2119 -2067 -1646 -1831 -3547 -4661 -3650 -2008
$$ packed form
678b763J863m97j708k97J452p74j750K71K376O66k432k129Q20J560N0q10K81R01
696b920j095j848N89J754Q93o20o02J03m90p86j0J625P69o49j10r5l06m74K64
715d008J742Q33j258p78P37J170m72m04J023J628q82k283P45K351J087j911j249
732a929J697J785p66j263L30J387l81r12J062J848K77k118p53J540J142l1J63
749C078O67m52j320l84J399J533k8p53M9n52l65K12J142R99j158j413O07J229
767D490k0j014J70J130m15j647nJ241P08j214m49O75n0r77m46Q95M90j092j154
786A316P3J290k57r70J56J11q37q63N23K002n9k430j656Q73J498j51j051L27K28
805A23j667j488P43K674L83k568k081N38J405j81N2M21j85j716j114J011J642
$$ plain form
822 -2008 -1915 -2974 -3383 -3507 -4315 -4724 -3558 -2413 -2485 -3517 -3683 -3508 -4354 -4870 -3812 -1999 -2858 -4847
840 -4847 -5069 -3056 -1945 -3102 -3797 -2702 -1897 -3288 -4165 -2737 -900 -1623 -3915 -3694 -1462 -333 -1201
857 -1201 -2328 -1455 -995 -1733 -1977 -598 432 189 -1106 -1039 -45 680 504 456 665 1029 500 463 1388 1878
877 1878 1771 1718 2587 2585 1665 1211 2466 3353 2903 2303 2766 3415 2658 1992 3454 4990 4182 2483 2329 3298
897 3298 3875 3064 3401 4512 4568 2949 2394 3554 4451 3539 2977 3536 3915 2746 1981 2168 3927 3829 2282
916 2282 1731 2071 2437 1876 1671 2643 2811 1644 910 1123 2108 1640 867 934 979 408 56 -30 508 229 -259
937 -259 -630 -109 38 -1081 -1820 -1486 -1221 -1501 -1958 -1589 -1355 -1884 -2684 -2450 -1529 -2441 -3368 -3099 -2368 -2600
957 -2600 -3617 -3649 -2919 -2648 -3590 -4006 -2562 -2404 -3868 -4952 -3504 -2249 -2587 -3683 -3520 -2806 -3237 -3874
$$ packed form
822b008R3j059m09j24q08m09J166J145p2j032j66J75q46n16J058J813q59j989
840d847k22K013J111j157o95J095Q05j391q77J428J837p23k292K21K232J129q68
857a201j127Q73M60p38k44J379J030k43j295O7R94P25j76m8K09L64n29l7R25M90
877A878j07n3Q69kr20m54J255Q87m50o00M63O49p57o66J462J536q08j699j54R69
897C298N77q11L37J111N6j619n55J160Q97r12n62N59L79j169p65J87J759r8j547
916B282n51L40L66n61k05R72J68j167p34K13R85m68p73O7M5n71l52q6N38k79m88
937b59l71N21J47j119p39L34K65k80m57L69K34n29q00K34R21r12r27K69P31k32
957b600j017l2P30K71r42m16J444J58j464j084J448J255l38j096J63P14m31o37
$$ plain form
975 -3874 -3039 -2017 -2416 -3176 -3526 -2800 -2725 -2978 -2283 -1337 -1377 -2494 -2933 -2228 -1449 -1477 -1426 -1284 -1086 -1752 -2114
996 -2114 -1049 251 471 -392 -832 -841 -121 300 849 1335 1483 501 141 1044 1851 1584 1399 1339 1914 1769
1016 1769 1510 2276 2698 2729 1746 2400 3166 3223 2486 2285 3318 3503 2605 2432 3305 3766 3325 2428 3033 3592
1036 3592 3149 2458 3289 3953 3669 1985 1745 3060 3443 3416 3159 3022 2332 1261 1752 2920 3851 2720
1054 2720 1548 1170 1395 1677 1851 2236 1977 1198 231 208 803 1114 647 16 518 1 -658 -744 -101 160
1074 160 -492 -1291 -1184 -831 -1726 -1909 -1259 -441 -1084 -2195 -2562 -2121 -2064 -2446 -2322 -1722 -2203 -3164 -3856 -2774
1094 -2774 -2029 -2500 -3443 -3024 -2683 -3250 -3615 -2787 -2163 -2736 -4019 -3658 -2293 -2509 -2816 -2896 -2114 -2713 -3506
1113 -3506 -3267 -2059 -1341 -2232 -2953 -2715 -2039 -2323 -2092 -1291 -819 -1511 -2711 -2382 -1203 -176 -326 -543
$$ packed form
975c874Q35J022l99p60l50P26P5k53O95R46m0j117m39P05P79k8N1J42J98o66l62
996b114J065J300K20q63m40rP20M21N49M86J48r82l60R03Q07k67j85o0N75j45
1016A769k59P66M22L1r83O54P66N7p37k01J033J85q98j73Q73M61m41q97O05N59
1036C592m43o91Q31O64k84j684k40J315L83k7k57j37o90j071M91J168R31j131
1054B720j172l78K25K82J74L85k59p79r67k3N95L11m67o31N02n17o59q6O43K61
1074A60o52p99J07L53q95j83O50Q18o43j111l67M41N7l82J24O00m81r61o92J082
1094b774P45m71r43M19L41n67l65Q28O24n73j283L61J365k16l07q0P82n99p93
1113c506K39J208P18q91p21K38O76k84K31Q01M72o92j200L29J179J027j50k17
$$ plain form
1131 -543 -336 -906 -1468 -908 800 1575 704 -529 -577 108 408 1114 1667 2258 1073 -185 311 2004 2280
1150 2280 2105 1474 2057 2237 1609 1785 2876 3546 2535 1864 2499 3055 2755 2247 2831 3627 3257 1955 1962
1169 1962 2865 3420 2874 2643 3288 3125 1942 1961 3300 3610 2848 1948 2241 2301 2180 2299 2540 2867 1979 887
1189 887 1259 2163 2290 1682 1089 916 931 643 906 1257 1099 110 -613 -325 410 227 -328 -328 -318 -920 -1590
1210 -1590 -1003 -101 -294 -1424 -1543 -1547 -1600 -2150 -2234 -1365 -1183 -1902 -2970 -2586 -1992 -1962 -2387 -2131 -2081 -2635 -3570
1231 -3570 -3193 -2500 -1872 -2854 -3109 -2786 -2425 -2872 -2983 -2533 -2443 -2792 -3319 -2835 -1885 -2372 -3017 -2613 -2206 -2119
1251 -2119 -2441 -2580 -1842 -2034 -2207 -1790 -1312 -1048 -1589 -1459 -1190 -977 -1438 -1200 -480 29 -615 -582 -265 -197
1271 -197 -141 -114 434 1383 810 -247 -74 1160 1750 1475 1137 1243 1491 1181 1183 2292 2319 2097 1091 1513
$$ packed form
1131e43K07n70n62N60J708P75q71j233m8O85L00P06N53N91j185j258M96J693K76
1150B280j75o31N83J80o28J76J091O70j011o71O35N56l00n08N84P96l70j302P
1169A962R03N55n46k31O45j63j183J9J339L10p62r00K93O0j21J19K41L27q88j092
1189H87L72R04J27o08n93j73J5k88K63L51j58r89p23K88P35j83n55%J0o02o70
1210a590N87R02j93j130j19mn3n50q4Q69J82p19j068L84N94L0m25K56N0n54r35
1231c570L77O93O28r82k55L23L61m47j11M50R0l49n27M84R50m87o45M04M07Q7
1251b119l22j39P38j92j73M17M78K64n41J30K69K13m61K38P20N09o44L3L17O8
1271a97N6K7N48R49n73j057J73J234N90k75l38J06K48l10KJ109K7k22j006M22
$$ plain form
1291 1513 2365 2864 2523 2056 2309 2252 2218 2745 3128 3062 2326 1915 2366 2920 3147 2893 2755 2593 2042 2236 2715
1312 2715 2948 3026 2027 1960 2229 1972 1931 2393 2676 2037 1129 846 1480 2105 1602 1524 1916 1307 392 -48 1029
1333 1029 1695 1176 223 -183 -45 -107 -362 266 619 -103 -1108 -1584 -1030 -569 -908 -1027 -1114 -1178 -1864 -1922 -1623
1354 -1623 -1042 -1604 -2167 -2096 -2043 -1993 -2352 -2251 -1978 -2063 -2567 -2759 -2437 -2420 -2582 -2546 -2241 -2241 -2801 -2847 -2195 -1935 -2487
1377 -2487 -2927 -2689 -2407 -2485 -2671 -2128 -1643 -2157 -2746 -2617 -1661 -944 -1698 -2142 -1689 -1287 -1698 -1426 -677 -368
1397 -368 -1121 -1668 -1182 -125 27 -302 -452 232 -84 -613 -411 233 928 714 534 726 912 740 734 1496
1417 1496 1880 1327 1240 1399 1355 1574 1861 2048 2096 1989 1417 1799 2238 2798 2325 2158 2453 2602 2038 2294 2707
1438 2707 2862 2183 1790 2208 2825 2586 2147 2220 2436 2353 1799 1729 2493 2261 1923 1498 1887 2268 1903 1572 1731
$$ packed form
1291A513Q52M99l41m67K53n7l4N27L83o6p36m11M51N54K27k54j38j62n51J94M79
1312B715K33P8r99o7K69k57m1M62K83o39r08k83O34O25n03p8L92o09r15m40J077
1333A029O66n19r53m06J38o2k55O28L53p22j005m76N54M61l39j19q7o4o86n8K99
1354a623N81n62n63P1N3N0l59J01K73q5n04j92L22J7j62L6L05%n60m6O52K60n52
1377b487m40K38K82p8j86N43M85n14n89J29R56P17p54m44M53M02m11K72P49L09
1397c68p53n47M86J057J52l29j50O84l16n29K02O44O95k14j80J92J86j72oP62
1417A496L84n53q7J59m4K19K87J87M8j07n72L82M39N60m73j67K95J49n64K56M13
1438B707J55o79l93M18O17k39m39P3K16q3n54p0P64k32l38m25L89L81l65l31J59
$$ plain form
1459 1731 1907 1233 411 662 1527 1331 932 685 714 457 -197 226 624 742 -266 -963 -305 -527 -199 16
1479 16 -396 -632 -1224 -1456 -1093 -483 -614 -1228 -1785 -1952 -1652 -1924 -1695 -1393 -1575 -2180 -2375 -2338 -1875 -1988 -2279
1500 -2279 -2059 -2064 -2317 -3087 -2685 -1944 -1932 -2316 -2355 -2268 -2389 -2595 -2374 -1907 -1969 -2272 -2473 -2342 -1706 -1586 -1730 -1720
1522 -1720 -1580 -1945 -2196 -1279 -727 -903 -1536 -1622 -1030 -760 -631 -532 -354 -535 -1125 -870 -242 74 406 187
1542 187 477 230 -164 -97 766 1265 1060 672 785 992 1243 1234 1569 2025 1907 806 1104 1634 2079 2299 2087
1563 2087 1930 1824 1675 1782 2567 2961 2870 2073 1787 2126 2201 2440 2303 2571 2054 1990 1730 2550 2912 2222 1753
1584 1753 1677 1879 1945 1751 2043 2201 1837 1587 1407 1878 1756 1067 846 938 758 406 575 1123 935 378 -62
1605 -62 216 484 124 -6 366 -100 -639 -1264 -873 -255 -475 -580 -977 -971 -1654 -1652 -1152 -836 -844 -1751 -2148 -1817
$$ packed form
1459A731J76o74q22K51Q65j96l99k47K9k57o54M23L98J18j008o97O58k22L28K15
1479A6m12k36n92k32L63O10j31o14n57j67L00k72K29L02j82o05j95L7M63j13k91
1500b279K20nk53p70M02P41J2l84l9Q7j21k06K21M67o2l03k01J31O36J20j44J0
1522a720J40l65k51R17N52j76o33q6N92K70J29R9J78j81n90K55O28L16L32k19
1542A87K90k47l94O7Q63M99k05l88J13K07K51rL35M56j18j101K98N30M45K20k12
1563B087j57j06j49J07P85L94r1p97k86L39P5K39j37K68n17o4k60Q20L62o90m69
1584A753p6K02O6j94K92J58l64k50j80M71j22o89k21R2j80l52J69N48j88n57m40
1605f2K78K68l60j30L72m66n39o25L91O18k20j05l97Oo83KN00L16qr07l97L31
$$ plain form
1627 -1817 -1625 -1625 -1857 -1930 -1825 -2157 -2336 -2065 -1758 -1833 -2445 -2515 -2240 -2114 -2244 -2070 -1832 -1903 -2399 -2402 -2068 -1771
1649 -1771 -1858 -2177 -2069 -1851 -2076 -1826 -1544 -1012 -1163 -2123 -2398 -1577 -995 -989 -950 -696 -1066 -1414 -1085 -306 352
1670 352 -391 -813 -945 -179 -119 127 503 560 287 -426 1 764 1153 1076 831 941 726 759 867 1658 1984
1691 1984 1597 1261 1365 1831 1615 1671 1985 2365 1852 1447 1677 2157 2440 1765 1885 2033 2005 1745 1955 2337
1711 2337 2473 2177 1602 1499 2136 2104 2004 2173 1987 1601 1064 1401 1847 2178 1820 1118 1137 1195 973 995 1312
1732 1312 1339 547 133 12 669 804 385 419 84 -226 -639 -208 603 536 -236 -560 -1028 -979 -798 -667 -661 -726
1754 -726 -1340 -1745 -1323 -795 -1129 -1398 -1626 -1866 -2048 -1914 -1725 -1241 -1583 -2144 -2241 -1946 -1928 -1553 -1897 -1675 -1962
1775 -1962 -2290 -2425 -1975 -1731 -1906 -2036 -2177 -1873 -1808 -1894 -1684 -1423 -1616 -2030 -2171 -1805 -1227 -1283 -1442 -1369 -1504
$$ packed form
1627a817J92%k32p3J05l32j79K71L07p5o12p0K75J26j30J74K38p1m96lL34K97
1649a771q7l19J08K18k25K50K82N32j51r60k75Q21N82OL9K54l70l48L29P79O58
1670C52p43m22j32P66O0K46L76N7k73p13M27P63L89p7k45J10k15L3J08P91L26
1691A984l87l36J04M66k16N6L14L80n13m05K30M80K83o75J20J48k8k60K10L82
1711B337J36k96n75j03O37l2j00J69j86l86n37L37M46L31l58p02J9N8k22K2L17
1732A312K7p92m14j21O57J35m19L4l35l10m13M31Q11o7p72l24m68M9J81J31Oo5
1754g26o14m05M22N28l34k69k28k40j82J34J89M84l42n61r7K95J8L75l44K22k87
1775a962l28j35M50K44j75j30j41L04O5q6K10K61j93m14j41L66N78n6j59P3j35
$$ plain form
1796 -1504 -1376 -1050 -756 -556 -596 -977 -852 -669 -811 -534 -309 -20 -231 -436 -409 77 539 535 326 675 522
1817 522 399 354 1019 1219 1027 946 866 1086 1299 1317 1602 1915 1401 1181 971 1784 1699 1752 1639 1804 1790 1920
1839 1920 1782 2111 2193 1971 1793 1687 1906 2018 1979 1780 2050 1796 1549 1606 1728 2041 1612 1431 1442 1316 1340
1860 1340 1253 1344 1377 1065 985 911 1047 826 584 665 623 912 242 -33 737 354 -34 130 362 -45 -642 -529
1882 -529 -221 -406 -504 -863 -737 -780 -806 -973 -854 -698 -1003 -1616 -1772 -1365 -1302 -1549 -1569 -1565 -1582 -1673 -1929 -1607 -1602 -1591
1906 -1591 -1962 -1809 -1781 -1924 -1716 -1867 -1485 -1779 -2093 -1640 -1851 -1795 -1825 -1678 -1491 -1398 -1827 -1615 -1393 -1081 -1389
1927 -1389 -1419 -1543 -1225 -1220 -1264 -958 -702 -507 -832 -1075 -552 -325 -566 -503 -85 5 -324 -333 230 486 292 196 291
1950 291 798 401 442 898 908 953 694 620 1115 1276 1271 1311 1164 1368 1308 1328 1635 2065 1739 1489 1426 1703 1597
$$ packed form
1796a504J28L26K94K00m0l81J25J83j42K77K25K89k11k05K7M86M62mk09L49j53
1817E22j23m5O65K00j92q1q0K20K13J8K85L13n14k20k10Q13q5N3j13J65j4J30
1839A920j38L29Q2k22j78j06K19J12l9j99K70k54k47N7J22L13m29j81J1j26K4
1860A340q7R1L3l12q0p4J36k21k42Q1m2K89o70k75P70l83l88J64K32m07n97J13
1882e29L08j85r8l59J26m3k6j67J19J56l05o13j56M07O3k47k0Mj7r1k56L22NJ1
1906a591l71J53K8j43K08j51L82k94l14M53k11N6l0J47J87R3m29K12K22L12l08
1927a389l0j24L18Nm4L06K56J95l25k43N23K27k41O3M18R0l29rN63K56j94r6R5
1950B91N07l97M1M56J0M5k59p4M95J61nM0j47K04o0K0L07M30l26k50o3K77j06
$$ plain form
1973 1597 1823 2045 1961 1733 1361 1259 1702 1874 1843 1781 1645 1935 1409 1580 1863 1969 1706 1195 1493 1312 1353
1994 1353 1290 1381 1418 1337 846 673 736 1140 1000 818 760 532 416 9 696 476 341 35 -27 64 -143 -182 -209
2017 -209 -369 -476 -695 -750 -334 -363 -837 -1029 -834 -1087 -1175 -1236 -1030 -1124 -1282 -1438 -1306 -1357 -1399 -1501 -1527 -1289 -1929
2040 -1929 -1627 -1798 -1516 -1491 -1339 -1769 -1491 -1795 -1729 -1685 -1387 -1416 -1668 -1842 -1627 -1322 -1512 -1464 -1611 -1268 -1567
2061 -1567 -1308 -1287 -644 -815 -1378 -1275 -872 -759 -793 -818 -341 -386 -499 -584 -520 -182 -96 -227 -171 -41 33 -17 276
2084 276 384 444 708 479 847 764 780 849 1110 1046 880 863 1106 1628 1556 1288 1195 1466 1530 1581 1754 1551 1551 1224
2108 1224 1345 1431 1835 1658 1804 1826 1547 1412 1476 1774 1839 1737 1374 1446 1432 1560 1421 1424 1407 1170 1182 906 1257
2131 1257 1371 984 911 934 930 686 540 787 697 358 199 301 404 245 71 215 99 -127 -336 -418 -118 109
$$ packed form
1973A597K26K22q4k28l72j02M43J72l1o2j36K90n26J71K83J06k63n11K98j81M1
1994A353o3R1L7q1m91j73O3M04j40j82n8k28j16m07O87k20j35l06o2R1k07l9k7
2017b09j60j07k19n5M16k9m74j92J95k53q8o1K06r4j58j56J32n1m2j02k6K38o40
2040a929L02j71K82K5J52m30K78l04O6M4K98k9k52j74K15L05j90M8j47L43k99
2061a567K59K1O43j71n63J03M03J13l4k5M77m5j13q5O4L38Q6j31N6J30P4n0K93
2084B76J08O0K64k29L68q3J6O9K61o4j66j7K43N22p2k68r3K71O4N1J73k03%l27
2108A224J21Q6M04j77J46K2k79j35O4K98O5j02l63P2j4J28j39Lj7k37J2k76L51
2131A257J14l87p3K3mk44j46K47r0l39j59J02J03j59j74J44j16k26k09q2L00K27
$$ plain form
2153 109 -662 -875 -605 -530 -567 -826 -781 -775 -1010 -1239 -974 -943 -1028 -1227 -1228 -1231 -1128 -1323 -1292 -1034 -1424 -1567 -1622 -1594 -1473
2178 -1473 -1753 -1443 -1452 -1182 -1279 -1617 -1777 -1410 -1326 -1468 -1302 -1535 -1284 -1761 -1278 -793 -816 -1511 -1563 -1423 -1027 -856
2200 -856 -923 -1099 -948 -775 -657 -601 -410 -613 -639 -392 -233 -142 -97 -121 -74 300 -82 -179 242 510 464 454 453 635
2224 635 392 512 969 995 1306 690 949 1101 1220 1056 1360 1180 1239 1050 1177 1579 1574 1520 1285 1108 1361 1536
2246 1536 1487 1437 1777 1452 1235 1119 1647 1594 1649 1180 1281 1257 1187 951 1189 1441 1065 869 999 1206 953 985
2268 985 971 1100 491 580 524 601 728 429 299 365 452 139 10 343 147 -218 -391 -388 -210 -258 -475 -465 -549 -756
2292 -756 -847 -631 -321 -590 -867 -1304 -1325 -1090 -1387 -1173 -934 -1118 -1257 -1593 -1663 -1424 -1144 -1409 -1446 -1517 -1367 -1521
2314 -1521 -1330 -1090 -1125 -1440 -1773 -1763 -1320 -1607 -1198 -1173 -1140 -1320 -1590 -1266 -751 -985 -1230 -1195 -1021 -1039 -1036 -623
$$ packed form
2153A09p71k13K70P5l7k59M5Ok35k29K65L1q5j99jlJ03j95L1K58l90j43n5K8J21
2178a473k80L10rK70r7l38j60L67Q4j42J66k33K51m77M83M85k3o95n2J40L96J71
2200h56o7j76J51J73J18N6J91k03k6K47J59R1M5k4M7L74l82r7M21K68m6j0jJ82
2224F35k43J20M57K6L11o16K59J52J19j64L04j80N9j89J27M02nn4k35j77K53J75
2246A536m9n0L40l25k17j16N28n3N5m69J01k4p0k36K38K52l76j96J30K07k53L2
2268I85j4J29o09Q9n6P7J27k99j30O6Q7l13j29L33j96l65j73LJ78m8k17J0q4k07
2292g56r1K16L10k69k77m37k1K35k97K14K39j84j39l36p0K39K80k65l7p1J50j54
2314a521J91K40l5l15l33J0M43k87M09K5L3j80k70L24N15k34k45L5J74j8LM13
$$ plain form
2336 -623 -738 -534 -763 -866 -628 -414 -420 -373 -47 -231 -215 -212 -134 425 311 264 139 261 192 230 534 630 673 522
2360 522 667 887 785 994 818 789 944 981 1102 1246 1397 1011 1397 1177 1073 1425 1390 1649 1518 1436 1192
2381 1192 1283 1093 1613 1360 1523 1243 1324 1207 1342 1481 1550 1067 936 942 985 1039 1071 1203 845 832 476 779 917
2404 917 818 377 598 371 666 660 443 423 153 -44 -148 -292 234 187 -27 -142 -330 -266 -562 -61 -358 -478
2426 -478 -877 -943 -436 -405 -860 -810 -570 -889 -995 -1045 -851 -751 -1210 -1046 -1524 -1192 -1147 -1194 -1087 -1218 -1306 -1367 -1475
2449 -1475 -1167 -1180 -1242 -1220 -1367 -1540 -1530 -1470 -1190 -1114 -1242 -1184 -1257 -1218 -1017 -1294 -852 -673 -1064 -756 -757 -814 -633 -699
2473 -699 -866 -566 -423 -422 -576 -260 -216 -189 -248 -164 10 78 140 97 201 70 79 59 405 549 398 558 519 658
2497 658 757 682 877 989 555 737 882 1130 1108 1148 903 1040 1351 981 1089 1410 1140 1210 1082 1351 1235 1281
$$ packed form
2336f23j15K04k29j03K38K14oM7L26j84J6LP8N59j14m7j25J22o9L8L04R6M3j51
2360E22J45K20j02K09j76k9J55L7J21J44J51l86L86k20j04L52l5K59j31q2k44
2381A192R1j90N20k53J63k80Q1j17J35J39O9m83j31OM3N4L2J32l58j3l56L03J38
2404I17r9m41K21k27K95ok17k0k70j97j04j44N26m7k14j15j88O4k96N01k97j20
2426d78l99o6N07L1m55N0K40l19j06n0J94J00m59J64m78L32M5m7J07j31q8o1j08
2449a475L08j3o2K2j47j73J0O0K80P6j28N8p3L9K01k77M42J79l91L08jn7J81o6
2473f99j67L00J43Jj54L16M4K7n9Q4J74O8O2m3J04j31Rk0L46J44j51J60l9J39
2497F58R9p5J95J12m34J82J45K48k2M0k45J37L11l70J08L21k70P0j28K69j16M6
$$ plain form
2519 1281 1380 1027 1414 1073 1116 1269 1395 1505 1003 1160 1121 1231 775 963 1003 931 716 701 694 1023 768 591
2541 591 697 355 559 218 354 421 435 279 67 -72 195 98 36 -64 -87 -365 -91 -668 -355 -328 -699 -784
2563 -784 -566 -862 -860 -537 -714 -720 -922 -1084 -1033 -769 -698 -953 -1324 -1178 -1177 -1332 -1240 -937 -1252 -1457 -1248 -1434 -1236
2586 -1236 -1216 -1115 -1384 -1056 -1321 -1569 -1238 -971 -818 -1147 -1007 -1240 -1040 -859 -694 -793 -922 -805 -884 -739 -666
2607 -666 -588 -537 -772 -430 -637 -412 -116 -202 -378 -223 -191 -18 0 -43 297 246 110 197 424 259 387 415 365
2630 365 631 604 621 603 853 899 634 915 785 755 979 1149 1123 1303 877 836 1040 1100 1228 1035 1232 1010 1327
2653 1327 1139 1353 1166 1219 1060 1094 1262 1065 1110 949 1085 1020 940 1003 1081 927 1029 742 774 779 837 869 421 752
2677 752 475 235 388 521 577 418 227 82 32 45 217 -126 255 -408 -477 -604 -509 -317 -341 -449 -545 -684
$$ packed form
2519A281R9l53L87l41M3J53J26J10n02J57l9J10m56J88M0p2k15j5pL29k55j77
2541E91J06l42K04l41J36O7J4j56k12j39K67r7o2j00k3k78K74n77L13K7l71q5
2563g84K18k96KL23j77ok02j62N1K64P1k55l71J46Jj55R2L03l15k05K09j86J98
2586a236K0J01k69L28k65k48L31K67J53l29J40k33K00J81J65r9j29J17p9J45P3
2607f66P8N1k35L42k07K25K96q6j76J55L2J73J8m3L40n1j36Q7K27j65J28K8n0
2630C65K66k7J7j8K50M6k65K81j30l0K24J70k6J80m26m1K04O0J28j93J97k22L17
2653A327j88K14j87N3j59L4J68j97M5j61J36o5q0O3P8j54J02k87L2NN8L2m48L31
2677G52k77k40J53J33N6j59j91j45n0J3J72l43L81o63o9j27R5J92k4j08r6j39
$$ plain form
2699 -684 -886 -704 -608 -665 -799 -730 -868 -814 -1140 -785 -918 -992 -1185 -1162 -1132 -708 -1143 -882 -1175 -1305 -1155 -1082 -1109
2722 -1109 -894 -1015 -1282 -1182 -1188 -1022 -971 -998 -933 -914 -1091 -960 -866 -876 -936 -774 -675 -522 -555 -795 -448 -337 -423 -525
2746 -525 -627 -289 -318 -6 -125 157 -60 -78 -256 -32 255 356 437 313 352 443 263 431 533 548 591 430
2768 430 887 705 820 789 846 831 343 684 822 1263 916 767 906 958 802 1014 1061 1274 1045 959 787 1083
2790 1083 1170 1254 1363 1038 1083 757 714 955 1245 957 586 926 744 999 693 1033 772 774 403 418 358 739
2812 739 588 513 399 268 294 158 212 293 193 -101 -332 -177 -158 -98 -126 -273 -378 -505 -604 -277 -280 -480 -782
2835 -782 -706 -731 -735 -728 -778 -884 -817 -999 -1047 -881 -729 -1073 -1029 -823 -1081 -1281 -1141 -910 -1151 -877 -957 -1349 -1284 -878
2859 -878 -973 -854 -821 -612 -1201 -840 -954 -664 -1003 -849 -951 -867 -802 -831 -595 -447 -488 -826 -589 -550 -337 -392 -238
$$ packed form
2699f84k02J82R6n7j34O9j38N4l26L55j33p4j93K3L0M24m35K61k93j30J50P3k7
2722a109K15j21k67J00oJ66N1k7O5J9j77J31R4j0o0J62R9J53l3k40L47J11q6j02
2746e25j02L38k9L12j19K82k17j8j78K24K87J01Q1j24L9R1j80J68J02J5M3j61
2768D30M57j82J15l1N7j5m88L41J38M41l47j49J39N2j56K12M7K13k29q6j72K96
2790A083Q7Q4J09l25M5l26m3K41K90k88l71L40j82K55l06L40k61Kl71J5o0L81
2812G39j51p5j14j31K6j36N4Q1j00k94k31J55J9O0k8j47j05j27r9L27lk00l02
2835g82P6k5mPn0j06O7j82m8J66J52l44M4K06k58k00J40K31k41K74q0l92O5M06
2859h78r5J19L3K09n89L61j14K90l39J54j02Q4O5k9K36J48m1l38K37L9K13n5J54
$$ plain form
2882 -238 -123 -221 -195 -140 -146 178 -118 -201 -91 -359 94 291 254 282 357 216 126 488 344 570 796 475 540 572
2906 572 833 815 768 757 881 658 609 774 870 854 930 996 869 839 1015 923 836 979 964 1061 703 1008 1095 795 893
2931 893 1107 1093 775 831 828 845 559 533 318 599 533 582 509 540 534 391 358 495 354 189 223 170 235 154 156 299
2957 299 210 -296 -73 6 -53 -166 -435 -544 -621 -206 -366 -472 -472 -518 -749 -805 -609 -856 -609 -723 -723 -825 -938
2980 -938 -768 -944 -761 -999 -969 -1102 -793 -925 -961 -1012 -940 -782 -920 -1072 -853 -669 -777 -1106 -1059 -846 -821 -659
3002 -659 -1004 -783 -964 -834 -1054 -532 -480 -515 -578 -643 -568 -292 -463 -360 -196 -320 -428 -400 -80 -73 -237 -29 115
3025 115 184 71 26 254 259 305 518 351 560 657 318 506 691 599 745 475 721 591 585 797 696 909 898
3048 898 1006 929 949 858 956 787 678 880 898 963 1036 957 602 1118 890 612 793 551 815 670 824 732 837
$$ packed form
2882b38J15r8K6N5oL24k96q3J10k68M53J97l7K8P5j41r0L62j44K26K26l21O5L2
2906E72K61j8m7j1J24k23m9J65R6j6P6O6j27l0J76r2q7J43j5R7l58L05Q7l00R8
2931H93K14j4l18N6lJ7k86k6k15K81o6M9p3L1oj43l3J37j41j65L4n3O5q1KJ43
2957B99q9n06K23P9n9j13k69j09p7M15j60j06%m6k31n6J96k47K47j14%j02j13
2980i38J70j76J83k38L0j33L09j32l6n1P2J58j38j52K19J84j08l29M7K13K5J62
3002f59l45K21j81J30k20N22N2l5o3o5P5K76j71J03J64j24j08K8L20Pj64K08J44
3025A15O9j13m5K28NM6K13j67K09R7l39J88J85r2J46k70K46j30oK12j01K13j1
3048H98J08p7K0r1R8j69j09K02J8O5P3p9l55N16k28k78J81k42K64j45J54r2J05
$$ plain form
3071 837 905 815 510 631 557 536 755 677 464 608 226 356 496 244 265 222 120 -78 89 -100 -62 -91 -117
3094 -117 62 31 -285 -457 -298 -312 -412 -511 -277 -722 -376 -388 -292 -689 -589 -595 -796 -720 -607 -765 -845 -833 -629
3117 -629 -609 -922 -865 -901 -633 -957 -1116 -1031 -1039 -738 -889 -885 -890 -845 -735 -924 -824 -837 -908 -972 -720 -522 -591 -868 -466
3142 -466 -262 -629 -619 -703 -426 -388 -479 -219 -366 -236 -311 -164 -343 2 -149 -281 164 -21 1 113 -6 106
3164 106 174 237 141 306 270 357 396 595 299 404 427 888 500 605 705 700 776 444 630 522 883 602 657 692
3188 692 970 755 909 836 830 665 592 724 918 850 863 767 802 776 785 628 835 872 607 550 675 560 564 594 579 662
3214 662 532 350 387 330 314 169 336 231 -137 87 89 63 159 -259 -94 -80 -90 -331 -110 -270 -375 -382 -804 -516
3238 -516 -479 -455 -608 -425 -360 -684 -718 -618 -586 -717 -955 -822 -843 -784 -698 -643 -748 -550 -625 -955 -747 -739 -868 -767
$$ packed form
3071H37O8r0l05J21p4k1K19p8k13J44l82J30J40k52K1m3j02j98J67j89L8k9k6
3094a17J79l1l16j72J59j4j00r9K34m45L46j2R6l97J00ok01P6J13j58q0J2K04
3117f29K0l13N7l6K68l24j59Q5qL01j51MnM5J10j89J00j3p1o4K52J98o9k77M02
3142d66K04l67J0q4K77L8r1K60j47J30p5J47j79L45j51j32M45j85K2J12j19J12
3164A06O8O3r6J65l6Q7L9J99k96J05K3M61l88J05J00nP6l32J86j08L61k81N5L5
3188F92K78k15J54p3oj65p3J32J94o8J3r6L5k6Rj57K07L7k65n7J25j15ML0j5Q3
3214F62j30j82L7n7j6j45J67j05l68K24Kk6R6m18J65J4j0k41K21j60j05pm22K88
3238e16L7K4j53J83O5l24l4J00L2j31k38J33k1N9Q6N5j05J98p5l30K08Qj29J01
$$ plain form
3262 -767 -930 -563 -834 -663 -1033 -1108 -353 -865 -744 -827 -670 -539 -613 -653 -505 -597 -675 -317 -436 -607 -357 -477
3284 -477 -79 -381 -188 -285 -197 -281 -198 -160 214 78 -115 -52 96 135 233 172 215 418 318 378 349 591 465 455
3308 455 251 596 710 456 430 629 549 732 874 644 525 742 586 608 775 736 826 696 718 789 768 727 679
3331 679 733 568 812 634 754 758 460 600 622 679 595 697 587 445 512 366 621 381 350 150 160 256 116
3354 116 309 193 0 74 228 238 -158 88 -335 88 -191 -202 -478 -404 -111 -214 -313 -645 -609 -344 -418 -562
3376 -562 -528 -618 -562 -536 -353 -785 -843 -635 -561 -597 -608 -665 -631 -662 -710 -661 -714 -796 -663 -788 -632 -518 -928 -677 -769
3401 -769 -780 -677 -496 -776 -514 -584 -441 -541 -370 -611 -375 -408 -475 -511 -454 -401 -336 -118 -214 -219 -147 -193 -104 92 -189
3426 -189 -169 -63 -203 -134 21 172 -20 204 117 94 173 15 282 327 325 411 430 434 411 457 465 357 398 444 702 539
$$ packed form
3262g67j63L67k71J71l70p5P55n12J21q3J57J31p4m0J48r2p8L58j19j71K50j20
3284d77L98l02J93r7Q8q4Q3L8L74j36j93O3J48L9R8o1M3K03j00O0k9K42j26j0
3308D55k04L45J14k54k6J99q0J83J42k30j19K17j56K2J67l9R0j30K2P1k1m1m8
3331F79N4j65K44j78J20Mk98J40K2N7q4J02j10j42O7j46K55k40l1k00J0R6j40
3354A16J93j16j93P4J54J0l96K46m23M23k79j1k76P4K93j03r9l32L6K65p4j44
3376e62L4r0N6K6J83m32n8K08P4l6j1n7L4l1m8M9n3q2J33j25J56J14m10K51r2
3401g69j1J03J81k80K62p0J43j00J71k41K36l3o7l6N7N3O5K18r6nP2m6Q9J96k81
3426a89K0J06j40O9J55J51j92K24q7k3P9j58K67M5kQ6J9Mk3M6Qj08M1M6K58j63
$$ plain form
3452 539 641 745 572 365 522 768 739 768 799 648 653 718 627 770 640 689 708 682 682 657 600 522 631 450 477
3477 477 578 485 345 609 158 546 382 130 493 272 111 62 39 -69 273 260 158 24 -136 94 -70
3498 -70 -112 54 -174 -181 -247 -31 -359 -517 -499 -292 -518 -574 -392 -517 -251 -334 -541 -577 -422 -656 -530 -479 -615
3521 -615 -803 -713 -728 -638 -694 -630 -684 -522 -550 -664 -718 -635 -670 -795 -589 -890 -572 -598 -774 -580 -695 -606 -640 -477
3545 -477 -296 -423 -438 -489 -398 -532 -288 -347 -291 -478 -195 -133 -371 -203 -121 235 -298 -114 26 82 -141 159 91
3568 91 232 464 120 430 390 243 382 436 406 352 441 652 532 417 472 442 616 474 421 556 889 658 609
3591 609 604 872 508 567 549 529 425 487 753 593 492 311 687 613 716 451 312 509 536 571 502 466 436 322
3615 322 469 587 310 419 185 384 209 213 262 185 33 227 -65 182 114 -40 -130 -48 -105 -129 -108 -137 -233 -127
$$ packed form
3452E39J02J04j73k07J57K46k9K9L1j51NO5r1J43j30M9J9k6%k5n7p8J09j81K7
3477D77J01r3j40K64m51L88j64k52L63k21j61m9k3j08L42j3j02j34j60K30j64
3498g0m2J66k28po6K16l28j58J8K07k26n6J82j25K66q3k07l6J55k34J26N1j36
3521f15j88R0j5R0n6O4n4J62k8j14n4Q3l5j25K06l01L18k6j76J94j15Q9l4J63
3545d77J81j27j5n1R1j34K44n9N6j87K83O2k38J68Q2L56n33J84J40N6k23L00o8
3568I1J41K32l44L10m0j47J39N4l0n4Q9K11j20j15N5l0J74j42n3J35L33k31m9
3591F09nK68l64N9j8k0j04O2K66j60j01j81L76p4J03k65j39J97K7L5o9l6l0j14
3615C22J47J18k77J09k34J99j75MM9p7j52J94k92K47o8j54r0Q2n7k4K1k9r6J06
$$ plain form
3639 -127 -139 -95 -335 -356 -104 -539 -298 -431 -559 -325 -493 -580 -448 -484 -532 -574 -157 -599 -738 -612 -692 -657 -646
3662 -646 -628 -384 -581 -542 -790 -537 -669 -656 -514 -350 -511 -488 -613 -551 -619 -573 -518 -376 -364 -231 -185 -306 -233 -378
3686 -378 -58 -302 -189 -278 -109 -46 -136 -282 0 12 15 -109 -1 115 402 212 181 134 159 309 320 453 435 493
3710 493 67 364 543 108 555 437 259 556 813 549 465 574 550 489 544 433 508 629 708 777 368 577
3732 577 358 743 757 512 632 504 701 314 440 594 648 427 498 437 461 518 415 388 455 352 361 248 190 246
3756 246 494 116 143 258 205 288 257 5 -69 -17 29 251 85 -97 -101 -280 -91 -301 -409 -295 -15 -118 -604
3779 -604 -244 -340 -410 -374 -115 -798 -421 -329 -514 -580 -212 -728 -581 -551 -487 -563 -527 -689 -546 -559 -436 -443 -556 -301
3803 -301 -460 -517 -574 -735 -358 -447 -295 -533 -744 -501 -342 -393 -477 -570 -453 -530 -131 -294 -283 -43 -73 -488 -160
$$ packed form
3639a27j2M4k40k1K52m35K41j33j28K34j68q7J32l6m8m2M17m42j39J26q0L5J1
3662f46J8K44j97L9k48K53j32J3J42J64j61K3j25O2o8M6N5J42J2J33M6j21P3j45
3686c78L20k44J13q9J69O3r0j46K82J2Lj24J08J16K87j90l1m7K5J50J1J33j8N8
3710D93m26K97J79m35M47j18j78K97K57k64q4J09k4o1N5j11P5J21P9O9m09K09
3732E77k19L85J4k45J20j28J97l87J26J54N4k21P1o1K4N7j03k7O7j03Rj13n8N6
3756B46K48l78K7J15n3Q3l1k52p4N2M6K22j66j82mj79J89k10j08J14K80j03m86
3779f04L60r6p0L6K59o83L77R2j85o6L68n16J47L0O4p6L6j62J43j3J23pj13K55
3803c01j59n7n7j61L77q9J52k38k11K43J59n1q4r3J17p7L99j63J1K40l0m15L28
$$ plain form
3826 -160 -115 -239 -78 -61 205 58 319 -144 197 45 124 162 324 -84 120 44 248 305 529 670 290 354
3848 354 440 287 602 360 568 383 249 247 587 583 303 595 268 444 653 556 728 567 570 407 534 660 361
3871 361 580 597 472 501 558 320 437 562 455 325 559 336 263 297 373 311 225 -83 145 56 232 309 115
3894 115 177 -39 -77 -97 12 -119 191 -220 -29 -91 6 -230 -338 -357 -342 -241 -157 -98 -141 -282 -222 -217 -324 -459
3918 -459 -217 -418 -534 -521 -628 -488 -383 -389 -639 -332 -507 -477 -605 -572 -436 -664 -350 -494 -632 -285 -465 -512
3940 -512 -568 -562 -561 -399 -433 -404 -470 -354 -440 -388 -442 -536 -164 -374 -469 -61 -153 -191 -77 -101 70 -183 -46 -168 -309
3965 -309 -32 194 -105 162 305 58 93 100 303 230 259 231 54 138 357 222 255 221 378 121 165 239 379 349
3989 349 457 407 558 279 395 577 443 491 363 669 240 460 422 476 431 614 358 461 670 464 598 364
$$ packed form
3826a60M5j24J61J7K66j47K61m63L41j52P9L8J62m08K04p6K04N7K24J41l80O4
3848C54Q6j53L15k42K08j85j34kL40mk80K92l27J76K09r7J72j61Lj63J27J26k99
3871C61K19J7j25K9N7k38J17J25j07j30K34k23p3L4P6o2q6l08K28q9J76P7j94
3894A15O2k16l8k0J09j31L10m11J91o2R7k36j08j9J5J01Q4N9m3j41O0Nj07j35
3918d59K42k01j16J3j07J40J05ok50L07j75L0j28L3J36k28L14j44j38L47j80m7
3940e12n6OJJ62l4K9o6J16q6N2n4r4L72k10r5M08r2l8J14k4J71k53J37j22j41
3965c09K77K26k99K67J43k47L5PK03p3K9k8j77Q4K19j35L3l4J57k57M4P4J40l0
3989C49J08n0J51k79J16J82j34M8j28L06m29K20l8N4m5J83k56J03K09k06J34k34
$$ plain form
4011 364 304 601 272 147 451 385 412 338 373 281 377 122 170 425 303 77 146 198 -25 130 -28 4 -92 41
4035 41 62 -81 -235 -43 -93 -248 -427 -66 -105 -375 -248 -585 -353 -297 -177 -359 -277 -130 -300 -519 -522 -401 -480
4058 -480 -589 -385 -425 -258 -476 -436 -302 -599 -437 -465 -670 -543 -523 -639 -738 -486 -561 -602 -279 -409 -313 -133 -473
4081 -473 -431 -469 -349 -314 -480 -80 -95 -499 -272 -391 -228 -105 -158 -216 -156 -84 -104 -110 -121 135 -161 -184 11 64 47
4106 47 40 -157 337 190 326 496 233 35 417 334 216 460 349 319 239 164 444 634 468 405 460 324 782
4129 782 449 434 391 328 475 313 288 697 687 428 689 353 369 438 415 415 508 355 359 219 216 350 261 532 518 350
4155 350 209 181 82 195 82 -98 303 18 172 -8 219 -22 -109 -2 101 144 -35 12 -68 99 -29 -321
4177 -321 59 -252 -287 -52 -143 -14 -351 -109 -300 -448 -266 -176 -514 -428 -335 -324 -363 -244 -496 -456 -436 -391 -493
$$ packed form
4011C64o0K97l29j25L04o6K7p4L5r2R6k55M8K55j22k26O9N2k23J55j58L2r6J33
4035D1K1j43j54J92n0j55j79L61l9k70J27l37K32N6J20j82Q2J47j70k19lJ21p9
4058d80j09K04m0J67k18M0J34k97J62k8k05J27K0j16r9K52p5m1L23j30R6J80l40
4081d73M2l8J20L5j66M00j5m04K27j19J63J23n3n8O0P2k0oj1K56k96k3J95N3j7
4106D7pj97M94j47J36J70k63j98L82q3j18K44j11l0q0p5K80J90j66o3N5j36M58
4129G82l33j5m3o3J47j62k5M09j0k59K61l36J6O9k3%R3j53Mj40lJ34q9K71j4j68
4155C50j41k8r9J13j13j80M01k85J54j80K27k41q7J07J03M3j79M7q0J67j28k92
4177c21L80l11l5K35r1J29l37K42j91j48J82R0l38Q6R3J1l9J19k52M0K0M5j02
$$ plain form
4200 -493 -429 -428 -205 -583 -534 -510 -585 -417 -520 -365 -513 -369 -126 -391 -316 -277 -517 -361 -456 -234 -277 175 -398
4223 -398 -130 -193 -213 -306 -285 -217 -265 -178 -18 38 131 -11 -14 -70 -10 -26 -59 203 107 248 87 243 310 453 153 81
4249 81 63 283 108 298 70 414 483 461 308 259 277 478 589 372 222 339 367 344 335 553 271 490 346
4272 346 409 275 392 379 567 584 420 504 221 520 225 188 305 355 186 243 219 9 156 209 163 174 79 337
4296 337 427 422 183 -2 136 -31 -91 195 67 152 -51 -36 -8 -109 -60 -247 -2 -160 -196 -186 -158 -116 -153 -103 -288
4321 -288 -268 -455 -214 -169 -257 -374 -212 -249 -316 -341 -438 -403 -475 -306 -308 -463 -449 -520 -370 -483 -343 -436 -348 -353 -197 -430
4347 -430 -199 -496 -449 -297 -442 -142 -514 -425 -246 -321 -242 -181 -174 -225 -146 -157 -153 157 114 -175 -48 -107 -34 -78 198
4372 198 -7 53 -125 45 -102 32 179 159 303 379 120 160 45 329 110 -87 53 176 301 623 479
$$ packed form
4200d93O4JK23l78M9K4p5J68j03J55j48J44K43k65P5L9k40J56r5K22m3M52n73
4223c98K68o3k0r3K1O8m8Q7J60N6R3j42ln6O0j6l3K62r6J41j61J56O7J43l00p2
4249H1j8K20j75J90k28L44O9k2j53m9J8K01J11k17j50J17K8k3rK18k82K19j44
4272C46O3j34J17j3J88J7j64Q4k83K99k95l7J17N0j69N7k4k10J47N3m6J1r5K58
4296C37R0nk39j85J38j67o0K86j28Q5k03J5K8j01M9j87K45j58l6J0K8M2l7N0j85
4321b88K0j87K41M5q8j17J62l7o7k5r7L5p2J69kj55J4p1J50j13J40r3Q8nJ56k33
4347d30K31k97M7J52j45L00l72Q9J79p5P9O1Pn1P9j1ML10m3k89J27n9P3m4K76
4372A98k05O0j78J70j47J34J47k0J44P6k59M0j15K84k19j97J40J23J25L22j44
$$ plain form
4393 479 132 426 292 317 527 611 222 389 502 407 189 571 337 242 371 370 342 156 544 410 326 197 227
4416 227 204 242 150 210 335 316 152 449 282 323 148 189 247 273 -11 29 27 29 -86 -51 -80 24 -45 -152 151 30
4442 30 -116 69 -55 -215 -13 -202 -57 -42 -181 -259 -130 -217 -121 -403 -282 -395 -497 -349 -494 -378 -165 -359
4464 -359 -422 -408 -416 -479 -354 -326 -193 -345 -421 -441 -394 -345 -367 -272 -335 -236 -50 -185 -430 -465 -193 -566 -407 -410 -281 -233
4490 -233 -135 -195 -132 -413 -468 66 -5 -32 -336 -71 -188 -213 -53 -88 -69 16 69 127 -40 -72 28 177 55 162
4514 162 -15 56 269 54 175 178 12 299 -6 366 424 290 96 8 314 667 236 96 282 307 376 259
4536 259 199 318 224 59 17 366 482 324 385 299 335 93 97 421 369 377 203 215 370 143 272 133 368 186
4560 186 188 134 119 259 316 137 248 103 62 -6 -19 -149 163 -67 55 118 14 -269 -110 -81 1 -124 -167 -324
$$ packed form
4393D79l47K94j34K5K10Q4l89J67J13r5k18L82k34r5J29jk8j86L88j34q4j29L0
4416B27k3L8r2O0J25j9j64K97j67M1j75M1N8K6k84M0kKj15L5k9J04o9j07L03j21
4442C0j46J85j24j60K02j89J45J5j39p8J29q7R6k82J21j13j02J48j45J16K13j94
4464c59o3J4qo3J25K8J33j52p6k0M7M9k2R5o3R9J86j35k45l5K72l73J59lJ29M8
4490b33R8o0O3k81n5N34p1k7l04K65j17k5J60l5J9Q5N3N8j67l2J00J49j22J07
4514A62j77P1K13k15J21Lj66K87l05L72N8j34j94q8L06L53m31j40J86K5O9j17
4536B59o0J19r4j65m2L49J16j58O1q6L6k42ML24n2Qj74J2J55k27J29j39K35j82
4560A86Kn4j5J40N7j79J11j45m1o8j3j30L12k30J22O3j04k83J59K9Q2j25m3j57
$$ plain form
4584 -324 -68 -282 -296 -342 -261 -263 -288 -331 -292 -278 -393 -305 -275 -271 -302 -59 -296 -393 -339 -289 -212 -404 -545 -138 -340 -229
4610 -229 -78 -346 -307 -429 -366 -423 -529 -531 -276 -434 -259 -76 -185 -299 -267 -242 -343 -255 -88 -81 -251 -79 -160 -144
4634 -144 -31 -235 -108 4 69 -170 117 -66 234 214 -48 -41 -12 160 92 205 9 451 159 61 145 313 167
4657 167 229 555 48 86 372 419 31 266 278 272 241 116 311 429 353 287 259 536 373 226 423 88 277
4680 277 362 152 474 160 176 193 404 -41 248 78 71 97 327 272 299 80 -14 261 127 165 247 111 -93 248
4704 248 184 -37 25 -71 36 61 103 -189 -235 115 -195 -107 -75 -139 -281 -191 -189 24 38 -228 -165 -250 -225 -274 -60 -266
4730 -266 -265 -330 -119 -230 -288 -145 -279 -420 -320 -243 -365 -492 -496 -298 -438 -142 -342 -310 -396 -25 -240 -359 -143
4753 -143 -394 -280 -375 -172 -374 -258 -70 -374 -227 -219 33 -54 -255 -217 -118 -235 -47 -247 -162 48 -12 -366 -90
$$ packed form
4584c24K56k14j4m6Q1kk5m3L9J4j15Q8L0Ml1K43k37r7N4N0P7j92j41M07k02J11
4610b29J51k68L9j22O3n7j06kK55j58J75J83j09j14L2K5j01Q8J67Pj70J72q1J6
4634a44J13k04J27J12O5k39K87j83L00k0k62PK9J72o8J13j96M42k92r8Q4J68j46
4657A67O2L26n07L8K86M7l88K35J2ol1j25J95J18p6o6k8K77j63j47J97l35J89
4680B77Q5k10L22l14J6J7K11m45K89j70pK6K30n5K7k19r4K75j34L8Q2j36k04L41
4704B48o4k21O2r6J07K5M2k92m6L50l10Q8L2o4j42R0KK13J4k66O3q5K5m9K14k06
4730b66Jo5K11j11n8J43j34j41J00P7j22j27mJ98j40K96k00L2q6L71k15j19K16
4753a43k51J14r5K03k02J16J88l04J47QK52q7k01L8R9j17J88k00Q5K10o0l54K76
$$ plain form
4776 -90 -150 150 -111 154 185 189 71 90 104 185 -21 -307 17 409 167 256 427 242 69 171 167 128 277 150
4800 150 499 270 222 99 94 240 310 255 334 270 215 442 101 18 278 484 171 286 261 287 366 330 257 329 163
4825 163 142 241 45 292 54 314 177 316 69 252 144 -70 296 288 51 -146 40 -27 -79 76 9 174
4847 174 -70 -237 -21 -19 -155 -86 -134 -27 -38 -178 -263 6 -321 -251 -216 -179 37 -230 -170 -357 -23 -503 -276
4870 -276 -326 -232 -336 -119 -317 -263 -359 -231 -181 -360 -180 -131 -431 -237 54 -346 -422 -164 -250 -172 -186 -421 -150
4893 -150 -144 -271 -190 -319 -98 -84 -165 -173 -226 -156 -141 -109 -138 -128 216 110 -22 -6 -239 46 -59 114 186 149 327
4918 327 -49 -21 -248 117 260 189 366 259 189 168 570 272 236 350 244 260 95 224 477 152 206 129 185
4941 185 180 275 294 333 53 337 405 294 258 181 121 29 20 120 -10 353 445 358 116 280 92 97 293 404 15
$$ packed form
4776i0o0L00k61K65L1Mj18J9J4Q1k06k86L24L92k42Q9J71j85j73J02ml9J49j27
4800A50L49k29m8j23nJ46P0n5P9o4n5K27l41q3K60K06l13J15k5K6P9l6p3P2j66
4825A63k1R9j96K47k38K60j37J39k47J83j08k14L66qk37j97J86o7n2J55o7J65
4847A74k44j67K16Kj36O9m8J07j1j40q5K69l27P0L5L7K16k67O0j87L34m80K27
4870b76n0R4j04K17j98N4r6J28N0j79J80M9l00J94K91m00p6K58q6P8j4k35K71
4893a50Oj27Q1j29K21J4q1qn3P0J5L2k9J0L44j06j32J6k33K85j05J73P2l7J78
4918C27l76K8k27L65J43p1J77j07p0k1M02k98l6J14j06J6j65J29K53l25N4p7N6
4941A85nR5J9L9k80K84O8j11l6p7o0r2rJ00j30L63R2q7k42J64j88NJ96J11l89
$$ plain form
4966 15 -17 -72 116 124 332 290 170 -8 84 131 -32 -34 -211 -33 124 -101 -46 -180 -154 -17 -196 -242 16 37 -135
4991 -135 -227 -48 -363 -398 -257 -340 -55 -76 -306 40 -107 -171 -347 -376 -92 -375 -138 -114 -163 -159 -80 -235 -268 -439
5015 -439 -195 -31 -311 -341 -122 -404 -321 -189 -440 -222 -179 50 -349 -347 -147 -297 -25 34 234 -31 -107 110
5037 110 -177 -54 -134 -27 62 231 -100 -59 -32 136 71 192 -321 225 240 233 263 59 254 -64 13 286 321 46
5061 46 -47 105 297 313 213 215 143 -193 372 112 56 234 511 426 187 390 139 256 34 352 310 168 267
5084 267 410 222 158 118 84 409 -12 -15 313 373 464 344 337 213 79 117 84 90 250 -197 2 50 21 -95 221
5109 221 69 62 222 95 -189 -228 -181 -23 -128 -70 -91 -33 -262 -114 -216 -331 -71 -137 -303 -236 -79 -188 -185 -40
5133 -40 -292 -266 -378 -264 -98 -53 80 -98 -264 -145 -341 -287 -291 -283 -165 -11 -138 -276 -322 -194 -345 -91 -390
$$ packed form
4966A5l2n5J88QK08m2j20j78R2M7j63kj77J78J57k25N5j34K6J37j79m6K58K1j72
4991a35r2J79l15l5J41q3K85k1k30L46j47o4j76k9K84k83K37K4m9MP9j55l3j71
5015d39K44J64k80l0K19k82Q3J32k51K18M3K29l99KK00j50K72N9K00k65p6K17
5037A10k87J23q0J07Q9J69l31M1K7J68o5J21n13N46J5pL0k04J95l18P7K73L5k75
5061D6r3J52J92J6j00Kp2l36N65k60n6J78K77q5k39K03k51J17k22L18m2j42R9
5084B67J43j88o4m0l4L25m21lL28O0R1j20pj24j34L8l3OJ60m47J99M8k9j16L16
5109B21j52pJ60j27k84l9M7J58j05N8k1N8k29J48j02j15K60o6j66O7J57j09LJ45
5133d0k52K6j12J14J66M5J33j78j66J19j96N4mQJ18J54j27j38m6J28j51K54k99
$$ plain form
5156 -390 -328 -102 -192 -152 -281 -135 -164 -169 -276 -142 -142 -223 -127 -115 -196 193 9 -80 -325 -40 -195 -116 87 159 154 -46
5182 -46 57 194 136 17 151 -85 19 119 142 249 204 325 -150 76 77 93 175 123 324 506 215 357 197
5205 197 394 11 263 430 180 261 55 -45 161 195 269 153 198 407 216 129 273 388 294 260 116 159 125
5228 125 159 -343 58 183 325 230 274 82 248 37 22 203 -174 263 198 52 57 151 205 -205 -23 5 35 -15
5252 -15 72 93 52 -81 -77 -12 125 42 -191 -74 -316 -130 85 -238 -79 -57 -125 -235 -120 -28 -216 50 -71 148
5276 148 -535 -283 -36 -259 -210 -360 -136 104 -194 -193 -247 -273 -245 -118 -371 -328 -220 -143 -127 -265 -124 -115 -521 -302
5300 -302 -144 -52 -128 -193 -219 -293 76 -339 -38 -6 50 -53 37 -35 -88 36 259 175 96 -290 -116 294 79 -89
5324 -89 24 205 168 114 316 25 55 14 235 291 306 172 173 162 -32 139 232 256 177 389 183 44 283 118
$$ packed form
5156c90O2K26r0M0j29J46k9nj07J34%q1R6J2q1L89j84q9k45K85j55P9K03P2nk00
5182d6J03J37n8j19J34k36J04J00K3J07m5J21m75K26JJ6Q2n2K01J82k91J42j60
5205A97J97l83K52J67k50Q1k06j00K06L4P4j16M5K09j91q7J44J15r4l4j44M3l4
5228A25L4n02M01J25J42r5M4j92J66k11j5J81l77M37o5j46NR4N4m10J82K8L0n0
5252a5Q7K1m1j33MO5J37q3k33J17k42J86K15l23J59K2o8j10J15R2j88K66j21K19
5276A48o83K52K47k23M9j50K24K40k98Jn4k6K8J27k53M3J08P7J6j38J41Rm06K19
5300c02J58R2p6o5k6p4L69m15L01L2N6j03R0p2n3J24K23q4p9l86J74M10k15j68
5324h9J13J81l7n4K02k91L0m1K21N6J5j34Jj1j94J71R3K4p9K12k06j39K39j65
$$ plain form
5348 118 350 118 283 353 99 50 142 265 324 379 352 225 135 67 175 341 150 101 11 188 298 340 246 88
5372 88 51 -80 -11 346 27 -8 30 -194 292 -23 53 -197 -132 -285 -97 -42 -7 19 137 -145 -52 -241 -358 -56
5396 -56 -30 -20 -163 -404 -136 -292 -284 -24 -85 -104 -212 -324 -354 60 -52 -185 -474 -244 -215 -356 -349 -300 -329 -261 -29
5421 -29 -84 -214 -297 17 -208 -137 -20 -206 -73 -166 278 -280 -217 -145 -113 -144 76 -236 -17 -14 -8 168 -201 117
5445 117 -92 -136 -94 5 -92 224 -102 152 118 58 200 -148 220 -91 104 -80 -83 58 260 122 -26 134 265
5468 265 -13 210 114 263 325 189 87 326 64 215 291 383 276 22 276 195 325 150 262 116 -92 98
5490 98 6 394 110 273 244 -6 38 -51 -37 193 177 66 142 -24 167 190 212 -34 -109 68 172 -178 57 125
5514 125 215 137 -67 -27 -10 197 -171 84 188 -85 15 148 -26 -66 -166 -105 -270 -71 -185 -89 -4 -221 -183
$$ packed form
5348A18K32k32J65P0k54m9R2J23N9N5k7j27r0o8J08J66j91m9r0J77J10M2r4j58
5372H8l7j31O9L57l19l5L8k24M86l15P6k50O5j53J88N5L5K6J18k82R3j89j17L02
5396e6K6J0j43k41K68j56QK60o1j9j08j12l0M14j12j33k89K30K9j41PM9k9O8K32
5421b9n5j30q3L14k25P1J17j86J33r3M44n58O3P2L2l1K20l12K19LOJ76l69L18
5445A17k09m4M2R9r7L16l26K54l4o0J42l48L68l11J95j84lJ41K02j38j48J60J31
5468B65k78K23r6J49O2j36j02K39k62J51P6R2j07k54K54q1J30j75J12j46k08J90
5490I8r2L88k84J63k9k50M4q9J4K30j6j11P6j66J91K3K2k46p5J77J04l50K35O8
5514A25R0p8k04M0J7K07l68K55J04k73J00J33j74m0j00O1j65J99j14R6Q5k17L8
$$ plain form
5537 -183 -293 -188 -89 -201 -65 -201 -200 -120 -141 -248 -240 -245 -138 -249 -189 -120 -160 -276 39 -204 68 -55 -6 -289
5561 -289 -394 -142 -220 -235 73 -254 -147 -220 -222 -202 -52 -95 75 64 413 29 -155 -63 -27 -105 8 -55 -95 6
5585 6 61 193 112 37 26 -13 -134 39 -224 264 -54 281 52 273 56 103 120 -10 349 239 -73 -163 253
5608 253 370 245 125 -29 16 -46 294 46 399 306 304 62 219 202 211 269 349 151 321 -14 166 123 76 191
5632 191 -140 161 -1 -143 228 -19 33 76 35 251 101 -82 50 -2 -12 -159 -93 87 -171 68 -19 -137
5654 -137 -186 -224 -223 47 142 166 -79 -314 -10 -276 -99 -287 -269 -272 -136 26 172 85 -300 -209 -237 -338 -134 -131 -199
5679 -199 -219 -272 -128 -105 -82 -62 -182 -68 -303 -95 -135 -188 -135 -72 -85 -283 -76 -221 -432 124 -242 -58 82
5702 82 -223 -71 -22 -171 -143 -207 -50 -153 245 -216 -82 -119 43 -29 78 -27 -98 -72 -240 55 -20 -27 99 90
$$ packed form
5537a83j10J05R9j12J36j36JQ0k1j07QnJ07j11O0O9m0j16L15k43K72j23M9k83
5561b89j05K52p8j5L08l27J07p3kK0J50m3J70j1L49l84j84R2L6p8J13o3m0J01
5585FN5J32q1p5j1l9j21J73k63M88l18L35k29K21k17M7J7j30L59j10l12r0M16
5608B53J17j25j20j54M5o2L40k48L53r3kk42J57j7RN8Q0j98J70l35J80m3m7J15
5632A91l31L01j62j42L71k47N2M3m1K16j50j83J32n2j0j47O6J80k58K39q7j18
5654a37m9l8JK70R5K4k45k35L04k66J77j88J8lJ36J62J46q7l85R1k8j01K04Lo8
5679a99k0n3J44K3K3K0j20J14k35K08m0n3N3O3j3j98K07j45k11N56l66J84J40
5702H2l05J52M9j49K8o4J57j03L98m61J34l7J62p2J07j05p1K6j68K95p5pJ26r
$$ plain form
5726 90 36 230 229 41 165 107 137 -32 291 341 132 -41 22 352 143 173 235 152 91 146 -1 87 288 -2 153
5751 153 412 334 168 209 194 148 200 469 173 335 109 184 319 173 111 243 19 117 77 -94 150 226 -18
5774 -18 -3 84 223 123 -53 117 68 64 -3 25 72 -23 117 -9 -110 76 20 -190 -244 29 38 -44 135 46 -149
5799 -149 -140 -201 -22 -334 -128 47 38 -7 -43 -275 -197 -186 -335 -60 -20 -180 -289 -184 -115 -132 -301 -179 -15 -125
$$ packed form
5726I0n4J94jj88J24n8L0j69L23N0k09j73O3L30k09L0O2q3o1N5j47Q8K01k90J55
5751A53K59p8j66M1j5m6N2K69k96J62k26P5J35j46o2J32k24R8m0j71K44P6k44
5774a8J5Q7J39j00j76J70m9mo7K8M7r5J40j26j01J86n6k10n4K73Rq2J79q9j95
5799a49Ro1J79l12K06J75rm5l6k32P8J1j49K75M0j60j09J05O9j7j69J22J64j10
$$ [...]
8191i8
##END NTUPLES=NMR FID
##END=
