##TITLE=1H_IAMT-123
 CDCl3, 32 sc, 
 12.3.2019
##JCAMPDX= 6.0         $$ Bruker NMR JCAMP-DX V2.0
##DATA TYPE= NMR FID
##DATA CLASS= NTUPLES
##ORIGIN= UXNMR, Bruker Analytische Messtechnik GmbH
##OWNER= root
$$ XWIN-NMR		Version 3.5
$$ Tue Mar 12 17:17:45 2019 Russian Standard Time (UT+4h)  she@DPX200
##.OBSERVE FREQUENCY= 200.1314
##.OBSERVE NUCLEUS= ^1H
##.DELAY= (6, 6)
##.ACQUISITION MODE= SIMULTANEOUS
##.ACQUISITION SCHEME= undefined
##.AVERAGES= 32
##.DIGITISER RES= 18
##SPECTROMETER/DATA SYSTEM= spect
##.PULSE SEQUENCE= zg30
##.SOLVENT NAME= CDCl3
##.SHIFT REFERENCE= (INTERNAL, CDCl3, 0, 15.7039)
##AUDIT TRAIL= $$ (NUMBER, WHEN, WHO, WHERE, WHAT)
$$ ##TITLE= Audit trail, XWIN-NMR		Version 3.5
$$ ##JCAMPDX= 5.01
$$ ##ORIGIN= Bruker BioSpin GmbH
$$ ##OWNER= she
$$ F:/spectra/data/she/nmr/H-F/1/audita.txt
$$ ##AUDIT TRAIL=  $$ (NUMBER, WHEN, WHO, WHERE, WHAT)
(   1,<2019-03-12 17:16:48.10 +0400>,<she>,<DPX200>,
      <continue with go, POWCHK disabled, PULCHK disabled
       configuration hash MD5:
       00 E9 B6 7A A2 85 ED C7 34 08 36 98 17 FE 4E 26
       data hash MD5: 16K
       1B 39 02 78 EE 16 1F AE 90 1D 19 56 23 25 F7 4D>)
$$ ##END=
$$ 
$$ hash MD5
$$ C4 C6 14 B9 C4 2A C3 4E 8C 87 1B 7C 88 DD E1 90
##$RELAX= 
##$RELAX= 
##$RELAX= 
##$RELAX= 
##$RELAX= 
##$RELAX= 
$$ Bruker specific parameters
$$ --------------------------
##$DU= <F:/spectra>
##$EXPNO= 1
##$NAME= <H-F>
##$PROCNO= 1
##$TYPE= <nmr>
##$USER= <she>
##$AMP= (0..31)
100 100 100 100 100 100 100 100 100 100 100 100 100 100 100 100 100 100 
100 100 100 100 100 100 100 100 100 100 100 100 100 100 
##$AQSEQ= 0
##$AQ_mod= 1
##$AUNM= <au_zg>
##$AUTOPOS= <>
##$BF1= 200.13
##$BF2= 200.13
##$BF3= 200.13
##$BF4= 200.13
##$BF5= 200.13
##$BF6= 200.13
##$BF7= 200.13
##$BF8= 200.13
##$BYTORDA= 1
##$CFDGTYP= 0
##$CFRGTYP= 5
##$CHEMSTR= <none>
##$CNST= (0..31)
1 1 145 1 1 1 1 1 1 1 1 1 1 1 1 1 1 1 1 1 1 1 1 1 1 1 1 1 1 1 1 1 
##$CPDPRG= <>
##$CPDPRG1= <>
##$CPDPRG2= <>
##$CPDPRG3= <>
##$CPDPRG4= <mlev>
##$CPDPRG5= <mlev>
##$CPDPRG6= <mlev>
##$CPDPRG7= <mlev>
##$CPDPRG8= <mlev>
##$CPDPRGB= <>
##$CPDPRGT= <>
##$D= (0..31)
0 1.2 0 0 0 0 0 0 0 0 0 0.03 0 0 0 0 0 0 0 0 0 0 0 0 0 0 0 0 0 0 0 0 
##$DATE= 1552396466
##$DBL= (0..7)
120 120 120 120 120 120 120 120 
##$DBP= (0..7)
150 150 150 150 150 150 150 150 
##$DBP07= 0
##$DBPNAM0= <>
##$DBPNAM1= <>
##$DBPNAM2= <>
##$DBPNAM3= <>
##$DBPNAM4= <>
##$DBPNAM5= <>
##$DBPNAM6= <>
##$DBPNAM7= <>
##$DBPOAL= (0..7)
0.5 0.5 0.5 0.5 0.5 0.5 0.5 0.5 
##$DBPOFFS= (0..7)
0 0 0 0 0 0 0 0 
##$DE= 6
##$DECBNUC= <off>
##$DECIM= 24
##$DECNUC= <off>
##$DECSTAT= 4
##$DIGMOD= 1
##$DIGTYP= 9
##$DL= (0..7)
0 120 120 120 120 120 120 120 
##$DP= (0..7)
150 150 150 150 150 150 150 150 
##$DP07= 0
##$DPNAME0= <>
##$DPNAME1= <>
##$DPNAME2= <>
##$DPNAME3= <>
##$DPNAME4= <>
##$DPNAME5= <>
##$DPNAME6= <>
##$DPNAME7= <>
##$DPOAL= (0..7)
0.5 0.5 0.5 0.5 0.5 0.5 0.5 0.5 
##$DPOFFS= (0..7)
0 0 0 0 0 0 0 0 
##$DQDMODE= 0
##$DR= 18
##$DS= 0
##$DSLIST= <SSSSSSSSSSSSSSS>
##$DSPFIRM= 0
$$ [...]
##$SUBNAM2= <"">
##$SUBNAM3= <"">
##$SUBNAM4= <"">
##$SUBNAM5= <"">
##$SUBNAM6= <"">
##$SUBNAM7= <"">
##$SUBNAM8= <"">
##$SUBNAM9= <"">
##$SW= 26.0245685251456
##$SWIBOX= (0..15)
0 0 2 0 0 0 0 0 0 0 0 0 0 0 0 0 
##$SW_h= 5208.33333333333
##$TD= 16384
##$TD0= 1
##$TE= 0
##$TE2= 300
##$TE3= 300
##$TEG= 300
##$TL= (0..7)
0 120 120 120 120 120 120 120 
##$TP= (0..7)
150 150 150 150 150 150 150 150 
##$TP07= 0
##$TPNAME0= <>
##$TPNAME1= <>
##$TPNAME2= <>
##$TPNAME3= <>
##$TPNAME4= <>
##$TPNAME5= <>
##$TPNAME6= <>
##$TPNAME7= <>
##$TPOAL= (0..7)
0.5 0.5 0.5 0.5 0.5 0.5 0.5 0.5 
##$TPOFFS= (0..7)
0 0 0 0 0 0 0 0 
##$TUNHIN= 0
##$TUNHOUT= 0
##$TUNXOUT= 0
##$USERA1= <user>
##$USERA2= <user>
##$USERA3= <user>
##$USERA4= <user>
##$USERA5= <user>
##$V9= 5
##$VALIST= <valist>
##$VCLIST= <CCCCCCCCCCCCCCC>
##$VD= 0
##$VDLIST= <DDDDDDDDDDDDDDD>
##$VPLIST= <PPPPPPPPPPPPPPP>
##$VTLIST= <TTTTTTTTTTTTTTT>
##$WBST= 1024
##$WBSW= 4
##$XGAIN= (0..3)
0 0 0 0 
##$XL= 0
##$YL= 0
##$YMAX_a= 2481807
##$YMIN_a= -2597067
##$ZGOPTNS= <>
##$ZL1= 120
##$ZL2= 120
##$ZL3= 120
##$ZL4= 120
##$ABSF1= 10
##$ABSF2= 0
##$ABSG= 5
##$ABSL= 3
##$ALPHA= 0
##$AQORDER= 0
##$ASSFAC= 0
##$ASSFACI= 0
##$ASSFACX= 0
##$ASSWID= 0
##$AUNMP= <proc_1d>
##$AZFE= 0.1
##$AZFW= 0.1
##$BCFW= 1
##$BC_mod= 2
##$BYTORDP= 1
##$COROFFS= 0
##$CY= 11.3945322036743
##$DATMOD= 1
##$DC= 2
##$DFILT= <>
##$DTYPP= 0
##$F1P= 18.9103706918063
##$F2P= -1.10871071338519
##$FCOR= 0.5
##$FTSIZE= 0
##$FT_mod= 4
##$GAMMA= 1
##$GB= 0.15
##$INTBC= 1
##$INTSCL= 1
##$ISEN= 128
##$LB= 0.24
##$LEV0= 0
##$LPBIN= 0
##$MAXI= 10000
##$MC2= 0
##$MEAN= 0
##$ME_mod= 0
##$MI= 1.114404
##$NCOEF= 0
##$NC_proc= 0
##$NLEV= 6
##$NOISF1= 3.799351
##$NOISF2= 2.8
##$NSP= 1
##$NTH_PI= 0
##$NZP= 0
##$OFFSET= 15.70392
##$PC= 1
##$PHC0= -8859.63
##$PHC1= 18.80025
##$PH_mod= 1
##$PKNL= yes
##$PPARMOD= 0
##$PSCAL= 0
##$PSIGN= 0
##$REVERSE= no
##$SF= 200.130013532006
##$SI= 16384
##$SIGF1= 3
##$SIGF2= 2
##$SINO= 400
##$SIOLD= 16384
##$SREGLST= <1H.CDCl3>
##$SSB= 0
##$STSI= 0
##$STSR= 0
##$SW_p= 3612.71676300578
##$SYMM= 0
##$S_DEV= 0
##$TDeff= 0
##$TDoff= 0
##$TI= <>
##$TILT= no
##$TM1= 0
##$TM2= 0
##$TOPLEV= 0
##$USERP1= <user>
##$USERP2= <user>
##$USERP3= <user>
##$USERP4= <user>
##$USERP5= <user>
##$WDW= 1
##$XDIM= 8192
##$YMAX_p= 0
##$YMIN_p= 0
$$ End of Bruker specific parameters
$$ ---------------------------------
##NTUPLES= NMR FID
##VAR_NAME=  TIME,          FID/REAL,        FID/IMAG
##SYMBOL=    X,             R,               I
##VAR_TYPE=  INDEPENDENT,   DEPENDENT,       DEPENDENT
##VAR_FORM=  AFFN,          ASDF,            ASDF
##VAR_DIM=   8192,          8192,            8192
##UNITS=     SECONDS,       ARBITRARY UNITS, ARBITRARY UNITS
##FACTOR=    0.000192,      1,               1
##FIRST=     0,             0,               0
##LAST=      1.572672,      0,               0
##MIN=       0,             -2597067,        0
##MAX=       1.572672,      2481807,         0
$$ Real data points
##PAGE= N=1
##DATA TABLE= (X++(R..R)), XYDATA
$$ [...]
2801a478l082K61K716L665J869Mj573l106l039j185J522L011L694J323j282l736
2817d16m308k786J589M632M682K513j579m838n839j976J743N849O627K722l816
2832D799q134o861o43O293P440P090N5p293r255m174J603P809R622L536k960r225
2848b98q639l622N237J0545Q691J334p103j0922p513J752P546J0977N725j422
2862A2288r865r167n542M373R578Q688L286n096r581p644j310N737Q945O838q59
2877A0669n286q265o045J422O536O507M103k279n982n720k800J889N702M958J160
2892F569k077m665m484j390J582M240M081J021k207l155l073j667J532K614L323
2907B244J978l22l684l014l551K0L351L942L441L76m104m712l688l26M668N915
$$ plain form
2801 -1478 -4560 -4299 -1583 2082 3951 3955 2382 -724 -3763 -4948 -3426 -415 3279 4602 3320 -416
2817 -416 -4724 -7510 -5921 -1289 3393 5906 4327 -511 -6350 -8326 -6583 -734 5893 8615 4799
2832 4799 -3335 -10196 -10839 -4546 2894 9984 10039 2746 -6509 -10683 -9080 -1271 8351 11887 8927 -298
2848 -298 -8937 -12559 -7322 3223 11914 13248 6145 -4777 -12290 -10538 -2992 7985 13710 12288
2862 12288 2423 -6744 -12286 -7913 1665 10353 13639 8543 -1038 -8682 -9992 -4255 4690 11528 10669
2877 10669 5383 -2882 -8927 -7505 -969 5538 9641 7362 1380 -4340 -7140 -5251 451 5409 6569
2892 6569 4492 -173 -4657 -6047 -4465 -225 3856 4877 2670 -485 -3558 -5225 -3693 -1079 2244
2907 2244 4222 3900 216 -2798 -6349 -6329 -2978 964 4405 4781 677 -4035 -7723 -8049 -3381 2534
2923B534M053l16m718p286k810P69O743O924M672k616p144p443k860M061P998
2938B561P326K341n953q878o927K21O932Q663N499j541p871r145l811L067Q930
2953A414Q836L091m237j0065p504j311N917J0269O349p88o793r484m730J493P572
2968B9P613L183k527p851p360k912M346N994O992M75l824o855n094o34M564N924
2984B063M092k50m162m680l594J392L310M521J468l34l315k598k391N28K243K550
3000H43J400o82j477k167j303j569J622K108K331J590p35k849l002j071O42L800
3016e19L469K358j718l653m496p71J751N071M466J040k913n502m993l67M986N756
3032C965M477p25m622p537m034K226N485O617L414k513o324o654k015L393P920
$$ plain form
2923 2534 6587 6271 1553 -5733 -8543 -7774 -1031 5893 10565 7949 805 -6638 -9498 -5437 2561
2938 2561 9887 12228 6275 -2603 -9530 -9309 -2377 6286 11785 10244 2373 -6772 -10583 -7516 1414
2953 1414 10250 13341 9104 -961 -8465 -9776 -3859 6410 12759 11971 5178 -4306 -9036 -7543 29
2968 29 7642 10825 8298 447 -6913 -9825 -5479 515 7507 7982 4158 -2697 -7791 -8425 -3861 2063
2984 2063 6155 5905 1743 -2937 -6531 -5139 -1829 2692 4160 3826 511 -2087 -4478 -3950 -1707 843
3000 843 2243 1561 84 -2083 -3386 -4955 -3333 -1225 1106 2696 1961 -888 -3890 -4961 -4319 -519
3016 -519 2950 5308 3590 -63 -4559 -5330 -3579 1492 5958 6998 4085 -1417 -6410 -6777 -1791 3965
3032 3965 8442 7717 3095 -4442 -8476 -6250 -765 5852 9266 6753 429 -6225 -8240 -4847 3073
3047C073N403J461n134p604m848K99N497O586M567j364o100p662k341K334O800
3062I67N052J494l605p178m461L37L429N804L769o07n154n172j346Q01L757M603
3078B490K088j752m166l708p37K152L692J971Q29k185k193j374r02J209K330Q13
3094E57P52m8j884p55j041J25J031J210J102P96J6j646k345j232O86K867K583
3111B774J100q14k962l255q23J516L688L070K320l500l738l810j43L363M456L031
3127F273m40m510m894k286O95M713N932J756l003n390n461r6L821N715M377n78
3143F624n331o318l128K083M962O371K168k504n862n080j822L645N844M152%m601
3159A203n057m023J256M159N494J760j608m309l846j354J614M325L411K51k443
$$ plain form
3047 3073 8476 9937 4803 -2801 -7649 -7350 -1853 4733 9300 7936 1836 -5826 -8167 -5833 967
3062 967 6019 7513 3908 -3270 -7731 -7394 -3965 1839 5608 5001 -153 -5325 -6671 -5870 -2113 2490
3078 2490 4578 2826 -1340 -5048 -5785 -3633 59 2030 2859 674 -1519 -2893 -3795 -2586 -256 557
3094 557 1309 1261 -623 -1378 -2419 -2294 -1263 -53 1049 1845 1861 215 -2130 -3362 -2676 191 2774
3111 2774 3874 3060 98 -3157 -3980 -2464 1224 4294 6614 3114 -624 -4434 -4577 -1214 3242 6273
3127 6273 5833 1323 -3571 -5857 -5162 -449 5483 7239 4236 -1154 -6615 -6711 -2890 2825 7202 6624
3143 6624 1293 -5025 -8153 -6070 -1108 5263 7431 4927 -935 -6015 -7837 -4192 1652 5804 5804 1203
3159 1203 -3854 -7877 -6621 -2462 3032 4792 3184 -1125 -4971 -6325 -4711 -386 3025 3276 833
3174H33l073k764M30K708K509K713r39k359k027q46O45K387J399m43J3j436j378
3191a628O6O58N36J107k00Q50l94r98o34o29J26P72J932J591p03p04j894j734
3209a880L59K391J749J736J2k875k453k215M99L307L265J309k306l935l400p68
3225e205K672L952K710K19k548n684j647K88M565M795K130k698m016m562j248
3240f277K643N141M586p41m701m611k591R92L823M552K196j849l796n392j012
3255g037L091L958L966k14k176m626k719Q82L580M826J224j431l559l129j086
3270d450K392L564J824k66j943k332j196J91J663K235J444j139k451q11k54J248
3286b81J082P33K94o45r57p60J482J8M90J10q73l52N25N39J126j167j773j30o00
$$ plain form
3174 833 -2240 -5004 -4574 -1866 643 3356 2417 58 -1969 -2815 -2170 217 1616 1173 1186 -250 -1628
3191 -1628 -1562 -904 -368 739 539 1389 995 -3 -637 -1266 -1140 -368 1564 3155 2452 1748 -146 -1880
3209 -1880 -1521 870 2619 4355 4367 1492 -961 -3176 -2677 630 3895 5204 2898 -1037 -4437 -5205
3225 -5205 -2533 1419 4129 4348 1800 -3884 -5531 -5243 -678 4117 6247 3549 -467 -5029 -6277
3240 -6277 -3634 1507 6093 5352 651 -3960 -6551 -5559 -1736 2816 5012 3163 -633 -6025 -7037
3255 -7037 -3946 12 3978 3764 1588 -3038 -5757 -4875 -1295 3531 4755 3324 -235 -3364 -4450
3270 -4450 -2058 1506 3330 3064 1121 -1211 -2407 -2216 -553 1682 3126 1987 -464 -1275 -1529 -281
3286 -281 801 1534 1828 1183 226 -534 948 966 1456 1566 693 341 866 1405 2531 1364 -409 -539 -1139
3305a139J700R92L99m10k102j839j12K202Q17Q21O78k107k056j118J544K012K474
3322B756l67k161k362j880R83K507K136J108k261j702k790k79K215L199K200o29
3338B673k123l544k323J299L073K802K080k134l451k333l62K603K716J777r5j922
3354G36k781p52J225J460J810Q23j024j941q41l28K036J367J27p84j507m37L79
3371d32J342J468k63j059r35j076L65J776J072r41M70k321l92Q21J131J768j62
3388B632j369j733j046O89J235K734k48j482k506j876K18K343K471M88M38l172
3404a84k552j046J199K687K140M35j738k873k758R32K141K623J508j232k171k689
3420c578p44K033K615J608J90k123k292j061P58K155K486p2j378k095j125J62
$$ plain form
3305 -1139 561 1553 1952 1542 -560 -2399 -2511 -309 508 1329 2007 -100 -2156 -3274 -1730 282 2756
3322 2756 2389 228 -2134 -4014 -3031 -524 1612 2720 459 -1243 -4033 -4312 -2097 1102 3302 2673
3338 2673 550 -2994 -5317 -4018 -945 1857 3937 1803 -1648 -3981 -4343 -1740 976 2753 2658 736
3354 736 -2045 -2797 -1572 -112 1698 2521 1497 -444 -1285 -1613 423 1790 1917 1133 -374 -811 -432
3371 -432 910 2378 2115 1056 121 -955 -590 1186 2258 1317 1787 -534 -926 -105 1026 2794 2632
3388 2632 1263 -470 -1516 -827 408 3142 2894 1412 -1094 -2970 -2752 -409 2062 2550 2988 -184
3404 -184 -2736 -3782 -2583 104 2244 2679 941 -1932 -4690 -3758 -1617 1006 2514 1282 -889 -3578
3420 -3578 -4322 -2289 326 1934 2124 1 -2291 -3352 -2594 -439 2047 1975 597 -1498 -2623 -2461
3436b461J438K297L49k98j889j294m89Q57K372J351o78j583j012J62P46J147Q18
3453A833J51j395o24o79J254Q73J93j07r35r50k31R86J384O9k7j761r56n41J342
3472a21J949L23k7j253j988p92Q82L016N40L2j749j807j868Q47J983J481N27r66
3490A009j690k404K16P81K635K150k06k516j933j346K91K467K293N38j816j548
3506a079j634K26M27J799J873k50j659j644q07J030Q52J879l19j037q70p93M35
3523a571J602J018M69j209o78L88j38N29K38N35q90J0j74J530p78O61o35o27o96
3542d16P80M99J051Rm06j472j817K59J426K455J081p58k047j944n04Q88K122K124
3560C330N41j899k206k456J25K484K184P76l29k773k466j132R94L284J970J78
$$ plain form
3436 -2461 -1023 1274 1623 1325 -564 -1858 -2347 -1490 882 2233 1555 -28 -1040 -878 -132 1015 1833
3453 1833 1984 589 -35 -714 540 1413 1606 1499 564 -386 -617 369 1753 1822 1795 34 -922 -1463 -121
3472 -121 1828 2151 2124 871 -1117 -1909 -1027 1989 2529 2561 812 -995 -2863 -2016 -33 1448 1975 1009
3490 1009 -681 -3085 -2869 -2088 547 2697 2491 -25 -1958 -3304 -3013 -546 1747 2285 469 -1079
3506 -1079 -2713 -2487 -2060 -261 1612 1362 -297 -1941 -2748 -1718 -866 1013 694 -343 -1213 -2006 -1571
3523 -1571 31 1049 1518 309 -369 19 -119 410 648 1183 293 303 129 1659 881 1542 907 280 -416
3542 -416 364 863 1914 1923 1517 45 -1772 -1513 -87 2368 3449 2691 644 -1300 -1804 -916 1206 3330
3560 3330 3871 1972 -234 -2690 -2565 -81 2103 2879 2550 -223 -2689 -3821 -2827 457 2427 2605
3576B605k290l279j598L41L362L203J181k145k322k738j127K298L399K523j10
3591C303k650l808q53K34L627J709J987j527l608k333m89J757L034K146l15k043
3607A71k641m96N62K189J675P11o45j264j021o17L48J279J881M0q68j553m57J31
3625e75N28P13J128j506M35l13j96J02j95M67o2N19L49l4j95q83m28O73n1N85
3645A061Q71l44j362j028j048O25J040J489R33q04k170k434K11J928K553R20l35
3662B106j306k894j854Q01K815K142R73j161k951k116j796K604L172K566J59k696
3678E64l158k386P88L190K455J856j116l776k056o56K867K363J820N81k632k390
3694a686j774M2K606L561P14j149k466k305l20J511K179J132L34j600j958j039
$$ plain form
3576 2605 315 -2964 -4562 -4221 -859 2344 3525 1380 -942 -3680 -4807 -2509 890 3413 3303
3591 3303 653 -3155 -4008 -3774 -147 1562 3549 2022 -1586 -3919 -4408 -2651 383 2529 2214 171
3607 171 -2470 -2966 -2404 -215 1460 2171 1526 262 -759 -1376 -1028 251 2132 2172 1304 -249 -706 -575
3625 -575 -47 666 1794 288 723 410 214 316 121 588 526 1045 1394 1360 1165 282 -146 527 476 1061
3645 1061 1932 1588 226 -802 -1850 -1225 -185 1304 2237 1433 -737 -3171 -2960 -1032 1521 2441 2106
3662 2106 800 -2094 -3948 -3147 -332 1810 2783 1622 -1329 -3445 -5241 -2637 535 3101 3260 564
3678 564 -2594 -4980 -4192 -1002 1453 3309 2193 -1583 -3639 -4295 -1428 935 2755 3336 704 -1686
3694 -1686 -3460 -3418 -812 2749 3463 2314 -152 -2457 -2777 -1266 913 2045 2379 779 -1179 -2218
3710b218k29J789J749J088j24r51j661q00J213P73R45M58k89j313r31kL57J23
3728b3M26R04p53k58K18m33m93j62m04J316N72O9n10n32j546M92M80J412J352
3747B127n13j536j566r57O4J951K214L15q31j768k721j117J730L020J499Q23k001
3764G33l080j986N47K030K467K099r7k426l203j618J733K977L528Q14j927m088
3780a497k576K96K008L233K644J2k877m092j447J067L325K826J560j248k927k832
3796b525j324J873L033K271O76j629k570k797J014K356K193O96o71j604j969j212
3812b189J413Q07J861J290j406j549j025j301J108R99J221M39k84j381j233p5
3828a305k59O88J544M33N60j271j638m55L37M86Q80R58O53j314j441j649n48K099
$$ plain form
3710 -2218 -2447 -658 1091 2179 2055 1104 -557 -1357 -144 629 1574 2032 1743 430 -501 -503 -146 -23
3728 -23 403 1307 554 296 514 81 -412 -574 -978 338 910 979 469 -63 -1609 -1117 -637 775 2127
3747 2127 1614 78 -1488 -2445 -2381 -430 1784 2099 1268 -500 -3221 -4338 -2608 412 1911 2734 733
3764 733 -2347 -4333 -3786 -1756 711 2810 2713 287 -2916 -4534 -2801 176 3704 4518 2591 -1497
3780 -1497 -4073 -3777 -1769 1464 4108 4120 1243 -2849 -4296 -3229 96 2922 4482 3234 307 -2525
3796 -2525 -3849 -1976 1057 3328 4004 2375 -195 -2992 -1978 378 2571 3267 2596 992 -977 -2189
3812 -2189 -776 31 1892 3182 1776 227 -798 -2099 -991 8 1229 1668 1384 3 -1230 -1305
3828 -1305 -1564 -876 668 1101 1661 390 -1248 -1703 -1366 -880 0 958 1611 297 -1144 -2793 -3341 -1242
3846a242J637K146q35j340k612j511L8K639K291K000j035k349k839j232J116L545
3862D17K225J069j309l258k716k2K163L285J847J83l227l390j044Q33K869L555
3878C480J158j772k757k460j238K157L269K083M96k189l410k673J148J841L898
3893C031J756j049l452k173j132Q14K612K114P92j118k453k121m23J314K605J719
3909B836p77j002j919p71M4R63J247Q78k63j345k87j582K18O74J507K23o03K30
3927B71r63n31o22R97Q85R39o74J41p19j402k68j39J555J661Q32j529n76j499
3945a641n34O5K345J248j14j82k149j399n68J555K517J867P09l585j534j186k04
3962b790L038K259J275j192k277k688m77Q15L000K288P66j883k694j910P2J941
$$ plain form
3846 -1242 395 2541 1706 366 -2246 -3757 -3719 -1080 1211 3211 2176 -173 -3012 -4244 -3128 417
3862 417 2642 3711 2402 -856 -3572 -3594 -1431 1854 3701 3884 657 -2733 -3777 -2944 -75 3480
3878 3480 4638 2866 109 -2351 -3589 -1432 1837 3920 4416 2227 -1183 -3856 -2708 -867 3031
3893 3031 4787 3738 286 -1887 -3019 -2205 407 2521 3313 2195 -258 -2379 -2802 -1488 1117 2836
3909 2836 2059 1057 -862 -1633 -1589 -626 621 1499 1236 -109 -396 -1978 -1760 -1086 421 644 41 271
3927 271 -692 -1223 -1845 -848 37 976 302 443 -276 -1678 -1946 -2085 -530 1131 1963 434 -142 -1641
3945 -1641 -2175 -2110 235 1483 1369 1187 -962 -2361 -2929 -1374 1143 3010 3719 134 -1400 -2586 -2790
3962 -2790 248 2507 3782 2590 313 -2375 -2852 -2037 963 3251 4017 2134 -560 -2470 -2398 -457
3978d57K434K557j365k449k171j481M11L103J992K93q68k014k261n52J703K382
3994A257J381l32j368k400j051L14J588J806N45p49j455j154n16M91J407N98J313
4011A675o18j880j559M5J076J123R35M5L80j880j018M61l24R97J126j26N69m80
4029E47j586o54N95M50R84J265j57l19j646j132m5O72K003K095q75j856j304j489
4047b452J047J909J672O29p92j518k579p44J683J818K343J93j229k962j671j38
4063b791K906K575J440o36k788k453j100J354K861J387R58j391l061k353O55J120
4079a317K512J942k93j668l797j197K52K400L218R88j200k325k523q88K448J622
4095A74J633J073j997j822j185K56J194J802L4P25k019j802p97Q83J388K180j214
$$ plain form
3978 -457 1977 4534 3169 720 -1451 -2932 -2521 582 2574 2867 1999 -15 -2276 -2828 -1125 1257
3994 1257 2638 2306 938 -1462 -2513 -2199 -611 1195 1740 991 -464 -1618 -2134 -1643 -236 362 1675
4011 1675 1057 -823 -2382 -2337 -1261 -138 797 842 1222 -658 -1676 -1215 -1539 -542 584 458 1027 547
4029 547 -1039 -1693 -1098 -648 336 1601 1444 1125 -521 -1653 -1698 -1026 977 3072 2197 341 -963 -2452
4047 -2452 -1405 504 2176 2805 2013 495 -2084 -2828 -1145 673 3016 3209 1980 -982 -2653 -2791
4063 -2791 115 2690 4130 3494 706 -1747 -2847 -1493 1368 2755 3713 2322 -739 -3092 -2437 -1317
4079 -1317 1195 3137 2844 1176 -2621 -3818 -3566 -1166 2052 3040 1840 -485 -3008 -3896 -1448 174
4095 174 1807 2880 883 -939 -2124 -1868 -674 1128 1162 1887 -132 -1934 -2731 -1848 -460 1720 506
4112E06K83j469o36o64N76J386P10J158k97j494q40k25j9J827J41P34j45j183
4130C49m19j165J90P81J253J063o9j632j300j000R72P90J607Q36p50o78j612r73
4148a757N11K034Q53J392j051k211k147n22K126J979J367L8r53l208j414L75J759
4165h29K033K246o50k245k249j805J343K922J540N69j298k770j288p37J968J769
4181E19J593N6j109k293j630K49J952J733J436q29k008j964l39J925J141J376
4197A808L78j242j868j080L55J127Q55J267m32j782l70k27m57J387J775o7l11
4214A116j042r83L61LJ145O23k29P49j286J77j005L87L0Q69L86j57j007j75n44
4233e82J73J31R59M66M88p44j242q24m23J058J580O66o5r34k385N54r85J799J250
$$ plain form
4112 506 789 -680 -1316 -1980 -1404 -18 692 1850 1553 59 -781 -1006 -1025 802 943 1677 1532 349
4130 349 -70 -1235 -1045 -264 989 2052 1983 351 -949 -1949 -977 -187 1420 2256 1506 828 -784 -1757
4148 -1757 -1246 788 1641 3033 1982 -229 -2376 -2898 -772 1207 2574 2612 1659 -1549 -2963 -2588 -829
4165 -829 1204 3450 2800 555 -1694 -3499 -2156 766 2306 2875 1577 -1193 -2481 -3218 -1250 519
4181 519 2112 2168 1059 -1234 -2864 -2615 -663 1070 2506 1677 -331 -2295 -2634 -709 432 1808
4197 1808 2186 944 -924 -2004 -1649 -522 333 1600 1168 -614 -984 -1211 -1668 -281 1494 1427 1116
4214 1116 74 -909 -548 -545 600 1223 994 1743 457 634 -371 16 46 915 1301 1144 137 -38 -582
4233 -582 -409 -278 681 1147 1635 891 -351 -1175 -1598 -540 1040 1706 1641 707 -1678 -1124 -2109 -310 940
4252I40J417p87j344j622p52J414L37J900Q5j04k240j833n54J135K858J074k13
4269A711j556k793n74R64Q30K672J060o96j932j458p11J485J662Q01Q86j629k034
4286a312j052K05Q48K916k8L20j765j755l82J249O70J723O36j281j662j26m56
4303a252R23J664P79k30r72p28j356Q33N77J85J287m67p42j76p65L65l29J244
4321H40l3M08q96l27q1o75P36M91O77m09j94K75j381l77P69K64P17j43L43j571
4341e67r83J80M72O33J487m2m49j875p01O12R04J106M96m98j41k303n32k7J986
4360b42J714Q00j387j522j456m45J578J173J892J19j289k350j321P83J454J573
4376A074J231l81j745j671p91R18J414J722l6n58j506j093l23J598J663P00k59
$$ plain form
4252 940 2357 1570 226 -1396 -2148 -734 -397 1503 1588 1484 -756 -2589 -3143 -2008 850 1924 1711
4269 1711 155 -2638 -3212 -2248 -1418 1254 2314 1618 -314 -1772 -2483 -998 664 1465 2351 722 -1312
4286 -1312 -2364 -2159 -1311 1605 1577 1897 132 -1623 -2005 -756 -86 1637 2273 992 -670 -796 -1252
4303 -1252 -329 1335 2114 1884 912 184 -1172 -339 238 423 1710 1243 501 325 -440 -75 -404 840
4321 840 807 1215 319 -8 -89 -764 -28 463 1140 731 537 812 -569 -946 -177 87 804 661 1004 -567
4341 -567 -1550 -1370 -898 -265 1222 1180 731 -1144 -1845 -1233 -329 777 1273 775 634 -1669 -2201 -2228 -242
4360 -242 1472 2272 885 -637 -2093 -2538 -960 213 2105 2224 935 -1415 -2736 -1953 -499 1074
4376 1074 2305 1924 179 -1492 -2283 -1365 49 1771 1735 1177 -329 -1422 -1745 -147 1516 2216 1957
4393A957j375j695p30M04J705J371K96j066r26q11m47N65J119J887p13k32j549
4410b40o19p3J068N19M80L26j104m35o82L00J32J199n62K62l72n09j039L33K62
4429g54P99L39L43m70n04m25p42J93J333J67L40J0j264p87n79R89J408Q10R1l39
4449I58j525k030J16J793R06Q59K4m70k252r58N41J737J425R30k44j558j729k04
4467a681P30J265J607N76j552j627j293k77J675J973N21N83k105j570p55R56J228
4484B54J785J7m95j537k072N24Q49K080R73K55j383j238j794J057N84J678M58
4501A995j49j604j133j075Q99Q85R61M32o66r16n70K52j99P74O65J59m83r43j35
4520h51o23J128P60J19j81m93J9n94p43K20M85P77P14l37n80p20r5m75J062J031
$$ plain form
4393 1957 582 -1113 -1843 -1439 266 1637 1933 867 -59 -870 -1317 -752 367 2254 1541 1309 -240
4410 -240 -859 -932 136 655 1135 1461 357 -78 -760 -460 -328 871 309 571 199 -310 -1349 -1016 -754
4429 -754 45 384 727 257 -247 -672 -1414 -1221 112 279 619 629 -635 -1422 -2001 -1012 396 1206 1297 958
4449 958 -567 -2597 -2481 -688 218 1077 1101 631 -1621 -2579 -2038 -301 1124 2054 1810 252 -1477 -1681
4467 -1681 -951 314 1921 2497 945 -682 -1975 -2252 -577 1396 1917 2500 395 -1175 -1930 -974 254
4484 254 2039 2056 1561 24 -2048 -1524 -675 1405 2378 2633 1250 12 -1782 -725 -141 1537 1995
4501 1995 1846 242 -891 -1966 -1067 -182 779 1211 545 -371 -941 -689 -888 -114 551 710 227 -716 -851
4520 -851 -1474 -346 414 533 352 -141 -122 -716 -1459 -1239 -754 23 737 400 -180 -900 -995 -1470 -408 623
4540F23Q34q13m22j461lN93R58K25J308j242r44j163k60J845O23O65N93j234j581
4559h56j488J78K047J101J562r69j935o42j73M03J359J423Q76j365k110p40m44
4576a773J190J784J134p28o46j647j263M40K100Q23L4k01j253j221q41Q94J025
4593a49J516j78q26m44j395j3O90J641K91m40o03j165j83L7P83J035O43k97p28
4612B15j256l62M8J167Q56o2o39n36m20l27jJ323M86Nm28j50l10o68k31N19K019
4633A248l49p4j89j558j8R0L61J237J140k15p95r90r06K46L86Q15J745o32j576
4652c4j006l85J128P07J143M16j51k056r86N1Q82R78J148M89j497j905q56R88
4670i46R07J245J172j516j734p32j50L98J482J213j5r77j410o81j21J634J443
$$ plain form
4540 623 1457 644 222 -1239 -1242 -649 309 534 1842 600 -344 -1507 -1767 78 701 1366 1959 725 -856
4559 -856 -2344 -2166 -119 982 2544 1575 -360 -1002 -1175 -772 587 2010 2886 1521 -589 -1329 -1773
4576 -1773 -583 1201 2335 1607 961 -686 -1949 -1509 591 1414 1448 1247 -6 -1227 -2068 -1174 -149
4593 -149 1367 1189 363 -81 -1476 -1489 -799 842 1133 693 90 -1075 -1258 -1221 -438 597 1240 943 215
4612 215 -1041 -1403 -1355 -188 668 606 -33 -569 -989 -1316 -1317 6 492 497 69 -81 -391 -1059 -1290 -771 1248
4633 1248 899 825 636 -922 -940 -850 -489 748 1888 1673 878 -112 -1018 -772 -386 429 2174 1542 -34
4652 -34 -1040 -1425 -297 410 1553 1969 1818 -238 -1224 -1173 -291 687 1835 2324 827 -1078 -1934 -946
4670 -946 -39 1206 2378 862 -872 -1604 -1754 -1356 126 1339 1324 347 -1063 -1744 -1865 -231 1212
4687A212r94L13p50j659J47Q05P21J478n71Nj767j91n53P42R89M15J96q82r39
4706a283l29K23J401J091j031O03j013P7p51K8O48P20OK77n07R6k83n86R63m33
4726h3P75n17k53l64N3o34N19R90K99J11k74k00j423o82P82J999O2O1j45j168
4746i2p38L28O20O48R10L9o46k372N30j44R69J011J07q9k007n14L37NJ677mO14
4767A189n96j612q4l16J498L46J064j041j29k322r8O71R61P72O36q97r99n20p78
4786b255J290J246Q20p24n72q00m03L43Q93Q65J50L63j478J86J90p96J448k08
4804E58r0o7q62k63K7K01R21L03q15J51p1l55o5J06P8J017m2m62l74j26j01J78
4826a53P99L34k86K69o42r3m94o1L91O31O05q54m10j252J57K26M04J626k5k57
$$ plain form
4687 1212 218 531 -219 -1878 -1731 -926 -205 1273 702 707 -1060 -1251 -1804 -1062 -73 342 538 -344 -1283
4706 -1283 -1612 -1389 12 1103 72 675 -338 -261 -1012 -984 -336 384 390 667 160 256 -27 -613 350 -83
4726 -83 692 175 -78 -442 -389 -1023 -504 486 785 896 622 422 -1001 -1683 -901 1098 1160 1221 1076 -92
4746 -92 -830 -502 118 766 1676 1715 1069 -1303 -773 -917 52 1063 1170 1081 -926 -1440 -1103 -1098 579 575 1189
4767 1189 593 -1019 -1103 -1419 79 425 1489 448 319 -2003 -2101 -1430 -469 303 939 42 -957 -1477 -2255
4786 -2255 -965 281 1101 377 -195 -995 -1398 -1055 -162 703 853 1216 -262 -76 114 -682 766 558
4804 558 468 401 -461 -724 -697 -496 425 728 -87 64 -7 -362 -427 -321 -243 774 732 270 -104 -230 -331 -153
4826 -153 646 980 694 963 321 228 -266 -327 64 695 1300 446 36 -1216 -1059 -833 -429 1197 1172 915
4846I15j750J4j93P20J331N54k5j169j063q16L5J120N69P03O7j181j242q09J076
4865a144K53J921j22j072j041k80L01K65J163J022j57j149j057o92O62J159O46
4882F78P60p41J4j187p40J194L68P36k49p21j273k38R29L38M81J176r94P1j136
4901e34n21P7R37J251N85j55j502M04j083P36K92M61J41k68l93j005J28K26L06
4920H3J67P71o59k43j93q99K83J213M92J11l65j022o78J8P75K92L64Q52j047o42
4940c27o13l15O55K80J036L96k319O42j214O21L78O61Q09n2J3j554O1k66R58O45
4960D95R45j81j176j046m76j40J853R31K60j237m52j223N73R4J041J000l29k24
4978G08j294o69N97O82R17L69l99n40p93K7K90P90N70M3j94j376m36m8P16P95
$$ plain form
4846 915 -835 -821 -1014 -294 1037 1591 1566 397 -666 -1482 -1447 -327 242 945 1012 -169 -1411 -2220 -1144
4865 -1144 -891 1030 908 -164 -1205 -1485 -1184 -919 244 1266 1109 -40 -1097 -1789 -1127 32 678
4882 678 1438 697 711 -476 -1216 -22 346 1082 833 112 -1161 -1399 -470 -132 349 1525 531 602 -534
4901 -534 -1055 -978 -41 1210 1795 1640 138 542 -541 195 487 948 1089 821 428 -577 -449 -223 83
4920 83 250 1021 362 119 -74 -973 -690 523 1015 1126 761 -261 -939 -921 -146 146 510 1362 315 -327
4940 -327 -940 -1255 -600 -320 716 1112 -1207 -565 -1779 -1158 -780 -119 690 638 651 -903 -842 -1108 -150 495
4960 495 1440 1259 83 -963 -1439 -1579 274 1205 1465 228 -224 -1447 -874 -780 261 1261 932 708
4978 708 -586 -1255 -658 24 941 1310 911 371 -422 -395 -105 685 1255 1298 1104 -272 -708 -756 -40 755
4998G55N69o42k74j70j022L34N95J84N90p17J70q31j59j04N27L91O24k4k00r56
5018c60o49N43L40L04n26K65J3l28o20Q79%l03J330n47l82n38L55No08R00R3L85
5040E51j03r22m13M0M35P67L38n10mj277O05k44M87J387m32l80o04k37k13J56
5060e73R95O43q25O86j126k09n19P87J114L7M17n83q76o90l50J259P00N16p12
5079F91p95j52m13K20P61P02N60j000j689J75P23N30P8J158o40o61m27j82l39
5098g00N44L61J46Mo12n29n80O45N04K72J36k30m68n69M68N58J74MJ15m1K02r6
5120C08r10l00J239L7M2j49l04j217NK67N43J52P54l65j66k11r70L29K91J505
5140H80M44m18q18n59j056Q94J693N38k20m17j409M3oK44L76J349l69j318o17
$$ plain form
4998 755 1324 682 408 238 -784 -450 145 329 919 202 372 -459 -618 -722 -195 196 820 796 596 -360
5018 -360 -1009 -466 -126 178 -348 -83 -70 -398 -1018 -139 -139 -442 888 341 -41 -579 -224 -219 -827 73 166 551
5040 551 448 -474 -887 -847 -412 355 693 183 179 -1098 -493 -737 -250 1137 705 325 -279 -516 -729 -573
5060 -573 422 1065 240 926 -200 -409 -928 -141 973 1010 1427 844 -32 -722 -1072 187 887 1403 691
5079 691 -104 -256 -669 -449 312 1014 1574 574 -1115 -940 -217 313 391 1549 909 248 -179 -361 -700
5098 -700 -156 205 351 355 -257 -786 -1366 -721 -217 55 191 -39 -507 -1076 -608 -50 124 128 243 202 404 308
5120 308 -602 -902 337 374 416 267 -37 -1254 -1249 -982 -439 -287 467 102 -64 -275 -1245 -916 -625 880
5140 880 1324 906 88 -471 -1527 -633 1060 1598 1378 961 -448 -405 -411 -167 209 1558 1189 -129 -746
5159g46k81o2R99Q80J072j467n65r64N53L24J396M21K38r05n45r77K45J204N6
5178H76M55n65m61j666L70R00K81Q60K1p96j103k52M21L45P02j61J17O5o91m81
5198g63m1M74J142J48k75p5j441K2M88k33Q48J1P8m54r50mJM61O51L35m09l30
5220c16j53j13J53O55rJ07Q66j108N5q61J190k36O6R3P7m97j76p11M15P32O05
5241H34l08q3p37o7q23N43R31R31j31o24o32p31O68l10J802l10l72k35p03n41
5261h98O17P21J70M76j39j774Lp85J511N0R87J93j523k04o5k9R81M21L52j141
5281g6P4l74p3m52Q67j87P53K52r54p02O0O55j17P93n60o2l25l24j41K61R16N23
5303H07M15l73j425O34m21R3K01Q04k34L77p13o49m44Q02R04l03J88o25l15M5
$$ plain form
5159 -746 -1027 -1089 -90 790 1862 395 -170 -1134 -581 -257 1139 1560 1798 893 348 -629 -384 820 876
5178 876 1331 766 305 -1361 -991 -91 190 1050 1071 275 -828 -1080 -659 -314 388 227 344 409 -282 -763
5198 -763 -804 -330 812 960 685 610 -831 -809 -321 -554 294 305 383 -71 -1021 -1025 -1024 -563 88 423 14 -316
5220 -316 -469 -582 -429 226 217 324 1190 82 137 -724 466 230 296 389 466 -31 -207 -918 -503 229 834
5241 834 526 443 -294 -361 -1184 -641 290 1221 1090 466 -166 -897 -229 -539 1263 953 581 346 -357 -898
5261 -898 -281 440 610 1086 947 -827 -824 -1609 -98 -48 939 1132 -391 -595 -660 -689 292 713 1065 -76
5281 -76 -2 -376 -449 -901 -34 -221 532 784 -170 -872 -812 -157 -274 519 -41 -103 -428 -752 -893 -632 284 807
5303 807 1222 849 -576 58 -363 -270 -69 735 501 878 165 -484 -928 -126 778 475 663 38 -277 -232
5323b32P2K80m52O62m4n04j70O21o83L46J63N01Q31j044m1l05j62K6J249k1m37
5344F56n39p06j03m5M85M79O85l21o12o68L0P42j54O01O13j003m53m44J17M56
5364a84O39N18N16j761k11J14m29R12J01R34j343O1o41L9l72K86J505N57j398
5383a57k11p31l74J127J149o55j6n00N45m80L54J47l80N32R0n70m92M66J67k33
5403b22M34K39k68n43K49m60O0P75N81k11J58l95J15r18M3J072QOj59J67n61o66
5425d96M97k59MQ49K1l47j18j080M18Q29q2L23p65K41q20l7N19m2O85K47j18n19
5447e0o78N49O21M6J49N73j575K75m3o17J116k29J83n0j091k15J63o06J761K23
5467E05L74o50p64r37K75J070J018L84r18p73j58L24m93P66R05L2r10o5l05J22
$$ plain form
5323 -232 -160 120 -332 330 286 -218 -388 233 -450 -104 59 560 1391 347 306 1 -161 -135 1114 1093 656
5344 656 117 -589 -692 -737 -252 227 912 591 -21 -689 -659 83 -71 530 1143 140 -313 -757 -640 -184
5364 -184 455 973 1489 -272 -483 -369 -798 114 215 1149 -194 -133 -774 -735 -1107 -821 684 1241 -157
5383 -157 -368 -1099 -1473 -346 803 148 132 -368 177 -303 51 198 -182 350 440 -130 -622 -156 11 -222
5403 -222 212 451 183 -360 -111 -571 -511 264 845 634 792 397 512 -406 -363 709 717 723 564 731 170 -496
5425 -496 1 -258 -254 595 616 269 151 -929 -511 318 236 559 -206 35 -785 -822 -303 -345 340 587 469 -50
5447 -50 -728 -179 442 488 637 1210 -365 -90 -133 -750 366 137 320 270 -821 -1036 -873 -1479 282 505
5467 505 879 229 -535 -1472 -1197 -127 891 1275 357 -416 -574 -250 -743 23 928 960 50 -15 -320 -198
5487a98m27R97J95m49J12m99J13l07q8Q77j58rk96k83M35j23K75K50K57K14o92
5508A96kl27j6J21O32L93n02p77L92l45M71j2n40P04o8k47o30N3m08Q53K87M39
5530F67N4l18o96q80P88k47P71K51L60p37p83o8L09R6J074q65K56n02k83m9Q3
5551g19J000L21m87p24O3O2M5J58J025m93J20o68J56l35M26O57N71j14j279o1
5571b76m11R40j55K31L16K29r51n14M39l79N50L91L90m51m44m63N8M12O7O20L63
5592I62l80l44n59p8N42L46l07J51M51m78l67m3L66j56O35q47j58M53q3N79r78
5613b93N87M2J38j46l40J78n33Q17J36j87j86k77p11M65J21N0J53j13M04o87K57
5634a25l70RJ07M40M68l28m30m24J56k56N34O03K27l06q37j87j19Q49K82P9q3
$$ plain form
5487 -198 -625 372 567 118 230 -269 -156 -463 -551 326 168 159 -137 -420 15 -108 167 417 674 888 196
5508 196 194 -133 -149 -28 604 997 495 -282 110 -235 236 224 -316 388 320 73 -557 -504 -912 -59 228 667
5530 667 721 403 -293 -1173 -385 -632 139 390 750 13 -770 -838 -529 -433 641 -224 32 -470 -753 -802 -719
5551 -719 281 602 115 -609 -546 -484 -439 -281 744 251 371 -297 -141 -476 -50 607 1178 1064 -215 -276
5571 -276 -687 253 98 329 645 874 -77 -591 -152 -531 19 410 800 349 -95 -558 -500 -88 -21 599 962
5592 962 582 238 -321 -399 143 489 182 333 784 306 -61 -104 262 106 741 -106 -264 189 106 685 -293
5613 -293 294 336 474 328 -12 166 -367 450 586 399 213 -64 -775 -310 -189 -139 14 -99 305 -382 -125
5634 -125 -495 -486 -379 61 529 201 -229 -653 -497 -753 -219 384 611 305 -532 -719 -838 11 293 372 289
5655B89k13o34K66j20N02K90j54j58q8p74K88L71K96k78M54Ln46L80R7m87L29
5676A13J378j03j359n8N9L62k54N42N9k05o13k29N29q33O80P77n77k8m80k30O07
5697A37l36J06L57M67r58r7l20N48k73L58L75q20M48k15K03j49j65J79l08P23
5717B60K96n51j89K13m39N05r93P14M55n02M6j88k39O73N39j79p04Q96l38K55
5737E30p63O14n03Q1k15O2m71RO92j67K85J25j435R08k04J00J92P79j85k01n7
5758A76k11q7O17j64J17L33l93m21K95m3j17M17k09l96N3k26j70L38K04J27k96
5779e6J71K23r85J011J61p35J18kj33j59P3l14P70rK23n71N58n11J94j156J448
5800C19l4k88p0k77L40m99L53K50j73J55k46j96j44Q5J71P9N22j40L37l04j79
$$ plain form
5655 289 76 -558 -292 -412 90 380 226 68 -20 -794 -506 -135 161 -117 337 340 -206 174 271 -216 113
5676 113 1491 1388 29 -29 30 392 138 680 739 534 -79 -308 221 -612 68 845 268 240 -240 -470 137
5697 137 -199 -93 264 731 -227 -324 -644 -96 -369 -11 364 -456 -8 -223 -20 -169 -334 -155 -463 260
5717 260 556 5 -184 29 -410 95 -898 -184 271 -231 -185 -373 -612 61 600 421 -283 613 275 530
5737 530 -233 381 -122 -41 -256 -194 -665 -656 36 -131 154 279 -1156 -248 -452 -352 -160 619 434 233 176
5758 176 -35 -122 495 331 448 781 388 -33 262 219 102 519 310 -86 -33 -259 -429 -91 113 240 -56
5779 -56 115 338 -647 364 525 -210 -92 -94 -227 -386 -313 -627 143 134 357 -214 344 -167 27 -1129 319
5800 319 285 -3 -73 -350 -10 -509 -156 94 -79 76 -170 -366 -510 -425 -254 -175 347 207 544 240 61
5821F1K67k27J5n53K99P4O33m91n2J72m05M02m0K93p4K7r75Q34N8L18k49n74o9
5844b56O8O14l87K87M26j35K45j190K08M29m30L64k42L74n69J20j41l74J103K89
5864H03j050l2j92j82M52K42K30J20O1q6q41J92m17J074j97j47j68l8n08M06L88
5885A10m50L50K82k96k59n89P81n59k62Q52K86o53L03L12m46M30K29r2m87j70
5905c28J00L11k9m95Q17m79J16k65J34n6M05n33L4M42l17M17l72O2P43j226Q22
5926C03k52N17jk36N5K6l5j98L68q71O24o7l60J50m6j78K1m19K96K96k50O96k64
5949A75j71j84J019j263N97L92l61q8m4L17R2o14k29M98m7L06j053J95Q7o64R42
5970i8J54k54N83q22J11K29m19M31l88N38l82K95l75M29J04O26j50o25m6N03p57
$$ plain form
5821 61 328 101 116 -437 -138 -64 569 78 26 198 -207 195 155 448 374 401 -574 260 318 636 387 -187 -256
5844 -256 -188 426 39 326 752 617 862 -328 -120 309 -121 243 1 375 -194 -74 -215 -589 514 803
5864 803 -247 -279 -471 -653 -201 41 271 391 452 366 -475 -283 -700 374 177 30 -138 -176 -684 -278 110
5885 110 -340 10 292 -4 -263 -852 -71 -630 -892 -40 246 -407 -104 208 -238 192 421 329 -158 -328
5905 -328 -228 83 54 -441 376 -103 13 -252 -118 -174 231 -302 -268 174 -143 274 -98 -36 707 -519 303
5926 303 51 568 567 331 386 412 377 179 547 -324 300 233 -127 23 -23 -201 -180 -599 -303 -7 -257 439 175
5949 175 4 -180 839 -424 173 565 204 116 72 389 481 -133 -362 136 89 395 -658 -463 -376 -1040 -98
5970 -98 56 -198 385 -437 -326 -97 -516 -85 -473 65 -317 -22 -397 32 136 762 612 -13 -59 444 -313
5991c13N26j95J24N2l30r27J004J91j90N9N00o89r3j77N75p03Q86n27N13M98J84
6012I68n38J93k75n4L25k87j003J225m17o26O23k83o4o38O73N11p50m19J297j360
6032h99J307o00P08o66N69m18M9n91O44m98N91l70k77K48j24N10j86p94L29J025
6052E57j136R65m53K23l44O32j49k36k96n07O64qQ0q1l5J23j49Q5R9K19K65m41
6074G7o35Q6J26N29m06J64k3J46q4J54n20K00M12L13p61J33J7J16J58k43N01n74
6096a14N52l65N29q36O10j05j31M17n91L82o61M82J19n4N06r79J40l21J10K76
6116c4O57l60N6K4L0k1n80k20M02N12k82m4o05N53Q7k48m8k63N41p14M85l56L36
6139i2m31M98l83p9M63l38O12l12o44Q62k98K12J14o91N68K17L9K92k26K1m43
$$ plain form
5991 -313 213 18 142 194 -136 -1063 -59 132 -58 1 501 -188 -281 -458 117 -586 300 -227 286 784 968
6012 968 430 623 348 294 619 332 -671 554 137 -489 134 -149 -213 -851 -178 333 -417 -836 461 -899
6032 -899 408 -192 516 -150 419 1 50 -541 103 -395 196 -174 -451 -203 -327 183 -3 -797 -468 557
6052 557 -579 386 -67 156 -188 444 295 59 -237 -744 -80 -88 -8 -89 -124 -1 -150 -65 34 253 518 77
6074 77 -558 -472 -346 183 -223 -59 -82 64 -20 134 -386 -186 226 539 -222 -89 -72 44 202 -41 460 -114
6096 -114 438 73 602 -234 376 271 140 557 -34 348 -313 169 288 234 740 -239 -99 -420 -310 -34
6116 -34 623 263 319 343 373 352 -228 -448 -46 466 184 140 -465 88 175 -73 -121 -384 157 -557 -72 -428 -92
6139 -92 -523 -25 -408 -487 -24 -362 250 -62 -706 156 -142 70 184 -507 61 278 317 609 383 404 -39
6160c9kn66M94L8K37m51r7P72n36l06l43J038J94n3m48K08j51P53l80P68j153
6181b3K11n56q0L40K8J96P65p09K14m00r5k31L63O95n65m00K17p42P39j86J33
6202h6K5N89n28L76J28j106J225o06R43j067N07q8j52k92M86n01R17j096N16n15
6222c25k82J4L21L57r4n43k9M62k01rJ64l07O00J05l56N25l46oJ7j94M86J62j010
6245d89J56N29M6l44L2J2K73j46j77k41J85L75k06L68p20p9O87k65R21q88J96
6266B25M4M9k88k74K36O66o11K07J78l65Q0K15k1k43L61m51q3l04j58L09K90K76
6288C38M54l96l54rj62M92o87N68M60j030L39o63P13l46M44j33j48j01N49l89
6308f1n26j73P34n21R1M37o42M78k60N99m21O73K00p08j60N04j89M29r9l52l01
$$ plain form
6160 -39 -41 -607 -113 -75 162 -289 -386 386 -150 -456 -799 239 433 380 -68 140 -11 742 362 1130 -23
6181 -23 188 -368 -448 -108 -80 116 881 172 386 -14 -109 -340 23 718 153 -247 -30 -772 -33 -219 -86
6202 -86 -61 528 0 376 504 -602 623 17 960 -107 400 312 160 -132 354 -147 770 -326 190 -325
6222 -325 -607 -593 -272 85 -9 -552 -581 -119 -320 -329 -165 -472 128 233 -123 402 56 50 67 -127 359 521 -489
6245 -489 -333 196 242 -102 -70 -58 215 69 -108 -349 -164 211 5 373 -347 -426 261 -4 917 29 225
6266 225 269 318 30 -244 -8 658 47 254 432 67 147 362 341 98 459 8 -75 -379 -537 -228 62 338
6288 338 792 396 42 33 -129 363 -324 244 704 -326 13 -650 63 -283 161 28 -120 -221 328 -61
6308 -61 -587 -760 -26 -547 -456 -19 -661 -183 -443 156 -265 408 608 -100 -260 244 55 484 385 33 -268
6329b68Q44p75q6k25M04K49M83m23K7k98k39M46o77J90L34N23j19m24n6k16K88
6350a8N76Q2L1n00n7K4LL08o9J83j00l31o36M38j45M3L51k79l9L80j58k85L30
6373A32P43p73J80J40o52k52P23p00K19O98q8r40J57J27p1K74l49Q69m50k88J9
6394b82j12K45j8L14m9K71o28L56m42k22N86J083o53K89pj703M94J45M86O6k84
6415f5L3k12k00J007n31k45L5J50k23Q89k58n86m6L55M06n98L88o91O42J08k81
6436G7K22J09M61j011L75k15L6J99J66K09p32K61K54K50j013j22J66j6P56m90
6456e8m63j08P87J9J24l6j22j06j7O26j05j8r0M60j203L49j13j54M09l87j27K27
6478a06k07M2j37l90L73Q33p08J69j83j03K54J046m80n67J84K11R2k02j47K61
$$ plain form
6329 -268 576 -199 -285 -510 -106 143 626 203 230 -68 -307 139 -538 -348 -14 509 390 -34 -90 -306 -18
6350 -18 558 640 671 171 114 138 141 449 380 563 463 132 -504 -66 -211 -168 183 -96 -135 245 87 -198 132
6373 132 875 102 282 422 -230 -482 241 -459 -240 458 370 -570 -413 -286 -357 -83 -432 437 -13 -301 -282
6394 -282 -394 -149 -167 147 98 369 -259 97 -345 -567 19 1102 449 738 731 -972 -478 -333 153 219 -65
6415 -65 -32 -244 -444 563 32 -213 -178 -28 -251 638 380 -206 -252 103 509 -89 299 -392 250 358 77
6436 77 299 408 869 -142 233 18 54 253 419 628 -104 157 411 661 -352 -474 -308 -324 432 -58
6456 -58 -521 -629 158 177 301 265 143 37 20 646 541 523 433 893 -310 39 -74 -228 181 -206 -333 -106
6478 -106 -313 -271 -408 -798 -425 408 -300 -131 -314 -417 -163 883 403 -164 20 231 323 121 -26 235
6498B35k76K31J61l9n83n7j93L16M1J68k61m1K97l42O54l93l82R25j02j25p4K14
6520C74N7j46K48l26m64P94j220N90k9P97o33l89r2N08M9p52N48l5J68J43k56
6541f6j98J29o6K69j74J71m74O16p27P63q54J034m16j1M87j113M59J84l18N0j7
6562b72J40j28q30N85O05k51K94K23m59l20J38L38K9J07M60q23o4P15o08j97Q78
6583E60p55k8J64N08n69J73J80k11M08o32L22j98n22O06j57J81N06p3L3o7k09
6604B20n91M52L88RK89j155N65k83J10l39L74o21Q22l24qJ44k33J97l39P81n78
6625a20M03o08o6n25Q06L03k36O94n71K28m77J67L0Q25j083K06k4J38l95K5j16
6646c96K05J06J49k35K14n18N61k66N75J7m18k29j60O39n86L55K54l58j73J0k51
$$ plain form
6498 235 -41 190 351 312 -271 -328 -521 -205 -164 4 -257 -298 -1 -343 311 -82 -464 461 359 234 160 374
6520 374 431 285 533 207 -257 537 -683 -93 -122 675 42 -347 -439 69 118 -634 -86 -121 47 190 -66
6541 -66 -264 -135 -201 68 -106 65 -409 207 -520 243 -611 423 7 -4 483 -630 -171 13 -305 -255 -272
6562 -272 -132 -260 -1090 -505 100 -151 143 366 -93 -413 -275 63 92 199 659 -164 -228 487 -121 -318 560
6583 560 -195 -223 -59 449 -120 53 233 22 430 -202 120 -78 -600 6 -151 30 536 463 496 429 220
6604 220 -371 81 469 478 767 -388 177 -106 4 -335 39 -582 240 -84 -92 52 -181 16 -323 458 -120
6625 -120 283 -325 -391 -916 -110 193 -43 651 80 308 -169 -2 28 853 -230 -24 -48 90 -305 -280 -396
6646 -396 -191 -85 64 -171 43 -475 86 -180 395 412 -6 -235 -395 244 -342 13 267 -91 -264 -254 -505
6667e05o0K07M3L66J09k15k65L04M20n34L90OK87l52K2J35k16L65k88J34K36l34
6689B55k51%P8M91o11O88q77j68J16J59j8L55k05j8n25O14Kl08L78L39o07n8K51
6712H0n31K77J12J83J70J27r21R00n58o46J74J092o66J71l14Q22r32J25J76j0
6732a69k51P90p4m13k39k99P89J37n32K6m3j72m40O10K38K08M88n85K26m08o3
6753a76k74m53R79K86l41J83j68r46P98O1L91O5P0k16l82P15l90k52L64l8l79
6774a03l59N60j84K74j35Q04r54l27J20N11l72o4J332j067N96r75K65l91L12O80
6794E23Nk98m06K70jM3L76p01l92M23j95k00O08P6m51K92L68m94n88P16J41k15
6816a00q4O38m31l37k9j01M80k5l4j31J76L90j92kn08M06p34R62l77j66L85m15
$$ plain form
6667 -505 -565 -358 -315 51 160 -55 -320 -16 404 -130 260 266 553 201 223 358 142 507 219 353 589 255
6689 255 4 4 82 573 -38 650 -227 -395 -279 -120 -138 217 12 -6 -531 83 85 -223 155 494 -113 -171 80
6712 80 -451 -174 -62 121 291 418 -503 397 -161 -807 -633 459 -207 -36 -350 472 -460 -335 -159 -169
6732 -169 -420 370 296 -117 -356 -655 134 271 -261 -235 -278 -450 -890 -280 -42 166 654 69 295 -113 -176
6753 -176 -450 -903 76 362 21 204 36 -910 -112 -51 340 405 475 259 -123 592 202 -50 314 276 -103
6774 -103 -462 98 -86 188 53 857 -97 -424 -304 207 -165 -229 1103 36 632 -343 -78 -469 -157 523
6794 523 528 230 -176 94 93 136 512 -189 -581 -158 -353 -553 55 131 -320 -28 340 -154 -742 -26 115 -100
6816 -100 -184 454 23 -314 -343 -444 36 11 -23 -154 22 412 220 218 -290 116 -618 344 -33 -199 186 -229
6838b29j08L43L28r09J257l71k2k88k17N58P0k05j40j53R5l08K26j21J04N51P8
6859E39p84M08l40J99K43L11n62j73J98j4l74N70Q13o55j17L52m86m11K82J67
6879A66K18n35P14m30p88K07J78M43J14l40M05j52m94J73N35l43P33j81j284J188
6899E27m31j519Q23N32K47P04r12r3p5J45j52P49k73l97J79n11P47r96J015j93
6919A16m35N63k77o86j14J299n64R83j009M64J8o82M54m77N41L97j75J22j007
6938d69r8Q55r88N80M92k90K88K32n44m8j92q2R04o34j99J39K39m7J18k18J3N31
6960E82m46m92M23k39K57l35M30J50l13m63K01K09M7K15l18K96M45q85N40m91
6980a87J74J52J14Q9p52K5Q6lL82l71L31l76J25J17j61o6M28n4q62J94O42o42
$$ plain form
6838 -229 -337 6 334 -575 682 311 289 1 -216 342 412 207 67 -86 9 -299 -73 -194 -90 461 539
6859 539 -245 163 -177 22 265 576 14 -159 39 25 -349 221 1034 379 262 614 128 -283 -1 166
6879 166 384 -151 563 133 -655 -448 -270 173 287 -53 352 200 -294 -121 414 71 804 623 -661 527
6899 527 96 -1423 -600 -68 179 883 -29 -122 -197 -52 -204 545 272 -125 54 -457 290 -706 309 116
6919 116 -319 244 -33 -719 -833 466 -98 885 -124 340 358 -324 130 -347 194 591 416 538 -469
6938 -469 -567 288 -700 -120 372 82 370 602 58 10 -182 -264 640 6 -193 -54 185 138 256 38 51 582
6960 582 136 -356 67 -172 85 -250 180 330 17 -446 -245 -36 11 226 -92 204 649 -236 304 -187
6980 -187 -13 139 253 342 -410 -385 -299 -302 80 -291 40 -336 -211 -94 -255 -321 107 53 -809 -615 27 -615
7002f15L59M47J73n31L25l27o05R36j96K97m60J031o41l13m92M37M09N4M18k6
7022F80l75J31k02m84J09k92M04m98M20J0L24K81N7k58J6j60M67r74O81k42L59
7043D54k76J75m7m64N06p05L59Q99j144M31n14N51j19j04n06j05P74k36K58l05
7063a18K86j98K01k00K63M1n59J61N22j65K88l22N6l6n67N9NK91k99o1O7M20o0
7086G5N07q27j35J06N6R88m35j325J373m82M88j63j27J22k47r6L6k24j28Q97N7
7107E16p92PJ16m0J29o70Q85l38J27L63m2k55J11K85L66r47N64q8k16K3M44L1
7129E79p25L89L35m72k51l9j14N00j64k88J52k69J94L18o17Q03m75O60l60p90
7149f34P08l84N75l5J60j09J41l52p80M11J04N7l9j19L56k08n98P51N2J97o31
$$ plain form
7002 -615 -256 191 364 -167 158 -169 -774 162 -34 263 -197 834 193 -120 -612 -175 234 288 706 680
7022 680 305 436 234 -250 -141 -433 -29 -527 -107 -97 227 508 565 307 323 163 630 -344 337 95 454
7043 454 178 353 306 -158 348 -357 2 901 -243 188 -326 225 106 2 -504 -609 165 -71 187 -118
7063 -118 168 -30 171 -29 234 275 -284 -123 399 234 522 200 256 220 -347 -288 -283 8 -291 -352 -285 135 75
7086 75 582 -245 -380 -274 -218 770 335 -990 383 -99 389 226 99 221 -26 -122 -86 -310 -438 459 516
7107 516 -276 -269 -153 -193 -64 -734 151 -187 -60 303 261 6 117 402 768 -179 385 297 81 104 548 579
7129 579 -146 243 578 106 -145 -184 -298 202 38 -250 -98 -367 -173 145 -472 331 -144 516 156 -634
7149 -634 74 -310 265 230 390 281 422 70 -710 -299 -195 -138 -177 -296 60 -148 -746 5 57 254 -377
7170c77J52k19rK03P01j94K50o93K5O80m27N23Q3l15j23l73J15k04J17o7N33p52
7192c71M63l84j23P62p72O92n9m59J98M69l44k8O26k84K26K36n70k71N01j198
7212f90M38R29L8p15m98O97L89q40m6K18N5K68J55p31j9J73K49R9O37o25P0m3
7234B08m23O96J85j79r44Q11p24l73L08J36J83J54k51j17M15n48J81N58n5Pk59
7255c1j48j48J84M53q9K45m46K67K15l46l9l41kR2l55P81m32K46p33L74L38L58
7277D43n78K46n73L01K89k17L71L86k70r3o3l68P4K40M86Q1k74j0n22m53P12m50
7299b42K23k75N22n13q5m25O27p0l44P95k49J3O03m40J17M19l09m95L62m73J65
7320g4M1L24p66J08P0K86o1J28p1m68K79l01Q24m46l10L19Mk8K22N15J88m15m56
$$ plain form
7170 -377 -225 -444 -453 -250 451 257 507 -186 -161 519 92 615 698 383 260 -113 2 -202 -85 -152 381 -371
7192 -371 92 -292 -415 347 -425 267 208 -251 -53 416 72 44 670 386 612 848 278 7 508 -690
7212 -690 -252 677 715 0 -498 199 588 -252 -298 -80 -25 243 398 -333 -352 -179 70 169 806 181 251 208
7234 208 -215 481 666 487 -457 354 -370 -743 -435 -299 -116 38 -213 -330 85 -463 -282 276 221 228 -31
7255 -31 -179 -327 -143 310 221 466 20 287 502 156 117 -224 -226 -134 -489 292 -140 106 -627 -253 85 443
7277 443 -135 111 -462 -161 128 -89 282 668 398 305 242 -126 -52 188 674 755 481 471 -51 -504 208 -242
7299 -242 -19 -294 228 -285 -370 -795 -168 -238 -582 213 -36 -23 580 140 257 676 367 -128 234 -239 -74
7320 -74 -33 291 -475 -367 -297 -11 -72 56 -15 -483 -204 -505 319 -127 -437 -118 -114 -142 80 595 783 368 -88
7343h8m81L38L23o6j0k75K06n35L41k69J37M54j94J81j09J67n18P93n37J47K55
7364B60R8k31j13J48n92J539m05j45k47k63O9M23j048J061l1n1p43p5L76k40j86
7385c96r5J155n13j32k74j60L77j02m53J049O5k88q4l22N9J6O08Q5p81M2m43J039
7407D52j211K84K34n33N77J13l02L38p4L31k81N48O2R9p31M37j26J5j35L45l00
7428A42o1L7k17L14K49k81k77J31l51m61Q83R9O2M65j032oj40N45l25M70k94N54
7450E06q33Q17k89M5k02R1K1l60O54j011P89j65M6L57j030P44o0q6n59M65k40
7471c00M8N09m87k14N4J532j720O49J38p7O24k87m78K1l3m90Q83K66q10J27N8
7492A3n24j04N10n14J39l20L4N42k89K30J50N38l75r3Q9N6k99N18o13P88L22r89
$$ plain form
7343 -88 -569 -231 92 26 16 -259 -53 -588 -247 -516 -379 75 -119 62 -47 120 -398 395 -142 5 260
7364 260 358 127 14 162 -430 1109 704 559 312 49 118 541 -507 554 523 472 -271 -346 30 -210 -396
7385 -396 -491 664 151 19 -255 -415 -38 -140 -593 456 521 233 149 -173 -114 -98 510 595 -186 -144 -587 452
7407 452 -759 -475 -241 -774 -197 -84 -386 -48 -122 209 -72 476 538 637 -94 343 217 232 97 442 142
7428 142 81 118 -99 215 464 183 -94 37 -314 -775 108 207 269 734 -298 -304 -444 101 -224 246 -48 506
7450 506 -327 490 201 246 44 135 156 -204 450 -561 228 63 109 466 -564 180 120 34 -525 -60 -300
7471 -300 -252 257 -230 -444 -390 1142 -578 71 209 132 756 469 -9 12 -21 -511 372 638 -172 -45 13
7492 13 -511 -615 -105 -619 -480 -800 -766 -224 -513 -283 -133 405 30 -63 26 82 -217 301 -312 476 798 -191
7514a91j44n66K65O11j38N44k22k56k62N80o32L17J008l37n12k33L27j15j67N25
7534D02j6L04q24K71J27k99l4L01L73j24j29l45N6o88O30l87L83M06j54k89J76
7555A40m49P36l93j72P02m22q5L6j2N79k59l48k6ml90j10K48O29J19j95n42R1
7577a27m6l21M14J36M64n92Q0rk8j98Q73l25k12k94M44j75l18M80k99J37n03N78
7599A59r4j79J73n43L70L41N45j274o9M52j76M09o6k73N17j41N7l39m04R11l23
7620E3q1L02j36j31o27Q10k4L73l16l51o4q69O12M51M07L8l88j37M05o02J55K46
7642A26q4j04M86m89j70P96l91R6O32p61O7o8r50O90J16K37j97n51k22L44N49
7663A52m53R19o06o76P60q0j62M37o44L49N14j78k57n77K01O17k41L53n62K21
$$ plain form
7514 -191 -335 -901 -636 -25 -163 381 159 -97 -359 221 -411 -94 914 577 65 -168 159 44 -123 402
7534 402 386 690 -134 137 264 -35 -69 232 605 481 352 7 63 -625 5 -382 1 407 253 -36 140
7555 140 -309 427 34 -138 564 142 57 93 81 660 401 53 27 23 -367 -477 -229 400 519 324 -218 -127
7577 -127 -173 -494 -80 56 520 -72 8 -1 -29 -227 646 321 109 -185 259 84 -234 246 -53 84 -419 159
7599 159 65 -114 59 -484 -114 227 772 -502 -571 -119 -295 114 48 -225 292 151 208 -131 -535 376 53
7620 53 -28 274 138 7 -620 190 166 539 223 -128 -192 -1061 -449 2 409 447 59 -78 327 -275 -120 126
7642 126 42 -62 424 -65 -235 561 170 266 898 137 204 136 -814 -124 -8 229 32 -519 -741 -397 152
7663 152 -301 618 12 -664 96 16 -146 291 -353 -4 510 332 75 -502 -301 316 75 428 -134 87
7683H7J3l52j20J17l41J04P8O72n01O22q8p9m25N89l9m87K19k65l22J48l73R91
7705B48j82J04m00j45J65O68l50m82P05m05k23j5k01L97P66j171L69K59J15n18
7725b96K22J41m69J276k51ql55n42J32Q25m52K2Mk63p82L67M2J66q6P19p92M64
7747H4j38k41l1j14k28O88K16m85j58l8J66J098j135P03m47l02L40q2j10k17N27
7768I6J71j77J19m92o47J304n05l16L48M27n24K63m2n62O60J94l58N34m90j58
7788a55o7K70L46m27j10J36O99q80j5k63L46L52j99k36j29N27K0k97j29N40j49
7809A80L07j027N69k31L72M38J4o50M68n92J23q7j03P59n33k24k21L56q11Q32
7829f1l26O17o23k43R75j21n26K61L34q1rJ27j77n73P34J87J60o93L75r96N53
$$ plain form
7683 87 100 -252 -372 -255 -596 -492 -414 258 -243 379 291 212 -213 376 337 -150 69 -196 -518 -370 -743 248
7705 248 66 170 -230 -375 -210 458 108 -374 331 -74 -297 -312 -513 -116 650 -521 -152 107 222 -296
7725 -296 -74 67 -402 874 623 615 260 -282 -150 675 223 245 249 -14 -796 -429 -387 -221 -307 412 -380 84
7747 84 -54 -295 -326 -440 -668 20 236 -249 -407 -445 -279 819 -316 387 -60 -362 -22 -104 -214 -431 96
7768 96 267 90 209 -283 -930 374 -131 -447 -99 328 -196 67 25 -537 123 317 -41 493 3 -155
7788 -155 -222 48 394 -33 -143 -7 692 -188 -203 -466 -120 232 33 -203 -332 195 215 -82 -211 329 180
7809 180 487 -540 29 -202 170 608 622 -28 440 -152 -29 -116 -219 540 7 -217 -438 -82 -893 -61
7829 -61 -387 230 -393 -636 339 218 -308 -47 287 206 197 324 147 -426 308 495 655 -38 337 -659 -106
7850a06j33J2l68N05O37j091P28k92p7J37K9O9J81r3M1K23m0l13J32K9R0l75k15
7873b90N69m56L13q49J162j015K31K20R1k58k51J72K56o05O87n57K41L47P85j015
7893b22Q2P4p1Q36n32k30N50m89Q47p82L48o23k72K41R4P30o72m15M58O3K92m98
7915a91j23M02K6n41K40M47n2o7j9K25p88L99k01J63o34O45k57N71k87n79N69
7936e2J68M4l4J19k75M54j11q3m56K93L4l08J86k6O19o16M16lr6l39j17N49q10
7959d44L15l51K13M50o53p4r8K40P13N4k21j20M2M00j11M9k96j01N96p63j57P5
7981b42J75k95J76K43l12j30J26o6J40k1L14J30p0j95Q9l93K02O56n15q0K06j26
8003A2l07L12N23m97k30J75N26r63N59L96p96J59M9j78n10M00j80N8L24j64jK18
$$ plain form
7850 -106 -239 -227 -595 -90 547 -544 184 -108 -185 -48 -19 50 231 138 179 402 362 49 181 210 300 -75 -290
7873 -290 279 -177 136 -713 449 -566 -335 -115 -24 -282 -533 -361 -105 -710 -23 -580 -339 8 793 -222
7893 -222 -140 -66 -137 699 167 -63 487 -2 845 63 411 -212 -484 -243 -149 581 -91 -506 -48 15 307 -191
7915 -191 -314 88 114 -427 -187 260 208 141 122 347 -441 -42 -243 -80 -714 -69 -326 245 -42 -621 -52
7936 -52 116 160 126 245 -30 424 313 230 -226 67 101 -207 -21 -47 572 -44 372 369 273 -66 -183 366 -444
7959 -444 -129 -480 -267 183 -470 -544 -642 -402 311 365 144 24 66 466 355 404 108 7 603 -160 -317 -242
7981 -242 -67 -362 -186 57 -255 -385 -259 -325 -185 -206 108 238 168 -27 62 -331 -129 527 12 -68 138 12
8003 12 -295 17 540 43 -187 -12 514 -449 110 506 -290 -131 -82 -260 -770 -370 -550 -492 -168 -332 -333 -115
8025a15J58j26J47o02O61L61j74N7L92m17l92N81k46k04m01J114p81mn87P6N71
8046F9k80O61j75k91l76J33N47k84J09Q0m72J05J001j077O55j87Lm51m61J239
8066E48L90m11r37N0O61n37J48M44m38M61m92q2j52L28q1n2O7j40J12k7P83r19
8088b76J60M12j89K11p6o95O50J61J3n24j30k63M0J134r45J26L88m76q6K83J85
8109A03o76O88j84R6n8J90J27j69k0l7j67m96J109n68k69N96l10l38K81l38N41
8130A01k94K75J58J53p04J3M68j10k52M16n74K24L81N3l51o2o4J06N48rl3Nq28
8153c80P60n92L92p23M40L21l21k76J56O68n95K8J1r1N52j30l9o00M10pQ9K43
8175C16r49M00O62m67M35l57l18k2L95M7J47l68J34J24j87L19
$$ plain form
8025 -115 43 -83 64 -538 123 484 310 367 759 342 -50 531 285 81 -320 794 13 9 -578 -502 69
8046 69 -211 450 275 -16 -392 -259 288 4 113 193 -279 -174 827 -250 405 218 221 -230 -691 548
8066 548 938 527 -410 -360 301 -236 -88 356 -82 379 -113 -195 -347 -19 -100 -152 -85 -225 -113 -140 643 -276
8088 -276 -116 296 107 318 242 -453 197 358 371 -153 -283 -546 -506 628 -317 -191 197 -279 -365 -82 103
8109 103 -573 115 -69 27 -31 159 286 117 97 60 -107 -603 506 -62 -331 265 -45 -383 -102 -440 101
8130 101 -193 82 240 393 -311 -298 170 60 -192 224 -350 -126 255 308 -43 -105 -169 -63 485 476 443 448 -380
8153 -380 380 -212 180 -543 -103 218 -103 -379 -223 445 -150 -122 -111 -202 350 220 181 -419 -9 -16 73 316
8175 316 -633 -233 429 -38 397 40 -278 -300 95 142 289 -79 55 179 -8 311
8191C11
$$ Imaginary data points
##PAGE= N=2
##DATA TABLE= (X++(I..I)), XYDATA
0@%%%%%%l2N6n6R6r6R6j60J92k24K78l40M14m78N64o63P56q89J031j172J353j541
27h15J753j997K244k536K855l184L574l991M438m946N490o096O764p484Q293r177
43d815J0155j1261J2481j3870J5451j7246J9354k1825K4781k8425L2986l8940
55b1174M7073n8874P7745j12797K00132q20192j908980K99354J435702J973701
65A111690J101620j87160j459655j729543j062411L47307J472772J741317Q64928
74B200865m69176j516927j565214p10121N81313J459454J456478N32122o83311
83A285483j478979j329122l91255P74144J422877J192483K21535q62976j408063
92e73873j079217j04098R23756J366875R76299j1423r78999j346625q89495R6530
$$ plain form
0 0 0 0 0 0 0 0 -32 24 -32 64 -32 64 -96 96 -128 150 -190 224 -254 310 -353 403 -486 545 -627 726 -815
27 -815 938 -1059 1185 -1351 1504 -1680 1894 -2097 2341 -2605 2885 -3211 3553 -3931 4362 -4815
43 -4815 5340 -5921 6560 -7310 8141 -9105 10249 -11576 13205 -15220 17766 -21174
55 -21174 25899 -32975 44770 -68027 132105 -688087 -2597067 -2297713 -862011 1111690
65 1111690 2213310 2026150 566495 -1163048 -2225459 -1878152 -405380 1335937 2200865
74 2200865 1731689 214762 -1350452 -2060573 -1479260 -19806 1436672 1968794 1285483
83 1285483 -193496 -1522618 -1913873 -1139729 283148 1475631 1697166 834190 -573873
92 -573873 -1653090 -1757188 -833432 533443 1509742 1498319 519320 -827305 -1716800 -1620270
102a620270J015106J309640Q13571j67930j038528j271030p35838K34865J060468
111c99946J246061O87119k81898j076764j209241n98981L77080J113847J166086
120A023363N21488m25363j107608j113069m34442N17682J149505J058111L10940
129A500607o15700j149521r79033k13864O81219J166299R26446R6110q12367j214264
139f14068q55376L3075Q96484J202911P64514j54223r92991j222709o88382K82311
149a348454J081137J202034N81463l96532j120617j157539m83841M89518J166181
158A3350J126336L96998n70520j169491j044494k79620O46206J167356R69261
167A255382J84181o99231j138751q72292p5882P46873J096643P70656j7770p81007
$$ plain form
102 -1620270 -605164 704476 1518047 1350117 311589 -959441 -1695279 -1460414 -399946
111 -399946 846115 1533234 1251336 174572 -1034669 -1633650 -1256570 -142723 1023363
120 1023363 1544851 1119488 11880 -1101189 -1535631 -1017949 131556 1189667 1500607
129 1500607 884907 -264614 -1243647 -1457511 -776292 390007 1316453 1412563 600196 -614068
139 -614068 -1469444 -1436369 -539885 663026 1427540 1273317 280326 -942383 -1630765 -1348454
149 -1348454 -267317 934717 1516180 1119648 -969 -1158508 -1642349 -1152831 13350
158 13350 1139686 1536684 966164 -203327 -1247821 -1527441 -881235 286121 1255382
167 1255382 1439563 740332 -398419 -1270711 -1346593 -599720 496923 1267579 1249809 468802
177D68802j053814o76607J09885Q12027R98799N66417k04004q28973r36379m74671
187a218518K64080Q29476Q82620L93237l29939q43693q35349l24573L70631Q28963
197A6935P86424K72174m06537q42047p67343k24705M48764Q41351P16302J66346
207A007664m74652q24817o77868j26123N03312Q28778O52197Q4854n27745q11202
217c65602n99463k7514N61147Q11709N71279j6705n95169q03621n10680J00020
227h74599O43224P87219M46651j68991o81045p75026l88159K48626P33182P56388
237G27470L01378l45721p74553p21789k18463M24663Q07936O84897J29168n15671
247D99315q37793o34111l5345N85594Q44192N81060m4883o49537q53965n24835
$$ plain form
177 468802 -585012 -1261619 -1151734 -339707 659092 1225509 1021505 192532 -743847 -1218518
187 -1218518 -954438 -124962 757658 1150895 820956 -22737 -858086 -1182659 -812028 16935
197 16935 803359 1075533 668996 -173051 -940394 -1165099 -716335 125016 841318 1007664
207 1007664 533012 -291805 -969673 -1095796 -592484 236294 888491 973345 445600 -365602
217 -365602 -965065 -992579 -431432 380277 951556 934851 339682 -463939 -974619 -874599
227 -874599 -231375 555844 1002495 833504 152459 -622567 -1010726 -762100 -28918 727470
237 727470 1028848 683127 -91426 -813215 -1031678 -607015 200921 885818 1014986 499315
247 499315 -338478 -972589 -1007934 -422340 421852 1002912 958029 308492 -545473 -1070308
257a070308J35571P11846Q41742M45574k19326p47970q07853l70245K97306P79423
267d240P73375K88514l68047p84702p09370j99476M24770P82386O55126J30899
277I89235m67953p69949n93282n3128N08281P48358N27155j1544n35405p28942
287c87174m73936O6643N60119P00628M09075j27247n79426o73980l62755J62948
297g05105N84255O46514L17980k03980n99441o27201k74180K41796O08290O08235
307E97163K41846k71594o18706n88836k00344L13280O35209N71648J65295l39727
317E05234o39330n51546j25128L83325O63449N33363P2951m32953o70813m95234
327g56682j4911M74071O73143M55559m6560n24745o75773m07133J13856N63120
$$ plain form
257 -1070308 -934737 -222891 618851 1064425 845099 97129 -710724 -1080969 -783663 -4240
267 -4240 769135 1057649 689602 -95100 -804470 -1003946 -579176 203210 858336 989235
277 989235 521282 -248667 -841949 -895077 -386796 361562 888717 877173 341768 -387174
287 -387174 -861110 -794467 -234348 466280 875355 748108 168682 -505298 -868053 -705105
297 -705105 -120850 525664 843644 639664 40223 -586978 -861158 -619362 -11072 597163
307 597163 839009 567415 -51291 -640127 -840471 -527191 108018 679666 844961 505234
317 505234 -134096 -685642 -810770 -427445 236004 769367 842318 409365 -261448 -756682
327 -756682 -771593 -297522 375621 831180 784620 259875 -415898 -823031 -709175 -146055
337a46055O60625L47656j82622o05792o54728k91586K57970O47290O27896K08962
347H69616l37865o72660n86265j34965M00921O87627N43125N6438m64236o92563
357c30827m85543K3702N11604O79338M26636q9847n49898o63274l64072J60236
367f81945N78071O30144K93036k19030n86209n90325k34120K59759N88046N48835
377E86262J71965l04569n85961n01318j17113L30849N68072M56366O8414l56591
387C16376n57173m12506k0642L76441N36421L69765j3439l80683n15177l36659
397f37276M5158L99013N09775L09603p3608m06988m90840k79336J01723M22823
407i9953M90706K61993j27178m38622m80571k29764J59489M53492M73911K07575
$$ plain form
337 -146055 514570 862226 679604 73812 -580916 -872502 -614532 32758 660654 869616
347 869616 531751 -140909 -727174 -862139 -461218 226409 769534 825972 361736 -330827
357 -330827 -816370 -792668 -281064 398274 824910 735063 185165 -478109 -842181 -681945
367 -681945 -103874 526270 819306 600276 14067 -576258 -810378 -550619 37427 586262
377 586262 758227 453658 -132303 -633621 -750734 -419885 148187 604553 672967 316376
387 316376 -240797 -653303 -673945 -297504 238917 608682 595243 214560 -300617 -637276
397 -637276 -592118 -193105 316670 626273 552665 145677 -345163 -624499 -522776 -99953
407 -99953 390753 652746 525568 86946 -393625 -623389 -463900 -10408 463503 671078
417F71078j85960m71922m71953j81739K20931M92066M57461J43704k62753n09278
427i8365m48595j10409K99590N25022M26115N7372l47809n37809l95005q584L83363
438b55114N39029L61153m3939m22319n39651l15686J04275M59712N26330K66679
448F80469j57962m83852n05530k11411K14422N04432M76801J51642k63869n09339
458a04197m37805r7887K99036N08407L98973M1276l39462n05263l54975Q853L62898
469b20146M83575L04802n8992l81374m65134k60899R8513L90234M35956K13437
479E39972j30470l89380m08434j79188J55099L92876L86677J47640j79477l88309
489e2994l57025j10572J97753L81956L37322R1293k04063l75962l16544o6730
$$ plain form
417 671078 485118 13196 -458757 -640496 -419565 72501 529962 673666 410913 -98365
427 -98365 -546960 -657369 -357779 167243 593358 650730 302921 -234888 -629893 -638477 -255114
438 -255114 283915 645068 601129 178810 -360841 -676527 -572252 -112540 413790 680469
448 680469 522507 38655 -466875 -678286 -463864 40568 517369 669011 405142 -104197
458 -104197 -542002 -639889 -340853 167554 566527 607803 268341 -236922 -591897 -583044 -220146
469 -220146 263429 568231 509239 127865 -337269 -598168 -499655 -109421 326535 539972
479 539972 409502 20122 -388312 -567500 -412401 -19525 367152 514792 335315 -52994
489 -52994 -410019 -520591 -322838 59118 396440 487733 283670 -92292 -408836 -475566
499d75566K20922L73434L04588N3561k25935l72057k92108l1540K48502L79099
509A82900K78782J0457k62771l77122k64032R330K79936L82854K51519l7594l07639
520A46620l89122k33582O6147L26071L85799K07768j03866l56561l90428j81154
530e22308J41826L76085L77021J42471j80810l93308l63763j07405K20586M11354
540A01749L47688O2884k59171m16613l14745j6208K92671M18464K85307k7258
550D74768l20395m11141k44069P4951L43130L94534K01526j12885l53794l73182
560c26557j60567J48969L64181L48431J19167j79484l60748l15291p7818K04842
570b34875L54355K86401M2017k24367l44682k50962p698K32009L25232K18624
$$ plain form
499 -475566 -254644 118790 423378 476939 251004 -121053 -413161 -444701 -196199 182900
509 182900 461682 472139 209368 -167754 -431786 -422456 -142520 240334 491853 454259 146620
520 146620 -242502 -476084 -409937 -83866 301933 509701 405835 49274 -341154 -522308
530 -522308 -380482 -4397 372624 515095 334285 -59023 -422786 -530191 -309605 101749
540 101749 449437 512321 253150 -163463 -478208 -494416 -201745 216719 502026 474768
550 474768 154373 -256768 -500837 -425886 -82756 311778 513304 400419 46625 -326557
560 -326557 -487124 -338155 26026 374457 493624 314140 -46608 -361899 -439717 -234875
570 -234875 119480 405881 447898 223531 -121151 -372113 -379811 -147802 177430 396054
580C96054j6403k38179l11492j96587L3645K40724K94698J71820n1909k40860
590H1511k81992j55479O4763K45442K75214J39646p6708k42109k60719j21857
600c32288Q8591K46731K60936J19540r6153k54422k56957j02992J14977K64456
610E2419K52997R0128j29934k74923k52751p5741J48771K83106K42657N2497j71791
621B17435k96380k42007l8973J93062L05437K28475M204k25961l15586k10001
631c80295K7327K46205L12187J82866o1833k69479l09072j55826R6307K85522
641b6091K96928J23513j26716k97957k82866q8160J61421L10366K62224N3023
651C85685j90461l07666k30526r754K15118L04302K07041k0006k28417k92070
$$ plain form
580 396054 379651 141472 -170020 -366607 -332962 -92238 202460 374280 322371 81511
590 81511 -200481 -355960 -291197 -45755 229459 369105 292397 50288 -210431 -332288
600 -332288 -243697 3034 263970 383510 287357 32935 -224022 -327014 -212037 52419
610 52419 305416 395544 265610 -9313 -262064 -337805 -189034 94072 336729 389226 217435
621 217435 -78945 -320952 -359925 -166863 138574 367049 371253 145292 -170294 -380295
631 -380295 -352968 -106763 205424 388290 326457 56978 -252094 -407920 -311613 -26091
641 -26091 270837 394350 267634 -30323 -313189 -401349 -239928 70438 332662 385685
651 385685 195224 -112442 -342968 -352722 -137604 166698 373739 353733 125316 -166754
661a66754j70473N6508K43553K76703J40284p8603k45917k57651j13560J00180
671b15730K46221K37623Q1631j19826k42570k17535o5640J23425K32193J98308
681B58100M4611j37096k30469j83472k7932J38478K18438J68184J7953j39941
691A26854k13542j55506l715J49804K10779J45321k369j47490k03407j39418J1200
702b21489J56051K08344J33897k1950j63807k08996j29685L2403J75571K15017
712A75356J20448n2016j94757k19971j07681P1183K07311K16398R2419r1666k23732
723f708k17470p5977J14629K35358K08477N1119j40644k48174k01289k8559J63146
734a46092K54715J83979l611j88965k57308j62759L3217K06596K50043J38352
$$ plain form
661 -166754 -337227 -280719 -37166 239537 379821 301218 55301 -202350 -315910 -215730
671 -215730 30491 268114 349745 229919 -12651 -230186 -295826 -172401 59792 258100
681 258100 302711 165615 -64854 -248326 -276258 -137780 80658 248842 266795 126854
691 126854 -86688 -242194 -245909 -96105 114674 259995 257626 110136 -93271 -232689 -221489
702 -221489 -65438 142906 276803 254853 91046 -117950 -247635 -215232 -39661 175356
712 175356 295804 243788 49031 -170940 -278621 -207438 -127 216271 308690 217024 -6708
723 -6708 -224178 -300155 -185526 49832 258309 309428 168784 -79390 -280679 -309238 -146092
734 -146092 108623 292602 288991 100026 -157282 -320041 -286824 -80228 169815 308167
744C08167o0018k20385k41010j09600R1906K35240K28537P9136j16947k34139
754c9113k03872m6117J38864K34460J83150K0039j54297k26842j57979N826J61295
765h4586K16411J36447k7529j72812k08762j15397M7449J76382J91353R0297o4300
776A84953j75474j79139p5063P3154J71042J63228N6527p9396j64304j50531m9842
787b24845Q0833J60993J45570M0975q6468j59200j37744l4127Q8176J57420J34214
798A65797L1976r1416j61049j32508k4347R9277J63586J28663J7808j07681j66941
809g6835j26910p607J19995J74562J22847m657j31041j76886j14072K0048J44615
820e5941J81159J06442l8167j59443j83308r1653N9577J72271J81431P2593q1490
$$ plain form
744 308167 248149 27764 -213246 -322846 -230940 4300 232837 311973 195026 -39113
754 -39113 -242985 -289102 -150238 84222 267372 287411 133114 -93728 -251707 -245881 -84586
765 -84586 131825 268272 240743 67931 -140831 -256228 -208779 -32397 158956 249253 184953
776 184953 9479 -169660 -244723 -171569 -527 162701 219228 139832 -24472 -175003 -224845
787 -224845 -144012 16981 162551 203526 117058 -42142 -179886 -214013 -125837 31583 165797
798 165797 197773 106357 -54692 -187200 -211547 -112270 51316 179979 197787 90106 -76835
809 -76835 -203745 -211352 -91357 83205 206052 201395 70354 -106532 -220604 -200556 -55941
820 -55941 125218 231660 193493 34050 -149258 -240911 -181334 -9063 172368 244961 163471
831A63471j88067j75844n2911J05686J96809J61468K5002j28093j97992j46150
841b36621o38J44803J97712J27887k2447j59087j93613j05800M9150J70358J86661
852A58365Q6102o8964j77894j75518o1415R0416J81565J57135L6693j04616j76309
863e4440j38151j6937J12360J69577J19356k377j19701j58479j01832J6587J18458
874e5579J47068Q6229k5875j19567j37332p0273L4420J15384J23402N8169l9365
885A16681j11608j17595n4449M1128J11477J13569M6211m6162j11360j10679m3172
896a65959M8963J12732J08738L9617n3576j14058j07546l5978N7120J19061J12624
907A21738L8063o1912j26919j14858l2609P4225J36520J17412K3748q4936j42793
$$ plain form
831 163471 -24596 -200440 -253351 -147665 49144 210612 235614 107521 -90471 -236621
841 -236621 -237259 -92456 105256 233143 210696 51609 -142004 -247804 -198654 -28296 158365
852 158365 244467 175503 -2391 -177909 -239324 -148908 32657 189792 226485 121869 -54440
863 -54440 -192591 -209528 -97168 72409 191765 189388 69687 -88792 -190624 -174037 -55579
874 -55579 91489 177718 151843 32276 -105056 -175329 -140909 -25525 97877 156046 116681
885 116681 5073 -112522 -166971 -125843 -14366 99203 145414 99252 -12108 -122787 -165959
896 -165959 -116996 -4264 104474 144091 90515 -23543 -131089 -167067 -109947 9114 121738
907 121738 159801 97889 -29030 -143888 -176497 -102272 34248 151660 175408 90472 -52321
918e2321j12541j2970R6507J47332J06339k100j09372j48848r6814J7033J21024
929d6731J49107Q4245l5807j33483j45828o5162N6480J41585J36939M5680p4585
940A12440j47285j26793k3705R3806J52586J12636J813j10325j51006r6229J8328
951a63734J22380J47449Q0008l7682j31222j38253o0252N2771J30269J25964M4612
962A72310o2767j29667j14865l0830O9488J24572J00645J8216p2305j15525q9762
973a30490j0384P2573J10444P8187l53p3879j00817o5975O018P2397R3543N8331
985A09595r467p0099q6967n1914J2140O9474Q4765N2152j2015o8606q6235n2677
997a09854J6182P5121R1133N1425j9388q0978r4450n1511K3186Q7556J01214N2574
$$ plain form
918 -52321 -164862 -177832 -81325 66007 172346 170246 60874 -87974 -184788 -167755 -46731
929 -46731 102376 186621 150814 17331 -128497 -193659 -137179 4406 141345 187025 112440
940 112440 -34845 -161638 -185343 -91537 61049 173685 175498 65173 -85833 -182062 -163734
951 -163734 -41354 106095 186103 148421 17199 -121054 -181306 -128535 1734 127698 172310
962 172310 109543 -20124 -134989 -165819 -96331 28241 128886 147102 74797 -40728 -130490
973 -130490 -140874 -68301 42143 120330 119977 46098 -54719 -120694 -114676 -42279 51264 109595
985 109595 100128 30029 -56938 -108852 -96712 -27238 57527 109679 97664 29058 -57177 -109854
997 -109854 -93672 -18551 72582 124007 104619 23641 -70809 -122320 -99134 -11578 89636 142210
1009A42210k9892r7027j07535n1409L7854J06362J09432M6744m8952j16355j10811
1020a19379l7453O1451J21475J07084K4205p2170j25639j02162j3854Q4782J31402
1031E9742R3848l537j00769j30539p9565K4058J10179J27793O2513m2476j20716
1042E31j19843m3095N8706J22939J09267K7480p1432j25433j00307j1827Q2379
1053g0635J24321Q6803n300r3751j20515p4422J9545R7221J11720N8974l2090
1064A01871r9627j03239m5525M0451R6962R3581L3490m5193r4051q4307k1892
1075a27479N2302R1625P5031J5587n2234q4998o6816q611N4139Q3751O4522O157
1087A02976n4971q0570n9761k921N5825Q2727O0409J650n8418q4438o0104K539
$$ plain form
1009 142210 112318 15291 -92244 -143653 -105799 563 109995 156739 107787 -8568 -119379
1020 -119379 -156832 -95381 26094 133178 157383 85213 -40426 -142588 -156442 -71660 59742
1031 59742 153590 150053 49284 -81255 -160820 -136762 -26583 101210 163723 121247 531
1042 531 -119312 -162407 -103701 19238 128505 155985 84553 -40880 -141187 -153014 -70635
1053 -70635 53686 140489 135189 41438 -79077 -153499 -133954 -36733 74987 133961 101871
1064 101871 2244 -100995 -146520 -106069 -9107 84474 117964 72771 -21280 -105587 -127479
1075 -127479 -75177 16448 91479 107066 54832 -30166 -96982 -105593 -51454 32297 96819 102976
1087 102976 48005 -32565 -92326 -95247 -39422 43305 103714 105364 46946 -37492 -97596 -95057
1099i5057O2473Q6439N9728l833o7546r2052o0437Q421P3413R5099N8470j4818
1111A10300q1137r8463n6799K0912Q9577J01945N0188l4798j00697j03469m1086
1122a43527M7343J06607R9171K9045o1461j14145r4722j4404P4582J17497Q4708
1133A30694m35q6728j18970p4813J5565R8879J19736O3777l3189j09207j13705
1144a08396m6750M8367J12702J05948L1405o2030j14829r5630j6066P1824J12490
1155C9035Q1643J176p9961j08567o9628J2037Q5847J02042N3858k6479q6338q9945
1167h5280l9233L4343Q3158Q1142K9579l7619q1023p2046j9952M2582P8329O4294
1179G8274J3832m4480p5419n8189p280M7149P0218N2417L882m4638o5630m8846
$$ plain form
1099 -95057 -32584 53855 113583 109750 42204 -49848 -110285 -101864 -28451 66648 125118 110300
1111 110300 29163 -69300 -126099 -105187 -15610 86335 136523 101725 1028 -102441 -143527
1122 -143527 -96184 10423 109594 138639 77178 -36967 -131689 -146093 -71511 45986 130694
1133 130694 130259 43531 -75439 -150252 -134687 -35808 83928 147705 114516 5309 -108396
1144 -108396 -155146 -106779 5923 111871 143276 81246 -33583 -129213 -145279 -73455 39035
1155 39035 120678 121854 41893 -66674 -136302 -124265 -38418 63624 117482 91003 4665 -85280
1167 -85280 -124513 -90170 -7012 74130 103709 66090 -14933 -86979 -106931 -64349 13980 78274
1179 78274 92106 47626 -27793 -85982 -93262 -46113 24105 76522 80404 35766 -29864 -78710
1191g8710l858M4342O6125N0122M208m5262o6871m9909k086M6924O9681N1164
1203H5870J641n1101p2487n2329J361N4394P6352N0041o557o2100q2314n1893
1215a09122J2732O9375Q3728M4975k3848p7888q5192l9904L1973Q5176Q5095L0760
1227A07860m4341r1265q1202j8558N4908R6857P7308Q403o5902r8915o8405P015
1239a16237P7359R8860N7794j9928q3958r5323m4764L2895R1045Q9857L2259m5333
1251G4526r1491p9585j8917N3711R0401P1852Q204n8566q8530o2223K114O3677
1263c4827Q3729N2608j1105o5064p7344m3193J7996O3578O9861L2926k1683n9558
1275G924o3270k7751K2608N6608N7072K3316k2983n4073n2994j8762K4478N2350
$$ plain form
1191 -78710 -82568 -38226 27899 78021 82229 36967 -29904 -79813 -81899 -34975 34706 85870
1203 85870 87511 36410 -36077 -88406 -87045 -32651 43701 93742 87185 25085 -57229 -109122
1215 -109122 -96390 -27015 56713 101688 77840 -48 -85240 -125144 -93171 -7995 77100 107860
1227 107860 63519 -27746 -108948 -127506 -72598 24259 101567 109970 44068 -54847 -123252 -116237
1239 -116237 -38878 59982 117776 97848 13890 -81433 -126197 -93302 -2257 87600 119859 74526
1251 74526 -16965 -96550 -115467 -61756 28645 100497 108701 50135 -38395 -100618 -98504 -34827
1263 -34827 48902 101510 90405 25341 -52003 -95196 -77200 -13622 56239 89165 67482 7924
1275 7924 -55346 -83097 -60489 -3881 53191 76507 53524 -549 -53543 -72305 -47827 4523
1287D523M8693J7010k3240m8577m7092j6489K3904N0149M7707J7586k4855n2171
1299b852n0057j8181K7595N7001N2486J4385l4194o3133n4452j3293L7116O6142
1311A8563N5928R447m4542p5140n7485m502N3712P8483N5438m127o2501q3435
1323f0161n0993J4516P2168Q3190M3724k3853p6409q1336l4026L4633Q3190P9341
1335H3984K3980m5379q6822p1602j2251N7402Q9202O3824j004o5055q7108n2431
1347a03260J4684P2797Q4355M1985k4681p5982p7363l1300L4863P8529P1444K1606
1359A07677m1653p7793o4134j1379M6771P4834N4487L202n0557p1183m8689L645
1371g4772M9845O5445M0772q136m9723n9160l5363J0435M7162N4981L1214j1015
$$ plain form
1287 4523 53216 70226 46986 -1591 -48683 -65172 -41268 8881 56588 74174 49319 -2852
1299 -2852 -52909 -71090 -43495 13506 65992 80377 46183 -16950 -71402 -84695 -47579 18563
1311 18563 74491 83938 39396 -35744 -93229 -97731 -44019 34464 89902 85775 23274 -60161
1323 -60161 -111154 -96638 -24470 58720 102444 78591 2182 -79154 -113180 -78547 4643 83984
1335 83984 107964 62585 -24237 -95839 -108090 -50688 38514 102338 101334 36279 -50829 -103260
1347 -103260 -88576 -15779 68576 110561 85880 9898 -67465 -98765 -63902 14627 86071 107677
1359 107677 66024 -11769 -75903 -87282 -40511 34323 88810 92012 41455 -29728 -78417 -74772
1371 -74772 -24927 40518 81290 73154 23431 -35729 -71092 -60657 -13495 41486 72700 61685
1383F1685m5727n1766k7907J2402M3266N0292K7064j2310m3221m8373k6375J1752
1395d9218M2820M9329K5992j3282m5483n1939k7342J5809M9038N4114K5335j9624
1407E5549n4145n5621k3621K5905N9507N6540J8525l2756o2902n5907j3841L9621
1419d3146O8728N5912P017m8018p4253n1920K356N6989P6321M6222j2833o5820
1431A7555p6017l8917K3999P1617P3467K9146l2584p4798o8805k0403M2476P7505
1443B4241O3785R865n1249p7042n5047K053N7154P4485M5369j1856n8486o9801
1455d6529l5705J8622O0733O3211K6591k5933o1191n7021j9395L1138N9107N0176
1467F3804J0222l4413n7147m3002l583L4972N0421L7469R2l4113m7820l3487P43
$$ plain form
1383 61685 15958 -35808 -63715 -51313 -8047 42245 69309 56999 13778 -34595 -60970 -49218
1395 -49218 -6398 42931 68923 55641 10158 -41781 -69123 -53314 -4276 49838 75173 55549
1407 55549 1404 -54217 -77838 -51933 7574 64114 82639 49883 -13019 -68926 -82767 -43146
1419 -43146 25582 81494 88511 40493 -33760 -85680 -83324 -26335 49986 96208 83375 17555
1431 17555 -58462 -97379 -73380 -1763 71704 100850 68266 -6532 -75337 -95740 -53264 24241
1443 24241 88026 97891 46642 -30400 -85447 -83394 -26240 48245 93614 81758 23272 -46529
1455 -46529 -82234 -63612 -2879 60332 86923 60990 -201 -57222 -76617 -45479 13628 63804
1467 63804 74026 39613 -17534 -60536 -64119 -29147 21274 58743 58835 24722 -23098 -56585 -55842
1480e5842L3354M5236L1358j884l2071m4484l0132J051L1798M3463K9029j300
1492D9576l1530m2511k9937J30L1545M4937L1724q27l4264m5911l1597K563L6782
1505a9320M9880L2949n469m1970n1897l0640J1336M7412N4518K7870j6812n2979
1517D878n5731k3189K5037N8610N5486J6124l3490o3522n3919p652M2932O7753
1529C3317M9116m21n1604o9200m2602J0596N7338O8318L5021k0363o1846o5628
1541e7958k8340K8733O6293O2173J8363l7852o7697n6392q545M3612O6946M7952
1553G7288j982m8419o3646l9641R592M9568N7748L1040j4506n0503n3716k5000
1565g2177J9699M9639M8725J8040k3707m8118m2543j2272K5251M5174L8587P471
$$ plain form
1480 -55842 -22488 22748 54106 52222 20151 -24333 -54465 -53414 -21616 21847 50876 49576
1492 49576 18046 -24465 -54402 -54272 -22727 22210 53934 53107 18843 -27068 -58665 -56102 -19320
1505 -19320 30560 63509 58040 16070 -35827 -66467 -55131 -7719 46799 74669 57857 4878
1517 4878 -50853 -74042 -49005 9605 65091 81215 47725 -15797 -69716 -77368 -34436 33317
1529 33317 82433 82012 30408 -38792 -81394 -70798 -13460 54858 89879 69516 7670 -57958
1541 -57958 -86298 -57565 8728 70901 89264 51412 -16285 -72677 -81222 -37610 29336 77288
1553 77288 75306 26887 -36759 -76400 -66808 -17240 40508 71548 57042 6539 -47177 -72177
1565 -72177 -52478 -2839 45886 63926 40219 -7899 -50442 -62714 -37463 7711 46298 53769
1577E3769k5549m1947l3331n719K4367L9225L1807N684k3629l8926k9407m480
1589d8136K4490L7780K8349M003k2878l6445k9233n185K4092L8306L0467L888
1601D9498k6158m1199l2838k373L0756M5773L2521k573l4890m7856l0268O590
1613e3017M0859M9566K7982j1695m4707n0738k4753J7491N1628N2014K0593k5997
1625D9226n6337n0713j3502L4045N9406M6489M850m1587n9924m2273L521M7277
1637a9522N9975L5203j2485n1940n8321k8403K0554N5120N4721J8650k7793n5993
1649a0234m9672j1184L2679N5667M2521L760l7290n3387l5673L087L7461N0301
1661B8036K9473p709l9425m5377k3500J1793L9031M1370J8229j3679l6058l5153
$$ plain form
1577 53769 28220 -13727 -47058 -52777 -28410 10815 42622 48306 24677 -14249 -43656 -48136
1589 -48136 -23646 14134 42483 46486 23608 -12837 -42070 -47255 -23163 15143 45610 49498
1601 49498 23340 -17859 -50697 -53070 -22314 23459 55980 53407 18517 -29339 -59607 -53017
1613 -53017 -12158 37408 65390 53695 8988 -41750 -66503 -49012 2616 54630 75223 49226
1625 49226 -7111 -57824 -71326 -37281 22125 68614 73464 31877 -28047 -70320 -66799 -19522
1637 -19522 40453 75656 63171 11231 -47090 -75493 -54939 181 54902 73552 45759 -10234
1649 -10234 -59906 -71090 -38411 17256 59777 63537 26247 -27140 -62813 -59726 -22265 28036
1661 28036 57509 49800 10375 -35002 -58502 -46709 -7678 33692 51921 38242 2184 -32969
1673c2969j2373J4863L4087L1233J1002j4114k9183k6978r260J1722K7374K5389
1685C0793J1071j0714k5142k5391j1580Q983K3606K6794J2172j0598k5390k6652
1697b2048j2331R147K6569K7674J2662r565k8754l0682j4114J4021L2848L1968
1709C7395J1508j8757l5500l3114p722K2666L9357L0929L897k8778m2787k9130
1721e0036J054L3616M3892K6946p590l9055m6466k1459J4660M4650M2627J6401
1733E9240k2439m4641m0707j0049K7241M7246L6605M203l2019m6678l2803J166
1745e3635L4332M6005K7448p309l7279m2602k1860J2844L7176L6466J5456j6047
1757C0995l5068l2818j0280J7762L4007K8626N760j7382l0714k2222l351J8160
$$ plain form
1673 -32969 -45342 -30479 3608 34841 45843 31729 2546 -24432 -33692 -21970 5404 30793
1685 30793 41864 31150 6008 -19383 -30963 -21980 1626 28420 40592 29994 4604 -22048
1697 -22048 -34379 -25232 1337 29011 41673 32108 3354 -27328 -41442 -27421 5427 37395
1709 37395 48903 30146 -5354 -38468 -46190 -23524 15833 46762 50659 21881 -20906 -50036
1721 -50036 -48982 -15366 28526 55472 47882 8827 -37639 -59098 -44438 212 42839 59240
1733 59240 36801 -7840 -48547 -58596 -31355 15891 52496 56699 24680 -21998 -54801 -53635
1745 -53635 -19303 26702 54150 46841 9562 -33040 -54900 -42056 -4880 31586 47042 30995
1757 30995 -4073 -36891 -47171 -29409 4598 33224 38984 21602 -9112 -31334 -34685 -16525
1769a6525K8342K0096L080j7739k5190j7170o14J6234K2836J7359J769j4398k1931
1782c851j7890k820J3568K2211J7791L417j2640k2672k0645n698J3626K4988K2505
1795C1890N424j4706k7380k4198n884J6765K9628K5450N005k0766l2666k6255
1807c7693j962K3550L4680K3606k843k9203l6813k0959Q424L1371L5314J5684
1819D3156j4475l4796l3659j0882J8976L8196L2945N369k5136m0269k7828J885
1831d6518L1435M1037K4608q637l5989l9439j8421J5217L8232L6292J2255j9273
1843C0799l8394l2746q348K3148L7245K8974K168k5621l5247k5221L859K5659
1855a3725L2552J9584n635k5171k8726j4204Q822K3936K3843J0780q610k1900
$$ plain form
1769 -16525 11817 31913 34993 17254 -7936 -25106 -25720 -9486 13350 30709 32478 18080 -3851
1782 -3851 -21741 -24561 -10993 11218 29009 32426 19786 -2886 -23531 -29229 -15603 9385 31890
1795 31890 37314 22608 -4772 -28970 -34854 -18089 11539 36989 41994 21228 -11438 -37693
1807 -37693 -39655 -16105 18575 42181 39338 10135 -26678 -47637 -39213 -7842 27472 43156
1819 43156 28681 -6115 -39774 -50656 -31680 6516 39461 44830 19694 -20575 -48403 -46518
1831 -46518 -15083 25954 50562 41925 5936 -33503 -51924 -36707 1525 37817 50072 30799
1843 30799 -7595 -40341 -48689 -25541 11704 40678 42846 17225 -18022 -43243 -39384 -13725
1855 -13725 18827 38411 32776 7605 -21121 -35325 -26503 -2567 21276 32056 23446 1546
1867A546k0568q196R077K0397J8120N122q800j8110j5197m654P706J5695J4250
1880A6388M451o428j3410j4694o318N206J3669J5642Q781m899j4850j8162q314
1893b2938M226J7070J8682Q847n898j8355k1308j1163P798K0481K1819R101j0476
1906A7886k4721k1939q043J3613K6079K1745L880j8039k7663j9434M51K0155K8833
1919A2803J6798m160k3491k6488j3414R279K6926K6445P743j3494k6786k2439
1931c0278l655J8941K7047J9048o94k1889k6111j4171O125K3602K3341R554r553
1944B1307k2929k1072n135J3223K2042J7048K510j4693k0002j2847J418J5162
1956c968J8580R315m986j4328j4995m528N405J2951R557K546o424r315p849j241
$$ plain form
1867 1546 -19022 -27218 -18141 2256 20376 25498 16698 -1412 -16609 -21263 -13557 2138 16388
1880 16388 20839 14411 1001 -13693 -20011 -14805 -1136 14506 23287 18388 3538 -14624 -22938
1893 -22938 -18712 -1642 17040 25887 19989 1634 -19674 -30837 -23039 -2558 19261 28362 17886
1906 17886 -6835 -28774 -36817 -23204 2875 24620 28500 10461 -17202 -36636 -36185 -16030 12803
1919 12803 29601 25441 1950 -24538 -37952 -28673 -1747 24698 32441 18947 -7839 -30278
1931 -30278 -33933 -14992 12055 31103 30409 8520 -17591 -31762 -25637 -2035 21306 30860 21307
1944 21307 -1622 -22694 -27829 -14606 7436 24484 26994 12301 -7701 -20548 -19130 -3968
1956 -3968 14612 23927 18941 4613 -10382 -14910 -9505 3446 13003 15549 9125 -190 -8039 -9280
1970i280M042O270N598J99k998m236l640j728O48K745K540K257J538p9l320k996
1986b440n041o17M089O769N721o89o110r705o123J197R061R608N330l614j0117
2001b681j1241n214N498J3276J0375L290q085j4657j0667Q80J1874J5623Q706
2014A6977m296j3423j4117n754P330J5982J3821J772r746j6363j0276O22J2462
2027e009J6966P131l568j3820j6181m503P557J5506J2990J780j0390j4660r583
2040a5784L002J0500J3318O437m197j1002j0965k410O259J0363P548l09o786r822
2054c848m955K002Q073O623J580m035p080l837k19M716M911J258j946m777l467
2069e001R26K862L142q8k377j643q06O19K639J666j619l668k435K95L113N731
$$ plain form
1970 -9280 -5238 1032 6630 6829 3831 -405 -4045 -5773 -5125 -2380 160 2417 3955 3876 556 -2440
1986 -2440 -7481 -8098 -4009 2760 8481 7792 1682 -8023 -14146 -12949 -3888 5720 11050 7436 -2681
2001 -2681 -13922 -19136 -13638 -362 10013 13303 5218 -9439 -20106 -19226 -7352 8271 16977
2014 16977 12681 -742 -14859 -20613 -13283 2699 16520 18292 8546 -7817 -18093 -17471 -5009
2027 -5009 11957 19088 15520 1700 -14481 -18984 -11427 4079 17069 18849 8459 -6201 -15784
2040 -15784 -12782 -2282 11036 17473 13276 2274 -8691 -11101 -4842 5521 13069 12760 5974 -3848
2054 -3848 -8803 -6801 1272 7895 9475 5440 -1640 -5477 -5696 -980 3931 5189 3243 -1534 -5001
2069 -5001 -4075 -1213 1929 1841 -536 -2179 -2985 -2366 273 1939 320 -3348 -5783 -5488 -2375 3356
2085C356J032k662o587m198m82O291P122M871j192q698q870l212M768J1083R619
2100A2241K10p232j1813o821J494R429J1682N861k999j2008j0992l384P557J2245
2114E470R753m67r529j3009p223M648J2837J1707K867o665j2673j0733Q26Q322
2128c869J3148Q244k074j1585j3934n728N959J2512J1546K726q050j2975r004
2141a3084q5R326J1544N237l386r022r154l053L950R284O306J602n254q552m804
2156i145R61O959N462J851l635m690n292J201M354M575m64k514l523j425J583
2171c742K889J902l29k324l629p48K993M023K698q25l312m755j068L080O067M261
2187G181j358n359o634k445L712O974O105M78o060p844m941J962P816Q081M098
$$ plain form
2085 3356 4388 1726 -4861 -9059 -9541 -3250 3872 8743 7551 -1147 -10017 -13229 -8461 2622 12241
2100 12241 12451 5219 -6594 -13415 -11921 -2492 9190 15051 12052 44 -10948 -14332 -6775 5470
2114 5470 15223 14756 5227 -7782 -15005 -10357 2480 14187 17054 10389 -2284 -13017 -12191 -3869
2128 -3869 9279 17523 15449 3864 -10070 -15798 -9839 2673 14219 16945 8895 -4080 -13084
2141 -13084 -13169 -3843 7701 12938 9552 530 -8624 -11677 -7727 1557 7863 9465 4211 -4341 -9145
2156 -9145 -8184 -1225 4237 6088 2453 -2237 -7529 -6328 -1974 2601 2137 -377 -3900 -5325 -3742
2171 -3742 -853 1049 720 -1604 -5233 -5981 -2988 1035 3733 2908 -404 -5159 -6227 -3147 2920 7181
2187 7181 5823 464 -6170 -8615 -4903 2071 8176 8654 2594 -5250 -10191 -8229 -413 7668 11766
2202A1766m479q947q094J44O594R654O374j737o869j0199m301M226R192R132K786
2217A5242o275j0272p334O78P154R219M801l107q697p571l414M664P961O351j152
2232H248n385o878m576K586N827N639J584m519o850l983J192O605N062J791m315
2247B028o277l683J092O175M903J407l262n845m010Q69M591M595K854k891n929
2262c383m371mO281O531K626m095o508n770m97O759Q682M456l358o879r076j444
2278a0050M643R759Q033L15o685j0722p043J841Q911R566N929l997j0059j0374
2292i933l217O574J0649O030J226o623r719n006J453P548Q585K708l137p204o116
2307f182p60M125P992M324q98n754o825k043K035O087L492M50l037n106l553O86
$$ plain form
2202 11766 7287 -1660 -9754 -9610 -3016 6638 13012 11275 4406 -5793 -10094 -5868 3324 12456 15242
2217 15242 8967 -1305 -8639 -7961 -807 8412 13213 10106 1409 -6162 -9576 -4912 3049 9400 8248
2232 8248 2863 -4015 -8591 -6005 -178 5461 7045 2526 -4324 -8307 -7115 -510 4552 6343 2028
2247 2028 -4249 -7932 -6840 -665 4238 5645 2383 -3462 -7472 -6603 -2012 2583 5437 2546 -3383
2262 -3383 -7754 -7758 -1477 5054 7680 3585 -2923 -8693 -9190 -2431 6251 10707 7349 470 -8606 -10050
2278 -10050 -5407 4352 12385 12700 6015 -4707 -11750 -9909 -998 8568 14497 10500 441 -9933
2292 -9933 -13150 -6576 4073 10103 11329 4706 -5013 -10019 -8566 -1018 7567 10275 7138 -66 -6182
2307 -6182 -6942 -2817 5175 9499 8601 2847 -3978 -6021 -3986 2101 5593 6043 3006 -2100 -5653 -4967
2323d967K999L282J140j626k176j858Q20J092P3N03k108K0J341J779J755M0l322
2340a213l493j643K666M962M450K52m218p707m206K049N735P600L024k108r770
2355c620o793j389N307J0159O971Q63p843j0240n548K016R663J1873N156m558
2369A2017j1693j1206j443P828J2649R231p83j0296j2713o736K595J1071J2439
2382A2960L842m982j2263j0831k899P310J1636R124L26q789j0911q005K163Q920
2396b399J0479M656l305r561q367k552M290Q278O518J273n130p383n497l20M822
2411d198N184L954q64m362m193k515L81K782K493K020n8j208m76j761j827n50
2427e198P43L736L230J392p99l227m727k251K578M380N148K587k396o979n651
$$ plain form
2323 -4967 -1968 1314 2454 828 -1348 -3206 -2386 -1294 -1221 -718 -2826 -2806 -1465 314 2069 2109 -1213
2340 -1213 -4706 -6349 -3683 1279 5729 5981 1763 -5944 -10150 -8101 -2366 5234 8258 6150 -3620
2355 -3620 -10413 -11802 -6495 3664 10635 11498 3655 -6585 -12133 -10117 -454 11419 16575 12017
2369 12017 324 -10882 -12325 -4497 8152 17383 16600 6304 -6409 -13145 -10550 521 12960
2382 12960 16802 11820 -443 -11274 -14173 -6863 4773 13897 14223 5434 -5477 -13482 -11319 -2399
2396 -2399 8080 12736 9431 -130 -8497 -11049 -6759 1519 8037 9310 4180 -3203 -8700 -9020 -4198
2411 -4198 986 4940 4076 -286 -4479 -6994 -6613 -3831 -1338 682 624 -584 -1060 -2821 -4648 -5198
2427 -5198 -4455 -719 2511 3903 3104 -123 -4850 -7101 -4523 -143 5005 7592 5196 -1783 -7434
2442g434k466L804P404P121Q45n945r413o804J251Q808J0411N431l496r777r995
2457a0255l631N391J2261J0715K452p843j3261q853j87J0992J2743Q317k158j2369
2471D314j4151n856M419J3368J1813L198o627j3642j0735j531Q942J2664Q558
2484A4734j34j0592j1372o827K990R579J0349M754m691r410r240j914N030R148
2498B404O675o78n559p973n607R56M354P026L023m07m681n252l254R42L526N120
2514F15K714l42k608l963j722M10J244L172K713K173J45l104m015l032j010M036
2530b574O200M756m5n117p729m486O46O415Q491N258j944q445q725m294K880R157
2546D44J0169L899m367j0725j0235k288P359J2000R279j3r470j2527p719K520
$$ plain form
2442 -7434 -9900 -6096 1308 8429 9274 3329 -6084 -12888 -11637 -2829 7582 13013 9517 -260 -10255
2457 -10255 -13886 -8495 3766 14481 16933 9090 -4171 -13024 -13211 -2219 10524 18841 16683 4314
2471 4314 -9837 -15693 -11274 2094 13907 17105 10478 -3164 -13899 -15430 -6488 6176 14734
2484 14734 14600 4008 -7364 -14191 -11201 -1622 8727 13481 8790 -620 -9860 -11774 -6744 2404
2498 2404 9079 8401 2842 -5131 -10738 -9782 -5428 1598 4621 4214 -467 -5719 -8973 -8031 -4505 615
2514 615 3329 2987 379 -3584 -5306 -4896 -3652 -480 2233 4406 4551 1447 -2568 -5600 -6610 -2574
2530 -2574 3626 8382 8337 3220 -4509 -8995 -8349 -1934 6557 11815 9871 1426 -7299 -11593 -8713 444
2546 444 10613 14512 10145 -580 -10815 -13103 -5744 6256 15535 15522 6052 -6475 -14194 -11674
2560a1674J1142J1047O608m240j2604j1880m522O293J2176J1454K207r615j3065
2573f673q779O06J0083J2546O568k457j1173j1346n309M318J0408J1079K946n427
2587G390j0165r270j908N803R907P089K53o098q894n134M89N521O959M435p48
2602E629m408n994k903N90L191N455K876o33k755l856k377%J848M674L055J628
2618F020j318m561l198k088J016N967M921K574j985o027o658k848K911P202Q101
2633A0029K512m819r100p906o81O095J0240P375N85p670j1701p432P70J0450J1598
2648A0345O510k698j1966j2493m895M845J2967J1393K974p576j3792j1102j174
2661a6662R447J3852P887o41j0887j2592p975L242J1039J3157M987m960j2463
$$ plain form
2560 -11674 -532 10515 17123 12883 279 -11601 -16123 -9830 2346 13800 16007 6392 -6673
2573 -6673 -15452 -14846 -4763 7783 14351 11894 721 -10625 -15934 -11616 -1208 9871 12817 7390
2587 7390 -2775 -12045 -13953 -8150 1757 8846 9099 3001 -5893 -11027 -10538 -5017 1942 6377 5629
2602 5629 1221 -4773 -7676 -7086 -3895 1560 4436 3803 1048 -2808 -5185 -5185 -3337 1337 4392 6020
2618 6020 4702 141 -3057 -5145 -4129 1838 6759 9333 7348 1321 -5337 -8185 -5274 1928 10029
2633 10029 12541 7722 -1378 -9284 -9965 -3870 6370 13745 14330 6660 -5041 -12473 -11703 -1253 10345
2648 10345 16855 14157 2191 -10302 -15197 -10352 2615 14008 16982 9406 -4386 -15488 -16662
2661 -16662 -7215 6637 14524 13883 2996 -9596 -17571 -14329 -3290 9867 14854 9894 -2569
2674b569j1044l639P685J2143R511N46p764j1300p560J168Q593R369O270k902
2688H507p151q740m576K763P595P631L101l138p720n245k548M854M806O222P62
2703G123k443m277m432j746K517L874L702K986j970l573l808k673J403K987M597
2718D267K968o17l057o023k847k82M535O104M060k58n264o577n522J387P185P283
2734G342M145k661q008q491l616L808R018Q578J919m641j0919q121q63P166J0396
2749E052P130j175q216j1089o518K788J0221J1352M237m769j1260j0839k471O636
2763h921J1534R508R47q138j2228p483M33R445J1247O000k256r452r261n140L294
2778a0471J0264Q057K821l738q692p092j896O000P432N665O02m907o634l851L89
$$ plain form
2674 -2569 -13613 -17252 -9567 2576 12087 12633 4869 -6431 -13991 -12823 -4230 5139 11409 8507
2688 8507 1356 -7384 -11960 -9197 -1602 6029 9130 5992 -1728 -6973 -9521 -4667 139 6361 7123
2703 7123 4680 403 -4029 -5775 -3258 616 4318 7304 5334 1761 -2047 -4720 -3317 -330 4267
2718 4267 7235 6618 3561 -2462 -5309 -5591 -1056 5048 9108 8850 3586 -2991 -8513 -7126 59 7342
2734 7342 11487 8826 818 -7673 -11289 -7481 1537 10115 12034 7393 -3526 -11647 -12510 -5344 5052
2749 5052 12182 11007 2791 -8298 -14816 -12028 -1807 9545 13782 9013 -2247 -13086 -15557 -8921
2763 -8921 2613 12121 13068 4930 -7298 -14781 -14348 -4903 6344 12344 10088 636 -8625 -13765 -10471
2778 -10471 -207 7850 10671 6933 -1759 -8851 -10747 -4747 2685 8350 8952 4045 -2589 -6440 -6051
2793f051M094N605L050r68l407m903j823N28L044M213K237p10k510k843k097k46
2809b787J902K410L147J124j374l508k908k599J331M430M017K255j963m782n715
2824e020k825J738O292O147J379l159o723o901k207N088P994O667J102o408q686
2839e522o271O84P509R358M912k782p667r780m132M590R690Q193L030n963j0920
2854e071p714m74P842J0232O665j482q919j0219m464K407J0153R380L579m880
2868G035r029p865k657O055R231P350P33o367q278n712M20O312Q103M402j188
2883H545o734o250l646K064O496N209K354k337n493m786k311L064M469L362J818
2898E824n34l601m209k807K038L630L561J601j100k574l639k762L59K929L895
$$ plain form
2793 -6051 -1957 3648 6698 5730 2323 -2580 -4403 -3875 -831 3382 5619 4909 2399 -444 -2541 -2787
2809 -2787 -885 1525 4672 5796 4422 914 -1994 -4593 -3262 1168 5185 7440 5477 695 -5020
2824 -5020 -7845 -6107 185 6332 7711 4552 -2171 -9072 -11279 -6191 1803 8470 9572 3164 -5522
2839 -5522 -11793 -11109 -3600 5758 10670 7888 221 -9559 -13691 -9101 589 8782 11812 5849 -5071
2854 -5071 -12785 -13259 -5417 4815 11480 9998 1079 -9140 -13604 -11197 -1044 8336 11915 7035
2868 7035 -1994 -9859 -12516 -6461 2770 10120 10853 4486 -3792 -9504 -9084 -2772 5331 9733 8545
2883 8545 1811 -4439 -8085 -6021 475 5684 8038 5701 208 -4578 -6889 -3825 644 4006 5824
2898 5824 5290 1689 -2520 -5327 -3289 341 3902 5503 4403 1829 -1810 -4572 -4213 -1284 2611
2913B611K657K1l006m627l952o40L800N285L713l54n206o014l651R66N920O449
2929C972M442k261p210p595k854L754P438Q199J101m805q859o094k98O395R321
2944D646N556j002p152r683m843K506Q583R277L754m167r677p708k333N388R638
2959B783P988O94o562r529n356J439O279R327M182k036o870p990l307L424P565
2974B031O744J045l566p400m969q00L475O933M195q93m465n533k210M57L925L984
2990B953K046q62l057l930j676J057K470L521J177j326j598k802k071M31J165
3005b502K576K269M33j138k095l003j788P18L245L741P60R2m581l821k264J751
3021e607N201L725J915j708n754m682j087L268O659M620Q40m953o090l693K97
$$ plain form
2913 2611 5268 5289 2283 -2344 -6296 -6936 -3136 2149 5862 5508 302 -5712 -9363 -8397 -2477 3972
2929 3972 8414 6153 -1057 -8652 -11506 -7752 -314 7885 8986 4181 -4678 -10772 -11070 -4675 4646
2944 4646 10202 9200 2048 -7635 -12478 -9972 -1389 7888 11642 7475 -2202 -9910 -12243 -6855 2783
2959 2783 10771 11465 4903 -4626 -9982 -8543 -2264 7063 11245 9209 2339 -5651 -8958 -5534 2031
2974 2031 8775 9820 6254 -1146 -6115 -6915 -3440 3493 7688 6795 2330 -3203 -5413 -4956 -1031 2953
2990 2953 4999 4137 1080 -2850 -4526 -3469 -999 2522 3699 2373 775 -2027 -4098 -3667 -2502
3005 -2502 74 2343 2776 1638 -457 -3460 -5248 -4530 -1285 2456 3216 3308 -1273 -5094 -7358 -5607
3021 -5607 -406 3319 5234 3526 -2228 -6910 -7997 -4729 1930 6550 7390 2437 -3653 -7346 -7049
3036g049N810O665L940k355o233o489k635L239P216N344J292m206p360m964N0
3051g735N170P100N143j470n487p338l186K671O974O254K261l254o419n870k56
3066e442L039O790L754K97m602n689l247J204L700M191J382n44m211m126j518
3081e022J459L668K668O88j784k072k302J03M24L069Q86k6o12j311o70j467P5
3098b226J490Q54J397k82r3j662k006r83K99J992K199L74m73k335k334j527J656
3115c660M119L464J153k284l982l161oL080M114L445Q47m634n510k690J249N025
3131E69M968K100k026n648n585j732L658O300N326p81l479o688l491J517M736
3146b56O289K688j633n225o268j143K593N564N498L2m038n788l666J82L858N368
$$ plain form
3036 -7049 -1239 5426 9366 7011 778 -5711 -8346 -5107 2109 7453 8745 4539 -2821 -7785 -7735
3051 -7735 -2565 4535 9678 8208 2721 -4617 -7803 -5132 1842 8096 10357 7103 684 -5186 -5442
3066 -5442 -2403 4387 8141 8438 3836 -1853 -5100 -3896 -196 3995 5377 4833 622 -3504 -5022
3081 -5022 -3563 105 2773 3461 1677 -395 -2697 -2594 -2170 899 1785 1759 1147 -164 -834 -2301 -2226
3098 -2226 -736 118 1515 1233 1140 -522 -2528 -3511 -3212 -1220 979 1353 880 -1455 -3789 -5316 -3660
3115 -3660 459 3923 5076 2792 -1190 -4351 -4357 -1277 2837 6282 7129 2495 -3015 -5705 -4456 569
3131 569 5537 7637 5611 -37 -5622 -7354 -3696 2604 7930 7149 3670 -3018 -6509 -4992 -256
3146 -256 6033 8721 7088 1863 -4405 -5548 -2955 2609 8107 8139 4101 -1687 -5353 -5171 -1313 4055
3162D055K343j311n049m474j021J398M157M273N39k511m373k496O3K824L752J355
3178C524l88l143k406j038R08J877K359O78m97j984k173j133J549P58J259L11
3194D61j49J58j156n07q78K94J012J483J265n41j008q40j580RJ433K672K41R62
3212C331j896k396j833N28J958M066J023m80l905l698m68K656L281L011k27j890
3228C061m328k274L73L408M800J793j642n146m273j162K788N065L893Q66m424
3243B798n556l481P38L675N927J675j021m244n205j376K220M300L699J041k025
3258C165n114l862M64K970M535J748j286l476k853j724K015L665J639L32k297
3273g9k588j466P96K506J860R57p53j796j899K33P68K501K05L04j947o71l27K43
$$ plain form
3162 4055 6398 5087 38 -4436 -5457 -4059 98 4371 4910 2399 -1974 -4470 -4407 -1583 2169 3524
3178 3524 3136 -7 -2413 -3451 -2543 -666 1693 2371 1874 -110 -2283 -3416 -1867 -1109 150 461
3194 461 312 470 -686 -1193 -2071 -1777 -765 718 1983 1442 434 -406 -1986 -1977 -544 2128 2369 3331
3212 3331 1435 -961 -2794 -2266 -308 3758 4781 4301 396 -3302 -3770 -1114 2167 5178 4951 3061
3228 3061 -1267 -3541 -3168 240 5040 6833 5191 45 -4228 -5390 -2602 2463 6356 7222 2798
3243 2798 -2758 -6239 -5501 -1826 4101 5776 4755 511 -4694 -6070 -3850 450 4149 5190 3165
3258 3165 -1949 -5811 -5347 -2377 2158 3906 2620 -856 -3709 -5433 -3418 247 1886 2218 -79
3273 -79 -2667 -4133 -3337 -831 1029 1986 1233 -563 -2462 -2229 -1461 1040 1245 1549 -398 -1069 -1396 -1153
3291a153J110K16L30r75R5P8N73M20j92j098j60M27M17J630M76l78j940o24l29
3310a077J510J551J621l08j998k180o88N75K422J622N76j565k920k173P61J987
3326b84L071Q93j202k997k377r29J912L240K176K34k010k781k477O32K417L000
3342B518J014j108k472l189k19J455J664K543M60k959k194j611J045J856K390
3357A193P41p20k886j151l2J104J555J399mj428j935O84N60J553M13r41q10m26
3375a131q4O98J096k95J8j620j73N95J410J295M7j215j240j047K18J389L147M74
3393C582j310k509j638K27J590K302J772o00j839k595j490J388K142J970K20o09
3409B603l327j721Q06J693J300K546j647r39k798j045Q14K520K174J83k327l015
$$ plain form
3291 -1153 -43 173 503 -472 -377 -299 274 694 502 -596 -756 -329 88 1718 2194 1816 -124 -748 -1077
3310 -1077 433 1984 3605 3297 1299 -881 -1569 -994 1428 3050 3626 2061 -859 -3032 -2271 -284
3326 -284 2787 3680 2478 -519 -2896 -3825 -1913 1327 3503 3737 1727 -1054 -3531 -2899 -482 2518
3342 2518 3532 2424 -48 -3237 -3456 -2001 -337 2206 2666 -293 -2487 -4098 -3053 -1197 1193
3357 1193 1934 1214 -1672 -2823 -2855 -1751 -196 1203 1199 -229 -2164 -1480 -920 633 1046 105 -705 -1131
3375 -1131 -1215 -517 579 284 302 -1318 -1491 -896 514 1809 1856 641 -599 -1646 -1428 -39 3108 3582
3393 3582 2272 -237 -1875 -1648 -58 2244 4016 3416 1577 -1018 -2508 -1120 1022 2992 3212 2603
3409 2603 -724 -2445 -1639 54 1354 3900 2253 1314 -1484 -2529 -1715 805 2979 3162 835 -2180
3425b180m73m40K844K126J201j780k197k240j10J717K126N82L80j710j885o42
3441b681J096J767J270m38p63j355j094J244N87P70P04j790p75l4Q40P76Q68m16
3459E76k59j759k64J583K20J134K77j164j407j60M04J441J862k60m53k013r05
3476a147Q51J167J624P21j159k457j145k08K145J811P23p18j532k598l40J710
3492e52J891K533j29j602l265j382M51K265K295J213q47k530k411j99J350J980
3508A061J459m22j463j538k156Q67J525J335Q87j040j450j104j97J220M87P17
3524A88m63j008M47l74jJ025j34j168M07K84J14R9r2R12r41j75n64K3J453R57
3544I89n14j212j266p9N53K973M60J94j600k261l66n4L398J309P10j022k688q46
$$ plain form
3425 -2180 -2653 -3093 -249 1877 3078 1298 -899 -3139 -3249 -1532 594 1176 1556 -154 -2039 -2681
3441 -2681 -1585 182 1452 1014 251 -1104 -2198 -954 -367 403 1107 -683 -1458 -1492 -652 124 992 576
3459 576 317 -1442 -1706 -123 97 1231 1508 344 -1063 -1223 -819 622 2484 2224 1771 -242 -1147
3476 -1147 -296 871 2495 3216 2057 -400 -1545 -1753 392 2203 2926 2208 676 -1922 -2262 -552
3492 -552 1339 3872 3743 2141 -1124 -2506 -2055 210 2505 3718 2871 341 -2070 -2269 -919 1061
3508 1061 2520 2098 635 -903 -3059 -2192 -667 668 1555 515 -935 -2039 -2236 -1016 -529 188
3524 188 -275 -1283 -836 -1210 -1211 -186 -320 -1488 -1081 -797 -683 -584 -676 236 -705 -880 -1444 -1421 32 989
3544 989 475 -737 -2003 -2082 -1529 1444 1904 2098 498 -1763 -2129 -2183 1215 2524 3234 2212 -476 -1322
3562a322j550K786K611P73K0k805k412j583K234K326K587P59j945l093k714L21
3578c007L284L073J374j409l101k758j214J436K509L010O29j953l451k486m2K924
3594a182L204J334j118k179j995k151J576L062K108jj494k763j611R39J113K639
3610A481K79o28j968j586j263J814J090N95P33o20j738n37M3R63R94J238k79L50
3628I61j262m35O53kL52L74O62n28K34j162o31r8j19O97J369L9J94p40j580K4
3648i98j234K010J828J256j033j079k585l14N87K532J669L39j317k242k480J180
3664a881K498J905N98o99k045k913p61M62L389K525k63j860l463k222N38L106
3680a086L338J016j137l244k282p89J416K484L148K14j262l569j782k05K355K241
$$ plain form
3562 -1322 -2872 -86 2525 3298 3318 513 -1899 -3482 -1248 1078 3665 4424 2479 -614 -3328 -3007
3578 -3007 277 3350 4724 3315 214 -2544 -3758 -2322 187 3197 3826 1873 -1578 -4064 -4106 -1182
3594 -1182 2022 3356 2238 59 -1936 -4087 -2511 551 2659 2658 1164 -1599 -3210 -2271 -1158 1481
3610 1481 1760 1132 -836 -2422 -3685 -1871 -781 -186 547 -73 -1811 -2348 -2305 -1342 -348 890 611 961
3628 961 -301 -736 -83 -85 267 641 1303 775 1009 -153 -784 -882 -1001 -304 1065 1104 1298 558 -1022 -998
3648 -998 -2232 -222 1606 2862 1829 750 -1835 -2149 -1562 970 2639 2978 1661 -581 -3061 -1881
3664 -1881 617 2522 3120 2421 376 -2537 -3298 -2836 553 3078 2815 955 -2508 -4730 -4192 -1086
3680 -1086 2252 3268 2131 -1113 -3395 -4184 -2768 -284 2864 3078 1816 -1753 -3535 -3740 -1385 856
3696H56J984o25k852k085j268R40K846J672N98j225k552j589k32K088K274Q50
3712A680L91j805j486p44P29J244Q43O10k26j433J38o53L04Q46J110q28m04j7
3730B99m8k95n76L6O39L47J067l68L41j584q35l80J533J676J57O84k084n86j484
3749a461L84P28J901J216n09j753k303j404L62L479J972P17j543l429j991M85
3765c149J271L269K647j925j401l279j140L46K675L473K51r17l685k124j137K023
3781b802L653K768p2k923l444k152L87M214K225J565p52l021k611j270J588L453
3797H06J963J180k514k147k278j358K875K945J886m75k282j718j367J40K061J204
3813I21K205j123j233k000n58O69J931Q12R38k98j607p22o49m76J710O60Q76M17
$$ plain form
3696 856 2840 2215 -637 -2722 -3990 -3050 -204 1468 2066 841 -1711 -3300 -3532 -1444 830 1680
3712 1680 2071 266 -1220 -1964 -1235 9 852 1462 1236 -197 -59 -712 -408 438 1548 720 316 299
3730 299 251 -44 -620 -584 55 402 1469 1101 1442 -142 -977 -1357 176 1852 2009 2693 609 23 -1461
3749 -1461 -1077 -349 1552 2768 2259 506 -1797 -3201 -2839 640 2612 3329 1786 -1643 -3634 -3149
3765 -3149 -1878 1391 4038 2113 712 -2567 -3707 -3361 -686 2787 3038 2121 -1564 -3688 -4825 -2802
3781 -2802 851 3619 3547 624 -2820 -4972 -4585 -371 1854 3419 2667 -354 -2965 -4235 -2647 806
3797 806 2769 3949 1435 -712 -2990 -4348 -1473 1472 3358 2883 601 -1117 -2484 -2344 -283 921
3813 921 3126 2003 770 -1230 -1788 -1119 812 1624 2562 2264 657 -65 -714 -1190 520 1180 2056 2473
$$ [...]
8191a51
##END NTUPLES=NMR FID
##END=
