##TITLE=1H_IAMT-122
 CDCl3, 32 sc, 
 11.3.2019
##JCAMPDX= 6.0         $$ Bruker NMR JCAMP-DX V2.0
##DATA TYPE= NMR FID
##DATA CLASS= NTUPLES
##ORIGIN= UXNMR, Bruker Analytische Messtechnik GmbH
##OWNER= root
$$ XWIN-NMR		Version 3.5
$$ Mon Mar 11 14:17:40 2019 Russian Standard Time (UT+4h)  she@DPX200
##.OBSERVE FREQUENCY= 200.1314
##.OBSERVE NUCLEUS= ^1H
##.DELAY= (6, 6)
##.ACQUISITION MODE= SIMULTANEOUS
##.ACQUISITION SCHEME= undefined
##.AVERAGES= 32
##.DIGITISER RES= 18
##SPECTROMETER/DATA SYSTEM= spect
##.PULSE SEQUENCE= zg30
##.SOLVENT NAME= CDCl3
##.SHIFT REFERENCE= (INTERNAL, CDCl3, 0, 15.7039)
##AUDIT TRAIL= $$ (NUMBER, WHEN, WHO, WHERE, WHAT)
$$ ##TITLE= Audit trail, XWIN-NMR		Version 3.5
$$ ##JCAMPDX= 5.01
$$ ##ORIGIN= Bruker BioSpin GmbH
$$ ##OWNER= she
$$ F:/spectra/data/she/nmr/H-F/1/audita.txt
$$ ##AUDIT TRAIL=  $$ (NUMBER, WHEN, WHO, WHERE, WHAT)
(   1,<2019-03-11 14:16:22.06 +0400>,<she>,<DPX200>,
      <continue with go, POWCHK disabled, PULCHK disabled
       configuration hash MD5:
       00 E9 B6 7A A2 85 ED C7 34 08 36 98 17 FE 4E 26
       data hash MD5: 16K
       E5 32 76 7C FC 64 B5 62 78 71 6B 24 CD 0A 72 F8>)
$$ ##END=
$$ 
$$ hash MD5
$$ 3D DB 51 82 AB B1 FB C1 83 ED C1 43 13 5D 1E 04
##$RELAX= 
##$RELAX= 
##$RELAX= 
##$RELAX= 
##$RELAX= 
##$RELAX= 
$$ Bruker specific parameters
$$ --------------------------
##$DU= <F:/spectra>
##$EXPNO= 1
##$NAME= <H-F>
##$PROCNO= 1
##$TYPE= <nmr>
##$USER= <she>
##$AMP= (0..31)
100 100 100 100 100 100 100 100 100 100 100 100 100 100 100 100 100 100 
100 100 100 100 100 100 100 100 100 100 100 100 100 100 
##$AQSEQ= 0
##$AQ_mod= 1
##$AUNM= <au_zg>
##$AUTOPOS= <>
##$BF1= 200.13
##$BF2= 200.13
##$BF3= 200.13
##$BF4= 200.13
##$BF5= 200.13
##$BF6= 200.13
##$BF7= 200.13
##$BF8= 200.13
##$BYTORDA= 1
##$CFDGTYP= 0
##$CFRGTYP= 5
##$CHEMSTR= <none>
##$CNST= (0..31)
1 1 145 1 1 1 1 1 1 1 1 1 1 1 1 1 1 1 1 1 1 1 1 1 1 1 1 1 1 1 1 1 
##$CPDPRG= <>
##$CPDPRG1= <>
##$CPDPRG2= <>
##$CPDPRG3= <>
##$CPDPRG4= <mlev>
##$CPDPRG5= <mlev>
##$CPDPRG6= <mlev>
##$CPDPRG7= <mlev>
##$CPDPRG8= <mlev>
##$CPDPRGB= <>
##$CPDPRGT= <>
##$D= (0..31)
0 1.2 0 0 0 0 0 0 0 0 0 0.03 0 0 0 0 0 0 0 0 0 0 0 0 0 0 0 0 0 0 0 0 
##$DATE= 1552299243
##$DBL= (0..7)
120 120 120 120 120 120 120 120 
##$DBP= (0..7)
150 150 150 150 150 150 150 150 
##$DBP07= 0
##$DBPNAM0= <>
##$DBPNAM1= <>
##$DBPNAM2= <>
##$DBPNAM3= <>
##$DBPNAM4= <>
##$DBPNAM5= <>
##$DBPNAM6= <>
##$DBPNAM7= <>
##$DBPOAL= (0..7)
0.5 0.5 0.5 0.5 0.5 0.5 0.5 0.5 
##$DBPOFFS= (0..7)
0 0 0 0 0 0 0 0 
##$DE= 6
##$DECBNUC= <off>
##$DECIM= 24
##$DECNUC= <off>
##$DECSTAT= 4
##$DIGMOD= 1
##$DIGTYP= 9
##$DL= (0..7)
0 120 120 120 120 120 120 120 
##$DP= (0..7)
150 150 150 150 150 150 150 150 
##$DP07= 0
##$DPNAME0= <>
##$DPNAME1= <>
##$DPNAME2= <>
##$DPNAME3= <>
##$DPNAME4= <>
##$DPNAME5= <>
##$DPNAME6= <>
##$DPNAME7= <>
##$DPOAL= (0..7)
0.5 0.5 0.5 0.5 0.5 0.5 0.5 0.5 
##$DPOFFS= (0..7)
0 0 0 0 0 0 0 0 
##$DQDMODE= 0
##$DR= 18
##$DS= 0
##$DSLIST= <SSSSSSSSSSSSSSS>
##$DSPFIRM= 0
$$ [...]
##$SUBNAM2= <"">
##$SUBNAM3= <"">
##$SUBNAM4= <"">
##$SUBNAM5= <"">
##$SUBNAM6= <"">
##$SUBNAM7= <"">
##$SUBNAM8= <"">
##$SUBNAM9= <"">
##$SW= 24.9337183474449
##$SWIBOX= (0..15)
0 0 2 0 0 0 0 0 0 0 0 0 0 0 0 0 
##$SW_h= 4990.01996007984
##$TD= 16384
##$TD0= 1
##$TE= 0
##$TE2= 300
##$TE3= 300
##$TEG= 300
##$TL= (0..7)
0 120 120 120 120 120 120 120 
##$TP= (0..7)
150 150 150 150 150 150 150 150 
##$TP07= 0
##$TPNAME0= <>
##$TPNAME1= <>
##$TPNAME2= <>
##$TPNAME3= <>
##$TPNAME4= <>
##$TPNAME5= <>
##$TPNAME6= <>
##$TPNAME7= <>
##$TPOAL= (0..7)
0.5 0.5 0.5 0.5 0.5 0.5 0.5 0.5 
##$TPOFFS= (0..7)
0 0 0 0 0 0 0 0 
##$TUNHIN= 0
##$TUNHOUT= 0
##$TUNXOUT= 0
##$USERA1= <user>
##$USERA2= <user>
##$USERA3= <user>
##$USERA4= <user>
##$USERA5= <user>
##$V9= 5
##$VALIST= <valist>
##$VCLIST= <CCCCCCCCCCCCCCC>
##$VD= 0
##$VDLIST= <DDDDDDDDDDDDDDD>
##$VPLIST= <PPPPPPPPPPPPPPP>
##$VTLIST= <TTTTTTTTTTTTTTT>
##$WBST= 1024
##$WBSW= 4
##$XGAIN= (0..3)
0 0 0 0 
##$XL= 0
##$YL= 0
##$YMAX_a= 1062997
##$YMIN_a= -1792881
##$ZGOPTNS= <>
##$ZL1= 120
##$ZL2= 120
##$ZL3= 120
##$ZL4= 120
##$ABSF1= 10
##$ABSF2= 0
##$ABSG= 5
##$ABSL= 3
##$ALPHA= 0
##$AQORDER= 0
##$ASSFAC= 0
##$ASSFACI= 0
##$ASSFACX= 0
##$ASSWID= 0
##$AUNMP= <proc_1d>
##$AZFE= 0.1
##$AZFW= 0.1
##$BCFW= 1
##$BC_mod= 2
##$BYTORDP= 1
##$COROFFS= 0
##$CY= 11.3945322036743
##$DATMOD= 1
##$DC= 2
##$DFILT= <>
##$DTYPP= 0
##$F1P= 18.9103706918063
##$F2P= -1.10871071338519
##$FCOR= 0.5
##$FTSIZE= 0
##$FT_mod= 4
##$GAMMA= 1
##$GB= 0.15
##$INTBC= 1
##$INTSCL= 1
##$ISEN= 128
##$LB= 0.24
##$LEV0= 0
##$LPBIN= 0
##$MAXI= 10000
##$MC2= 0
##$MEAN= 0
##$ME_mod= 0
##$MI= 1.114404
##$NCOEF= 0
##$NC_proc= 0
##$NLEV= 6
##$NOISF1= 3.799351
##$NOISF2= 2.8
##$NSP= 1
##$NTH_PI= 0
##$NZP= 0
##$OFFSET= 15.70392
##$PC= 1
##$PHC0= -8845.396
##$PHC1= 9.60014
##$PH_mod= 1
##$PKNL= yes
##$PPARMOD= 0
##$PSCAL= 0
##$PSIGN= 0
##$REVERSE= no
##$SF= 200.130013532006
##$SI= 16384
##$SIGF1= 3
##$SIGF2= 2
##$SINO= 400
##$SIOLD= 16384
##$SREGLST= <1H.CDCl3>
##$SSB= 0
##$STSI= 0
##$STSR= 0
##$SW_p= 3612.71676300578
##$SYMM= 0
##$S_DEV= 0
##$TDeff= 0
##$TDoff= 0
##$TI= <>
##$TILT= no
##$TM1= 0
##$TM2= 0
##$TOPLEV= 0
##$USERP1= <user>
##$USERP2= <user>
##$USERP3= <user>
##$USERP4= <user>
##$USERP5= <user>
##$WDW= 1
##$XDIM= 8192
##$YMAX_p= 0
##$YMIN_p= 0
$$ End of Bruker specific parameters
$$ ---------------------------------
##NTUPLES= NMR FID
##VAR_NAME=  TIME,          FID/REAL,        FID/IMAG
##SYMBOL=    X,             R,               I
##VAR_TYPE=  INDEPENDENT,   DEPENDENT,       DEPENDENT
##VAR_FORM=  AFFN,          ASDF,            ASDF
##VAR_DIM=   8192,          8192,            8192
##UNITS=     SECONDS,       ARBITRARY UNITS, ARBITRARY UNITS
##FACTOR=    0.0002004,     1,               1
##FIRST=     0,             0,               0
##LAST=      1.6414764,     0,               0
##MIN=       0,             -1792881,        0
##MAX=       1.6414764,     1062997,         0
$$ Real data points
##PAGE= N=1
##DATA TABLE= (X++(R..R)), XYDATA
0@%%%%L2o4O4o4R6j28J60k24K88l25L89m82N78p03Q31r78J143j326J547j797K070
25A107k378K718l095L515l977M490n055N672o347P091p914Q813r795J0877j2066
40f344J3369j4800J6382j8143K0097k2274K4728k7506L0677l4341L8633m3734
52b3256M9916n7603O7460q0622R9214j27691J77306k88163R59030l34140j907734
63a466283R57926J333703j79809j360819J04261J146567L54740j027734n40165
72f77613N27266N48275l51446l25152L21262M30089k65440m64347k0111L14355
82C7138M4005j50005j7632J67412O9228n1115j17930j33069o6104J73914K52023
93B07865o910k50196n8694K03374M6874k86028j64328K41675K78803p9363k03444
$$ plain form
0 0 0 0 0 0 32 -32 32 -32 64 -64 96 -128 160 -165 224 -258 320 -383 448 -530 613 -713 834 -963 1107
25 1107 -1271 1447 -1648 1867 -2110 2380 -2675 2997 -3350 3741 -4173 4640 -5155 5722 -6344
40 -6344 7025 -7775 8607 -9536 10561 -11713 13015 -14491 16186 -18155 20478 -23256
52 -23256 26660 -30943 36517 -44105 55109 -72582 104724 -183439 775591 441451 -1466283
63 -1466283 -508357 825346 645537 -715282 -611021 535546 890286 -137448 -677613
72 -677613 -150347 397928 46482 -278670 42592 472681 207241 -257106 -277217 37138
82 37138 81143 -68862 -86494 80918 150146 99031 -18899 -151968 -218072 -44158 207865
93 207865 200955 -49241 -107935 95439 142313 -143715 -308043 -66368 212435 133072 -70372
104g0372K6254J03536j06671j40342J19737K00470m2970j39593P2317J25950j52071
115c755k46050Q4798K86850J4683k13876J9962K33210m6465l33083n1701L51115
126I5688J62176k83759j79011K84205K34174k95787l82180J59036M35445J8696
136B48683l49076p7029K92855J05757k78943j89854J90112K22811o7241j47765
146d9690M8333R6949q2030j33552M0697J32333J5610o1373J1851M2102m6741p5731
158f1242J5604N3086j4336j3734P4770N4106r9790j29522M2638J39626k603j24506
170f5903m14J51172M6282j52292j21416P8382J20722j9221p9676J8936P4617p850
182D3339p6977k9196L4014K7645P435J6776P084k6146k3981N628l49k8100Q770
$$ plain form
104 -70372 -44118 59418 -47253 -187595 -67858 132612 89642 -49951 22366 148316 -3755
115 -3755 -249805 -165007 121843 136526 -77350 -57388 175822 129357 -203726 -255427 95688
126 95688 257864 -25895 -204906 79299 313473 17686 -364494 -205458 229987 248683
136 248683 -100393 -177422 115433 221190 -57753 -247607 -57495 165316 98075 -49690
146 -49690 -1357 95592 13562 -119990 -79293 53040 68650 7277 19128 61230 14489 -61242
158 -61242 -45638 7448 -6888 -20622 54148 108254 8464 -121058 -78420 61206 58603 -65903
170 -65903 -66317 84855 131137 -21155 -142571 -64189 56533 37312 -42364 -23428 51189 43339
182 43339 -33638 -62834 -28820 -1175 6260 23036 30120 3974 -20007 -14379 -14728 -42828 -34058
195c4058O5032K8010o1498m6951M8763M5206o4942o9534P3865J21745l3396j37663
207f5421j2500J22935K7417j25200n2813J28626J01806r2602j20676N1296J10483
218G3351l5050j11907K3603J27031J3318j18108m2923Q9496M4293q2902n2923
229g2721P9932P7061n3019q0540K5436O7392k0766o6627J7084P3472M393o5635
241a4538k1385M6660J6748m7094k2976M6455M1259k5085m3268M021K9944j809
253H932k5747k586K6747J6173j4238k1177o221P291R442j331o676N495J6700J172
267A3976k4295j6099J7562K2506j1363k3039J4184L3652j0469m5378q103M4208
279G342K1994l6601k5960L6049L6716l0058m8934J5452N0680j319m5738k898M6858
$$ plain form
195 -34058 30974 58984 -2514 -49465 -702 44504 -20438 -89972 -16107 105638 72242 -65421
207 -65421 -77921 45014 72431 -52769 -105582 23044 124850 32248 -88428 -37132 73351
218 73351 38301 -73606 -50003 77028 90346 -27762 -70685 18811 63104 -19798 -72721
229 -72721 7211 84272 31253 -49287 -23851 43541 22775 -43852 -26768 46704 51097 -14538
241 -14538 -35923 10737 27485 -19609 -42585 3870 45129 20044 -23224 -19203 10741 8932
253 8932 -16815 -19401 7346 23519 9281 -11896 -18117 -10826 -1384 -2715 -9391 -3896 12804 13976
267 13976 -10319 -26418 -8856 13650 2287 -20752 -6568 27084 16615 -28763 -36866 7342
279 7342 29336 -7265 -33225 2824 39540 9482 -39452 -24000 26680 25361 -20377 -23275 23583
292B3583R677m8701k2317M2211L1411l2372l2428K8030L8365k1561m6129Q954
304b1277M5156M473l9335j0480L6713J7017l4153k6169K5053K9437j4108k9126
316a6799R501K8416m008l1397m959K7507J2936k0505j5494J5778J7401j1013k3216
329a5852K572K2266M457j8156r283J5439J1418j3488j6632Q559J8930j213j7757
342h740m445J7531P283j6089j4648J2130J9633n806k1058M22K0080N593j9743
355g857j0604J6582J7026j1459j8668O713J9751k102k0817k171K0654Q218j8050
368b784j3142J4661J6101r577j9382N685K1738J300k1202o687J9453J0944j5613
381A495j5032J1544J7619n940j9080L00J9529L583j7607p595J4986J1319j0844
$$ plain form
292 23583 33260 -15441 -37758 4453 35864 3492 -28936 -906 37459 15898 -30231 -21277
304 -21277 23879 28352 -10983 -21463 15250 32267 -1886 -28055 -3002 26435 12327 -16799
316 -16799 -7298 21118 17110 -14287 -19246 8261 21197 692 -14802 976 18377 7364 -15852
329 -15852 -13280 8986 13443 -4713 -13996 1443 12861 -627 -17259 -8700 10230 9017 -8740
342 -8740 -13185 4346 11629 -4460 -19108 -6978 12655 6849 -14209 -13787 6293 11886 -7857
355 -7857 -18461 -1879 15147 3688 -14980 -8267 11484 9382 -11435 -13606 7048 15266 -2784
368 -2784 -15926 -1265 14836 5259 -14123 -8438 13300 14600 -6602 -13289 6164 17108 1495
381 1495 -13537 -1993 15626 9686 -9394 -9094 10435 14018 -3589 -11184 3802 15121 4277
394D277j5433Q194J5463k456j7814q53J6399O234j6538r003J1071J2486q251j4883
408a1107N912J4203l64j5005m333J3938Q275j2701j1400Q521J4088n343j5198
421a0514J389J4043L389j3522o567J1163R383p947j1602N943J1433j868j2822
434h099j192J1995N198j1206p915R847J0186p451j1675M453J3009K52j2734k876
448h208J2074N035r965p920Q401R436n430j0524K708J1156m29j0004k360J0708
462D678L516q041o613P140O979m477r067L375R308k03r145k394P790M441o515
477G72n100M230O220k316p099P27O216J153n894l046M422M322k702n252M58N330
493B441M51m287k839M135L874l272n032J411N881L59n845k471O039M423o479n873
$$ plain form
394 4277 -11156 -2962 12501 10045 -7769 -8622 7777 14011 -2527 -11530 -459 12027 3776 -11107
408 -11107 -5195 9008 8644 -6361 -10694 3244 11519 -1182 -12582 -4061 10027 4684 -10514
421 -10514 -9125 4918 8307 -5215 -11782 -619 8764 817 -10785 -4842 6591 4723 -8099
434 -8099 -9291 2704 7902 -3304 -11219 -1372 8814 1363 -10312 -5859 7150 7402 -5332 -8208
448 -8208 3866 8901 -1064 -8984 -583 8853 3423 -7101 -4393 6763 6334 -3670 -6030 4678
462 4678 8194 153 -6460 680 7659 3182 -5885 -2510 6798 6595 -2550 -4944 2846 7287 772
477 772 -4328 -98 6122 3806 -3293 -2566 3650 4803 -1091 -4137 285 4607 1905 -3347 -2889 2441
493 2441 2892 -1395 -4234 -99 3775 503 -4529 -3118 2763 3122 -2723 -5194 845 5268 -1211 -7084
509g084N164O591k927p678P08R495L37r432k828Q810N395p244p507O305Q895n228
525A772q918K116J0808o04j0166j480J0920L057r833m806P861P875p058q951N539
540a868R021k274j0120Q25R380J448r206k137P233L793n911n018N756M930l957
555A895n204K755M842j472l989m52L518N97k544j093J468R41m17j362o53J093
571g7Q48Q24j783j318N27K958r85l718M10L868J404m302l412M957L281l896n052
588e466L686O880l032p019P22P353K95p138k642R032K770p302m393O040O429o002
604B13p226M439R253l334r435K341Q380J06r429j343R398K940p385n219O817O500
620G016o065o822L919Q038k726p096P58O992N07o614j053M804L242m398l325K665
$$ plain form
509 -7084 -1920 4671 1744 -5934 -5226 4269 4606 -4826 -7654 1156 6551 -693 -8200 -1895 7000 1772
525 1772 -7146 -5030 5778 5174 -4992 -6472 4448 7505 -2328 -7134 727 8602 1544 -7407 -1868
540 -1868 7153 4879 -5241 -4416 4964 6412 -2794 -4931 2302 6095 184 -4834 922 5852 1895
555 1895 -3309 -554 4288 2816 -1173 -1625 1893 2490 -54 -1147 321 1262 845 -517 -1170 -77
571 -77 771 1595 -188 -1506 -979 1979 994 -2724 -2314 1554 2958 -1344 -4756 201 3482 -414 -5466
588 -5466 -1780 5100 2068 -4951 -4229 3124 3419 -3719 -6361 2671 5441 -1861 -6254 -214 6215 213
604 213 -7013 -2574 6679 3345 -6090 -3749 4631 4737 -4692 -6035 3363 6303 -1082 -6301 516 7016
620 7016 951 -5871 -1952 6086 3360 -3736 -2978 4014 4521 -2093 -3146 1658 4900 502 -2823 -158
636a58K636j339l435J666K428p26q40k45K51j099Q83J205j276j653J125K640p76
653A287l326n0M337J38m568j071M953K510m368m539L765M278k308n848K331O651
669D172j906o516R72N454O06m826j931N202K181n003k644L859M066l723l899L101
685h35M758k528n338K147N057j182n147P22N920R5n840j342N176K251m770l156
701d012N365K948l248m801K998M169k522l579J069M775j385l335L13L357j34l079
717a101L65J727N63k652m35K993l06k546K67K029R90l023o74K955pk968p59L170
735E88J785k568k245J822K462k049j940P98L514j281k528N22K645n41k983R60
751a039K486r17k030j78L310n38l368K5L756O04m092j015M692J600m673k439L936
$$ plain form
636 -158 2478 1139 -2296 -630 1798 1072 232 -13 238 -861 22 1227 -49 -1702 -577 2063 1287
653 1287 -2039 -2089 2248 2386 -2182 -3253 1700 4210 -158 -4697 -932 3346 1038 -4810 -2479 4172
669 4172 2266 -4250 -3278 2176 2782 -2044 -3975 1227 3408 -1595 -4239 -380 3686 -37 -3936 -835
685 -835 3923 1395 -3943 -1796 3261 2079 -3068 -2346 3574 3669 -2171 -3513 1663 3914 -856 -4012
701 -4012 1353 4301 1053 -3748 -750 3419 897 -2682 -1613 3162 1777 -1558 -1245 2112 1978 -1101
717 -1101 -736 991 1554 -1098 -1533 1460 1154 -1392 -1125 904 1894 -1129 -1803 1152 1145 -1823 -2582 588
735 588 2373 -195 -2440 -618 1844 -205 -2145 -1347 2167 886 -1642 -1120 1525 984 -1999 -1039
751 -1039 1447 530 -1500 -1678 1632 1094 -2274 -2249 1507 2111 -1981 -2996 1696 3296 -1377 -3816 120
768A20L823k838m996K485M991j479n844Q54N847K37m940j399N006K276m202l834
784c893M090L834l286l252J599L556j042m192J625K659M95k392q32J629P77j744
800c69o61J113J036j036k06N31L7j69o76J231o86n23J77O43l31j094j06J874K92
819A077k269M82J276J015k687j124J960J624j712k010K580J587j816l193K232
834i78K592r98l458N94M047O10m171o30L566P57l039k209L610K642k553l523K933
851b08L899k370m181Q85M374K40l705j683M067R13k569k059L026K071j960k356
867a616J046K619j272k015J063J694N85k555m65J660R73j514k65Q68j6o20p52
884e82J033m46P0l39Q68o50k78k92L98k36r25R39J002n84q00P03Q08n45j353q3
$$ plain form
768 120 3943 1105 -3891 -1406 3585 2106 -3738 -2884 2963 3200 -1740 -3139 1867 4143 -59 -3893
784 -3893 197 4031 745 -2507 -908 2648 1606 -2586 -961 1698 2193 -199 -1031 598 1375 -369
800 -369 -1030 83 1119 83 -123 408 445 276 -400 831 145 -378 -201 442 111 -983 -1089 785 1077
819 1077 -1192 -710 566 1581 -1106 -2230 -270 1354 -358 -2368 212 1799 -17 -3210 -978
834 -978 1614 616 -2842 -2248 1799 2409 -1762 -2392 1174 1931 -1108 -3317 293 2935 382 -3141 -208
851 -208 3691 1321 -2860 -1975 2399 2639 -1066 -2749 1318 2231 -338 -2397 629 2700 740 -1616
867 -1616 -570 2049 777 -1238 -175 1519 2104 -451 -916 744 1717 203 -62 806 790 170 -582
884 -582 451 5 75 -264 604 -46 -324 -616 -218 -454 -1379 -440 562 -22 -822 -119 689 144 -1209 -1292
904a292J778O89k500j50K465K5j552j606K312J670k177j433J385K130p97k643
920a696Q25J765Lk198k83K375M33j775j426K070K053k234j577P18K907r57k540
937a537N14K825k14k320o32K029J047j796q58J482R55j505r73P81P50Q46j513
954a19o76J173O79j438j68P13P93j31r96M47n74Q33p70J55L44m31J39m30m1pJ232
975G27l95j065j12J159J8j284K92P76N91r43j230M30J755m06j455m37K466m98
993C89j468j22J982N56k204k85J048N98r66k86L09J006l2j652J94J829j64r04
1011a72m48L85R32o90q19Q85O31r3j573L27J480j6j064m69R27N25p93l45J8J263
1031H91l8j474O4J432M8o51q33M99R92l87p56k79J111N41r54q63K96J035k83r36
$$ plain form
904 -1292 486 1175 -1325 -1475 990 1015 -537 -2143 169 1839 -338 -1771 -386 1744 947 -1696
920 -1696 -871 894 897 -1301 -1584 791 1224 -551 -1977 93 2146 -88 -1665 -947 1960 1003 -1537
937 -1537 -1023 1802 1588 -732 -1364 665 1712 -84 -942 540 1495 -10 -983 -202 548 1394 -119
954 -119 -795 378 1057 -381 -549 164 957 826 -170 277 -297 536 -234 -79 265 -166 -27 -457 -498 -505 727
975 727 332 -733 -845 314 332 -952 -660 116 707 -236 -1466 -1036 719 313 -1142 -1579 887 389
993 389 -1079 -1201 781 1337 -867 -1152 -104 494 -472 -758 -449 557 525 -1127 -933 896 732 -172
1011 -172 -620 -235 697 7 -812 73 704 611 -962 -635 845 829 -235 -704 223 748 -45 -390 -372 891
1031 891 853 -621 -557 875 923 272 -561 -62 930 543 -213 -492 619 1160 206 -657 -361 674 391 -545
1051e45k72R12N29q77o39J323L30q40j051K48J251m43j089M88P89L85J29j936
1069a308R01Q39k61j429O60N73L47j111N43K23Q2p9q68O57O72l37r59J03R64R8
1089C10n23p86J722j15m58j070N61J429r83n91O1R90J67p28J04K17O9R7j259M63
1109c23J416j048J02q1O87l32r82q6P01N28o74l36k44J961k24j129p92J274k55
1128A63o43J84n55R52M78j060K40j6K25M6p87Q05L42qj018O45M43n60m88L26N65
1149B79k70l91M7Q04L9o59k30J16P49j058K32J41P7P36r61j6R75l68r39J19L27
1170b51O02l05q40N48M40N12j267O09K17k23l42j31J56J125n10l87j00N31j79
1189B05O9j07k68L74r6k17r6Q7K63o86J21N17J1p8n70J39P08n49L29n54K64O16
$$ plain form
1051 -545 -817 95 624 -253 -892 431 761 -79 -1130 -882 369 -74 -1163 -675 114 499 628 -1308
1069 -1308 -407 432 171 -1258 -598 -25 322 -789 -246 -23 59 -20 -888 -231 441 104 -855 -752 212 310
1089 310 -213 -999 723 608 150 -920 -359 1070 87 -504 -443 547 714 -14 90 307 376 473 -786 -323
1109 -323 1093 45 147 66 753 421 -561 -647 54 582 -92 -428 -672 1289 1065 -64 -856 418 163
1128 163 -480 -296 -851 101 579 -481 -241 -257 -32 14 -773 32 374 366 -652 -7 436 -124 -612 -286 279
1149 279 9 -382 -335 469 508 -151 -381 -265 484 -574 -342 -201 -124 612 -349 -365 610 242 -697 -578 -251
1170 -251 351 46 -794 -246 194 706 -561 48 265 42 -300 -431 -275 850 340 -47 -147 384 205
1189 205 274 167 -101 273 177 -40 -136 -49 214 -472 -351 166 177 99 -471 -332 376 -173 156 -398 -134 482
1211D82l75n58M63O17k49j096M7J160j52p65r05J927K03N7j495K67K05l64l11
1230h42j40J512o1p55m81J266j28p02j13M84K41J74r37J69O81k19k14n12M69N87
1250D79o46j30j44R98p79M26l38L42L96j073n83J034J42j6k70O75p6J53j278O53
1270c5P74j282P11K95q66O89Pk78r5L45L76k75j21j014P05nJ67o68O17O20l0j134
1292d97N04N65j07n68J70M27k10j076O11O1N58n20q67J311L87n53p15O95P00j256
1312c80l10J23K94O93q61r2N45K68l74r76J567n15k52l48Q97M67j207j58Q5R21
1332C87p98O38p16K01Q47o31k94J000j66n06J05J45j84Lk39K29q6M64n55o30J164
1353C78k04R7M84l93p38K85J91q5r4M44l00j72l05M05N05J43m52k26L98J28k04
$$ plain form
1211 482 107 -451 12 629 380 -716 -669 491 339 -426 -1331 596 799 856 -639 -372 -167 -531 -842
1230 -842 -982 530 469 -286 -767 499 371 -331 -444 40 281 455 -482 -313 368 149 -65 -577 -108 479
1250 479 -167 -297 -441 557 -222 204 -134 208 604 -469 -1052 -18 124 108 -162 513 437 590 -688 -35
1270 -35 739 -543 168 463 -403 286 293 15 -80 265 641 366 245 -769 -64 -69 98 -570 47 667 637 -497
1292 -497 7 572 465 -103 67 494 284 -792 -181 -120 438 -82 -949 362 749 196 -519 176 876 -380
1312 -380 -690 -567 -273 420 -441 -533 12 280 -94 -1070 497 -18 -270 -618 279 746 -461 -619 -534 387
1332 387 -411 227 -489 -288 559 -72 -366 634 468 -38 67 212 28 31 -208 21 -65 399 -156 -786 378
1353 378 174 271 755 362 -376 -91 100 15 -79 365 65 -107 -412 -7 498 641 189 -37 361 489 285
1374B85j083M84J14N09n90Q9N98m97j15O3P72n61l75p01J122K88q50l14R65K73
1394D76Rn97n42R46m02k66k58R47l36J56K86k38r7j63L54K32m17n10M51L22M95
1415H48q45l88K32M06j44J01l73P3l44L20n11J149k12n54M01j56j09J035l14r88
1435c73L56K91m22j04n92O89O51k4m38K70l67J16j46L4p2K85M0l50m5K24o0K20
1457A83J26K3K83j373O18M02Ko78j38N8O46l48k74j16J216N00j242l33O67k19
1477CJ95j42oJ1J0m24N33Q29j022n30K06J102k90p46K36Mk89j89N6O93j01j017
1499h78Q20mJ5Q9j14N3J4J92N06l69n76N17m90m2K02k34L57j44n2M8K99j9J83
1522C73m92J92K73k48l31L08p5j37M34j174J258L94j318j36L22Q93r15l70K20
$$ plain form
1374 285 -798 -314 -200 309 -281 -192 406 -91 -206 -143 629 68 -307 -1008 114 402 -448 -762 203 476
1394 476 485 -112 -654 292 -110 -376 -634 313 -23 133 419 181 84 -79 275 507 90 -420 31 353 848
1415 848 3 -385 -153 253 109 210 -163 -90 -434 -114 -625 524 312 -242 159 3 -106 929 615 -373
1435 -373 -17 274 -148 -252 -844 -155 496 472 34 304 -63 53 -93 -59 -131 154 194 -156 -201 23 -37 183
1457 183 309 332 615 -758 -140 262 264 -414 -552 -494 152 -196 -470 -586 630 1130 -112 -445 222 3
1477 3 198 56 50 61 71 -353 180 1009 -13 -543 -337 765 475 -271 -35 -31 -320 -509 -453 240 139 -878
1499 -878 -58 -62 -47 42 -72 -19 -5 187 693 324 -252 265 -225 -267 -65 -299 58 -86 -138 -90 209 190 373
1522 373 -119 73 346 98 -233 75 0 -137 297 -877 381 775 -543 -679 -357 536 -379 -749 -529
1541e29Q80p23M25l38P3N09n67Q8L24l54N68j2j88K45k8j072M36P66o70M6q2M82
1563B79n71P00l39j07K85N4k69j81P77q02J58l1l97k65O89J16k57ok91O38j81
1584aL31l02m26O12k3K75l80o44K41M36J66K35m14n77O94P6l96J31j2L42k67l95
1606b98O87k57J56O2m01M94k78j45k0m85M63N0k90O77O1l61p44J18K83L68m31
1627b91N06k15l70M37m21Q80J19r79j73O13m29Q0N90n26m22P68l12K88l34M86
1647B95n36j34Q92j101J090n40JM01m09o54N35L60n94J48k96J205j013N66n41
1666c25L01j85Q8o8J03K08k88j83Q96n30J63o16Q25r36L34M67l69L02K98m33l97
1687c45L68M12o20N36o71M01P0J52k06m83K64K74jK3p39P53j4o91O18n1N38n56
$$ plain form
1541 -529 351 -372 53 -285 -212 297 -270 -182 142 -212 356 344 156 401 373 -699 -263 503 -167 -121 -203 279
1563 279 -292 408 69 -38 247 301 32 -149 628 -174 -16 -47 -444 -709 -20 96 -161 -167 -458 180 -1
1584 -1 330 28 -398 214 191 466 86 -558 -317 119 285 520 106 -471 223 299 -97 34 22 364 97 -298
1606 -298 389 132 288 350 -51 443 165 20 0 -485 -22 28 -262 415 476 115 -629 -511 -228 140 -291
1627 -291 215 0 -370 67 -354 526 645 -334 -507 106 -323 -243 347 -179 -601 167 -145 143 -191 295
1647 295 -241 -375 517 -584 506 -34 -33 368 -41 -695 -160 200 -394 -246 -542 663 -350 216 -325
1666 -325 -24 -209 -121 -189 -86 122 -166 -349 547 17 180 -436 389 -547 -213 254 -115 187 485 52 -345
1687 -345 23 435 -185 351 -320 81 151 303 97 -386 -122 152 151 174 -565 188 174 -517 101 50 588 32
1709C2l6M84r39M91R5o51O77k57N12n20n0J54J84p16L88L67j00j52j26k2J36M6
1731ck83L35l95K97l27n6N66k76L0j07K43j3m8K91l17j47N59j55m0N2j88j42K38
1754A14J76m90j38L8O71J57j421M65O10N7j5l58j36J05M32R6J76k36m81J97Q5
1775A04j57L01m87L5Q7O8M75m66K29l08M1r6J66O25p61j10K74K22n09j69O58l57
1797a35M32j118J271l29p6o36O84m7Jl73M03m79M00k57k9Q14m33N18j435J42O25
1818e7M5j09R24l91K78l76j91j12L02n67N8k59M65L02J60q82K69r6J34P33q26
1839a96N40n90N76J06j139Q33J31j19j36n0j06L50p61J08N19J46J59r88K94J75
1859a48K97l20o64J73J158o66L39J90p67R51q75K54L95k04M59o51K14p19P48n09
$$ plain form
1709 32 -4 480 -459 32 127 -524 153 -104 408 -112 -162 -8 176 -540 -152 215 115 -37 -163 -185 -49 -3
1731 -3 -286 49 -346 -49 -376 -432 134 -142 -112 -219 24 11 -37 254 -63 -210 349 194 154 206 18 -124 114
1754 114 290 -200 -338 -300 371 528 -893 -428 182 239 224 -134 -270 -165 267 363 539 303 -178 19 104
1775 104 -53 248 -239 -204 -117 -49 426 -40 189 -119 -78 -174 -8 617 -144 -254 20 242 -267 -436 222 -135
1797 -135 297 -821 450 121 45 -591 93 46 47 -326 77 -402 -2 -259 -288 526 93 611 -824 -682 -57
1818 -57 -12 -121 803 412 690 314 123 11 313 -254 -196 -455 10 312 472 -410 -141 -237 -103 630 -196
1839 -196 344 -246 330 436 -703 130 261 142 6 -44 -150 200 -561 -453 66 212 371 -617 -323 -148
1859 -148 149 -171 -835 -662 496 -170 169 359 -408 543 -332 -78 317 113 572 -79 135 -584 164 -345
1879c45K13M86k14r90J095n5J48l33j66k96N08M03k62k86J25j24O36p28L49k05
1899d1o2P11p57N70k95p4q5M9l45L6J24l64M57L25l81K22l13K64L64q02M84k89
1921b02L33m10L88l10N18m41M13l54K12K64k9k48K0k26J4K84o21L71M59m26K29
1942B38j48k71M56J82q92O98k61J25m58q6J89l31N53J03o85R11P9q93K03L67K95
1963C74o24J09J07L30O3Pm83K71o09P57m60K20l62Q28o05L40j25l75N83k71L0
1984A05j77J93j43k47j63L01j6O23n92l69L25P38l79O3j84J49N71j71j061M98
2004F4P5m24L68O3o28L65N12q00M63L42k39q18P21J21m91N45n74p9N06n01K81
2025a28j84O39k43k32j12J72K01L22j060O25K67L01n12J21l4q44J032m01m09N03
$$ plain form
1879 -345 -132 354 140 -850 245 190 338 5 -161 -457 51 454 192 -94 31 -93 543 -185 164 -41
1899 -41 -103 608 -149 421 126 52 -33 16 -329 -293 -169 -533 -76 249 -132 90 -223 41 405 -397 87 -202
1921 -202 131 -279 109 -201 317 -124 289 -65 147 411 382 134 154 -72 -58 226 -395 -24 435 9 238
1942 238 90 -181 275 457 -435 263 2 127 -331 -417 -228 -559 -6 97 -588 323 402 -491 -288 79 374
1963 374 -250 -141 -34 296 359 366 -117 154 -455 302 -158 62 -300 528 -77 263 138 -237 346 75 105
1984 105 -72 121 -22 -269 -432 -131 -147 476 -116 -485 -160 578 199 262 78 227 798 627 -434 64
2004 64 139 -285 83 146 -482 -117 395 -405 58 400 161 -657 64 185 -306 239 -335 -414 92 -409 -128
2025 -128 -312 327 84 -148 -260 -88 113 435 -625 0 267 568 56 177 143 -701 331 -70 -479 24
2045B4k97L54l97j30M37j38k6N63n67l97P06m59M11j10j91j2P13n86j12pJ53K91
2067B23ojj98l49L46J43O87p87p3j00O88p58J24M66r14J89o4M96k11N16n03j77
2089b63N20l87J37j11K09M3m89Q46o59K97k54J06m87P17l09J61j3K40k78m28L52
2110e0J6K97j67J8n31K82K41k31L91K66j163J004r96K36O9J96J9k52Q0l19N83
2131a1l6j64J87L02N06j089N07k04p6k29m8J16J47p94J384l51m32K72k76K18j07
2152a78N07m70J92j26j40N19m35J9O68q85J315q20M88n17l57J60m65M71J76L52
2172D74l52N08r22P00l74l26L52J76p47J173k17r5m97L08k52L7O68J38j055j40
2192d43K15k31J00O3m0J43m9N82j80M6j55p94J058m95K89j086J517j135M91N80
$$ plain form
2045 24 -273 81 -316 -446 -9 -147 -173 390 -177 -574 132 -327 84 -26 -217 -229 484 -102 -214 -221 -68 223
2067 223 217 216 18 -331 15 158 845 58 -15 -115 573 -185 -61 405 -509 -320 -384 112 -99 417 -86 -263
2089 -263 257 -130 7 -104 105 148 -341 505 -154 143 -111 -5 -492 225 -84 77 64 304 26 -402 -50
2110 -50 -34 263 96 114 -417 -135 106 -125 266 532 -631 373 -623 -387 -318 -122 -103 -355 -275 -594 -11
2131 -11 -47 -211 -24 278 784 -305 202 -2 -78 -307 -355 -239 -92 -886 498 147 -285 -13 -289 -71 -178
2152 -178 329 -141 51 -75 -215 304 -131 -112 556 -329 986 166 654 137 -220 -60 -525 -54 122 474
2172 474 122 630 -292 408 34 -292 60 236 -511 662 445 350 -147 161 -91 -54 614 752 -303 -443
2192 -443 -228 -459 -359 -296 -336 -193 -242 340 160 206 51 -743 315 -180 109 -977 540 -595 -104 476
2212D76m86j35J00k45q0L83l1n15L70L35r1k22L69r2k00K58jm77K51J24j99L1
2234g7o05R31j5m80L38p10k8O42J62J30k31k67m51P70m62N83q43P29m97J157j080
2255c04P27l19M17p6o57Q6O44k28N6l16J71K51o18K43m19O57r6q21P30p41J193
2276E80m49m27j83L85J5n05P62n00K15N56p13j15L14K17N6j00P24n95l94j72Q7
2297b42P37j369J598n49j6l17M63j058O97J14k97Q22j033N78M58n12J66pK46n84
2317a05m74M98L88J15m78j15Q67q04L48l5k93K84J16P8m34J53l02k51K28N28J28
2338D40p57R10q86P90m59K5P2K53P3n17M36o90p2j53M36L97m75K5M78o53N85k33
2360B5K95p09M81M83n48k27R3k62N79k94M39M2k07q4k79l2k52P40j95p09P81j3
$$ plain form
2212 476 -10 -145 -45 -290 -370 13 -18 -533 -163 172 81 -141 228 136 -64 194 193 -284 -33 91 -108 -77
2234 -77 -682 249 234 -246 92 -618 -646 -4 158 288 57 -210 -661 109 -353 230 -613 116 -381 776 -304
2255 -304 423 104 521 445 -212 -126 518 290 346 30 201 452 -166 77 -342 315 219 -602 128 -613 580
2276 580 131 -296 -479 -94 -79 -584 178 -322 -107 449 -264 -379 -65 152 208 108 832 237 -157 -329 -242
2297 -242 495 -874 724 175 159 -158 305 -753 -56 58 -239 583 -450 128 586 74 240 233 479 -105
2317 -105 -579 -81 307 422 -56 -171 696 -108 240 205 -88 196 312 390 -44 109 -193 -444 -216 312 440
2338 440 -317 593 -293 497 38 63 135 388 461 -56 380 -310 -382 -535 -99 298 -177 -152 326 -327 258 25
2360 25 320 -389 92 575 27 -200 -107 -369 210 -84 355 397 190 106 -173 -205 -457 283 88 -621 160 147
2382A47m15P75m4k27J68p53J80L04MK84j33n57K85RM45q34K15l5N8R5J44j73m91
2405e49Q39k98J80l64k5R94j026M56jo2l92J16r8O13m40m7l93M30L49K72m47L37
2427D44l3R8k71k39M06n71M69o85P12n25Q33j171Q88j08j50n6n54N87P9J00K03
2448D56j025O19j91KJ90j020O80K9J45J022k86n33j47m3n92O22p0l42j40J040
2468D16o41Q0J00J35j11J67m68k32O20j31J80k40J59L4p0P0k41J82j49l19pO12
2490A46l87O65k8n38L64m70J84L05J40l22J24m96K3K30M63m43qL68k2n41L0M91
2512B78l41j12l97M67n3L1M19m56j2l45k25O02j8N45n11L99l1k34J65J14r64O00
2534g9n8K55j25L20P4o81J35L87k90j76Q3l8j2P8Q00o03M71m47k4l84PJ03k54
$$ plain form
2382 147 -268 507 463 236 404 -349 -169 135 139 423 290 -267 18 27 472 -362 -147 -182 -124 -29 115 -58 -549
2405 -549 290 -8 172 -192 -217 777 -249 207 206 144 -248 -132 -230 383 -57 -104 -497 -67 282 554 107 444
2427 444 411 509 238 -1 405 -166 303 -382 330 -195 638 -533 355 247 97 41 -513 74 153 253 456
2448 456 -569 50 -141 -139 51 -969 -289 -260 -115 907 621 88 -59 -102 -694 -72 -142 -484 -624 416
2468 416 -225 -145 -45 90 -21 146 -322 -554 66 -65 115 -125 34 68 -2 68 -173 9 -140 -459 -466 146
2490 146 -241 424 396 -142 222 -248 -64 241 381 59 183 -313 -290 -60 403 -40 -48 320 298 -243 -213 278
2512 278 -63 -175 -572 -105 -158 -127 292 -164 -176 -521 -746 -144 -162 383 -128 271 240 6 171 285 -679 -79
2534 -79 -137 118 -7 313 387 -294 -159 228 -62 -238 -155 -193 -205 -127 673 70 541 94 70 -314 -307 -204 -458
2557d58j07N3N66J29k25M75k80rn53N98j04l63k69O26L16o86P14k76j46J31n41
2578d09K00k49L13k76L52M0N5M18P61j071p6k93K78j40j52M70m42l5P38j044Q49
2599B87l63L53o37L32J84m82l80N26O43n53p68R27j27L86j92J03j92k31n74r4
2619h52J058m80M4M57o57Q6N66m6m2n49L88l16M97q8L73o18L63J88l37k5L78m52
2641f4L26K86q10Q54k29J07n33p51O86M12j18k85k51j41O03l04O0j35L3K41L90
2662C77k95J09n82O07k12O4L50k40l92K88j43M27k85J43k7O0n18N32l16M53L17
2683G17o20O7k09J27l07o4J73QP82l95k15l00O19k05n40K45J27l20J84M02l01
2704b5J83m65M96k51O8j22L94m12m67P05o9j66j34N44n73L70m53O9Q0k21K98J010
$$ plain form
2557 -458 -565 -512 54 183 -42 433 153 144 -409 189 85 -278 -547 79 395 -291 423 147 1 132 -409
2578 -409 -209 -458 -145 -421 -69 -29 26 444 1205 134 58 -235 43 -97 -249 221 -221 -256 482 -562 287
2599 287 -76 277 -360 -28 156 -326 -706 -180 463 -90 -858 69 -58 328 136 239 47 -184 -758 -852
2619 -852 206 -274 -230 227 -430 -344 222 176 134 -415 -27 -343 154 66 439 -179 184 372 35 10 388 -64
2641 -64 262 548 -262 592 363 470 -63 -814 -128 284 166 -119 -370 -511 92 -212 -152 -287 -254 -13 377
2662 377 82 191 -391 216 4 68 418 178 -214 74 -69 358 73 216 189 249 -269 263 -53 400 717
2683 717 97 164 -45 82 -225 -289 -116 -108 674 279 64 -236 383 178 -362 -117 10 -310 -126 276 -25
2704 -25 158 -307 189 -62 6 -116 278 -134 -601 104 35 -131 -265 279 -294 76 -377 -308 -228 -449 -151 859
2726H59m70l25k2q7L22J41j11m99q9J50L65j71m38N40L5l25J5K3K00j09j18K33
2748A19k81J02n91Q30l00O37m54P72n57l04N66r80O03r9k26K97J22M98j340M09
2768a77J17N58p60j5K23M41R0p18M88j51k62m12K64Q59j127R06q09k03O49P06
2788F67r03o70J465r70J73j40N14M3q8j89l70M76R8J86n01K15J05l13R1m26M01
2809a36j37L0O46K09l05l88q3J08J20k94Q08j27q12R50j419N30O99l98J38l07
2829a68N94m6p61p07Q52L64j19k55R4k21K77M20m42j41K02K66k55j68k92L87l97
2850e16K77L98q78L35N65j11k85Q3K74J97m02K62m7QJ32l08J7l17N61o67L87p0
2872a05k14L91L04L61q62J52P29q64K48OL38o23k76N87N1k26o37P25J41n62N10
$$ plain form
2726 859 389 64 42 -45 277 418 307 -192 -281 -131 234 63 -375 165 200 -125 -110 -87 113 4 -114 119
2748 119 -162 -60 -651 179 -121 516 62 834 277 -27 539 -441 162 63 -163 134 256 754 -586 -177
2768 -177 -60 498 -262 -277 -54 387 477 -241 247 96 -166 -578 -314 545 -582 324 -485 -688 -39 667
2788 667 -236 -906 559 -411 -238 -378 136 179 91 -98 -468 8 106 292 -209 6 111 -202 -111 -537 -136
2809 -136 -273 -243 403 612 307 -81 -164 -56 64 -230 578 451 -361 589 -830 -300 399 1 139 -168
2829 -168 426 380 -381 -1088 -236 128 9 -246 -152 -373 -96 324 -118 -259 -57 209 -46 -214 -506 -119 -516
2850 -516 -239 159 -719 -384 181 70 -215 -132 142 339 -63 199 152 160 292 -16 1 -316 245 -422 -35 -105
2872 -105 -319 72 376 737 -125 27 756 -108 140 146 484 -139 -415 172 223 -3 -640 85 226 -336 174
2893A74m31K3R8J37N54m52J18p1m11N02j05J24j19l59l0N8p0K74m1O2j9N16n27
2916Ej60M8K49k95l8P99q30K34J01j90K65p28L79k22K27L5N97o46k53L96l75L49
2938e3J19j97M49k47l7o79O86K58l95l64r7J398m75k95O2j1l53J16l99M70j40
2959a84R3L3k21m95N27j45qL33l39k96P30O5J52j35k8k15N59o72M66M7k60J50
2981A57k60q6k23J264o32o03N75p6p39L87O63m16J51n5m89K28L89j5l93J72j22
3002a23M38J06J59o94j93J28m0L01Pr8J32j2Kk62P13o14J68j89O4n28N59o28Q52
3025B48j25l9L69m32RJ12p20P13n29K75k04k9L57k06n36Q42m34o20N23Q2L7l20
3047f27J075l14L63n99r4N00k05R3k64M88m22m15q5L81Jk01R33n46J5L85m04K77
$$ plain form
2893 174 -257 -234 -136 1 555 103 221 150 -261 241 136 260 141 -218 -248 -190 -260 14 -27 35 16 532 5
2916 5 -155 -107 142 -153 -191 608 -222 12 113 -77 188 -540 -161 -383 -156 -121 476 -170 -423 -27 -402 -53
2938 -53 66 -131 318 71 34 -645 41 299 -96 -460 -557 841 366 71 133 122 -231 -115 -514 -44 -184
2959 -184 -91 -58 -279 -774 -247 -392 -400 -67 -406 -702 28 93 245 110 82 -133 426 -246 220 267 7 157
2981 157 -103 -189 -412 852 220 -383 192 116 -623 -236 427 11 162 107 -382 -154 235 220 -173 -1 -123
3002 -123 315 421 580 -114 -307 -179 -219 82 89 -9 123 111 113 -149 564 -50 118 -71 -7 -535 24 -604 248
3025 248 123 84 453 21 30 142 -578 135 -394 -119 -323 -352 5 -201 -737 105 -329 -949 -426 -344 -307 -627
3047 -627 448 134 497 -102 -196 304 99 192 -72 416 -6 -421 -506 -125 -124 -325 608 62 77 462 58 335
3069C35o13K34j30J061j330rN51N1l3O13l83o0j78p80Q18K99n36O64j102J86L05
3090c7NJ97J9n2o32K19K91m89Q67J33r96Q53m51L41J17k77o36M37K22K43l02p60
3112f88P01q01P25J70k96O36L87k06j245L4P56J31l38k5J97J92n92R1M62M8k24
3133A15Q91r82n1P1j18M27k56l19N74m66N07j14L40m52p24Q18K58k17m29O22n36
3154d1l61r1L27R5K5J21j71N61L8m22k92P44l56J75n93K74J17M17o73n23P13k42
3176a58N14l83m12J170j048O47j100J230j4r89R28j03m80L06n50J53M50k93N4
3195g8p5J40M68k39p96L38k41M46J63N9l11j68K06m31p5P33p2j27k89O69k50k1
3217D9M6k5o25P92l59M51pn48j90K66N0n78N67j59K29OJ99m69n7M8O63J40j01
$$ plain form
3069 335 -278 -44 -174 887 -443 -452 99 150 117 730 347 287 109 -671 147 446 -90 574 -528 -342 -37
3090 -37 -32 165 184 132 -500 -281 10 -479 388 521 -475 378 -73 268 385 108 -528 -91 131 374 72 -688
3112 -688 13 -788 -63 107 -189 447 834 628 -617 -583 173 304 -34 -59 138 330 -262 -171 291 339 115
3133 115 1006 24 -27 44 -74 353 97 -222 352 -114 393 279 619 167 -557 261 519 302 -127 495 -41
3154 -41 -402 -493 -166 -71 -46 75 -96 465 503 81 -211 533 177 352 -241 33 150 567 -106 -629 84 -158
3176 -158 356 -27 -439 731 -317 330 -770 460 446 -543 385 282 -198 108 -442 -289 161 -132 -78
3195 -78 -153 -13 455 216 -580 -242 -483 -37 126 185 -126 -294 -88 -519 -594 139 67 -60 -349 320 70 49
3217 49 95 70 -555 237 -122 329 322 -226 -416 -150 -100 -678 -111 -270 -41 -35 164 -305 -362 -314 349 489 388
3240C88p34Q39o36k1L7K59j54O6L50l31j52Q6K25o1k4k99j87j90K75L77j23q24
3262h34M42O83k43q8j41O64o97n8L18L7n6j21N5N6L13J63o72O77r03N15m21l0
3284c41P53l29j02KK9l43L33l05L61L36j14l0n58O3M01l58o9R37q21P05o02K23
3306A71K96N4o1l63J78O0L57o44K83p34Q26l33o50P82k13q15J157j26m08n38M09
3327c12L37J47KM21j095N43l69j95R18n19m37M3L72O29m81L33o37P75m88n20N5
3348d78P77l74m35K71O52o35J1J71N39q33O48J85p93M70p7l36K23M35p30L83Q0
3369A54l36N26q57Q58k03k53m4p56KN11J84J088j006L38j96p0P7j66N04p16Q72
3390E11l85kr0J54k07K03l52L63%J46n60O09p68j64O98j63L4n17J35M36k97L84
$$ plain form
3240 388 -346 493 -143 -164 -127 132 -22 44 394 63 -89 -3 222 161 137 -162 -349 -539 -264 113 -10 -834
3262 -834 -392 291 48 -40 -181 483 -214 -272 46 83 27 -94 -39 17 330 493 -179 498 -405 110 -311 -341
3284 -341 412 83 -19 -17 12 -331 2 -303 58 394 280 250 -308 -245 156 -202 -271 666 -155 550 -52 171
3306 171 467 521 460 97 275 335 692 48 331 -403 423 90 -560 222 9 -806 351 225 -183 -721 -312
3327 -312 25 172 174 595 -500 43 -326 -521 397 -122 -559 -516 -144 485 4 337 -300 475 -13 -533 -478
3348 -478 299 -75 -510 -239 413 -222 -211 -40 499 -334 314 499 -294 176 99 -237 -14 421 -309 74 154
3369 154 -182 344 -513 345 142 -111 -155 -911 -909 -398 -214 874 -132 206 10 -60 17 -149 355 -361 511
3390 511 126 124 34 188 -19 184 -168 195 195 341 -219 390 -378 -542 156 -7 27 -490 -355 81 -216 168
3412A68j29L20n61K01k21J86N07p21N74l80Q9L05k48L68J76m81M65m1m23l60N69
3433C63q91L85n7K1m27P82k07L28l10k63O03l02j83J31J18L7m12K81m5J93k5l16
3455a96J84l27N3K18m89K60O32l40J53N31n04m04P01l34J00q1m19N58n06R6N52
3476D38o80M12J51Q0o32N09r11R18l80M73n8m01J07k48N5R50r35R03n37j49j62
3497i7O89k41l17j40q0K57l22l5J0N43q5J44o66P68p78O26n05K14K39k02J70J99
3519C91J11l08k35J25L4m80N98l23j72L66k63K72k75P4L71M2l85J57K74K47l87
3540B34n26q6K99K02j73O7K06j76N45k87j99j12P9J8k03l20l0Q33l78Q55r50j1
3562a13m3L53K96l40n51J69Q44m10m31J5k03L03N51o62m21L66J47j32L64n84L82
$$ plain form
3412 168 39 359 -202 -1 -222 -36 471 -250 324 -56 33 338 90 458 634 153 618 577 154 -206 363
3433 363 -528 -143 -200 -179 -606 176 -31 297 -13 -276 327 25 -158 -27 91 128 -284 -3 -48 145 120 -196
3455 -196 -12 -339 -286 -68 -557 -297 335 -5 148 679 175 -229 472 138 238 157 -262 296 -210 -114 438
3476 438 -242 170 321 401 -231 278 -633 285 -95 378 320 -81 26 -222 -167 783 -152 751 214 65 -97
3497 -97 592 351 34 -106 -186 71 -251 -286 -276 267 182 326 -340 428 -350 276 -229 -15 224 22 192 391
3519 391 502 194 -41 84 118 -362 236 -87 -259 107 -156 116 -159 -85 286 328 -57 100 374 621 234
3540 234 -292 -378 -79 123 -50 17 223 47 592 305 106 -6 73 91 -112 -432 -462 371 -7 848 -102 -113
3562 -113 -156 197 493 153 -398 -229 615 205 -226 -211 -414 -111 440 -222 -643 -277 -130 -262 102 -482 -100
3583a00m10P14q38J43N29O2m96J31L8L74k66j05N11k86L65j0k00m75L88k67J89
3604iN17J20l65k80L93Jk62q2P59k75m90k7k9J32L4O7k39j16L7l77O85n41o8K61
3628a54P6k10K43k16k4K01n09J430j132O44m01m25M92q33L10L29k51K26O43K50
3648F89l2j008L16k55M79l77K08M1k32L33j3j89o2J19J32Mn72r1L64K14k83M18
3670B03J25o18M7L45k10J37J16MM81l75j11k35L99L16o98K6k40K20j02J9L27j28
3692D8l0l98N02l90k81L77K65p6l24M32l26j42L80l58m66P28M16n39m27O51j22
3713h0M3k01l13Q4L76J24K57m37K55k76M59J01n4o49K2L36M0M41j21k56m6j11
3735fl08K44L78K1j086Q66J05J55l85l90N69k94P4K1K49l13J52l57O84n98O54
$$ plain form
3583 -100 -510 204 -634 -491 38 100 -396 -265 -227 147 -119 -224 287 1 366 356 156 -319 69 -198 -9
3604 -9 508 628 263 -17 376 377 115 33 792 517 27 0 -29 103 137 204 -35 -151 -114 -491 194 -347 -415 -154
3628 -154 -78 -288 -45 -261 -285 -84 -593 837 -295 349 -52 -477 15 -818 -508 -179 -430 -204 439 689
3648 689 657 -351 -35 -290 189 -188 20 61 -171 162 149 -40 -102 17 149 153 -419 -510 -146 68 -215 203
3670 203 328 -290 -243 102 -108 29 145 149 630 255 144 -91 308 624 -74 -48 -288 -68 -170 -151 176 48
3692 48 18 -380 122 -268 -549 -172 93 17 -307 125 -201 -343 37 -321 -787 -59 357 -182 -609 42 -80
3713 -80 -37 -238 -551 -467 -91 33 290 -147 108 -168 291 392 338 -311 -289 47 87 528 407 151 105 -6
3735 -6 -314 -70 308 329 -757 109 214 369 -16 -406 163 -131 -57 -36 213 -100 52 -305 379 -219 435
3756D35l09K34L89j033QJ16L0r6J73p5M45m57mJ94j94P8p8L28J63m72L1Q0m11
3779d25Q52k38j99j94P88n38R8L52m63J52m59O79l10n6j64QN77L60j016K79M45
3800E28l47l80O13j87k19o93K98N32N07k80L4m62L90k21j78K46j04n12J064p32
3820a03l84O92n3j51O27n41MJ61k82m0K62j82N01n39k39Q9Q5j72M16M42k99m59
3842a65N05o68l47L0N83r5%K07K27k36l23M24J99J23m88K72kj94n17P69k81j39
3864a16j71M83M9k53p46O86j99k31P15m03j67J63L56j3j2m7j92k9l18L61j06M38
3886B48j7q17J125n47j80L14o74M43k33K12m4M30J23n32M76m8p74O61n2l2k19
3907a37j13P83n33L8m58K20L2l2K73K08q48J113m70k16n6L35k69k89J39J39K06
$$ plain form
3756 435 126 360 749 -284 -276 -160 -130 -226 -53 -128 317 -140 -144 50 -144 -66 -144 184 347 -125 -94 -14 -425
3779 -425 427 189 -10 -204 584 46 144 496 33 185 -274 405 95 39 -125 -117 460 820 -196 83 528
3800 528 181 -199 414 227 8 -685 -387 145 652 372 406 -56 334 113 -65 181 77 -435 629 -103
3820 -103 -487 205 152 1 628 87 91 252 -30 -70 192 10 511 -28 -267 -178 -93 -265 151 593 294 -165
3842 -165 340 -328 -675 -645 -62 -157 -157 50 277 41 -282 142 341 464 -24 248 246 52 -465 304 23 -116
3864 -116 -287 196 245 -8 -754 -68 -267 -498 217 -186 -353 -190 166 153 141 94 -98 -127 -445 -84 -190 248
3886 248 231 -586 539 -8 -188 126 -548 -105 -338 -126 -170 260 383 -149 327 279 -495 166 114 82 -137
3907 -137 -250 533 0 38 -420 -200 -168 -200 73 281 -567 546 76 -140 -196 139 -130 -419 -280 -141 65
3928F5n10P68n29J26J11m89M2R45j031M90J76l9m39l47K26J46O04n08L5R10m91
3949B61r97M85L27L53o41M47K74k69k28k69J76J77k57L24oJ57k16K06o39M9L9
3970b47p6M38m77J81L41J5K14m54j73M44m18N00j40k47j42r9J32K41K56L38n94
3991C3L10n96L90j33K19J24k6n54J31n37J190k3m75j31p22N61Q33r28J10l79J158
4012E55l30k57P8l42L10J5L51n0o71J11M12J04Q6n66j78l12P99j21K33j56l79
4033c08P50k51m4k8l60K43k99O28n75K28nK16K82m18P46n45n82N4M47k69nj67
4055b62o3N77J7o13L87l39J27L07m28R0k1K43l05O55j215N58N7K55k33l33K36
4076c03K49Q2m17J21P83o94Q67o3n54J49k60J06m3n5P4N85p63M77o54K10r6L10
$$ plain form
3928 65 -445 323 -206 -80 31 -458 -416 529 -502 -12 164 125 -314 -661 -435 -289 315 -193 -158 752 261
3949 261 -736 -251 76 429 -212 235 509 240 12 -257 -81 96 -161 163 157 314 98 304 -335 -286 -247
3970 -247 -323 115 -362 -181 160 175 389 -65 -238 206 -212 288 148 -99 -241 -340 -208 33 289 627 33
3991 33 343 -253 137 4 223 347 321 -233 -102 -639 551 528 53 -78 -800 -239 594 -334 -224 -603 555
4012 555 225 -32 46 -296 14 29 380 330 -341 -230 182 286 372 -194 -372 -684 115 -6 227 71 -308
4033 -308 442 191 147 119 -241 2 -297 331 -244 -16 -21 195 477 59 805 260 -322 -268 179 -90 -95 -262
4055 -262 -325 252 269 -344 43 -296 -169 138 -290 -200 -221 22 -283 372 -843 -285 -228 27 -206 -539 -303
4076 -303 -54 28 -389 -268 515 -179 688 625 71 220 -40 66 23 -32 42 627 -136 341 -313 -103 -199 111
4098A11K2l71J69j1k88Q55q22M09n43O06j11M64q63oO60J98p06M46J48k15P68
4119I20j433N52j25q9K85j23j35n8j47N88m10K87j25M99l44k51P48o84M00p20
4139c65K77K17M1M40j205M88j33m80J091j016J263n40K59n62L48k18L11J00m45
4158a29L66n51K50l07N27j05J4pJ68K11q20N21m73n03Q12j27K4P62o14K74o65
4179c72O46P9m45Q26j081O39m51L07r52J151p81L0O60l74J2m87N28j70O91m48
4199Hr7P3n48K12m09L67K39N25l55q8j9L38l21M43q09K94J70j73j72K60q8J55
4221EJ98o4p01K83J87l48M51P0k93K17K26L82n32l45N15o8N5j85l59j23L22m70
4243e77M45O3j09k67K61j83M03K23l21j53N8m98K63K28k44M89O8j48k46L71Q1
$$ plain form
4098 111 133 -238 -69 -80 -368 487 -335 74 -469 137 26 490 -373 -379 281 479 -227 219 367 152 920
4119 920 -513 39 -86 -175 110 -13 -148 -206 -353 235 -175 112 -13 486 142 -109 639 -45 355 -365
4139 -365 -88 129 170 610 -595 -107 -240 -720 371 -645 618 78 337 -225 123 -95 216 316 -129
4158 -129 237 -314 -64 -371 156 51 65 58 226 437 -383 138 -335 -838 -26 -153 -129 633 19 293 -372
4179 -372 274 353 -92 734 -347 292 -159 148 -804 347 -434 -404 256 -118 -106 -593 -65 -235 456 8
4199 8 -89 -16 -564 -352 -761 -394 -155 370 15 -73 -92 246 -75 368 -441 -147 23 -150 -322 -62 -150 5
4221 5 203 139 -562 -279 -92 -440 11 81 -212 5 231 613 81 -264 251 183 238 53 -306 -429 -107 -577
4243 -577 -132 -69 -178 -445 -184 -367 36 259 -62 -215 -157 -655 -392 -164 -408 81 149 1 -245 126 207
4264B07p32L93L83l26j79J5L48n31N2N68N34j071J89j77N84P7L39j266Q80L6l61
4285c8l29L11j2R8p97Q90l01j78R32q01K50N6K64K8l41n77J58J89J58K7k16j22
4307c51M06jl10J76l10P53O0k86J89j82l47J41J04j46j37O10o2m97J19rPk04L9
4330b38J72j92N22J82Q7m28M22p44O69o49M88o03J53l49L69J75J52M59o93j6L80
4351C18l17l19O42K40j084P64J20k66j5M08n42J85J98m56O99j834Q19P1O14K61
4371E06l21m07J74J83m18k53P10L03l1j108P95L10p87P7J93L35L19q34J9j11k83
4392f29R01m45N33l79M13K23r1j027K47k9j2M01p10R56Jj47q4j80N01j023N41
4413c9K69n15O66m68J73J25p23N2M25l21L64j95L80Mq87R42J19p88P6R71k20n07
$$ plain form
4264 207 -525 -132 251 -75 -254 -239 109 -422 -370 198 732 -339 -150 -327 257 334 673 -593 287 323 -38
4285 -38 -367 -56 -68 30 -767 123 -178 -356 576 -225 25 81 345 373 32 -545 -387 -198 -40 -13 -229 -351
4307 -351 55 54 -256 -80 -390 363 423 137 326 144 -203 -62 42 -104 -241 369 307 -190 -71 -80 -73 -277 -238
4330 -238 -66 -258 264 446 533 105 527 -217 452 -197 291 -312 -159 -508 -139 36 188 647 -46 -62 318
4351 318 1 -318 324 564 -520 244 364 98 83 491 -51 134 332 -124 575 -1259 -440 -369 245 506
4371 506 185 -222 -48 135 -283 -536 174 477 446 -662 133 443 -344 -267 -74 261 580 -254 -235 -346 -629
4392 -629 272 -173 360 -19 394 617 526 -501 -254 -283 -295 106 -604 352 353 206 122 -58 443 -580 -39
4413 -39 230 -285 381 -87 86 211 -512 -460 -35 -356 8 -187 193 197 -690 252 371 -417 -341 630 410 -97
4435i7l2q2r9N9jM63l87M86R7j68l37l24M86M72p67J21l12K15J43m9j72N53k50
4458A8J62j38o20Q23l36J11o25K36N05k71K24n5M5O5K1k22k84N28n2K52j38N0
4480B99l34J78J05k55l33N06mm29L44n07M85k16L46q48P95m93P46j179P84L06
4500B96r25Q29m13J37N23k99K61m10l82J99l23J220j76n92k56O55l70k88L09n68
4520e73l5N07J5J45O5l1l07Q08p27k12L56J70K49r8q30K34Q58j10q9l15k41J31
4542c0j38L87k44l30M99k49L86R7k99q8n8P8n94J32P08l26j11Q8p61O20l30M43
4564a20m44M90J08o6m67K43M57n53L31j95J1M87k00j47N1J75m16j54O82o60Q09
4585D22l90n29M67J62m54j66J360r60m7O7P27q45N1L6j45r0M84q6j80l19M1R20
$$ plain form
4435 -97 -129 -211 -310 -251 -252 211 -176 310 407 239 -98 -422 64 536 -231 -110 -422 -207 -64 -113 -285 268 18
4458 18 180 42 -578 245 -91 20 -605 -369 136 -135 89 34 79 144 165 -57 -341 187 135 387 249 299
4480 299 -35 143 248 -7 -340 166 162 -267 77 -430 55 -161 185 -663 132 -361 385 -794 -10 296
4500 296 -629 200 -213 -76 447 148 409 -1 -383 -184 -507 713 537 -55 -311 344 -26 -314 -5 -573
4520 -573 -608 -101 -86 59 124 93 -214 594 -133 -345 11 181 430 332 -498 -264 594 484 395 80 -161 -30
4542 -30 -168 219 -25 -355 144 -105 281 378 79 -9 -67 11 -583 -451 257 -69 -180 -92 -853 -233 -563 -120
4564 -120 -564 -74 34 -32 -499 -256 201 -352 -21 -216 -205 282 82 -65 -14 161 -255 -409 273 -387 422
4585 422 32 -497 -30 132 -322 -488 872 -88 -135 -68 659 -186 -135 -99 -244 -334 150 64 -116 -435 -394 526
4607E26l79l76K01N0o74P73N17o07j19M24P9q19M32J59j38l88M93j41J63k32j52
4628b08J23N86p56O97n78l93R29n89K68j71L04Mm39J97M25n31L26J36l8r9l43
4649a50m70O09J30q5l19R3R24p73M27k66n0j55m90Q59M27n81p44J060n74l34O77
4670B15l15J63l79L66K24o01J90M26j32n20j21M30O60p43L14l57K66K78l21m09
4690c66j44m2R92j51k82J98j70j16l77J093p48j7Kk23L14JK16q8j97l20K97k01
4712c29O28j23o01o2Q67n16K31n90M78N61o24J11l27j27O08J23j70l93j83j22
4732e60Q9Q47o72N06q35M43j46J33M36p74M1P28n11p1M04k4n90J019m50J21J4
4753A48k10O94n46O62o27j01K2K89m5L91r83M22L40l22m60J61N00R0n90O98l69
$$ plain form
4607 526 147 -229 -28 22 -652 121 638 31 -88 336 415 -404 28 187 49 -339 154 13 176 -56 -208
4628 -208 -85 501 -255 442 -136 -529 400 -189 79 -92 212 216 -223 -26 399 -132 194 330 292 193 -150
4649 -150 -620 -11 119 34 -285 -192 732 -41 386 120 70 -85 -575 284 711 130 -614 446 -128 -462 215
4670 215 -100 63 -316 50 274 -327 -137 289 157 -363 -484 -54 606 -137 177 -180 86 364 43 -366
4690 -366 -510 -552 440 289 7 205 35 -81 -458 635 -113 -130 -128 -351 -37 -36 180 92 -105 -425 -128 -329
4712 -329 299 176 -425 -487 380 -136 95 -495 -17 544 -80 31 -296 -423 185 308 138 -255 -438 -560
4732 -560 -471 376 -296 210 -625 -182 -328 -195 241 -533 -492 236 -275 -346 58 34 -556 463 13 134 148
4753 148 -62 632 86 748 121 20 42 331 286 677 -306 116 456 134 -326 -165 335 425 -165 533 164
4774A64j27k45k93N80j60l77P55m99P72m05m12L12J07k43j54L3l76P27L74n73
4794d0K97j68j28L22k04m06N75M39l74n98k61L53J69L99n10j87N48K69k36m56
4814a97N34k45P17k76j035L09l2k0Q05k87j027N95r3M99q8K76l5m69k82P86j102
4835f67J030no06L92j79m25O09l58R51j057N31k54j29J73nN05J1m2m26o8J65l36
4857a90j01O38m80M77n94j56K44K33M83l53P20n64l90O4O0M40k47o18lK80n72
4878f29N57j72M16k3r05J079q3J10m75j83K7l9J24K30q4l59O02k41P06l30l16
4899A2q06R31j94k2K04K13l65J60q83Q80k68l64J73M72m23m76Q26k34L43k27o
4920e4K17M89l44k83L55p75K25M75m12K10L20m31k80J34k09O27m81K62j99J42
$$ plain form
4774 164 37 -208 -501 79 -81 -458 297 -202 570 165 -247 65 172 -71 -225 -192 -568 159 533 -40
4794 -40 257 89 -39 283 79 -327 248 687 313 -285 -546 -193 -24 375 -135 -322 226 495 259 -197
4814 -197 337 92 809 533 -502 -193 -225 -245 560 273 -754 -159 -252 247 159 435 400 -69 -351 435 -667
4835 -667 363 358 -248 144 -35 -460 149 -209 742 -315 216 -38 -167 6 1 506 517 475 49 -19 146 -190
4857 -190 -291 347 -133 344 -250 -406 -162 71 554 201 921 357 -33 31 91 531 284 -334 -337 -57 -629
4878 -629 -72 -244 172 149 -756 323 240 350 -125 -308 -281 -320 -196 34 -50 -409 193 -48 658 328 12
4899 12 -794 137 -57 -79 125 338 -27 133 -750 130 -138 -502 -329 143 -280 -756 70 -164 179 -48 -54
4920 -54 163 652 308 25 380 -395 -170 305 -107 103 423 -8 -288 -154 -363 264 -217 45 -154 -12
4940a2M54m24O2N05p42L13L4J49j63l94L45j53p5J67j99K51k41J47j80M97J9r59
4962e99O34N1j23R5p08k01J178k72j06m51M82l67K68k42k7J54L78l99j84O29l32
4983a42K4K05m07L89M21n82J43k01k82J49J69j70M06p71Q60m17q8K7m13J153o92
5004b19l27R38n23O30l49J51k8l43o83N29M01m66P53m32l59M70rO7l43L96l22
5025f8j67R43q28k92R49m12j95K08J0J16o75q2R35n36J51L44o19l13J05O42n58
5046c42k3N51J3j24q95J119o47k42M79k46K40O75o43K86m52J88m21J84L92m21
5066c29K23k74J03L50N53j019J063k66J38n07P7j5K9J23n77K77J59k23P36j85
5086D36j092J69K79K69l8l99J019p17k5k53O66R4n43k26n0M26N55r45k13J108
$$ plain form
4940 -12 442 18 80 585 -157 156 190 339 176 -218 127 -26 -101 66 -133 118 -123 24 -156 341 360 -599
4962 -599 35 86 -37 58 -650 -851 327 55 -51 -502 -20 -387 -119 -361 -388 -234 144 -255 -439 190 -142
4983 -142 -118 87 -320 69 490 -92 51 -150 -432 -283 -114 -284 122 -649 211 -206 -294 -267 -680 473 -219
5004 -219 -546 392 -131 499 150 301 273 -70 -753 -224 177 -289 464 32 -327 143 134 201 -142 254 -68
5025 -68 -235 708 -120 -412 537 125 -70 138 148 264 -411 -493 442 -94 57 401 -218 -531 -426 216 -342
5046 -342 -365 186 199 75 -820 299 -348 -590 -111 -357 -117 558 -85 201 -251 -63 -484 -300 92 -329
5066 -329 -106 -380 -277 73 626 -393 670 404 542 35 112 97 126 249 -328 -51 108 -115 621 436
5086 436 -656 -487 -208 61 23 -376 643 -74 -99 -352 314 408 -135 -361 -411 15 570 -375 -588 520
5106E20m44L7J28o0L70o76K23o8l85j9M69l9k23R69p19J54l78p9j67J50J24L08
5128A95m45L96k39O7P64n89R8o47M59P19j068P45o11m80L33K28Q2m87M55j35J68
5149HN1l93K99m1l60Q82p53J70M5q10N94J62J77l85M33j88o43M97L6l36L45M77
5171B67q49K72L40l21K05l0k70Q28o99O62j60j24K66m17L47m64J60N98m81p03
5191e73p9L46j00M92k2K60j17M9O6k89m84Q22j91q7R4K52m82o50O94K58k19j16
5213g6J77K54l82J94m1n4M66O2r44P7P24j77j4o55K78r6L14l60O71l68J68k08
5235A0l54L2N40r9K53n68L77k86j28k69L67j92P36P3m41N31j314O43M53o26O25
5256C63r15L09l62P26K18j80j3m75k17K51P21j131N81N11m09J47K72n72M59l10
$$ plain form
5106 520 76 113 241 181 551 -125 98 30 -355 -374 95 56 -167 802 83 237 -141 -220 -387 -237 -113 195
5128 195 -250 146 -93 -26 738 149 247 -400 59 778 -290 455 -156 -636 -303 -75 7 -480 -25 -160 8
5149 8 59 -334 -35 -76 -436 446 -307 -137 -92 -902 -308 -146 31 -354 79 -109 -752 -255 -219 -555 -210 267
5171 267 -582 -310 30 -291 -86 -116 -386 442 -257 405 245 121 387 -30 317 -147 13 611 130 -573
5191 -573 -652 -306 -406 86 64 324 207 256 322 33 -451 371 180 93 187 439 -43 -693 1 259 40 -76
5213 -76 101 355 -27 167 126 72 538 600 -344 -267 457 280 266 -389 -111 -207 107 -253 418 50 218 10
5235 10 -344 -312 228 129 382 -186 191 -95 -223 -492 -125 -317 419 492 51 582 -732 -89 364 -262 363
5256 363 -552 -243 -605 121 339 159 146 -329 -546 -295 426 -705 -124 387 -22 125 397 -175 284 -26
5276b6J16r4J61p20L11N29l82J39j20J45L55J1l18l62P58j46j062O92q3k80L28
5297d8j38O58k23k3m26L93k52M35o98L7J50n5L15M05n97n68K63j7N71m54r7pM16
5320D0L2o58K84R10m57k02K3j7Q0l3n25K78M39R4m80l44K55M14l01l80O78J6n63
5343d17K80K27L27l86K72p52M65j1o4k78l9L55r0l45M91K19j52j20K98n77P76
5364D79n19L4N8l77L16M48m61k70J54j80L35O5O7k05K40l23K17K3k93L99r1J40
5386B56p60J92O65n08N25o27N56k95R57r61l73P57j04o88J73K60L56P3j08l74
5406b8L62k92m31l2Q26l52j10L22q2m42LL63o21J020q01O21k67M03m47K79o78
5427c84l2J89O58n96M67k4k20N24m44J80o33N88k68nJ24j14k17k81N71pl7M53
$$ plain form
5276 -26 90 -4 157 -563 -252 277 -105 34 -86 59 414 425 107 -255 503 357 -705 -13 -96 -376 -48
5297 -48 -186 472 249 226 -200 193 -59 376 -322 -285 -135 -190 125 530 -67 -635 -372 -389 182 -272 -369 -376 40
5320 40 72 -586 -302 608 151 -51 -28 -45 35 2 -523 -245 194 288 -192 -536 -281 133 -168 -548 130 146 -417
5343 -417 -137 90 417 31 303 -449 16 5 -59 -337 -376 -21 -111 -456 35 254 102 -18 280 -297 479
5364 479 -40 -6 52 -325 -9 439 -22 -292 -138 -318 17 82 149 -56 184 -139 78 101 -192 207 116 256
5386 256 -504 -312 353 -155 370 -257 299 4 961 0 -373 384 280 -408 -235 25 381 454 346 -28
5406 -28 334 42 -389 -421 405 53 -57 265 183 -259 -256 107 -514 506 -295 326 59 462 15 294 -384
5427 -384 -416 -227 431 -165 302 278 58 582 138 318 -315 273 5 0 124 10 -207 -488 83 76 39 492
5449D92k90j90M52K82j303M81N01L49j179J13l20N74J18k46M09q71N17J20N4m04
5469c41P29o15L02j27j98KJ57m0P41o77j9J12k03N53l72J14l9P9J66j009J006
5490C21m34k1J52K47J0l64N7J42J82m28j5L91k02k67K68l88N7Q13q89k22J270
5511F80o00Q06r28k58P6M10n84L26l04K11P10r88M73j65j60J013o02k96l0rK52
5532C3l66M94O8N7r1q96M14M53m06J87j44M58o2j49j87K00j43N74q17J30J88m3
5554d8K29O4l21j98nJ88q3M43Pk84N2j34K26R2J10l59K74k36o89J77P92l76N09
5577D30K97j065N48m14K42k20N9k5K21Q1m11N93p25k5N60p68P32K21l14K18m04
5598a69J88l90K33K22l84j51N19K83l77%N1o28O94j171R28Q83o50j79M11k00m08
$$ plain form
5449 492 202 12 464 746 -557 -76 425 774 -405 -292 -612 -38 80 -166 243 -628 -111 9 63 -341
5469 -341 388 -227 75 -52 -250 -248 -91 -131 610 -67 -86 26 -177 376 4 118 79 158 324 -685 321
5490 321 -113 -134 18 265 275 -89 -32 110 292 -136 -151 240 38 -229 39 -349 -292 521 -368 -590 680
5511 680 80 886 -42 -300 -224 186 -398 -72 -376 -165 545 -443 30 -135 -295 718 116 -180 -210 -219 33
5532 33 -333 161 229 286 195 -701 -287 166 -240 -53 -197 261 199 50 -137 63 -80 494 -323 -193 -5 -48
5554 -48 181 245 -76 -274 -279 -91 -174 269 276 -8 44 -90 136 228 338 -21 253 17 -672 -495 297 -79 430
5577 430 727 -338 210 -204 38 -182 -123 -148 73 154 -257 336 -389 -414 146 -622 110 331 17 235 -169
5598 -169 19 -371 -138 84 -300 -451 68 351 -26 -26 25 -603 91 -1080 -152 731 81 -98 313 113 -295
5619b95L92m41P69o36J80l87M46k62p8M72j58m5K20J28p83K35J09N92k30n77P78
5640D29j05q08L89J053m92n76L9J06M9L7L59m14m00L24K77oJ45m64j06k39J00
5661c03l54N58N1k06O04k66n53Q54j169O76n98Q28Pk65j37J69rP21o57k03R33
5682F81K7n85m41K40J37J42k73M29l24j42l05o1K87N91l62M1j64N2L0N03q90N0
5704c37K7L48o19P66K1j07j79jk66j77N08r7m72k05Q38p44J103n14R1k48L79J59
5726B74o43N10n46O14M4K37q52J64O33l04J48l12L92L77j085K12J98l88O83n37
5746a81K49o57N01K27k16J00k41j1K87l01M53m07L73K2j05l0J32k04K92m98j89
5767d04N07k75K7N25l41J70k45k50N6L21l80Q7K16O5n32J33K52l47P49j27k52
$$ plain form
5619 -295 97 -344 425 -211 -31 -418 28 -234 -312 160 2 -43 177 305 -478 -243 -134 458 228 -349 429
5640 429 324 -484 -95 958 466 -110 -71 35 84 121 480 66 -334 -10 267 261 406 -58 -164 -403 -303
5661 -303 -657 -99 -48 -254 350 84 -469 385 -784 -108 -706 122 129 -136 -273 -104 -113 608 -49 -252 681
5682 681 708 123 -318 -78 59 201 -72 357 33 -109 -414 -475 -188 403 41 82 -82 -30 0 503 -387 -337
5704 -337 -310 38 -581 185 206 99 -80 -81 -347 -524 -16 -113 -585 -790 48 -696 407 -107 -16 -264 115 274
5726 274 -369 141 -405 209 253 490 -362 -198 435 131 279 -33 359 736 -349 -137 61 -327 356 -181
5746 -181 68 -589 -88 139 -77 23 -218 -229 58 -243 210 -197 176 198 93 63 195 -9 283 -215 -404
5767 -404 103 -172 -145 380 39 209 -36 -286 -230 91 -289 -202 14 79 -453 -320 -68 -415 334 207 -45
5788d5J74J35j02O92o01m20M42l63K91o59L73L74j03j032K54O11L05l07P5k22
5808a28N13m5k90j3n10N25L03j68J34Q5n20j1K87j70OM9L58o57J86j84Q18n16
5830E2k63K10k71L0K40o75J237l91k40K13L48m15k38J54N3J6N5L21n50K08m38
5851c44P42q12N33j40k07K51n4K21N5n65L23n20N78k03L25l49L80j73m28M64K87
5872C64l32m1J85j84N4o2k28Q53j54j60M00r99l6N7Q44r06O4L23m99L12l10K62
5894a93N98k20k25l13K69M17q62Q34j70l56j02O02o54K87P4O3N37n71j01k11K2
5915b75p3J26L04K51l16j87J53m19N19m14j14P51k92J40m22O14N0K42j102Q37
5935C73p71oK03M54P26q59l13K64Q9l05p4m17N62K1k19K73j58k05P62q36K11J84
$$ plain form
5788 -45 129 264 162 854 253 -167 275 -88 203 -456 -83 291 188 -844 -590 21 326 19 94 -128
5808 -128 385 340 50 37 -473 52 355 187 321 406 -114 -125 162 -8 -2 47 405 -252 -66 -250 568 52
5830 52 -211 -1 -272 -242 -2 -677 560 169 -71 142 490 75 -163 -9 44 60 115 436 -114 94 -344
5851 -344 398 -414 119 -21 -228 23 -31 190 245 -320 3 -517 61 -142 183 -166 214 41 -387 77 364
5872 364 32 -9 176 -8 46 -16 -244 609 455 295 695 -304 -340 -283 561 -345 -281 42 -457 -145 -455 -193
5894 -193 405 185 -40 -353 -84 333 -529 305 135 -221 -323 279 -375 -88 -14 49 586 15 -86 -297 -275
5915 -275 -348 -222 82 333 17 -170 -17 -436 83 -331 -445 306 14 154 -268 346 396 638 -464 373
5935 373 -398 -404 -201 253 979 120 -193 71 160 -145 -219 -636 -74 -53 -272 1 -157 -362 400 -436 -225 -41
5957d1K97o3o02M14l43P97j66M75k19q06j22J94K45M17o82L70J91j49k80j31P8
5978a26j98J347j095N98o72M47j30K12q1M4k96N7M4k08j59L24Q5o1J77n46N30
5999B93L76q45L81m52L0O13l33L49p81J95J18K53j64R3o7k68M7k36J94K92l69
6020b81N60j68l36M5M92l43j48L03n7o83p6L46O85l10k59O4O22p10J51j2J15o1
6042f1K84n02J13n1M43j04o8K83o47q3J041o71J68j6l7k66L06J93n44L04j18k14
6064b47P51p11k39J18P67p19L73Jj13L82o58P7K79l84J010r51M02j60K11J16p05
6085d00N04K6l27l1J23Q7M77p53P0MM52p33N10m8K91l81K74l8K85o29N68l34j31
6108a34j63Q09n87k92M44J71R0m50N7J63j17J81l4L3J46k39n74L1M99KL57j53
$$ plain form
5957 -41 256 193 -409 5 -338 459 293 768 549 -257 -379 -185 60 477 -205 165 356 207 -73 -204 -126
5978 -126 -324 1023 -72 526 -146 301 171 383 302 346 50 107 151 -57 -216 108 193 132 309 -237 293
5999 293 669 -176 205 -247 -217 396 63 412 -369 -174 -56 197 33 126 59 -209 -162 -398 -204 88 -281
6020 -281 279 111 -225 -180 312 -31 -179 124 67 -616 -692 -346 339 29 -230 -166 456 -254 -103 -115 0 -61
6042 -61 223 -279 -166 -217 226 122 54 337 -310 -393 648 -23 145 129 92 -174 132 325 -219 85 -33 -247
6064 -247 504 -207 -446 -328 439 -280 93 94 -19 363 -295 -218 61 -323 687 -264 138 -22 189 305 -400
6085 -400 104 130 -197 -228 -105 -18 459 -294 -224 -220 232 -501 9 -39 252 -129 145 107 392 -237 331 -3 -134
6108 -134 -297 512 -75 -367 77 248 338 -112 -55 108 -9 172 138 171 317 78 -496 -465 34 36 393 240
6130B40j71K51n36p4M04L0m6j037P86L29k16R0J27M18j163O95p62M65P60p80N05
6151C15l31k69P63m19k04J35j89j8Q04j089O91m53M90Kl09p14J532m86k07M54
6171D98j53m70k30M63M49m64m72q3N72l66M19L40n81L1J90n44L60n34M41K16k24
6192a42O10n94J98L12r3l86j5Q4J00K51n56J62l43J208r14q7k12J28P44k88n67
6213d00P47k99o26L64k03J270m65k10o11Q03p87M79O1K96k96l72j08K25O96r09
6233c45N59j45L92j153P76J68n18K41J84L17m03K42l19l47P02q98J145n50j77
6252a29j33J56J18L50M17r69j60K2J71j53L33Opk67J38j47n8L32k59p0K94n89
6274f04P15j67l31O71L33r27J51M05k77m93L74J2J39k06N2J20n4M42m59J08l78
$$ plain form
6130 240 69 320 -216 -290 114 144 98 -939 -153 176 -40 50 177 595 -568 127 -635 -170 590 -190 315
6151 315 -16 -285 478 59 -145 -10 -199 -217 587 -502 189 -264 226 228 -81 -795 737 251 44 498
6171 498 345 -125 -355 108 557 93 -379 -462 110 -256 163 503 -78 -47 143 -401 -41 -575 -134 82 -142
6192 -142 468 -126 72 384 291 -95 -110 -26 74 325 -231 -69 -412 796 -118 -205 -417 -289 455 167 -400
6213 -400 347 48 -578 -214 -417 853 388 178 -433 370 -417 62 123 419 123 -249 -357 -132 564 -345
6233 -345 214 69 461 -692 84 252 -266 -25 159 476 73 315 -4 -351 351 -547 598 48 -129
6252 -129 -262 -106 12 362 779 -190 -350 -328 -157 -310 23 29 22 -245 -107 -254 -312 20 -239 -309 -15 -604
6274 -604 111 -56 -387 284 617 -310 -159 246 -31 -524 -150 -138 1 -205 -153 -33 -87 355 -104 4 -374
6295c74J79Q91q20j06N60k7m69P93r11M42j55j97K97Q4m07j01l18P32O06j660
6315i61P02J34k10m74J285l69j97O33j036P51k10j09K53L48p33j55O86o7o1Rk16
6336Ck03K33M44n74l20j67Q90k93O13p02L83q4j84Q2K08k55J38l47K00J4q1o88
6358f90L23M46m65j42O15O66j373M69K46Q0m36o9L33o30P80J14j74j39L79r28
6378e95O96p7j91J91N9K36j93K60o12J83j73M87o69M54L81p97L79j15l13K03L95
6399A89j76J90l34j94N35j23q87J122j90r5l98p5R07m44k03k09J56Q62j064J035
6419F04o25L67j050P63r9L10J94L90j090J83N03k26Q8J95r08N50k19j21Q28n81
6439E6Q4j13P9m92N02r50O75k12L0J11L40K28l5M0k26R1m12N1k04Q22L3j267J050
$$ plain form
6295 -374 -195 696 -124 -230 330 303 -166 627 -284 158 3 -194 103 187 -220 -321 -639 93 699 -961
6315 -961 -259 -125 -335 -809 476 107 -90 543 -493 258 48 -61 192 540 -193 -348 338 271 210 219 3
6336 3 -200 33 477 -97 -417 -584 306 13 626 -76 307 223 39 121 329 74 212 -135 65 79 -2 -690
6358 -690 -367 79 -386 -528 87 753 -620 -151 95 175 -261 -330 3 -627 153 267 93 -46 333 -595
6378 -595 101 24 -167 24 83 319 126 386 -226 -43 -216 271 -398 56 437 -360 19 -96 -409 -206 189
6399 189 13 203 -131 -325 210 87 -800 322 132 37 -361 -436 471 27 -176 -385 -229 633 -431 604
6419 604 -21 346 -704 59 -40 270 464 854 -236 -53 450 224 312 507 -401 149 -70 -191 637 56
6439 56 140 27 106 -386 116 -834 -159 -371 -341 -230 110 338 303 343 117 208 -204 -153 -357 465 498 -769 281
6462B81J33o75N67m71l0P82m09n0j87j65O49j76J74q74O71M0q8J54q97Q52n46
6483b65M64J89q29M09k66M81n13L92n42J15P18o70L43N56k48O9j01l1j78l38O90
6504D45q19M48L79r15L98M17k36q3J55N11n32r1k57r4P21q26N12J09k58k89N54
6525B49n14K92K69m81J69l18M53nK85N64j131J46J85K78m40N96j93p21J045j175
6545d47O62q09O64k8p1K03O18r99L21k72p22N41L39N4K06O77k058J353R3K04k04
6566C25o46M6M73nl40nk6N68o15K86n03J010o07j99N46l91K66n4o68L74l33J50
6588c48j31n01P17K03l45L77k22j70P86k07q09K15N74o42R14q27O5N14p9M2n15
6609c89O39l76q6j87j01l97P83l3J16M31r51J123q80l93Q02m16Q53j63l87J04
$$ plain form
6462 281 414 -261 306 -165 -195 587 178 128 -59 -224 425 249 423 -451 220 260 172 326 -571 281 -265
6483 -265 199 388 -441 -32 -298 183 -330 62 -480 -365 353 -317 26 582 334 403 302 271 93 -245 445
6504 445 -374 74 453 -462 -64 353 117 34 189 700 168 77 -180 -274 447 -379 133 242 -16 -305 249
6525 249 -265 27 296 -185 -16 -334 119 114 399 963 -168 -22 163 441 1 597 404 -317 728 -447
6545 -447 215 -594 70 42 -29 174 792 -207 114 -158 -880 -339 0 54 260 937 -1121 232 325 529 325
6566 325 -321 -275 198 193 -147 -152 -178 390 -225 61 -442 568 -39 -238 308 -83 183 129 -539 -165 -498 -348
6588 -348 -479 -980 -263 -60 -405 -28 -250 -420 366 159 -650 -435 139 -503 411 -416 -351 163 84 126 -389
6609 -389 250 -126 -212 -399 -500 -897 -114 -147 -31 400 -551 572 -308 -701 101 -315 538 375 -12 92
6629I2j55J0L84k55k05J69J33k13k09M92J9m50j42r6J43R5k39J276o30m72M29
6650A76j74P1Q27q16l78j70M98k73P36q88O9M49r56J310o38K16K39q70L32j9O07
6671C48p34L94J23k55K73l11J45l69k6P23m87q04J068j48k18L76J5J9j13P43j392
6692f30L60j42L44K1m42Q61o92N73n89Q0Q42k96m51p9O60j56k11l53K31l1L94
6713B94j10l78j73N18j82r1M01J67N8j51p33O49K08m96L8L37p18j2M31K57k78
6734C6l72P67r26N1K89K19J87j33k51j52n4j23N40K12p7n79K90J2L3J34N83n45
6756A41j68L42o67K21K2R8j34K12L09l96M29p95Q4j64K53N13p59O24k42N37p98
6777c38L87j36P7N1p9M56o79P80n28j9J92n21R57l52o63J81K1N96l04o17J88J69
$$ plain form
6629 92 -63 -53 331 76 -129 40 173 -40 -249 243 262 -188 -330 -426 -283 -188 -427 849 219 -253 176
6650 176 2 73 900 84 -294 -464 34 -239 497 -391 -322 127 -829 481 -157 59 298 -572 -240 -259 348
6671 348 -386 8 131 -124 149 -162 -17 -386 -412 311 -176 -980 88 -60 -278 98 113 132 19 762 -630
6692 -630 -270 -412 -68 -47 -489 372 -320 253 -336 -256 586 290 -161 -240 420 264 53 -300 -69 -100 294
6713 294 184 -194 -367 151 -31 -122 279 446 504 353 -380 269 477 -19 19 356 -362 -374 57 314 36
6734 36 -336 431 -495 -444 -155 64 251 118 -133 -285 -339 -462 78 290 213 -366 -76 -64 -31 103 686 141
6756 141 -27 315 -352 -131 -109 -11 -145 67 376 -20 409 -386 -302 -466 -213 300 -459 165 -77 460 -338
6777 -338 49 -87 -10 41 -38 418 -261 519 -9 -28 164 -357 600 248 -415 -234 -213 383 79 -538 -350 -181
6799a81J07p3L28j84q41N53J22Q0j09K22j39k94N46L68o27m46P17l08N75K4o75
6820b35L74n72N0O18l71k9J82m15Q40l56k71J46O3N58j024K92j25J068m90k34
6840F9m3J06l92Q64K0p74O98J42k09q66L89m15P05n33k26J83P43m97N90m85k64
6861a95J61n59N16j63l0N50p00O45k33k72j80L45n65N34m99J470l40r23M68k20
6881a90j88K89L83l05j01J92L38m56K2m94j03N33J52M6K02ql40r1l30P41m70J26
6903e2j55J62K86l33O12l57m68j28M83L65o40P78o26J5k0K5K42J52q26Q34j11
6924B38k25k07k6L50p0j43q5o8K77RK25n09J34P9K0K3J52o00LJ26P45l02j16J47
6948A77n8o03J33K49l35P99p24O11k88l12N00n36L25K82j23j53K82m01Q22m96
$$ plain form
6799 -181 -74 -147 181 -3 -844 -291 -169 -89 -198 24 -115 -409 137 505 -122 -568 149 -159 416 440 -235
6820 -235 139 -433 -383 235 -136 -165 17 -398 442 86 -185 -39 24 582 -442 -150 -275 793 303 69
6840 69 26 132 -260 604 624 -150 548 690 481 -385 4 -411 294 -239 -465 -282 461 -36 554 69 -195
6861 -195 -34 -593 -77 -240 -270 280 -420 225 -8 -280 -460 -115 -680 -146 -645 825 485 -438 30 -190
6881 -190 -378 -89 294 -11 -112 80 418 -38 -16 -510 -613 -80 72 118 320 312 -28 -119 -449 292 -178 -52
6903 -52 -207 -45 241 -92 520 163 -305 -433 50 415 -225 553 -73 -58 -78 -53 189 341 -485 349 238
6924 238 13 -194 -220 130 60 -83 -168 -236 41 50 275 -234 -100 -21 -1 22 174 -426 -423 -297 448 146 30 177
6948 177 119 -484 -351 -102 -437 362 -362 249 -39 -351 149 -387 -62 220 97 -56 226 -175 647 151
6968A51J06j51l60O12k55l31P26o18l54O08O09o7r46O12J43n23O39p62K51j60
6988g0m45Q89m85k88N36J61q94Q13p5j24P8j124K76L52j04P96N57q54r6n9M5J97
7010H2m92O14K75o22k4m3J16R4p8j32L8P54r86k05N40M28k70m5l47j90N74L1K5
7033A37p1p69J088m28m48P28j045R97k13O27m28k92P2j40N24l47m38P7k94M38
7053b25L79j59N2O47k62m40j0J60M37j59j02m03j32N05L72p65Q6O10m88M62o40
7074g5J018j153J96j48L09n86N58l10N73j19o33P66j000O17p01M82L23j52k14
7093b49J93K82m31P48q68N39l11K59O0p73O32l25M93m20P43o16N03m87o24nM18
7114b39O01j05n13M22j47n6l08K56j25J90o12K09L30J20j23m4j8K92L31m29k01
$$ plain form
6968 151 257 106 -254 358 103 -228 498 -120 -474 134 743 676 -270 342 485 -38 601 -161 90 -70
6988 -70 -515 374 -111 -399 137 298 -596 217 142 18 96 -1028 -752 -400 -504 292 849 -5 -101 -160 -115 82
7010 82 -410 204 479 -143 -167 -210 -94 0 -78 -210 -172 582 -404 -609 -69 359 89 44 -303 -493 81 112 137
7033 137 66 -703 385 -43 -491 237 -808 189 -24 603 175 -117 -45 -185 339 -8 -446 -369 -663 -225
7053 -225 154 -5 47 694 432 -8 -18 142 579 420 318 -85 -217 288 660 -105 -19 591 103 565 -75
7074 -75 943 -210 -14 -162 147 -439 119 -191 382 263 -370 396 -604 13 -688 -206 117 -35 -249
7093 -249 -56 226 -205 543 -325 214 -97 162 222 -551 81 -244 249 -171 572 -44 459 -28 -652 -657 -239
7114 -239 362 257 -256 166 19 -37 -345 -89 -214 -24 -636 -427 -97 23 -100 -144 -162 130 461 32 -169
7135a69n3K19l83k69M09N80k15p40O37m12L74L82k96m55K74J70M31j44l25L67
7155C82l47N55n93K54K45j166N20P4l0Q03j171N0M31J90q56P02K56k44K35q2M36
7176F44p70M97j79J12o29K95qR2l80o05P56L62j00k37J70k14J55j85l32M96N01
7197D41r39J292j164M48O13n65p45M23L06k72K71k55p4L30P42r51J1J80L94q36
7217c50M29J08m38lK17j69K63K22l29N85o11N0J78o33K19L56m14K83n71P52k89
7238a45m05O93P9j94L80k99p36O73nl14M19o18Q72p05K29O55j348N64m02N24K24
7259A41m79P40o35q1L89k65M70N2l97N8J09p2L35k84J04Mp97Q41J41l14P37l85
7281D12n77N01o42K80j87J88M76p09M92l77J62m55P39o30k35R13q3l37J45n51
$$ plain form
7135 -169 -222 -3 -386 -655 -246 334 119 -621 16 -396 -22 360 64 -391 -117 53 484 340 15 382
7155 382 35 590 -3 251 496 -670 -150 -76 -106 697 -474 -424 7 197 -659 43 299 55 290 208 644
7176 644 -126 371 192 304 -325 -30 -38 54 -326 -931 -175 187 87 -150 20 -194 -39 -224 -556 -60 441
7197 441 -498 794 -370 78 691 126 -619 -196 110 -162 109 -146 -220 110 852 -99 -88 92 486 -350
7217 -350 79 187 -251 -254 -37 -206 57 279 -50 535 -76 -26 152 -481 -262 94 -320 -37 -608 144 -145
7238 -145 -550 143 222 28 408 109 -627 46 41 -273 146 -472 400 -305 -76 579 -769 -205 -607 -83 141
7259 141 -338 402 -233 -314 75 -190 280 332 -65 -7 102 30 365 81 185 189 -608 233 374 60 797 412
7281 412 -165 336 -306 -26 -213 -25 451 -258 234 -143 19 -436 303 -327 -562 351 268 -69 76 -475
7301d75O05n36P33j69o07L00O49j165P77m92N7K37L95m85k57M37J16M47r00K62
7321g1p39N21j92Q11l71l98O67j03K45k94K51n11P03k8p00J22J91l68M40l03O89
7342E62n97n4m2L75K89q87jN75p13J017k06j43K5q8m58M32m44L14r5l73N56L91
7364D35r80J011l50k73O14m99m2m69K02M71l74J18K57OM3r2j29L5j19Q7n5j77
7386b80N49n66N12l39jK22j19K8K5l76N99l80o2k84L59j41M98m42N48k79J42L65
7408E78r19m6RJ31N55n86L70K5n02K59q4L70k32P5lr1o39P28M67p87k02M02k56
7431c78M19j6r9J26L65o07K79P0k99J006o55m35M13o03P03r6J46j98o70L61j37
7452c05P37l69k76n09J131j09O6k00k42j4J3L2l04K75p61N77J37O6K28k18M3k06
$$ plain form
7301 -475 130 -406 327 158 -449 -149 500 -665 112 -380 -323 -86 309 -176 -433 4 120 567 -333 -71
7321 -71 -810 -289 -481 330 -41 -439 228 125 370 76 327 -184 519 491 -209 -87 104 -264 176 -127 562
7342 562 -35 -89 -131 244 533 -354 -355 220 -493 524 318 175 200 112 -346 86 -358 -44 -139 -512 44 435
7364 435 -545 466 116 -157 457 -42 -84 -553 -351 120 -254 -136 121 127 170 78 -51 -16 -135 -48 -103 -280
7386 -280 269 -297 215 -124 -125 97 -22 6 31 -345 254 -126 -188 -472 -113 -254 244 -198 350 71 213 578
7408 578 -341 -387 -378 -247 308 -278 92 117 -385 -126 -210 160 -72 3 0 -91 -730 -2 465 -322 -524 -122 -378
7431 -378 41 25 -74 52 417 -190 89 159 -140 866 211 -224 189 -414 289 193 339 141 -529 -168 -305
7452 -305 432 63 -213 -722 409 300 366 166 -76 -90 -77 -45 -349 -74 -835 -258 -121 -55 173 -45 -2 -208
7474b08L39P5N8J3n47J37N2l85N39l16L54lk04K44N7J10r9n6L45n69Q03p14j52
7497a27L41P9l5R5m28n11N28M01o40Q9N78k74M13k72J52l00n6n51R04L0j0k23
7519A83O1l75L08k98K17k26K07m68j46K29L77N51L35o79k09j04p28Q54J65m60
7539b06K21J17l08K46J13L94p88p6P39n5n33N36n91O2J69o25J121j262P38o4j16
7560a68p2M8J36J13r5j33j14l00N28l5L96r03P26j11j34k07j39P17l79J99K61
7581C34N3m01L62p93M51o83O46N22J84p46K33m60K39K11l96K49m38P01n4m13K05
7602FL10p50M84N18K92q01o03m93O85M49q12M14J034p05M10l70m7k12L37k1N45
7623F70o80j77l85O98o1l67J88j98Q89n64J7P2L74j079P64N1r0K23m02K95J51
$$ plain form
7474 -208 131 206 264 277 -270 -133 -81 -466 73 -243 111 108 -96 148 205 315 216 160 505 -64 739 25 -127
7497 -127 214 293 258 353 -75 -586 -58 343 -297 -208 370 96 509 237 389 89 33 -518 386 416 406 183
7519 183 244 -131 177 -121 96 -130 77 -391 -537 -308 69 620 955 276 67 -37 -765 89 254 -206
7539 -206 15 132 -176 70 183 577 -211 -287 452 397 -136 400 -191 -129 40 -585 536 -726 12 -52 -168
7560 -168 -240 -192 -56 57 -38 -171 -285 -585 -57 -92 304 -599 127 16 -118 -325 -464 253 -126 73 334
7581 334 387 -14 348 -445 6 -677 -31 491 675 -71 162 -298 -59 152 -244 5 -433 268 214 -199 6
7602 6 316 -434 50 568 860 59 -544 -1037 -352 97 -715 -301 733 28 438 68 21 -191 146 125 670
7623 670 -10 -187 -572 126 65 -302 -114 -312 577 13 30 102 476 -603 161 212 122 345 -57 238 389
7644C89o03j13N91n42M79q4j83M31O2p02K26j03j4m12K48L23M40j01o72N8K15
7665f7L26m42m39P45lK56l5k75J17m72M67l21J63K7n14M78J57o8N26n1n24n51
7687e00Q33n61J93j75K32l6K18M71l95j05p6m6J20k54P09q84L46j03K95l33k15
7708b66l3J99J14r4j22N47P0l20J62K9n3o99R98p04m0Q5J67j087J066P3N16n91
7730A7l29K56j36M6M77P4p73L46m2R42n08o16j6m21P53q9j62l4O3m6o0K88j6j31
7754a17k52M07k00j73L06J59P01j218L72m64O19k22K18l97M60J59n06L48m85O47
7774C62J88q26P44j47m01L71n35K3J81P45o70r5N75m66j18K83M1n33K37k76p5
7795c92PP51j07L16m50j14J21K59p38J51O60m98k38j62N32o91R78n64M5M66J6
$$ plain form
7644 389 -214 -327 264 -278 201 117 -66 365 427 -275 -49 -152 -166 -578 -330 -7 433 332 -340 -282 -67
7665 -67 259 -183 -622 123 120 376 341 66 183 -289 178 -143 20 47 -467 11 168 100 626 575 51 -500
7687 -500 333 -228 -35 -210 22 -14 204 675 280 175 99 53 173 -81 628 -256 90 -13 282 -51 -266
7708 -266 -299 -100 14 -80 -202 345 415 95 257 286 233 -466 532 -172 -212 -127 40 -1047 19 92 608 17
7730 17 -312 -56 -192 -146 331 405 -368 -22 -64 878 370 -246 -262 -683 70 -19 -181 -215 -152 -198 -258 30 14 -117
7754 -117 -369 38 -162 -335 -29 130 831 -387 -15 -479 140 -82 136 -261 199 358 -148 200 -285 362
7774 362 550 -276 468 321 -80 291 -244 -221 -40 705 35 -60 515 49 -69 214 255 -278 -41 -317 -392
7795 -392 -385 366 259 575 125 11 132 391 -347 -196 464 -34 -272 -434 98 -593 385 -179 -134 332 348
7816C48k19L85k26o92R28m40PL50k01k73J46K30o85J58L73o6o1M72r99J56P48
7837D39k40j0m69Q0m5J62o28K91O86p91L4N56J04l4l71R94q20O38P8l79n78M70
7859A67p0L0J61k34j31k76P78m19m91K88j3J56J64o5k26k2L59O4k5p05K55K51
7881dm49R0M44M09m09M5J63l17j14rL72J11m59J84M20o43l67M27k64j30L32p8
7903b46L0J1p2O8O74r1j41o13N30m41n10R22j63l92J16Q74n22O88o28k05J90k60
7925a81J40J8K07j71m0k2P8M9J63o71r8J230q10M05k49m51J70J93PO02j72j11
7947B86k44J54j75m1r5k4P0n8n3J74M56o17K94l03n8J72N23j84j63q4J1j57o24
7970g40O32J25k0L42l84M35l60L22j93j55K91m33k92K65R0o3N2J83L94p59k4L12
$$ plain form
7816 348 129 514 288 -404 524 84 91 441 240 -33 113 343 -342 -184 189 123 62 534 -465 -309 439
7837 439 199 189 -280 -200 -245 -83 -711 -420 266 -525 -491 65 169 135 -236 758 -62 576 654 275 -303 167
7859 167 97 127 288 54 -77 -353 425 6 -485 -197 -210 -54 110 45 -181 -203 156 220 195 -510 -255 -4
7881 -4 -453 -363 81 490 81 126 289 -28 -142 -151 221 332 -127 57 477 -166 -533 -106 -370 -500 -168 -246
7903 -246 -216 -205 -277 -209 465 374 233 -380 150 -291 -801 121 -42 -434 -318 556 34 722 94 -111 79 -181
7925 -181 -41 -23 184 13 -27 -49 29 78 241 -430 -528 702 -108 297 48 -403 -233 -40 -33 569 397 286
7947 286 42 196 21 -20 -115 -139 -69 -127 -180 -6 450 -167 127 -176 -234 -62 461 277 114 30 41 -116 -740
7970 -740 -108 17 -3 339 -45 390 30 352 159 4 295 -138 -430 -165 -75 -138 -86 97 491 -268 -292 20
7992B0N5m00R52j82k97k14l16N17k7m09L85L45o45L15j80L07m4R7p12O83k36k05
8014a91j22L83m68j51N57j78K56L8J92o74J9O68o43L81j83K7k00p3M98L86p52
8035b30l59M42p9M24j82j43P14m18k74J50O2k19N13q7n23J76O53m20n75O84q76
8056e67j89Q71N3K19o0k96k37K60l87j42Q00m63l01O32J95l02l84j17P70l97P3
8077C1m8l27L38r1K98o42M18J39l54K88l05M48o13L44k2K4l88P62q45L23n1K05
8099f8L48l66L29l46O3J027j009k31M69n97K3L03O0k87M09L8K54p45M80l6J77
8120B95m14M28r6k68J24K83l9o18M56J6o07J32P3K94J12j36o92P30n76P32j18
8141A11L17p08K86p1N7o1l0j61r4O69n4K49m84j93M64k50p24P52l26M78k39p2
$$ plain form
7992 20 75 -325 627 445 148 -66 -382 135 108 -301 84 429 -216 99 -81 226 182 279 -433 250 14 -191
8014 -191 -313 70 -398 -549 8 -170 86 124 316 -358 -339 329 -314 67 -116 -89 -289 -362 136 522 -230
8035 -230 -589 -147 -226 198 16 -127 587 169 -105 45 107 -112 401 314 -209 -33 620 200 -375 309 -567
8056 -567 -756 115 168 387 327 31 -206 54 -333 -475 325 -138 -439 193 388 86 -298 -415 355 -42 31
8077 31 -17 -344 -6 -97 201 -441 -23 116 -238 50 -255 193 -420 -76 -98 -74 -462 300 -545 -222 -273 -68
8099 -68 280 -86 243 -103 -40 987 -22 -253 216 -381 -358 -55 5 -282 127 165 419 -326 154 118 295
8120 295 -119 309 213 -55 69 352 313 -305 151 167 -440 -308 -235 59 171 35 -657 73 -503 229 111
8141 111 428 -280 6 -65 -8 -69 -99 -260 -354 315 261 510 26 -167 297 47 -677 75 -251 227 -12 -84
8163h4l21R49k41p00J50M75k0l84M18j72j04O78j009M9J15J7r3J85j23k37O15
8184A63k21J94j060J123l39K9M04
$$ plain form
8163 -84 -405 544 303 -397 -247 228 208 -176 242 70 -34 644 -365 -316 -201 -184 -277 -92 -215 -452 163
8184 163 -58 136 -924 199 -140 -111 293
8191B93
$$ Imaginary data points
##PAGE= N=2
##DATA TABLE= (X++(I..I)), XYDATA
0@%%%%%%%L2n5N5o4O4o4R6j28J54j86K22k63K97l50M12m76N42o20P08q06R19j038
29e49J170j318J479j654J847k058K291k548K827l136L472l842M258m717N223n785
45c040O419p141P965q914J0025j1349J2950j4928J7450k0795K5452l2390M3806
58B5510o5766J22575n16485j358715J287058J568820m35720j368403J75173J228250
68F62297J36711j136826m62703P67981N95628m08403m13106L12830L53278l36520
78G1167m69778J09800M14477O0796k04234k6712J59411K7270j29882j16959m1324
89a45968M6298J89251J75836r7069k76094m9912K08010M5838k42905q8672K88293
100E2906K41328j62039k60957K7658J40002o1368j06801J30343J81311q0853j82717
$$ plain form
0 0 0 0 0 0 0 0 0 32 -23 32 -32 32 -32 64 -64 90 -96 126 -137 160 -190 222 -254 288 -332 376 -430 489 -549
29 -549 621 -697 782 -872 975 -1083 1208 -1340 1487 -1649 1823 -2019 2239 -2478 2745 -3040
45 -3040 3379 -3762 4203 -4711 5314 -6035 6915 -8013 9437 -11358 14094 -18296 25510
58 25510 -40256 82319 -434166 -1792881 -505823 1062997 627277 -741126 -565953 662297
68 662297 799008 -337818 -800521 -32540 563088 154685 -258421 54409 407687 71167
78 71167 -398611 -288811 125666 186462 -17772 -44484 114927 142197 12315 -104644 -145968
89 -145968 -99670 89581 265417 168348 -107746 -157658 50352 96190 -146715 -235387 52906
100 52906 294234 132195 -128762 -101104 38898 -22470 -129271 1072 182383 101530 -81187
111h1187L7869J11974j23966j80325J37701K88213k2812k52074j0721K05379m6833
122F3218k82657R988L59879J17228l16850j77868K71913J91624l01638l04889
132c70052K47018M31823o0518l99300o1488L09667Q4673k88758j42876K47603
142b208K21813j22749j92598M2756J10301o7896j10060P3402J45540m287r6661
153b647j1390L9285l5486n9574L5495P3839m827k6628M2010K2982r9790r6674
165a23405P7299J43637j6390j28070J526J33364J4245j61854q8412J21193J31894
176A05027m0428j00019J4834P1739j9272q0835j2178O0368L6700p451o738p062
188A4685k9745k1747J5366J4542j0338J1607M8652P720o9157m2505N1286M5956
$$ plain form
111 -81187 -43318 68656 -55310 -235635 -97934 190279 167467 -84607 -95328 110051 63218
122 63218 -219439 -209451 150428 267656 -49194 -227062 44851 236475 -65163 -370052
132 -370052 -123034 308789 248271 -151029 -212517 97150 181823 -106935 -249811 -2208
142 -2208 219605 96856 -95742 -52986 57315 -10581 -120641 -47239 98301 94014 -2647
153 -2647 -14037 25248 -10238 -69812 -34317 39522 34695 8067 50077 73059 -26731 -123405
165 -123405 -46106 97531 81141 -46929 -45403 87961 102206 -59648 -148060 -26867 105027
176 105027 64599 -35420 -20586 51153 31881 -48954 -61132 -764 35936 28485 21747 14685
188 14685 -15060 -36807 -21441 -6899 -17237 -5630 43022 50742 -18415 -60920 -9634 36322
200C6322n3572n1695P3995R5773n8614j36551O448J31051K2074j20958l6276J31662
212C9659P7534j14437j15778O8396J16838l8235j07951L1421J20183o716j25845
223e4931l1611J02266M6155q1782m5091Q4351O5804o8537q2646L6259P5463k1802
235B3898o3093K1847P0017q525p2290j5225N5126K0079m3006j7117M8065L3371
247E3147l8378m6012J2468L6963j211k6759M90K7929Q617k4250k1048K382J5010
260f52J0388k916o738L882R883m793k2492q881K2050K0932j4248k3089J2540K6468
274B2334j4924m0621J447M7194J5424l9849k3782L6130L0368l5010m3101K3827
286b0563N1192p546m8655j298M5513M944m8073j6238M7578K7703l6020l2268K9698
$$ plain form
200 36322 -17250 -68945 5050 100823 42209 -94342 -87894 43157 65231 -55727 -92003 39659
212 39659 117193 2756 -113022 -44626 72212 33977 -73974 -42553 77630 70914 -54931
223 -54931 -86542 15724 61879 -19903 -64994 19357 85161 16624 -66022 -29763 45700 23898
235 23898 -39195 -17348 52669 44144 -28146 -43371 11755 31834 -11172 -28289 19776 53147
247 53147 14769 -31243 -18775 18188 16977 -9782 -9292 18637 27254 3004 -18044 -15662 -652
260 -652 9736 6820 82 3964 13847 9054 -13438 -22319 -269 20663 6415 -16674 -4134 22334
274 22334 7410 -33211 -31764 15430 30854 -8995 -32777 3353 33721 -1289 -44390 -20563
286 -20563 30629 23083 -25572 -26870 18643 23587 -24486 -40724 6854 34557 -1463 -33731 -4033
299d033L5118k4997m3251J6451M6967j144m2208p881L7511J3222l4892k1313K9504
312i46K9413j9389k9360J1675K8847o206l0859L88L0607R325k4190j4316J7843
325B832J7352j4542k0870P496K3582J050k1159o999J6388J0629j4995j3377J0554
338b059J8480m565j9373k656J7772N826j8283r718J3839J6284q104k0822K546
351a0833K0470J772j9575p977J8325J4467j5423j7881R140J9138n208j9334o19
364a3538K0728N083j8783j1188J5333J5551j2428j7972Q404K1116k013k2308l860
377a5875J9841Q959j6973j3020J3855J6180q144j8626M226J9341R65j8081n526
390a2878J6602J1154j3772j3989J0099J5648n397j6925N87J7813L526j6137p400
$$ plain form
299 -4033 31085 6088 -37163 -20712 26255 25111 -17097 -24978 12533 25755 -9137 -30450 -946
312 -946 28467 9078 -20282 -8607 20240 14034 -16825 -16437 14170 23495 -695 -15011 2832
325 2832 20184 5642 -15228 -7732 15850 16900 -4259 -11258 5130 15759 764 -12613 -2059
338 -2059 16421 11856 -7517 -10173 7599 13425 -4858 -14576 -737 15547 7443 -13379 -10833
351 -10833 9637 11409 -8166 -16143 2182 16649 1226 -16655 -7515 11623 6415 -12919 -13538
364 -13538 7190 12273 -6510 -17698 -2365 13186 758 -17214 -8810 12306 10293 -12015 -15875
377 -15875 3966 12925 -4048 -17068 -3213 12967 4823 -13803 -9577 9764 10729 -7352 -12878
390 -12878 3724 14878 1106 -12883 -2784 12864 7467 -9458 -8871 8942 12468 -3669 -11069
403a1069J3211J1906j0723j3658P103J5499k477j5946j643J4448O100j3778r536
416a0563J1041J2358p048j4699K967J4562J598j4599n091J2264Q664j0338j0739
429i623N855J2096l560j3170O55J2575K902j1743n448R407Q531p564j1205M836
443e456J2648k239j2474j232J1557M076j0647o629R198Q850p109r596L995J0486
457E428j414j0614l67J0106L420r494n557Q120P432o085q386M385R109r25r967
472d809M0P863L737p042m696N028O117l490p236J616P037J92n765j990N872K300
488D774l181m006J849N191n36n103j447M534K877m063n119K756O226j124o298
503b670j082O053M032o925n319N502P022l922p685J230Q597l24q658k537Q992
$$ plain form
403 -11069 2142 14048 3325 -10333 -3230 12269 9792 -6154 -7797 6651 12751 -1027 -10563
416 -10563 478 12836 5788 -8911 -5944 8618 10216 -4383 -9474 2790 11454 1116 -9623
429 -9623 -3768 8328 4768 -8402 -7747 4828 7730 -4013 -9461 -54 8477 913 -10292 -5456
443 -5456 7192 4953 -7521 -8753 2804 6880 -3767 -10396 -1198 7652 543 -9053 -5058 5428
457 5428 4014 -6600 -6967 3139 6559 -2935 -8492 -372 7060 975 -7411 -3026 6083 5158 -4809
472 -4809 -4769 3094 6831 -211 -4907 121 6238 2748 -4488 -2872 4165 4357 -1408 -3398 2474 4774
488 4774 1593 -2413 -564 4627 4091 -1012 -2459 2075 4952 889 -4230 -1474 4752 3628 -2670
503 -2670 -3752 2301 6333 -592 -5911 -409 6613 2691 -4994 -3764 4833 4509 -4149 -6686 2306
518B306M972q756o462O872P962n162j0058L524J0452j134j1151n13J0634K199
532E685r570m432R086O110p590p804O343Q729m233r493K250R187R52q973k398
547f151Q942K912p747l705N167N688m056n163L567M174k158l917L56M404J93k109
563C97k096K624J347j501r86j61J03J716L14j907j318J917J530j05l495k1L703
580B061J737m221l039M439K883m180m909M474O267k939p796K577O886n87p311
595c658j418Q352J821q080l441O787N869o757o344N094P770l477r171K558R038
610D943p44r469q00R369K065q223m226P936M854o180n662M743P001l554p503K095
626c355P187m99o578j196N969K915m313l155L045L129k462k934K038K170l71k082
$$ plain form
518 2306 7278 -1478 -7940 -1068 6894 1732 -8326 -4802 5650 4516 -6635 -7148 3486 5685
532 5685 -3885 -8317 769 6879 -711 -8515 -2172 6557 2324 -7169 -4919 4268 5220 -3753 -6151
547 -6151 2791 5703 -2044 -5749 -582 5106 1050 -4113 -546 3628 1470 -2447 -2091 2313 2506 397
563 397 -1699 925 2272 771 -215 -376 -273 1443 1757 -150 -1468 449 1979 1874 -1621 -1642 2061
580 2061 3798 -423 -3462 977 3860 -320 -5229 -755 5512 2573 -5223 -2646 4240 3653 -3658
595 -3658 -5076 3276 5097 -2983 -6424 363 6232 -525 -6869 -1775 5995 2518 -6653 -4095 4943
610 4943 4199 -5270 -6070 3299 5364 -2859 -7085 851 5705 -475 -6137 -1394 5607 2053 -5450 -3355
626 -3355 3832 3333 -3245 -4441 1528 4443 130 -3025 20 3149 687 -2247 -209 1961 1590 -492
642d92M78N22jj05O63k23k023J548J825j693k642N85M169L89m031j640M744J965
660D038n060k726M434L707l580m739J981O450j734o012j16O275J272o000j525
675c335M891K154n042l176M363L807l964l608L108M066k968m724K411N321k092
690A212m725K80N736j12o105j01N768J466n139k709N496L315m654l705L149M140
706C312k675l824J198M702r85l914J76L711q8k509l46K522K63k723p85K871P9
723I85k034k76L303Jk638l14K223Q72l024r89K652K477k588k662K137K593k242
740D76k214J619K648j792k874J395K418r68k731J066K649o30k764Q35K650j246
756E37k753j50M065N23m237j08L441J126l882j603L233K760l236l817L097M871
$$ plain form
642 -492 -14 508 507 402 1065 842 -1181 367 2192 499 -2143 -1558 2611 3000 -1031 -2671 2073 4038
660 4038 -1022 -3748 686 4393 813 -3926 -1945 4505 2771 -3241 -3357 2918 4190 -1810 -3335
675 -3335 1556 3710 -1332 -4508 -145 3662 -302 -3910 -802 3264 296 -4428 -2017 3304 1212
690 1212 -3513 -3233 2503 2391 -3714 -3815 1953 3419 -1720 -4429 1067 4382 -272 -3977 -828 3312
706 3312 637 -3187 -1989 2713 1728 -2186 -2010 1701 1613 -896 -1242 1280 1543 -1180 -1965 906 985
723 985 -1049 -1325 1978 1979 -659 -973 1250 2122 -902 -1891 761 3238 650 -2012 125 2718 476
740 476 -1738 -119 2529 737 -2137 -742 1676 708 -2023 -957 1692 1062 -1702 -867 1783 537
756 537 -2216 -2366 1699 2222 -2015 -2123 1318 2444 -1438 -3041 192 2952 -284 -4101 -1004 3867
772C867k278n347J343N564k78n112j478M511L445n255l342M113M054l267l814
787c274J777L697k68l485m88L215J124l253r43K696Q34j435j095R34J266j234
803F8n5Q1J025j528J01M28J059r02l50J356r27q52Q9J407l58j144m41J421P31
822A209j690j062K597Q47j746k069K216J846k316k381J919K587j141k542k22L494
838A546J53l577m57L326J433l529k293L682K949l807k538K487L435k191l823J312
854a892L784j99l828o17L386J594l649q85K390K221j594l040J696K421r62k392
870a566Q40J480N09k076j97K062J55r70j048J270J005r58j175J199l11k81Q8R71
888I97p46M5l66M56n15L3L74O46p92q25N96Q53j24j613K9K088M20k695m03K268
$$ plain form
772 3867 1589 -3758 -2415 3149 2871 -2241 -3719 792 4237 -1018 -4360 -247 3807 540 -3274
787 -3274 -1497 2200 1932 -1553 -2041 1174 2298 -955 -1898 798 1632 197 -898 36 1302 68
803 68 13 94 1119 -409 -308 120 1179 277 -73 1283 356 -496 -407 1000 642 -502 -943 478 1209
822 1209 -481 -1543 1054 1901 155 -1914 302 2148 -168 -2549 -630 1957 816 -1726 -1948 1546
838 1546 1699 -1878 -2335 991 2424 -1105 -3398 284 3233 -574 -3112 -625 2810 619 -3204 -1892
854 -1892 1892 1693 -2135 -2752 634 2228 -1421 -2306 84 2305 711 -2329 -633 1788 826 -1566
870 -1566 -726 754 1263 -813 -1010 1052 1207 237 -811 459 1464 506 -669 530 219 -62 26 997
888 997 251 296 -70 386 -129 -96 278 924 132 -693 -97 756 632 -981 -952 1136 1556 -1139 -1542 726
908G26K73j802o81J008K223j921j482Q27K565j772j857K64L057l73k386m51K251
925D69R29k495j233K707J677k468p72M92K081j259j887J162J619n43j813N43R00
942A09J748k676l69J505J081p72j745J240J363j530m84L1J009O21q82k89j93R36
960G03l56o92M69k43Q86p81J19k77N12k32N89n77O52O64j166j073M05J641l65
979H78p78m22O39R24j210r11Q79J386m34j211n68J830p68j265J16J601j8j187
997e19l62R66J182j567m51L39J446o66j305j63J998k80j309o39J455O08j147j88
1015f02O57N05k58o53L18O79K96j335n80J627N0m83r37P49R59o87j046p97K261
1034G23L87j269r22J095P85p4j242L53R06j88o77m41R49O15p37j008P74N15K21
$$ plain form
908 726 999 -803 -1484 -476 1747 -174 -1656 -829 1736 -36 -1893 -1629 1428 1055 -1331 -1782 469
925 469 1398 -1097 -2330 377 2054 -414 -1186 -694 1387 128 -1759 -597 1022 479 -1334 -791 109
942 109 1857 -819 -1188 317 1398 626 -1119 121 1484 -46 -530 -499 510 1131 249 -40 -233 703
960 703 347 -345 124 -119 767 -14 105 -172 340 108 697 120 772 1436 270 -803 -398 1243 878
979 878 100 -322 317 1241 31 -880 -1 1385 951 -260 -828 1002 234 -1031 -915 686 668 -519
997 -519 -881 85 1267 -300 -751 -412 1034 368 -937 -1100 898 618 -691 -1330 125 733 -414 -602
1015 -602 55 560 302 -351 -33 646 942 -393 -973 654 704 221 -716 33 992 305 -741 -1538 723
1034 723 1110 -159 -1081 14 799 725 -517 -164 742 554 -123 -564 385 1000 263 -745 29 544 765
1053G65n91j097J831K85j072k99J31J005p48j130N85R63j37l8j166J057J350j476
1071B18l69q6J169o56n02q29J519K63j216n58Q90N39l63o68k60J617k86j132j10
1090h20J128K65q27r30J037R45j196J61j30P62J65j061J05M99K26p45J56m38J111
1109D13K9r13J11J107k82n81K15M51n13m2n93O61O05m71J06j308J522L46r43p09
1129g89M82J271r81K29j48P84l89m47l30M80J09k67k39L05J270j119q76M49O42
1148D36K4q78M43L49P45j405o38P29Q70l44j220R79M49l72j102J109l16q1j04
1167c27o06N68Q34n39m5K24L0J98p52m39J447L2o61j38j96R31j106L9M89j47K5
1188a39o43L41O91J5o60n09J359R0q4q11r6R68p54K15m99Q72m92J072q86n23O25
$$ plain form
1053 765 174 -923 908 1193 121 -178 -47 958 210 -920 -335 628 491 453 -713 344 1694 218
1071 218 -151 -237 932 276 -226 -1055 464 727 -489 -1047 -157 382 19 -649 -909 708 422 -710 -820
1090 -820 308 573 -254 -1184 -147 798 -398 -237 -367 395 560 -501 -396 103 329 -416 -260 -698 413
1109 413 442 -471 -360 747 465 -116 99 550 37 -5 -598 63 668 197 303 -1005 517 863 -80 -789
1129 -789 -307 964 -17 212 64 848 459 12 -318 162 271 4 -235 70 1340 221 -655 -206 436
1148 436 460 -418 25 374 1119 -286 -924 -195 675 331 -889 90 539 167 -935 174 -142 -223 -327
1167 -327 -933 -365 469 -70 -115 109 139 337 -415 -854 593 625 -36 -174 -370 561 -545 -506 -17 -164 -139
1188 -139 -782 -441 250 265 -395 -904 455 545 461 -350 -446 522 -232 -17 -516 356 -136 936 50 -473 152
1209A52K45No32L7L26L42l60j14N97o71m42k64M38J589j214j005J319N04r64l2
1229a44n74J409J93j817M50J000J38r39n91J215L26j298J75j33J857k68j169p02
1247h72J304j35o80l46J133j6n51r89J278R59r97m09L22J33l26K37p58Q03n9k79
1267b48J82k42K30J36R5n99k7P32nk95KL0l93M64l09J45J77R61j403p5k82P49
1289B5J53l88M32R26j257l94O21Q07q36p02M60O31K37j228L34L47R9l99l07J08
1309c31J383j164p30J111j63R81j762J01R69m60p08Q92K09j62k82q10J030M73
1327E77p85j12N46r2J6r52L11R41l94r21J70O15L21r85j00R89n6m28O11J78n53
1348a03m6L69N6Ol13K48N17p27L52o86j78k4k41K56O30j45p3k07J5O28m10n84
$$ plain form
1209 152 397 402 -230 -193 133 475 115 1 598 -73 -515 -779 -341 1248 34 -971 348 852 -112 -144
1229 -144 -718 691 884 -933 -483 517 655 -284 -875 340 666 -632 -457 -590 1267 999 -170 -872
1247 -872 432 297 -383 -729 404 388 -163 -1152 126 1085 88 -321 1 134 -192 45 -713 90 31 -248
1267 -248 -66 -308 -78 58 153 -446 -473 259 254 -41 -39 -9 -402 62 -247 -102 75 1036 -367 -442 -724 25
1289 25 178 -210 222 1148 -109 -503 118 925 89 -613 -153 478 715 -513 -179 168 267 -132 -439 -331
1309 -331 1052 -112 -842 269 106 1087 -675 -574 395 -65 -773 119 328 166 -116 -926 104 577
1327 577 -208 -320 226 134 150 -802 -491 450 56 -865 -695 -80 241 -744 -844 145 89 -339 272 450 -103
1348 -103 -149 220 276 282 -31 217 734 7 359 -327 -505 -529 -770 -514 116 -29 -102 -309 -294 334 -76 -660
1370f60Q99k61J75q96J079k38J53j010P77J047n66j57j004O38J89m37m79J373
1388F22m65M47j214J101L90p04M16r19J103O9j382L96Q36n46N1k94N63K34j034
1407c30r18J332j39m13Jm78J612p31n38L02L48l55r4K57M27K4q18N94k05l13L76
1428e9j27m55O12j0l71O59n32K89j44L23p06J30N1n3l34M96N14m64M51l06l92
1449d28O31K07j280L71J142j62j013Q3R25M13j178K18l31O56O0n70K20M2l95L0
1469c59J63O69k69J47j038J079m0m37j56K08M66n55R9k31M17p0l27L96J93l18
1489C7j27L30K64o62r2K11M29j15n8m67j06P57q78M9L02j96Q45o18R6M80q30N19
1511A70j21n4P8q2j32N03k66m52O76O2m13o22J283o87K89o4o0L74o68M84n62L26
$$ plain form
1370 -660 239 -22 153 -743 336 98 251 -759 18 1065 499 342 -662 -24 165 -272 -751 622
1388 622 157 604 -610 491 881 177 593 -326 777 846 -536 -140 696 150 201 -93 470 704 -330
1407 -330 -1248 84 -55 -468 -467 -945 667 -64 -602 -300 48 -307 -401 -144 283 307 -511 83 -122 -435 -59
1428 -59 -186 -641 -29 -39 -410 249 -283 6 -138 185 -521 -391 -340 -393 -727 -231 283 -181 270 -36 -428
1449 -428 203 410 -870 -499 643 481 -532 -449 476 889 -289 -71 -402 254 314 -256 -36 6 -389 -359
1469 -359 -196 473 204 351 -687 392 352 -85 -241 -33 433 -122 -23 -254 163 93 -234 162 355 37
1489 37 -90 240 504 -158 -250 -39 390 275 217 -250 -356 401 -477 -428 -126 -322 523 -95 1 481 -349 170
1511 170 49 -5 73 -9 -141 362 96 -356 320 382 -31 -653 630 -57 232 168 108 482 -186 298 -264 62
1533F2o80L89m87J113M63j012K91J02k31P3k5K98p22j44J92L75k04k77P93m90
1553a21k7K58j23j72M33O1n51M15L49l02j40J87p22J368q51n89O14O20p22L50
1573C35o83l87Q57j119P82N70L95k97J15j136O74M08j354L37J4O68n39o16J052
1592G6k23j00n4L0K50j14L65k65p51Q08L6k51M05%K07j95l77N42o83M36j42K64
1614B64J44m43m76M88N68o00j24Q65j168O20q3l23J49j35L59l03l87Q86j73k49
1634a21K96k63O60p92L19J31N97r00j68R81o77l06LL33J13j93n0m5l79M63J29
1655A31L35n58K30k41J16L8j33n14Q88q02J60O24r73K78R26m79l42O69l50K61
1675B64j53l51K94k94M95k84oj94R8L84k68K61j83l44N39q4R3m08P9j25M93n12
$$ plain form
1533 62 -618 -229 -716 397 860 -152 139 241 10 83 58 356 -366 -510 -318 57 -147 -424 369 -121
1553 -121 -148 110 -13 -185 248 309 -242 173 522 220 80 267 -455 913 62 -527 87 707 -15 335
1573 335 -348 -735 122 -997 -215 355 750 453 568 -568 106 514 -840 -503 -489 179 -360 -976 76
1592 76 -147 -247 -301 -271 -21 -135 230 -35 -786 22 58 -193 212 212 419 224 -153 389 -294 142 0 264
1614 264 408 -35 -511 -23 545 -55 -179 686 -482 138 55 -268 -119 -254 105 -198 -585 301 128 -121
1634 -121 175 -88 572 -220 99 230 827 -73 -241 740 63 -243 -240 93 206 13 -37 -82 -461 2 131
1655 131 466 -92 138 -103 13 51 -82 -596 292 -510 -350 274 -699 -421 505 26 -316 353 3 264
1675 264 111 -240 54 -240 255 -29 -35 -229 -131 253 -15 246 63 -281 258 174 267 -141 -62 -187 306 -206
1697b06O38m36m2K90k02l6p06J163m94m59J99L38p7L74l93K61n16P20n17L8J17
1718E4J54J36m60j64K97P5K07k42LP6J62k36k09L70M16l14k44J19k2j0J95P9n46
1741a04N89n01O1n00J28k4j30M73mj29K18l5L29j74k14p75O85J83K43j12l96K24
1763C5k85L08Q4m10J71k75N16k42M4Mk85J64j43K6O44m21r4N37p95O22J21j43
1785A83K82q00J64M71n14P49q4j224J356m63L36j11l89M6m1o1r6KL06R9k40m99
1807e28J18J80N30p39L28J59K2J85m87K26n7j30O48j73Q8q2n08L8J32l09J02R05
1829F48j022j15M51M31l9k2n44k82N25j41L47m52J116j049M11p65k34K58N90m00
1849b88N26l64L4J61p97R87j61J0p1n5K10j16q24Q12n56J065n24j41o4k06M52
$$ plain form
1697 -206 432 -4 -46 244 42 6 -700 463 -31 -490 -291 47 -30 344 -49 212 -304 416 -101 -63 54
1718 54 208 344 -116 -280 17 92 299 57 60 136 298 62 -147 223 639 325 81 200 178 168 363 442 -104
1741 -104 485 -16 45 -455 -327 -351 -481 -8 -12 -141 77 42 371 197 -17 -792 -107 76 319 207 -189 35
1763 35 -250 58 142 -268 -97 -372 144 -98 -54 -50 -335 -171 -314 -288 356 -65 -159 378 -417 205 326 183
1785 183 465 -335 -171 300 -214 535 451 -773 583 120 456 345 -44 2 -39 -100 -196 -194 112 211 -29 -528
1807 -528 -410 -230 300 -439 -111 48 70 255 -232 -6 -63 -193 455 282 370 288 -220 -182 -50 -359 -257 648
1829 648 -374 -489 -38 393 354 332 -212 -494 31 -110 237 -215 901 -148 263 -502 -736 -478 112 -288
1849 -288 238 -126 -92 69 -728 259 98 108 37 -18 192 76 -748 64 -492 573 49 -92 -156 -362 90
1870I0l24N08k12m33J87P4k58Q36q35J020o45L38J4L75p81j66Q1L49Q2l00O0o71
1892f11M52K92o19M70K7m68N5P33p24N5n52J245n47K06K7L16j07p4O7N8l09m81
1914d89L77J74K92m22k43J70L87o48J065j025O49n39n3L02nk17PJ91j68Q0M48
1935C33m88L33L57o55J29m07M19K46k31l22P57p91K55J33M41n33k43J99j26L44
1955A50k10q4M75J43o71J24k21N73n67N16l95J86J60O5L5l24j1p6L88k40j26L15
1977B05j16M59l88n29Q93k8l27J03q46J308j16j203N64j7O11n66l3L34n77Q1J8
1998a70R6j90L82j5j92l14M89j3mL00j20m10J02k56Q24o46j39P4JM62l13j94R35
2021F89m39k00n5Q0Q35p23l02N38p84K19j2J65J13P8j87o4j32L32J44o41m47O05
$$ plain form
1870 90 -234 274 62 -371 -184 -110 -368 468 -367 653 8 346 360 735 -46 -212 -131 218 300 0 60 -611
1892 -611 -159 133 -486 -16 11 -457 -402 331 -393 -338 -890 355 -192 14 41 357 250 176 243 301 -8 -489
1914 -489 -112 62 354 -68 -311 -141 246 -402 663 -362 287 -252 -305 -3 -8 -225 -218 -27 -195 -115 333
1935 333 -155 178 535 -120 9 -398 21 267 36 -286 471 -320 -65 68 509 -24 -267 -68 -194 150
1955 150 -60 -144 331 474 -197 -73 -294 279 -288 228 -167 19 179 244 279 -45 -56 -132 256 16 -110 205
1977 205 89 548 160 -369 524 496 169 272 -574 734 618 -585 -21 -38 573 7 -26 308 -269 -188 -170
1998 -170 -74 -264 118 103 -89 -403 86 73 69 369 249 -161 -59 -315 509 -137 -276 -202 -201 261 -52 -246 689
2021 689 250 50 -5 75 910 187 -115 423 -361 -142 -154 11 124 202 15 -49 -181 151 295 -346 -793 -188
2043a88J32L31l53M47j17m31P88r89J27P53p16k57M36k78J248j094J53N5O3m50
2063c40k07M8N96j39o21P31M4n70J51R4R6L27k03n21J94J72m17L00M24p2N20n55
2085E2j046J309n86N26J92n42O0L31K31m32k39M05l26j65L38j92o2k76N31p45
2105f36j8M83L66k2k79L08O3l35m1n45L60M16j5j70p5J62K17j19K17q41j49M33
2127b20n29R27M94o85l29J14R5Q24m01q6P8j37j42j36m89P08O7o58J083q22J52
2148i2K45l66M02j3j83J41j66K41k6l42L29k32K81K23O0m36l22J64J51J13o20
2169d48Q36k44J65n90M25M12n07J49m9l31M50l33k92J241l72r58R6J69L08m39
2189c12J29L07N92p63p09Q04L25K26r31O75l04kj46M6M46l22K26p72P66n50L39
$$ plain form
2043 -188 -56 275 -78 369 252 -179 609 -380 -253 500 -216 -473 -37 -315 933 -161 -8 47 110 -340
2063 -340 -547 -499 97 -42 -663 68 112 -458 -307 -213 -117 210 7 -514 -320 -148 -565 -265 159 87 607 52
2085 52 -994 315 -271 255 447 -95 -35 296 527 95 -144 261 -65 -230 108 -84 -146 -422 109 -636
2105 -636 -654 -171 195 173 -106 202 265 -70 -111 -656 -296 120 105 -65 -140 22 239 120 337 -504 -653 -220
2127 -220 -749 178 672 -13 -342 -228 -133 691 290 204 282 145 3 -133 -622 86 153 -505 578 -244 -92
2148 -92 153 -213 189 176 -7 134 -32 209 183 -159 170 -62 219 442 502 66 -256 -92 59 172 -448
2169 -448 388 144 309 -281 144 556 49 198 149 -182 268 -65 -357 884 512 -446 -350 -181 127 -312
2189 -312 -183 124 716 -47 -756 48 373 599 -332 343 39 37 -109 -63 383 61 287 -485 281 -269 70
2210G0m27m46Q22L88p03O46n36L75o8J83l29K25l8nk04M49l58M14r27K29P15l65
2232A10k34J70P6j06o3j86L18p1k07l45Q36m34Q45q52M03P7l36K8k19n5N78m49
2254a16J16p82R46Q5l94M43j23m90M23l33q6P5N79k11m71M98m95O90m31L49j88
2275H4j40N6q9K13K17n31K76J51k2n19j0mK57M19j103R45q2L05o01M73o75M62
2297H2L60r0k72j90o3N23p32r0M10R8l12R3J89p8L90k6j97K05j45m75P39n20p8
2320a79L31pj32n96Q81k57n69M76R8J69K05l71J96m35N47o10j25O67j75o28N23
2341Ij83p7q3r1J84J70M18o12K36K3o7K03j11O0m8j26N13l19j0LR11r62m28P90
2365D03l35q8L04l59rk43J062o67L6O8O35p87Q4J23k6j84m2j13R5J33p12R26m97
$$ plain form
2210 70 -357 -803 19 407 -296 350 -186 189 121 304 -25 200 162 157 -47 402 44 458 -469 -240 475 110
2232 110 -124 46 122 16 -47 -233 85 14 -193 -538 298 -136 709 -143 260 337 1 29 -190 -245 333 -116
2254 -116 0 -782 164 249 -145 298 175 -315 108 -225 -311 -236 343 132 -339 159 -336 354 -77 272 84
2275 84 -56 0 -89 124 341 -190 86 237 215 -304 -314 -318 -61 358 -745 200 118 423 -178 295 -380 82
2297 82 442 352 80 -110 -173 350 -382 -472 -62 36 -276 -183 6 -72 318 292 95 300 155 -320 419 -101 -179
2320 -179 152 145 13 -583 298 41 -528 -52 46 215 420 49 245 -190 357 -253 -378 289 114 -514 9
2341 9 -174 -251 -334 -425 -241 -71 347 -265 -29 -6 -73 130 19 79 31 -95 418 99 89 92 1003 41 -387 403
2365 403 68 -20 284 -75 -84 -327 735 68 104 172 807 20 104 227 201 17 -25 -138 -43 90 -622 304 -193
2388a93M74o11K51n44J064o44l9J92O72q66k02M85N1l78q8M20r2k4r0q7M0N19
2410C10l98l23K84L56o0J33K1n95rK52l47M74L22k99k16N43m49j30N57l49k82
2431b05K8O34q58K15L35J39k79k92L40L60J31o87O1N54k58l62K52m31L66l28J30
2452a55K34L24m51J72J83L76k49l75J93m5j27j21P39j250L36O24n70j02o26P54
2472a36N03j29j06Kj47n27N05J16J69r73P9N36k43k90N64l27K60k99N28n2j09
2493g6K20l52N41p44R8K57L66n29N9J32r61P06L98k89K19L15m46j13N03l00N09
2514E13k79r98O11N2L95j083M45O40k70p1o91O84m63N98L98p91L78k06N49j72
2534B39n5k0j45k28Q1k7j52Q97m01K80n46l4J7M81r4l53J30k48j15N75N5k87j87
$$ plain form
2388 -193 281 -330 -79 -623 441 -203 -242 -50 622 -244 -446 39 90 -288 -376 44 -48 -72 -162 -249 -209 310
2410 310 -88 -411 -127 229 169 302 323 -272 -281 -29 -376 98 420 121 -95 448 -1 -131 426 77 -205
2431 -205 -177 457 -401 -186 149 288 9 -283 57 417 548 -139 -78 476 218 -144 108 -323 43 -285 -155
2452 -155 79 403 -48 124 307 683 434 59 252 207 80 -41 698 -552 -216 408 -162 -264 -890 -136
2472 -136 367 238 132 134 -13 -540 -35 81 250 -723 -644 -108 -351 -641 -77 -404 -144 -443 85 33 -76
2493 -76 144 -208 333 -411 -313 -56 310 -219 -160 -28 -989 -283 115 -174 45 360 -86 -199 304 4 513
2514 513 234 -764 -153 -101 294 -789 -344 296 26 -45 -736 -52 -515 83 481 -310 68 -138 411 239
2534 239 184 164 19 -209 -128 -155 -307 590 189 469 -77 -111 -94 387 293 -60 70 -178 -293 282 337 50 -137
2557a37M23l25L53j65n3M7K75q69L96k0k48L62l3L6M16m72k90O45r02L47J28o2
2579a48j8O6l33J149p73l18J74N1P51k45j89k24j39J83N51k79n96P86m69M2m5
2600b3q8J99L53o69J26J75q6N3J20m10K28K2j3j42P6n5J47J04j00L3r4L74m37
2623a07L29p6o57N19m46J49O20n53Q5P12q01K82J02M9M18m71Q9l12l5L45J32J91
2645E64p89K07M8N90j090J011o51P4J33m1q1k56N24p36R44q07QJ038o43R7l94
2666b50L01n33K70j31M45k15m7L33n03J58J67J50j85K69l48P57L9r25o3L27l80
2687c64N03l48j23L53r8R80q03P5K14r0m94L45L62j371M79J061j116O34j03kL17
2708D11l09k71J3M33n48M73o78L74J00m07J115m76p79J13Q3P47p5r5j92O58r53
$$ plain form
2557 -137 286 -39 314 149 96 143 418 -451 -55 -75 -323 39 6 42 458 -14 -304 341 -561 -214 -86 -148
2579 -148 -166 -100 -433 716 -57 -375 -201 -150 601 356 167 -57 -196 -13 538 259 -337 449 -20 22 -23
2600 -23 -111 88 441 -228 -102 73 -13 40 160 -250 -22 0 -13 -155 -79 -134 13 117 17 50 -44 330 -107
2623 -107 222 146 -511 8 -438 -289 331 -222 -137 575 -226 56 158 207 625 154 243 -69 -104 241 373 564
2645 564 -225 -18 30 620 -470 541 -110 -36 97 56 -25 -281 243 -493 451 -356 -348 690 47 144 -250
2666 -250 51 -482 -212 -343 102 -113 -160 173 -330 -172 -5 145 -40 229 -119 638 677 -248 -311 16 -364
2687 -364 139 -209 -332 21 -77 903 100 175 389 299 -195 150 512 -859 -380 681 -435 199 96 94 411
2708 411 102 -169 -156 277 -271 202 -476 -102 -2 -409 706 230 -549 -436 -353 394 319 224 32 690 -263
2729b63J74j80P40o17p43P00L51l03Q09n66m4q95Q85l99J74j73k55M80Q7qm4P63
2751F73o72P10r17M2NM32m48N63j30k43k68K75n81Q71L42n02K1q50Q86m83O30
2772C56n36R1n74M20L50K62k01L7o14R65m77l6J78O2jo56M02L17p7l64J36O84
2794G24j097O63j55L00l87l4n33j02J79O32J40p21M03l87K57L2M45j0j074O38
2814h7N82m51M87r66p7k32J133M1q87L08K9J43J77k37m46M39N0k3M99m67m74J28
2836c31N63m0m93M42j16m9q8l1M90o16n1R68o18j08L5p7L31l96P8K21P0Ml07k
2860a21M26k13L14r33J185r33l36Q14j78m63J048k43m64K66o31M52n47L31k39
2879d65N44k1k78P48j095L36J91O58o06N06p75R0k02M99K46K75p19p48P19j41
$$ plain form
2729 -263 -89 -269 471 -146 -889 -189 162 -141 668 102 58 -837 48 -351 -177 -350 -605 -125 -38 -46 -90 673
2751 673 1 711 -206 -164 -159 273 -175 388 258 15 -253 22 -559 312 654 152 173 -677 209 -274 356
2772 356 -180 -89 -663 -243 107 369 168 205 -409 556 79 43 221 283 282 -374 28 345 268 -96 40 724
2794 724 -373 290 135 435 48 14 -519 -621 -442 190 330 -391 12 -375 -118 -86 359 349 -725 -87
2814 -87 495 44 531 -435 -512 -744 389 430 -457 -149 -120 23 200 -37 -483 -44 6 -17 482 15 -459 -331
2836 -331 232 192 -301 141 25 -24 -112 -143 347 -269 -320 648 30 -78 -43 -120 211 -185 -107 114 184 188 -119 -121
2860 -121 305 92 406 -527 658 -275 -611 203 25 -438 610 367 -97 169 -462 -10 -557 -226 -465
2879 -465 79 58 -220 528 -567 -231 -40 618 12 518 -257 -167 -369 130 376 651 -68 -816 -97 -238
$$ [...]
8191D81
##END NTUPLES=NMR FID
##END=
