##TITLE=1H_IAMT-121
 CDCl3, 8 sc, 
 11.3.2019
##JCAMPDX= 6.0         $$ Bruker NMR JCAMP-DX V2.0
##DATA TYPE= NMR FID
##DATA CLASS= NTUPLES
##ORIGIN= UXNMR, Bruker Analytische Messtechnik GmbH
##OWNER= root
$$ XWIN-NMR		Version 3.5
$$ Mon Mar 11 14:05:21 2019 Russian Standard Time (UT+4h)  she@DPX200
##.OBSERVE FREQUENCY= 200.1314
##.OBSERVE NUCLEUS= ^1H
##.DELAY= (6, 6)
##.ACQUISITION MODE= SIMULTANEOUS
##.ACQUISITION SCHEME= undefined
##.AVERAGES= 8
##.DIGITISER RES= 18
##SPECTROMETER/DATA SYSTEM= spect
##.PULSE SEQUENCE= zg30
##.SOLVENT NAME= CDCl3
##.SHIFT REFERENCE= (INTERNAL, CDCl3, 0, 15.7039)
##AUDIT TRAIL= $$ (NUMBER, WHEN, WHO, WHERE, WHAT)
$$ ##TITLE= Audit trail, XWIN-NMR		Version 3.5
$$ ##JCAMPDX= 5.01
$$ ##ORIGIN= Bruker BioSpin GmbH
$$ ##OWNER= she
$$ F:/spectra/data/she/nmr/H-F/1/audita.txt
$$ ##AUDIT TRAIL=  $$ (NUMBER, WHEN, WHO, WHERE, WHAT)
(   1,<2019-03-11 14:03:53.48 +0400>,<she>,<DPX200>,
      <created by zg, POWCHK disabled, PULCHK disabled
       configuration hash MD5:
       00 E9 B6 7A A2 85 ED C7 34 08 36 98 17 FE 4E 26
       data hash MD5: 16K
       00 18 FA 4E 78 A4 49 A6 40 B3 64 2A D5 54 7B 1F>)
$$ ##END=
$$ 
$$ hash MD5
$$ 55 08 D1 42 DB E7 74 BA 89 0A F2 47 2C 74 28 45
##$RELAX= 
##$RELAX= 
##$RELAX= 
##$RELAX= 
##$RELAX= 
##$RELAX= 
$$ Bruker specific parameters
$$ --------------------------
##$DU= <F:/spectra>
##$EXPNO= 1
##$NAME= <H-F>
##$PROCNO= 1
##$TYPE= <nmr>
##$USER= <she>
##$AMP= (0..31)
100 100 100 100 100 100 100 100 100 100 100 100 100 100 100 100 100 100 
100 100 100 100 100 100 100 100 100 100 100 100 100 100 
##$AQSEQ= 0
##$AQ_mod= 1
##$AUNM= <au_zg>
##$AUTOPOS= <>
##$BF1= 200.13
##$BF2= 200.13
##$BF3= 200.13
##$BF4= 200.13
##$BF5= 200.13
##$BF6= 200.13
##$BF7= 200.13
##$BF8= 200.13
##$BYTORDA= 1
##$CFDGTYP= 0
##$CFRGTYP= 5
##$CHEMSTR= <none>
##$CNST= (0..31)
1 1 145 1 1 1 1 1 1 1 1 1 1 1 1 1 1 1 1 1 1 1 1 1 1 1 1 1 1 1 1 1 
##$CPDPRG= <>
##$CPDPRG1= <>
##$CPDPRG2= <>
##$CPDPRG3= <>
##$CPDPRG4= <mlev>
##$CPDPRG5= <mlev>
##$CPDPRG6= <mlev>
##$CPDPRG7= <mlev>
##$CPDPRG8= <mlev>
##$CPDPRGB= <>
##$CPDPRGT= <>
##$D= (0..31)
0 1.2 0 0 0 0 0 0 0 0 0 0.03 0 0 0 0 0 0 0 0 0 0 0 0 0 0 0 0 0 0 0 0 
##$DATE= 1552298632
##$DBL= (0..7)
120 120 120 120 120 120 120 120 
##$DBP= (0..7)
150 150 150 150 150 150 150 150 
##$DBP07= 0
##$DBPNAM0= <>
##$DBPNAM1= <>
##$DBPNAM2= <>
##$DBPNAM3= <>
##$DBPNAM4= <>
##$DBPNAM5= <>
##$DBPNAM6= <>
##$DBPNAM7= <>
##$DBPOAL= (0..7)
0.5 0.5 0.5 0.5 0.5 0.5 0.5 0.5 
##$DBPOFFS= (0..7)
0 0 0 0 0 0 0 0 
##$DE= 6
##$DECBNUC= <off>
##$DECIM= 24
##$DECNUC= <off>
##$DECSTAT= 4
##$DIGMOD= 1
##$DIGTYP= 9
##$DL= (0..7)
0 120 120 120 120 120 120 120 
##$DP= (0..7)
150 150 150 150 150 150 150 150 
##$DP07= 0
##$DPNAME0= <>
##$DPNAME1= <>
##$DPNAME2= <>
##$DPNAME3= <>
##$DPNAME4= <>
##$DPNAME5= <>
##$DPNAME6= <>
##$DPNAME7= <>
##$DPOAL= (0..7)
0.5 0.5 0.5 0.5 0.5 0.5 0.5 0.5 
##$DPOFFS= (0..7)
0 0 0 0 0 0 0 0 
##$DQDMODE= 0
##$DR= 18
##$DS= 0
##$DSLIST= <SSSSSSSSSSSSSSS>
##$DSPFIRM= 0
$$ [...]
##$SUBNAM2= <"">
##$SUBNAM3= <"">
##$SUBNAM4= <"">
##$SUBNAM5= <"">
##$SUBNAM6= <"">
##$SUBNAM7= <"">
##$SUBNAM8= <"">
##$SUBNAM9= <"">
##$SW= 24.9337183474449
##$SWIBOX= (0..15)
0 0 2 0 0 0 0 0 0 0 0 0 0 0 0 0 
##$SW_h= 4990.01996007984
##$TD= 16384
##$TD0= 1
##$TE= 0
##$TE2= 300
##$TE3= 300
##$TEG= 300
##$TL= (0..7)
0 120 120 120 120 120 120 120 
##$TP= (0..7)
150 150 150 150 150 150 150 150 
##$TP07= 0
##$TPNAME0= <>
##$TPNAME1= <>
##$TPNAME2= <>
##$TPNAME3= <>
##$TPNAME4= <>
##$TPNAME5= <>
##$TPNAME6= <>
##$TPNAME7= <>
##$TPOAL= (0..7)
0.5 0.5 0.5 0.5 0.5 0.5 0.5 0.5 
##$TPOFFS= (0..7)
0 0 0 0 0 0 0 0 
##$TUNHIN= 0
##$TUNHOUT= 0
##$TUNXOUT= 0
##$USERA1= <user>
##$USERA2= <user>
##$USERA3= <user>
##$USERA4= <user>
##$USERA5= <user>
##$V9= 5
##$VALIST= <valist>
##$VCLIST= <CCCCCCCCCCCCCCC>
##$VD= 0
##$VDLIST= <DDDDDDDDDDDDDDD>
##$VPLIST= <PPPPPPPPPPPPPPP>
##$VTLIST= <TTTTTTTTTTTTTTT>
##$WBST= 1024
##$WBSW= 4
##$XGAIN= (0..3)
0 0 0 0 
##$XL= 0
##$YL= 0
##$YMAX_a= 465079
##$YMIN_a= -607850
##$ZGOPTNS= <>
##$ZL1= 120
##$ZL2= 120
##$ZL3= 120
##$ZL4= 120
##$ABSF1= 10
##$ABSF2= 0
##$ABSG= 5
##$ABSL= 3
##$ALPHA= 0
##$AQORDER= 0
##$ASSFAC= 0
##$ASSFACI= 0
##$ASSFACX= 0
##$ASSWID= 0
##$AUNMP= <proc_1d>
##$AZFE= 0.1
##$AZFW= 0.1
##$BCFW= 1
##$BC_mod= 2
##$BYTORDP= 1
##$COROFFS= 0
##$CY= 11.3945322036743
##$DATMOD= 1
##$DC= 2
##$DFILT= <>
##$DTYPP= 0
##$F1P= 18.9103706918063
##$F2P= -1.10871071338519
##$FCOR= 0.5
##$FTSIZE= 0
##$FT_mod= 4
##$GAMMA= 1
##$GB= 0.15
##$INTBC= 1
##$INTSCL= 1
##$ISEN= 128
##$LB= 0.24
##$LEV0= 0
##$LPBIN= 0
##$MAXI= 10000
##$MC2= 0
##$MEAN= 0
##$ME_mod= 0
##$MI= 1.114404
##$NCOEF= 0
##$NC_proc= 0
##$NLEV= 6
##$NOISF1= 3.799351
##$NOISF2= 2.8
##$NSP= 1
##$NTH_PI= 0
##$NZP= 0
##$OFFSET= 15.70392
##$PC= 1
##$PHC0= -9003.532
##$PHC1= 12.20014
##$PH_mod= 1
##$PKNL= yes
##$PPARMOD= 0
##$PSCAL= 0
##$PSIGN= 0
##$REVERSE= no
##$SF= 200.130013532006
##$SI= 16384
##$SIGF1= 3
##$SIGF2= 2
##$SINO= 400
##$SIOLD= 16384
##$SREGLST= <1H.CDCl3>
##$SSB= 0
##$STSI= 0
##$STSR= 0
##$SW_p= 3612.71676300578
##$SYMM= 0
##$S_DEV= 0
##$TDeff= 0
##$TDoff= 0
##$TI= <>
##$TILT= no
##$TM1= 0
##$TM2= 0
##$TOPLEV= 0
##$USERP1= <user>
##$USERP2= <user>
##$USERP3= <user>
##$USERP4= <user>
##$USERP5= <user>
##$WDW= 1
##$XDIM= 8192
##$YMAX_p= 0
##$YMIN_p= 0
$$ End of Bruker specific parameters
$$ ---------------------------------
##NTUPLES= NMR FID
##VAR_NAME=  TIME,          FID/REAL,        FID/IMAG
##SYMBOL=    X,             R,               I
##VAR_TYPE=  INDEPENDENT,   DEPENDENT,       DEPENDENT
##VAR_FORM=  AFFN,          ASDF,            ASDF
##VAR_DIM=   8192,          8192,            8192
##UNITS=     SECONDS,       ARBITRARY UNITS, ARBITRARY UNITS
##FACTOR=    0.0002004,     1,               1
##FIRST=     0,             0,               0
##LAST=      1.6414764,     0,               0
##MIN=       0,             -607850,         0
##MAX=       1.6414764,     465079,          0
$$ Real data points
##PAGE= N=1
##DATA TABLE= (X++(R..R)), XYDATA
0 0 0 0 0 8 -8 8 -16 20 -24 32 -40 48 -64 78 -96 112 -136 160 -192 224 -264 305 -356 410 -472 540 -616
27 -616 700 -793 897 -1010 1133 -1271 1422 -1588 1769 -1968 2186 -2425 2689 -2978 3297 -3649
43 -3649 4041 -4477 4966 -5519 6149 -6872 7713 -8702 9894 -11358 13202 -15619 18930
56 18930 -23772 31561 -46192 83319 -373037 -607850 187626 280922 -1975 -307534 -128668
67 -128668 66269 56721 -97694 -56015 48777 34430 -131586 -141701 -26817 41174 -28274
78 -28274 -14586 78763 84845 -56650 -136201 -22295 161904 137593 -38944 -127230 -34240 51874
90 51874 7490 -59990 -22989 38796 32230 -10649 1412 39984 27395 -19587 -4360 59283
102 59283 45956 -57852 -86381 36677 147837 83289 -63154 -84847 35558 106169 20262
113 20262 -87225 -61895 44829 77826 11466 -43179 -27032 14198 39430 58128 57943 9314
125 9314 -42027 -18610 73894 122724 48517 -35533 1016 95287 102418 7669 -43370 25549
137 25549 95956 67042 -4356 -15612 31575 52974 32340 26654 42752 23726 -22907 -14897
149 -14897 54337 85803 18256 -66606 -54612 21179 46577 -1568 -42587 -13574 33975 26358
161 26358 -15185 -28739 -7199 8914 2608 -9447 -22503 -38870 -36785 -811 33524 16004
173 16004 -40842 -60969 -7146 50850 29875 -39902 -55268 8792 59081 29004 -30399 -36291
185 -36291 10678 40603 19353 -12909 -10867 8949 10936 3469 4267 7120 -576 -8343 8917 30260
199 30260 16299 -19145 -29727 4320 37385 15477 -34189 -47887 -16744 13822 10055 -14093
211 -14093 -31559 -33196 -21489 -435 14840 4574 -19738 -26314 -6361 9307 -9053 -31458
223 -31458 -14182 19839 18693 -20666 -39588 -1639 47008 45238 29 -26133 -3042 33369
235 33369 42941 26229 5949 -3222 2088 20899 36960 28496 1244 -9846 13716 42725 36079
248 36079 1208 -11178 17249 41326 23728 -11143 -17613 9406 29934 18996 -1897 -7177
260 -7177 681 7927 9020 7285 745 -11805 -13304 4730 16315 416 -24535 -23571 7739 25541
274 25541 1786 -29903 -25799 5947 19990 -676 -21734 -15366 391 1789 -6193 -8995 -3609
287 -3609 401 -497 1653 3305 -5121 -11809 -1714 15179 12373 -14801 -30491 -10195 18272 15824
301 15824 -14218 -31141 -13856 10312 7311 -15798 -26494 -13937 1870 2397 -10615 -23046 -24345
314 -24345 -14585 -2153 1219 -9522 -22783 -20975 -3681 8785 75 -19608 -24795 -10334 3325
327 3325 610 -11491 -16771 -8526 3563 7227 1710 -6673 -10144 -5547 -705 -2912 -9268 -11195 -3103
342 -3103 6473 4958 -3058 -4356 5296 16116 13161 -2510 -12165 -4443 11177 18389 8966 -7079
356 -7079 -12078 -256 17557 23498 8480 -9695 -9937 5412 16677 8840 -6180 -5691 8797 15919
370 15919 5115 -9374 -6991 10295 21267 13632 -3100 -11708 -4007 12003 21497 16231 819
383 819 -10434 -5029 11021 19800 11442 -3330 -8464 -1706 5010 4169 796 3050 9033 8613 821
398 821 -4825 -90 9977 14074 6635 -5009 -9956 -2695 10460 15582 7533 -4870 -7617 3096
412 3096 14432 12171 -788 -9265 -4666 6136 8220 -815 -9649 -7236 4126 10726 4658 -5425
426 -5425 -5772 4504 13868 10110 -4809 -15393 -10611 2783 9107 567 -12544 -15709 -6960 2720
440 2720 2148 -7814 -14762 -12295 -4730 -2794 -9762 -17794 -16903 -7653 -995 -4486 -13705 -16569 -8667 668
456 668 388 -8217 -13089 -7687 -19 -184 -8043 -13574 -9809 -1799 1099 -3620 -9661 -9061 -1866 4346
472 4346 3828 -2212 -7860 -7384 -2748 460 -456 -2629 -1031 3335 4023 -1106 -5137 -2065 6003 9258
488 9258 2145 -8870 -13157 -6995 4597 10260 3821 -8835 -15155 -8976 3581 8847 2406 -6222
502 -6222 -6961 -51 4353 1294 -2578 -446 4159 4100 -512 -2032 3329 9710 10475 7328 4739 5228
518 5228 6347 6747 7547 8594 7620 5337 4686 7153 10522 11677 10921 10187 9779 8021 6316 6471 7821
535 7821 7825 5442 2894 2723 4261 4175 1498 -1938 -3368 -1420 1068 820 -2765 -7961 -11117 -9487 -4702
552 -4702 -2298 -5425 -12214 -16364 -14256 -8051 -2736 -1362 -4479 -8897 -10363 -7704 -2489 926 890 -1457
568 -1457 -5090 -7903 -6253 195 6190 6007 551 -2898 47 3889 3287 346 519 3546 1930 -5944
584 -5944 -11337 -6517 3795 9248 4912 -2093 -5264 -4682 -1921 1869 3894 513 -7032 -10690 -5494
599 -5494 1904 2693 -1089 -1072 3729 4027 -3165 -7059 107 9516 7603 -2979 -6622 1282 9539 8293
615 8293 2534 1695 5573 8024 8480 10526 13098 11371 7396 8619 16278 20561 15195 7883 8893 15617
631 15617 17245 12103 10235 15796 19507 13902 6520 8012 16185 19778 14276 6158 2524 3661 8561
646 8561 14551 15586 7237 -4155 -5464 5664 14423 8571 -3446 -6030 2466 8246 3727 -2891
660 -2891 -2949 1447 2458 -37 -2253 -3162 -3923 -1656 4473 7847 2200 -6729 -6452 3422 8458 1420
676 1420 -7041 -4091 5505 6969 -1414 -5369 756 6842 3507 -4598 -7493 -4902 -2670 -1570 -1233
691 -1233 -4317 -11111 -14496 -8410 -610 -4000 -15624 -19665 -10696 -2775 -9160 -22203 -24432 -13787
705 -13787 -5804 -10947 -22039 -26366 -21193 -12567 -7752 -8693 -16078 -23285 -21461 -10409 -3179 -10023 -21820
720 -21820 -21325 -7639 696 -7687 -19737 -16713 -1677 5526 -3241 -13947 -11836 -223 6895 3743
734 3743 -3288 -7159 -5996 -831 4418 4195 -2982 -8438 -3266 7158 8468 -2399 -10671 -3843 9664
749 9664 10448 -3457 -13575 -6066 9094 13038 2675 -7609 -6882 1050 6781 5923 859 -3870 -3787
764 -3787 2829 9820 8619 -654 -4694 4513 16283 13499 -2014 -9254 2895 19062 17632 255
778 255 -9791 93 17454 22064 11825 1035 1158 9914 17214 15982 7158 -805 1020 10857 16461
793 16461 8731 -3880 -3981 10502 20391 10940 -7463 -12714 -343 11308 7370 -5054 -10291 -4750
807 -4750 2678 4802 2372 -1728 -4317 -2928 1440 1486 -7031 -14800 -8975 5784 8694 -7087 -21536
822 -21536 -12525 10892 18954 2004 -17381 -15328 1985 11833 5351 -6477 -11161 -7067 1060 7503
836 7503 6115 -3128 -9282 -1083 13743 14773 -1931 -14536 -4725 13938 14355 -4964 -17263 -7081
850 -7081 9752 10478 -3038 -11026 -5758 2806 5490 2619 -2885 -8494 -8438 826 9840 4933 -10321
865 -10321 -15214 -359 14661 8524 -10842 -15780 225 14019 8211 -6959 -10275 209 9591
878 9591 8101 637 -4689 -3977 3349 12717 13231 301 -11733 -5424 14597 22815 7622 -11101
892 -11101 -8086 11289 20067 7816 -7213 -6753 5214 11229 6319 -1421 -3995 106 7941 13123
906 13123 6879 -7523 -13251 -1 16753 12945 -9076 -20170 -5083 16510 16636 -2035 -13050
919 -13050 -4191 9813 10920 1580 -5641 -5427 -1743 1682 2545 -1938 -8640 -8256 3177 12567 5318
934 5318 -11465 -14094 3452 17256 6444 -16275 -20803 -2303 13154 6762 -10124 -14463 -3252
947 -3252 7646 7332 128 -5759 -6952 -3043 3018 3887 -4902 -14200 -9811 5594 12107 -1112 -17031
962 -17031 -13152 6697 16256 2517 -16510 -17263 -1099 10033 4021 -9529 -14390 -6906 3697
975 3697 7650 2001 -7339 -10698 -3131 6641 6432 -5041 -13335 -6980 5872 8206 -2547 -11000 -4611
990 -4611 8607 11331 257 -10780 -8390 4192 11962 6394 -5482 -10734 -3359 8891 12587 3465
1004 3465 -7545 -7544 3697 11974 6977 -4757 -8072 1379 11400 9161 -2421 -8562 -1129 11110
1018 11110 13315 2821 -8466 -7609 4037 13125 9585 -2369 -8625 -2200 9278 11623 2207 -7406
1032 -7406 -5633 4949 10410 3271 -7419 -8029 2014 10703 7277 -3506 -8613 -2507 6733 8193
1046 8193 595 -6994 -6214 1566 7929 4847 -3761 -7258 -535 8554 8338 -1795 -9121 -4002 7440
1061 7440 10857 1898 -8288 -7580 2512 9380 5350 -3929 -7019 -1091 6982 7898 962 -5549 -3583
1076 -3583 4649 8775 2218 -8561 -10741 -814 9681 7832 -4128 -11347 -5244 6200 8973 -450
1090 -450 -10162 -9442 -903 4557 188 -8169 -10331 -3420 4808 5017 -3784 -11293 -8170 1843 6625
1105 6625 96 -9775 -11280 -2364 5593 3550 -4698 -8276 -2942 4402 4429 -2545 -7940 -4852 3068
1120 3068 6649 1111 -7417 -9144 -880 8039 7268 -2435 -8962 -4417 4737 6684 -594 -7262 -4743
1135 -4743 3093 5851 260 -6962 -6434 1154 7742 5238 -3930 -10173 -6455 3799 8890 2251 -8190
1150 -8190 -10241 -977 7764 5528 -4672 -9552 -3200 5705 6137 -1688 -7322 -3795 4222 7687 3223
1165 3223 -3424 -4222 1900 8723 8386 1735 -3429 -470 7163 9849 3470 -3893 -2585 5861 10481
1180 10481 5176 -3404 -4388 3285 10030 7221 -2116 -7618 -3498 4030 5759 104 -6607 -6156 109
1195 109 4805 2058 -4841 -7846 -3315 3552 3604 -3729 -9788 -7248 1177 5191 -259 -8875 -10422 -3141
1211 -3141 4498 3713 -3754 -8503 -5089 2279 4657 -247 -6330 -5749 383 4701 1812 -4349 -5552
1226 -5552 722 7247 6057 -1628 -6894 -3266 4660 7258 1573 -5261 -5459 637 5598 3885 -2073
1241 -2073 -5299 -2294 3103 4415 -377 -5518 -4813 853 4124 722 -4891 -5500 62 4573 2422
1256 2422 -3774 -6013 -1016 5583 6024 -232 -5641 -3463 3928 8568 5477 -1146 -3921 924 7202
1271 7202 8575 3645 -1413 -486 4999 8978 6679 1735 612 4919 9325 7951 2474 -377 2870
1286 2870 8223 8904 3954 -806 284 5764 9616 7468 1523 -1907 440 5453 6539 2312 -2683
1301 -2683 -2577 2456 5785 2888 -2087 -2569 2179 4879 1254 -4541 -4944 403 4541 2273 -3438 -5429
1317 -5429 -1672 3756 5306 2054 -2459 -3762 -390 3868 4552 421 -3935 -3199 1235 4275 1663
1332 1663 -3161 -3892 648 4525 2570 -2926 -5129 -1987 2261 1507 -3170 -6360 -4598 -608 215 -2721
1348 -2721 -6166 -6454 -3483 -1020 -1889 -5142 -7609 -6472 -3394 -1903 -4302 -7999 -8349 -4811 -1929 -3163
1364 -3163 -6553 -7301 -3995 -699 -1374 -5347 -7366 -4939 -1112 -244 -3011 -5462 -4672 -709 2480 1983
1380 1983 -1143 -3054 -1494 1296 1780 -437 -2171 -1053 1387 2038 -50 -1474 23 2749 3772
1395 3772 1910 -759 -1272 414 2676 3089 1098 -1462 -1970 370 3197 3173 112 -2110 -530 2971
1411 2971 4060 1583 -1414 -985 1955 3401 1613 -313 -320 1456 2202 1440 648 993 1807 1841 1246 1155
1429 1155 1715 2644 2734 2464 1478 595 745 2156 3479 3063 784 -952 230 2831 3656 1855 258
1446 258 638 1577 891 -714 -478 1164 1623 -107 -1706 -1281 189 342 -212 -57 148 -1345 -3597 -3381
1464 -3381 -599 1311 -260 -3237 -3777 -1669 -238 -416 -878 -370 -427 -1901 -2769 -1473 972 1263 -876
1481 -876 -2326 -1120 494 476 -66 719 2125 1615 -177 -863 199 1327 912 2 54 374 -295 -691
1499 -691 773 2580 1884 -856 -1971 133 1743 993 -1165 -1172 602 1007 -407 -1429 111 1444 727
1516 727 -1135 -1716 -716 511 482 -40 -386 -869 -1245 -553 857 1137 -68 -1217 -470 756 825 -327
1534 -327 -446 429 927 233 -647 -390 745 1512 1388 1107 201 -361 -78 1263 2152 864 -1168 -1482 844
1553 844 2693 1548 -791 -1388 770 2618 1643 -489 -1277 -109 1410 1829 960 -498 -1252 -297 1432
1570 1432 2353 939 -1000 -1074 978 1951 333 -1697 -1103 909 1222 -591 -1561 -136 1417 1166 -217
1587 -217 -1078 -995 -881 -671 -284 -457 -1614 -2294 -784 1657 1651 -1312 -3300 -1474 1324 982 -2323 -4011
1605 -4011 -2058 748 1427 -119 -1368 -1502 -577 331 720 -244 -2243 -2981 -912 1134 307 -2628 -2976
1622 -2976 338 3162 1338 -2747 -3961 -734 2393 1435 -1821 -3403 -1985 300 858 72 -866 -1429
1638 -1429 -832 583 983 -193 -2033 -1342 1333 2093 -578 -3668 -2290 2152 4225 1510 -2175 -2475
1654 -2475 670 2809 2360 368 -572 206 1857 2802 2161 563 109 2185 4566 3724 -174 -1999 728
1671 728 4952 5094 964 -2279 -399 3504 4629 1957 -982 -664 1869 3348 2004 -702 -2137 -887
1687 -887 1747 2912 831 -2336 -2580 809 3609 2603 -1769 -3519 -937 2447 2373 -1129 -3056 -897
1703 -897 2543 2588 -350 -2429 -1052 2112 3009 925 -2032 -2720 -579 2488 3419 1397 -1541 -1582 1641
1720 1641 4335 2945 -681 -1898 1253 3817 2103 -1965 -2946 452 3798 2842 -1108 -3046 -1276
1735 -1276 1956 3044 769 -2540 -3872 -2277 682 1518 -1509 -4815 -4536 -751 1808 -260 -4058
1750 -4058 -4640 -1460 1206 -361 -3800 -4446 -1921 963 648 -2237 -4099 -2973 19 1573 -290 -3105
1766 -3105 -3648 -812 1997 1603 -1801 -3656 -1662 1988 3084 275 -2716 -2416 510 2077 798 -1738
1782 -1738 -2491 -358 1826 1575 -881 -2940 -1386 2015 3121 47 -4208 -4097 246 3587 1911 -2694
1798 -2694 -4187 -1464 2079 2534 -54 -2424 -2502 -393 1433 1154 -753 -1948 -64 2715 3089 125
1814 125 -2034 298 4406 5099 1226 -2829 -1599 3060 5539 3402 -266 -909 1434 4045 4666 2840
1830 2840 621 -16 1622 3026 1908 -867 -2062 213 3086 2113 -1625 -3129 -527 3257 2945 -1646
1846 -1646 -4972 -3384 452 1735 -844 -4080 -4529 -2241 45 -201 -2655 -4446 -3424 -530 698
1861 698 -1525 -4730 -4926 -1231 1692 290 -3868 -5002 -2109 1660 1522 -1538 -3498 -1957 1109 2168
1877 2168 -189 -2607 -2735 76 2669 1984 -1206 -3256 -1340 2173 3431 597 -2676 -2596 532 2498
1893 2498 942 -2126 -2746 -403 1754 1063 -1426 -2758 -585 2124 2396 -404 -2898 -2158 1346 3324
1909 3324 1342 -1938 -2795 -185 3145 3457 758 -1560 -367 2739 4271 2305 -430 -648 2453 5120
1925 5120 4161 871 -680 1450 4575 5066 2223 -218 440 3546 5226 3796 1082 129 2243 4464
1941 4464 4216 1076 -1131 93 3000 3708 1032 -1597 -1216 1606 3257 1704 -1103 -1833 52 2189
1957 2189 1944 -597 -2575 -1405 1314 2445 130 -2845 -2662 841 3299 2057 -1452 -2814 -737
1972 -737 2191 2812 518 -1940 -1766 574 2204 1430 -965 -1596 457 2404 1864 -1183 -2709 -1199
1988 -1199 1874 2368 -344 -3221 -2971 198 2369 919 -2417 -3994 -2068 726 1154 -1457 -4098 -3581
2004 -3581 -856 431 -1292 -3872 -4188 -1931 189 -305 -2998 -4473 -2957 -335 199 -1895 -4114 -3508
2020 -3508 -744 1005 -479 -3244 -3719 -1210 1216 1040 -1942 -3399 -1579 1216 2082 128 -2205 -1804
2036 -1804 929 2621 1247 -1601 -2280 -369 2269 2344 -55 -1848 -1083 1478 3070 1943 -873 -1960
2052 -1960 118 2849 2518 -470 -2581 -943 2467 3379 693 -2152 -1679 1429 3382 1968 -797 -1606
2068 -1606 214 2312 2120 106 -1320 -464 1665 2650 987 -827 -796 1599 3183 1862 -883 -1852
2084 -1852 301 2765 2683 118 -1961 -1147 1668 3158 1600 -1108 -1792 295 2461 1947 -780 -2318
2100 -2318 -1069 1183 1709 -220 -1960 -1843 488 1916 834 -1596 -2673 -981 1289 1430 -1057 -3076
2116 -3076 -2023 441 1613 175 -1915 -2179 -660 1207 860 -1049 -2259 -1445 674 1548 -328 -2398
2132 -2398 -1850 706 2161 401 -2084 -2361 -5 1988 1225 -796 -1863 -897 1009 1850 878 -955
2148 -955 -1433 -135 1593 1759 -285 -1350 -84 1929 1888 -282 -1336 53 1845 1893 73 -1387 -1038
2165 -1038 409 1722 1463 -190 -1564 -1072 1050 2134 795 -1612 -1792 267 1884 865 -1487 -2250
2181 -2250 -484 1292 979 -786 -1901 -1279 212 936 331 -1118 -1788 -776 543 696 -659 -1677
2197 -1677 -819 864 1240 -165 -1451 -765 1354 2020 795 -969 -1118 356 1412 1346 329 -399 -30
2214 -30 993 1607 1072 6 -105 701 1589 1129 -456 -1163 91 1889 1865 -139 -1569 -733 980 1608
2232 1608 443 -784 -1080 -537 207 359 -103 -1212 -1577 -470 471 -6 -1617 -1722 -247 1149 253
2249 253 -1715 -1891 -218 915 253 -863 -1288 -512 330 471 129 -254 -560 -189 529 1007 -72 -1152
2267 -1152 -912 558 1154 -275 -1458 -899 638 785 -396 -1253 -806 110 15 -653 -986 -1050 -1100 -629 -137
2286 -137 -266 -1193 -1801 -980 418 288 -1261 -2366 -1257 157 -32 -1391 -1706 -485 289 -56 -852 -675
2304 -675 104 344 -16 302 301 -44 -204 910 2063 1860 428 -42 1506 2705 2376 1053 641 1763
2322 1763 2218 1470 943 1680 2314 1887 1029 1061 1461 1486 974 756 873 806 34 64 781 1350 318 -781
2342 -781 -379 658 851 -228 -899 -350 456 -6 -698 -736 54 322 -3 -175 189 140 46 100 766 728 318
2363 318 -200 78 1191 1466 686 220 673 1325 1188 737 602 864 999 468 213 517 715 666 303 242
2383 242 149 -32 -447 -489 -523 -859 -1204 -1299 -1205 -1022 -1370 -1617 -1372 -1103 -1139 -1383 -1602 -1456 -1400 -1502 -1592 -1538 -1424
2406 -1424 -1420 -1392 -1011 -715 -860 -676 -602 -55 -93 -757 -1141 -542 -77 83 -172 -286 339 672 412 138 205 556
2428 556 301 -225 -320 231 454 144 34 249 362 26 -85 124 172 -115 -692 -793 -174 -238 -622 -977 -278
2449 -278 362 -48 -863 -620 54 116 -516 -685 -160 87 -189 -235 502 1023 689 172 616 1355 1409 501 131
2470 131 999 1783 1302 495 853 2025 2295 1590 1163 1447 1712 1040 501 943 1233 654 203 532 1091 893
2490 893 141 -100 461 478 -426 -1342 -901 -271 -410 -1368 -1631 -1198 -748 -1225 -1407 -1144 -775 -1150 -1493 -1426 -1138
2511 -1138 -1331 -1838 -1289 -439 -532 -1450 -1850 -729 266 -283 -1363 -1511 -582 117 -463 -830 -183 235 163 -303
2531 -303 -85 191 -274 -751 -478 168 80 -782 -1011 -65 553 25 -851 -744 -59 119 -751 -1175 -701 -136
2551 -136 -486 -758 -670 -359 -188 -400 -122 147 -265 -533 -128 635 706 45 -363 387 1471 1387 661 334 1168
2572 1168 1697 1544 1085 910 995 1211 1124 1297 1343 1435 1380 1624 1850 1606 818 808 1325 1774 1444 459 276 1012
2594 1012 1627 1006 327 215 532 736 506 359 77 137 193 272 210 -153 -635 -245 97 -25 -533 -834 -414
2615 -414 -2 156 -183 -560 -292 0 282 -81 -366 -366 -168 143 323 26 -191 -234 266 613 250 -319 -364
2636 -364 136 394 224 -463 -509 -129 403 253 -495 -720 -371 -77 154 -249 -688 -944 -604 -222 -209 -434 -1089
2657 -1089 -1207 -681 -405 -377 -1018 -1220 -939 -318 -704 -1155 -1174 -512 -131 -392 -975 -994 -607 53 -77 -292 -462
2678 -462 -445 -275 109 269 -93 -310 -345 101 256 -131 -362 -272 464 576 48 -446 -409 285 728 584 69
2699 69 -164 -202 161 463 762 146 -374 40 633 860 230 -176 191 948 798 55 -85 157 671 522 176
2720 176 57 146 306 453 526 438 72 137 598 762 256 -409 -260 403 1123 515 -396 -216 241 696 436
2741 436 107 -97 142 134 253 208 44 -173 -173 345 292 -253 -613 -114 647 571 -317 -755 -277 297 354 -213 -570
2764 -570 -456 -219 74 37 -275 -521 -629 -306 224 -1 -587 -917 -341 279 -133 -892 -980 -299 210 -120 -538
2785 -538 -902 -366 -11 -85 -256 -613 -474 -182 51 42 -372 -489 -374 233 443 53 -323 -195 405 604 110
2806 110 -218 -101 425 771 345 -74 -172 276 651 446 183 -185 -181 474 784 486 -34 -542 -43 514 511 -101
2828 -101 -610 -344 17 399 -55 -502 -511 -47 151 -90 -459 -532 -301 -174 -133 -469 -588 -499 -73 250 -81 -324
2850 -324 -377 -28 247 455 -16 -268 -79 484 695 543 144 116 570 750 630 250 212 620 905 754 323
2871 323 33 126 662 766 446 -166 -143 244 512 420 -27 -423 -47 277 356 -111 -368 -354 12 91 -167 -469
2893 -469 -435 -33 94 40 -264 -534 -223 153 52 -128 -412 -517 -114 310 152 -253 -492 -124 299 377 -82
2914 -82 -220 -153 241 306 124 -102 -119 31 161 74 -180 -466 -243 98 75 -244 -533 -601 -275 -13 -349 -853
2936 -853 -993 -713 -176 -613 -980 -1034 -833 -356 -325 -745 -907 -686 -464 -214 -240 -457 -742 -487 -163 161 84
2957 84 -343 -268 240 322 234 -93 33 661 771 586 340 316 461 919 947 847 644 559 673 939 1068 679
2979 679 338 420 699 793 396 221 315 513 494 25 -126 -28 290 205 142 -174 -565 -267 39 264 -8 -364
3001 -364 -440 -32 466 169 -190 -235 87 494 172 -39 -170 211 529 436 176 162 147 281 490 433 241 53
3023 53 122 482 655 330 -121 4 570 529 138 -154 -351 2 140 -176 -417 -492 -234 -293 -297 -527 -543 -533 -475
3046 -475 -367 -601 -614 -886 -644 -200 -164 -545 -1001 -688 -89 -71 -502 -704 -387 -124 -111 -280 -219 -160 -129 21
3068 21 4 22 -204 -192 44 263 157 -112 -251 258 573 153 -176 -184 286 338 268 -105 -108 105 35 -92 -87 101
3092 101 -235 -426 -259 74 -120 -419 -393 -210 -16 -274 -538 -253 -56 6 -189 -429 -112 157 85 55 181
3113 181 132 172 221 497 596 310 50 276 669 692 351 204 552 912 924 542 466 672 820 696 403 338 550
3136 550 539 436 418 502 305 106 205 382 161 -165 -451 -227 -22 -48 -413 -485 -252 -170 -318 -533 -388 -141
3158 -141 -331 -765 -562 -459 -660 -563 -535 -111 -202 -446 -390 -194 101 -81 -595 -535 -124 -54 -258 -419 -134 -101
3180 -101 -64 -301 -110 -108 -23 -156 -322 -113 -209 -280 -421 -72 102 -184 -473 -294 -2 29 -253 -545 -202 -132 -119
3203 -119 -307 -253 -186 -47 -103 -72 149 131 60 -37 114 193 210 -52 92 445 558 209 93 302 633 458 71
3226 71 169 308 501 421 217 333 500 372 252 366 560 569 336 210 399 368 35 43 182 392 174 -108 -18
3249 -18 390 401 12 -99 -37 119 -121 -365 -249 -42 61 -131 -293 51 -45 -69 -186 -20 143 -172 -456 -435
3271 -435 123 92 -87 -218 -26 98 -59 -251 -35 197 236 -170 -300 55 307 134 -144 154 297 132 -129
3292 -129 -64 208 282 -13 -214 29 222 59 -122 -107 353 5 -224 -224 -5 187 -139 -226 -100 6 -179 -295
3314 -295 -252 75 40 -352 -309 -158 66 -216 -375 -262 -12 -260 -457 -215 51 135 -243 -253 -188 79 -156 -290
3336 -290 -203 124 4 -252 -365 106 75 -160 -368 -45 377 14 -231 -317 123 259 -239 -240 87 476 91 -44
3358 -44 70 377 370 -69 16 174 478 -5 -181 218 434 184 -186 27 437 400 105 -3 143 367 -2 -43
3380 -43 225 385 168 -20 48 248 374 100 51 204 262 74 -24 102 153 56 12 -77 53 270 40 -86 85
3403 85 223 -91 -197 -28 194 -10 -96 -185 -73 153 -67 -120 -9 104 -23 -113 -144 -109 131 30 -169 -87 -121
3426 -121 -103 -247 -207 -233 -147 -236 -260 -272 -171 -227 -240 -176 -174 -173 -346 -283 -57 171 -53 -287 -163 -113 -59 -153 -67 15 133
3453 133 38 8 55 77 188 -26 73 132 157 140 115 191 168 115 131 140 176 302 79 98 223 132 145 -25 -43 -14 27
3480 27 86 11 -32 -54 -166 -209 -49 -104 -115 -292 -139 -243 -241 -204 -109 68 -133 -131 -187 -109 -65 -56 15 -216 -26 8 36
3507 36 168 225 16 -3 -26 166 293 186 70 90 120 35 72 161 210 199 208 49 166 245 235 77 104 190 146 92
3533 92 129 215 86 15 186 79 113 32 20 32 112 89 -26 -35 110 50 -24 -9 -102 44 50 116 31 140 -24 -104 0
3560 0 63 189 47 -95 -12 -13 -3 -64 73 41 -25 -67 -208 -66 -37 -2 -259 -161 -147 -212 -225 -185 -197 -142 -257 -303 -297 -122
3588 -122 -146 -400 -320 -139 -79 -276 -428 -271 -369 -316 -216 -129 -277 -181 -274 -76 -173 -39 -86 -15 72 -4 62 30 116
3613 116 213 195 116 93 131 145 293 330 372 319 298 163 305 363 209 249 127 173 126 254 116 253 174 141 181 4
3639 4 170 120 124 91 -96 -42 17 -7 -93 -46 -60 -214 -217 -132 3 -87 -179 -83 -41 46 21 57 -96 100 61 -24 -13 0 -13
3668 -13 105 -99 -171 -47 161 73 164 60 -44 -99 60 35 44 19 -97 -264 -88 120 0 -93 -159 -67 -187 -60
3692 -60 -21 -38 -20 -23 -36 -267 -11 -25 51 2 89 -107 51 -57 15 31 -142 58 -76 11 114 3 38 22 84 50
3718 50 60 73 31 125 71 -2 66 97 129 117 154 -17 88 15 99 39 31 -148 -47 -23 -9 -182 46 -50 -81 -230 -42
3745 -42 23 -1 -67 -270 -169 -86 -66 -115 -77 -78 -174 -89 -67 -64 -23 69 -54 -269 -11 154 94 61 176 72 201 117 -55
3772 -55 147 216 219 125 122 260 306 221 187 239 209 243 139 170 274 288 170 241 133 202 203 146 197 66 32 -30 58 45
3800 45 22 12 -153 16 42 -85 -17 -59 34 4 -61 -52 -63 -312 -137 -97 -192 -1 -217 -137 -54 -155 -43 -167 -172 -132
3826 -132 -17 -46 -117 -100 -82 -73 -138 -78 -255 -46 -65 -96 -125 -60 72 -56 -38 -28 95 -109 -69 -26 -31 -76 33 91 119
3853 119 74 -123 -13 -44 83 17 -44 -16 -92 -67 18 26 72 113 75 -65 32 212 179 4 96 179 37 4 -2 87 163
3880 163 19 18 -5 107 43 175 51 -48 60 123 46 -7 4 55 -58 21 101 -10 -17 60 -1 50 99 -10 -40 24 -71
3907 -71 -92 -91 -39 27 -195 -82 -90 -76 0 -28 -46 -10 -32 -160 -107 -70 -8 63 -49 39 19 74 -57 -26 -10 -4 -37 -100 81
3936 81 60 27 40 44 35 -15 31 77 189 20 33 127 19 234 88 117 81 8 166 -128 150 153 194 -21 -53 -13 46
3963 46 137 30 -19 46 -17 43 -214 -22 29 -25 -272 -71 -149 -138 -126 -194 -97 -177 -128 -64 -85 -130 -172 -238 -203 -83 -76 -133
3991 -133 -109 -208 -52 -53 -89 -189 -69 -23 -174 -80 -15 38 -98 -56 -87 -86 18 25 55 162 -155 -93 123 123 -64 -45 34
4018 34 75 77 189 165 104 53 236 157 107 80 151 7 28 -54 78 40 89 136 18 107 111 -64 -47 200 32 -142 -30
4045 -30 45 205 82 -38 45 183 176 12 -72 4 52 74 -19 -164 119 135 12 47 199 167 -18 -123 -87 183 81
4070 81 -134 -71 -103 -24 -60 -61 65 -23 -132 -251 -245 -94 8 -199 -118 25 -22 -180 -166 -130 31 -120 -152 -159 101 -28
4096 -28 -137 -238 -10 209 -88 -119 -44 152 -7 -62 -64 -25 109 49 -32 67 80 149 14 56 141 197 115 -127 72
4121 72 188 101 -66 -6 62 50 -89 63 -17 163 107 -64 9 -16 -40 -87 -26 91 162 -9 -159 -159 30 -103 -35
4146 -35 -17 -2 -78 -98 -37 131 89 2 -8 -14 192 2 -117 124 75 74 65 -126 -28 18 85 -95 7 124 -34 -34 81
4173 81 45 94 90 56 -21 -48 -17 -30 180 176 12 34 -48 56 132 17 -48 1 104 121 10 180 11 127 -204 -36
4199 -36 13 -18 41 -31 53 87 60 -140 -41 101 224 32 28 123 97 52 80 -58 71 -24 -58 -49 -146 32 -30 -139 -71
4226 -71 10 -86 -156 -200 -125 8 -175 -179 -115 -75 -105 -180 -275 -176 -176 -238 -193 -70 -128 -131 -138 -141 -45 -291 -188 -238 -50 -106 -106 14
4256 14 32 112 -90 3 78 -12 44 -8 -24 120 171 192 37 181 169 59 -35 207 232 167 26 155 177 260 211 77
4282 77 131 230 127 65 70 79 153 109 67 16 32 8 131 52 -54 23 -34 56 -12 2 -31 39 -33 -34 -86 -102 -83 -33 -36 -105 -83
4313 -83 16 -58 -68 -68 26 32 -47 -45 -34 -172 -122 -119 -43 -76 -89 -46 -83 -119 -52 47 -42 -28 -32 -95 -185 -32 69 -85 -129 -145 -8
4344 -8 149 95 -67 -83 -2 -22 -18 -40 23 -6 -67 -51 18 26 188 103 47 -66 -86 -34 57 -5 -62 1 -22 126 -1 42 107
4373 107 85 78 102 -36 8 -83 89 195 23 -47 -55 108 -51 17 133 64 46 -96 25 32 -58 26 12 -3 -138 47
4399 47 -32 -50 -109 66 -74 -3 -26 -55 -51 -73 -200 14 -139 71 -72 -73 -19 -65 -5 -67 -48 16 -46 28 -79 41 24
4426 24 -62 -35 71 73 62 -31 19 136 48 81 25 -1 105 79 100 -18 19 32 99 26 127 95 168 35 37 263 69
4453 69 78 126 141 -18 -88 59 38 63 84 -30 -33 -32 -41 -1 -130 4 -74 28 -70 -88 -1 -118 13 -217 -164 -161 -12 -174
4481 -174 14 -198 -1 -37 -112 -78 -73 -129 -197 -180 -140 -47 -118 -85 -38 -38 -17 -43 -103 101 -36 8 2 19 6 95 9 -18 137
4510 137 31 -51 -57 30 -40 48 -68 107 -40 68 128 59 -72 -68 176 121 -14 63 241 58 7 73 94 78 213
4535 213 -11 -64 93 68 27 86 175 -80 93 -45 108 105 325 81 54 84 139 -21 -42 41 2 -36 11 33 21 -22
4561 -22 -82 55 78 -87 -20 -96 -152 -135 -78 -93 56 -235 -88 -72 -135 -109 -134 -27 0 18 14 -150 57 -65 -16 -6
4587 -6 -184 -43 16 0 -12 27 -43 -104 -64 -10 5 16 93 79 63 21 50 46 0 150 128 10 44 169 211 121 68 36 150
4616 150 40 37 31 144 22 18 -80 124 -33 105 -169 -135 55 -149 -48 -107 -25 105 -95 -189 -168 -42 1 -63 0
4641 0 -47 -57 -51 -65 56 -54 -42 -30 -263 -29 -63 -65 -10 21 -93 -80 -104 92 64 111 -54 -74 26 181 10 7 56
4668 56 79 49 41 76 55 122 37 172 86 68 -81 -84 88 -92 71 34 193 86 29 55 55 152 197 -24 89 39 87
4695 87 89 3 154 254 -19 56 119 114 67 45 111 -59 147 43 122 112 -61 -39 43 7 -3 22 87 21 -7 -27 -152
4722 -152 -37 -3 -57 -42 -223 -98 -209 -176 -234 -117 -184 -245 -195 -132 -73 -206 -297 -216 -172 -223 -186 -214 -88 -155 -49 -90
4748 -90 -130 1 -163 57 -12 76 -50 -57 20 -56 -52 -46 -14 -81 87 64 62 154 1 -26 131 73 -46 -34 1 27 79 98
4776 98 131 72 157 0 -45 60 30 -61 6 107 -54 21 23 65 -73 -10 25 11 3 -7 4 121 -104 61 -7 14 -81
4803 -81 29 -33 -12 104 104 21 -22 64 51 184 -21 -6 34 132 72 30 -28 -18 95 -52 42 -8 162 -10 87 -10 142
4830 142 203 37 48 56 45 -40 30 -34 21 -47 -29 -6 165 66 41 -78 -25 -2 -81 17 64 14 53 53 16 -47 -3 88 124
4859 124 24 113 185 -70 -94 49 80 -72 79 81 116 86 -37 162 137 19 -18 -35 -11 -5 6 -41 -4 -3 -95 -48 -42 -63
4887 -63 -28 -185 -118 -65 -63 -151 -82 -21 -103 56 -94 -139 -64 -94 -46 -9 6 -9 -165 -111 -41 -77 -50 -194 -27 78 105
4914 105 79 -63 -7 69 103 7 121 96 71 71 52 72 78 93 116 147 193 106 32 83 157 91 37 -39 110 82 197 99 97
4943 97 3 184 19 124 65 -10 91 1 -64 -68 61 -46 91 60 19 -1 -14 20 -118 -73 -90 -76 -120 -115 -133 33 -87
4970 -87 21 -112 -46 -176 -37 -195 -68 -90 -133 -21 -58 -171 -210 15 -41 -258 -167 -153 -26 -172 -102 -2 -1 -48
4994 -48 -105 -54 -52 -130 -142 -117 168 -51 69 36 -50 66 101 90 89 94 106 -35 3 27 48 45 -97 27 34 53 3 14 63
5023 63 93 19 -3 75 145 25 28 5 102 -19 81 -101 4 152 22 -29 -105 114 84 -30 -24 9 -20 -29 17 -70 -45
5050 -45 37 -41 -17 -48 -36 -128 -127 21 14 -109 -92 -80 15 -114 -5 -18 -55 39 -1 -16 -167 12 -94 38 110 91 -15
5077 -15 -88 -11 142 21 44 -53 15 -48 19 51 -76 83 -142 29 12 26 -2 162 76 -58 113 -10 -3 -2 -23 127
5103 127 -57 21 -17 -9 0 138 -23 57 78 -71 -72 -57 9 -53 -25 52 -61 -110 50 -111 -49 -100 -50 -129 -106 82 -54
5130 -54 -112 -49 -3 63 -86 34 -41 -90 -115 19 -146 -76 22 -31 34 -49 -124 0 36 32 -91 -30 -118 5 41 -85 -138
5157 -138 -22 229 -27 93 -60 -1 -21 -60 -32 18 -140 -5 38 -28 104 75 9 10 -47 40 61 80 8 5 109 21
5183 21 110 158 56 -8 172 158 77 30 35 -15 -50 160 68 106 70 145 -13 117 -75 -83 107 30 59 -15 106 64 18
5210 18 57 26 23 4 -130 154 -17 12 -16 -50 -97 -133 116 -55 -147 -30 -122 -40 -78 -9 72 -57 -70 -125 -44 -138 -132 -54
5238 -54 -131 -20 43 -41 -97 45 -42 -28 117 88 -28 16 -52 -7 64 76 2 52 29 90 158 93 196 114 126 72 198
5265 198 95 37 -10 76 -8 -81 37 85 106 -22 8 36 -18 -71 -1 -40 -5 -9 16 -120 51 36 115 63 -81 8 23
5292 23 -52 -30 -16 56 47 -22 -55 15 -6 -76 -6 102 -142 52 -61 -24 86 -5 -54 -36 18 103 -19 54 20 -109 90
5319 90 115 -91 33 60 145 -38 86 -3 90 74 -24 -12 -28 17 55 91 4 -32 64 48 83 141 28 49 18 33 45 99
5347 99 -63 131 84 -82 38 83 5 68 76 35 -21 39 190 143 20 49 59 -52 -61 18 148 99 89 -110 74 -99
5373 -99 60 -80 69 -63 51 -174 -233 -43 -81 -59 -155 -54 -127 -119 -174 -199 -166 -145 -86 -114 -149 -49 4 -119 -20 -94
5399 -94 -132 66 -58 -163 -96 11 -56 -11 -34 50 25 -91 173 19 -137 -67 3 1 90 -22 52 21 95 94 87 32 141
5426 141 50 72 88 72 79 -24 84 177 24 -18 78 74 -64 -55 8 -2 -64 252 -57 -21 -74 9 -83 15 34 -20 -22 -58 116
5455 116 106 -75 -27 37 -123 -51 57 9 72 10 22 57 7 -126 33 35 75 -17 -112 83 -7 -48 4 -10 -15 119 127 -71
5483 -71 11 -20 -9 91 -129 -87 -46 197 -79 7 10 -35 -77 134 -5 81 -82 -84 111 -82 68 -15 -78 53 58 103
5509 103 -15 -84 17 -39 17 64 23 99 126 141 -36 65 -76 -12 121 -77 64 -145 56 23 -6 -32 -38 -36 -10 -34
5535 -34 -144 -137 -41 62 63 -85 -62 -30 2 -121 -4 -10 -50 -66 -83 33 64 1 32 -47 -3 83 -37 -66 -117 -80 19 47
5563 47 115 -126 31 59 119 -54 -51 -35 -71 87 39 -97 14 36 86 155 122 3 -83 109 -37 -51 -19 85 31 1
5589 1 88 105 68 190 108 105 92 -46 -22 6 -80 -56 2 26 245 133 -12 34 86 -43 134 30 25 -73 -8 67 106 -111
5617 -111 41 33 -17 15 -52 -100 -7 5 -50 -105 -102 -103 -131 6 -53 12 -133 -107 60 94 -31 -202 -84 102 -34 -15 -35
5644 -35 -27 107 -23 64 -6 -8 17 23 44 -127 63 -24 23 -28 -59 81 21 4 76 12 136 -38 10 66 75 181 55 52
5672 52 13 55 8 127 26 14 39 48 68 80 103 51 17 -14 79 34 129 -45 24 24 82 51 36 25 -20 -33 -27 -79 89 200
5702 200 8 -46 11 -102 -82 -84 -40 -58 -82 -3 79 2 -100 -2 -36 -82 -5 -73 -113 -77 -46 57 -148 -96 -102 -72 19 -118
5730 -118 75 -20 73 62 -108 -30 -116 -82 -31 121 12 -174 6 5 57 -36 14 62 -41 52 56 18 -75 121 -23 62
5756 62 -36 37 -17 38 97 -53 3 -3 -77 -17 45 17 -73 -36 -94 72 -50 67 29 91 -76 -34 43 -4 11 43 71 -106
5784 -106 -33 -149 -7 86 26 -127 -48 -14 28 -3 2 -14 14 -57 -87 -94 -104 -128 -99 -23 38 -92 -59 -34 142 17 -133
5811 -133 69 -51 84 29 -25 -40 20 63 101 -8 -72 -65 25 -55 135 45 -63 -52 106 -30 66 168 17 51 20
5836 20 41 -92 -67 6 53 44 -3 -14 111 103 52 78 -18 58 127 12 80 8 75 -1 18 40 -97 -35 -21 -7 -40 43 -25
5865 -25 29 69 8 -45 -65 -104 -71 57 -16 -13 -72 -26 -51 34 -10 10 30 46 17 4 60 -47 -103 -16 60 -46 -17 -93 42
5894 42 8 47 -26 4 -89 27 44 -120 -11 56 69 106 13 56 15 -32 62 137 114 64 64 179 113 134 73 14 -85 102
5922 102 217 84 93 45 -49 -43 68 -48 -43 12 172 -94 30 125 19 -65 1 -18 97 -72 50 70 -35 -49 92
5947 92 25 101 -22 -77 15 15 -111 16 -6 -169 54 25 -27 48 64 -32 129 32 68 -36 -136 18 62 -34 -6 -78
5973 -78 44 12 -18 -6 40 61 7 24 -2 -45 -54 21 40 140 -61 -126 79 -10 57 35 -77 -65 -27 -37 4 -44 94 56
6001 56 25 25 55 85 -76 63 -16 101 -58 -16 63 53 -45 -141 27 -35 -30 40 -8 -95 28 11 63 -29 -112 -70 147 -111
6029 -111 -40 -80 91 62 -18 58 -79 -59 -44 -53 -102 -11 -45 84 -2 -115 -10 -49 -111 -116 34 -142 -110 -54 -29 -50 -58 36
6057 36 -38 -74 -40 121 -39 -14 22 -70 -85 -32 -79 -111 -9 -242 45 83 -77 55 -1 -10 95 -15 -18 -29 -91 55
6083 55 17 196 9 45 85 139 110 25 52 51 41 -38 67 18 89 126 -1 3 38 129 -93 170 -19 -22 18 -26 17 -14
6111 -14 -57 6 -23 -146 -87 -14 -41 -78 -73 62 10 -82 -27 -32 17 37 -3 12 13 -6 -20 -35 11 -6 56 -118 -1 -89 -44 -35
6141 -35 39 13 -18 24 -65 -52 27 3 -15 -69 -32 88 54 68 -85 10 28 -7 4 100 0 -27 109 13 -41 70 -65
6168 -65 71 143 31 201 24 -58 -6 -18 45 11 -74 88 89 78 30 -67 98 59 -74 29 -29 -12 -160 -8 -104 -61
6194 -61 -98 64 60 -92 -70 -121 -81 69 -145 -107 -2 -66 -9 -6 78 4 -15 6 -9 -79 -30 -82 -25 -27 -5 -160 16 44
6222 44 119 -55 -69 45 9 -154 -80 -66 2 -34 89 93 -149 93 -37 37 -65 44 -11 -17 -55 18 -74 -2 3 122 -22
6249 -22 42 25 34 5 6 72 98 129 143 45 -119 -56 29 71 -27 28 -22 35 18 82 -50 35 131 -20 82 -60 42 -102
6277 -102 99 29 -40 22 -92 19 -16 145 -69 -13 -99 26 27 -7 13 -19 -30 -31 35 -54 69 -53 -61 -116 38 46 84
6304 84 130 61 -61 100 11 155 -92 40 29 133 44 -75 -7 35 94 -60 76 111 -18 -22 5 7 162 -33 45
6329 45 -68 0 86 95 58 45 -51 13 -26 46 39 32 160 50 -15 63 3 20 81 172 -46 58 61 78 -53 -9 8 37 4
6358 4 34 -57 113 -94 37 -3 14 -83 -5 -31 -96 -26 14 57 -46 41 -154 -58 -79 60 -30 -132 -139 -69 65 -83 -142
6385 -142 -27 17 -71 16 -15 44 -29 -131 -114 12 -10 100 -95 -53 -38 43 -53 11 58 16 -4 -39 14 -16 186 -39
6411 -39 3 -77 124 15 91 -29 21 128 57 -17 -8 -36 -106 -149 33 -81 62 -85 0 -59 -53 99 -61 -73 -47 29
6437 29 14 -23 -8 23 -24 50 65 -34 73 14 83 152 -118 -20 28 -56 -15 -108 25 -66 -38 6 69 171 53 -61 58
6464 58 20 6 42 36 -27 -50 -22 -7 31 91 -19 -112 29 -88 15 -37 25 -33 60 -48 -4 10 -55 42 139 35 16 13
6492 13 -44 -65 57 11 120 -68 -65 136 43 88 57 -26 19 4 -40 -44 -3 145 -38 143 -106 -45 64 48 14 -80 -61
6519 -61 100 -80 -61 54 -47 -99 -73 -115 -31 -29 4 38 -8 76 -192 -108 -154 -9 6 -104 -85 57 -77 -51 -51 -98 -148
6546 -148 26 5 -118 -10 54 17 -91 -9 14 -29 -43 -31 24 2 113 -80 96 -46 -31 71 -33 74 31 11
6570 11 -20 49 -48 80 27 116 165 -69 -2 -10 82 -66 -51 54 83 61 86 37 70 75 69 54 36 27 -92 -51 11 124 -64
6599 -64 -53 -11 -14 20 -112 -133 69 95 -1 -23 1 16 84 -92 -141 11 66 -40 -73 114 -67 36 -20 -56 105 3
6625 3 8 9 82 48 -3 -56 -64 -17 -86 -89 -32 32 -20 6 -34 121 75 -65 -19 -64 -78 107 47 -149 62 111 6 -33 -55 100
6655 100 54 181 162 -29 59 -53 -39 18 -14 -76 35 99 -48 -68 -24 -2 32 62 -82 -77 192 3 -42 -5 -4 28 -28
6682 -28 146 66 119 2 39 -43 -12 -41 -69 -140 -30 -149 -14 -79 75 36 -123 -56 26 -38 -41 98 41 14 35 27 -71
6709 -71 20 -37 -140 68 -16 57 48 -50 -45 36 25 -28 -30 -116 71 -2 109 9 5 8 -25 78 -73 -34 28 9 -26 22 -31
6738 -31 -130 16 -39 95 -69 -65 -35 89 25 101 -203 19 11 110 115 99 72 83 -89 44 -8 59 38 48 -9 -30 13 -9
6766 -9 -69 -38 67 -142 -42 -109 53 18 -29 -23 15 -114 70 -36 -54 -10 -51 -35 22 -76 55 19 -60 22 -50 -36 -123
6793 -123 -88 60 43 -94 56 29 66 -44 -39 -134 -45 -36 17 67 41 36 32 74 28 -101 -2 100 6 -13 30 1 80 4 -107
6822 -107 133 22 127 12 29 51 44 114 2 -43 -29 2 -151 -13 68 61 38 119 65 52 56 25 -48 43 -73 -60 -93
6849 -93 45 3 -2 -6 -64 40 -15 -85 -135 -21 45 -37 -96 -36 21 -57 42 11 66 -103 -67 28 -111 -106 67 56 66 -14 -33
6878 -33 12 -47 -102 -15 59 5 56 43 -67 91 10 -95 44 -32 103 62 -21 -60 -137 64 27 -60 -25 24 102 26 -108
6905 -108 -67 -56 59 -79 20 53 50 -5 4 84 -70 5 75 16 -2 -52 -47 168 37 51 -51 -8 53 21 19 28 -5 107 -1
6934 -1 19 -32 -18 -52 -81 -65 -7 93 -75 15 -83 12 53 -98 -107 -86 8 26 -4 33 33 -61 107 -64 65 58 -102 106
6962 106 -87 -81 124 75 -66 63 25 48 -70 92 -19 -50 -77 84 -12 89 69 82 -51 91 -11 113 132 67
6986 67 10 87 188 -39 133 31 2 9 29 -24 56 88 8 -11 33 119 -21 13 57 13 -36 70 -47 51 37 58 50 -92
7014 -92 -14 -41 -78 -84 -37 11 63 -88 -41 -44 -109 17 -65 -82 -188 -85 11 -56 -50 23 41 30 -18 30 18 11 -2 -74 -129 -59
7044 -59 -125 -78 -63 36 106 13 -24 31 -185 27 61 65 60 -113 12 20 104 -37 -22 -49 35 -23 -43 -110 27 117 58 101 30
7073 30 -4 0 -50 12 53 2 -45 37 -79 56 -48 -55 36 -27 -23 32 -187 50 72 -95 -25 143 -143 -62 66 -5 -89
7100 -89 -71 -77 -97 -56 -70 -62 -150 -71 74 54 -64 -16 -102 -37 26 59 -38 70 129 -103 -69 10 -124 -66 65 -28 42 5
7128 5 -62 -69 -27 -4 16 87 15 -71 23 -6 117 60 54 20 97 -78 2 -25 -7 -52 76 -57 -3 44 -22 65 146 69 -18 31
7158 31 -31 -11 -16 26 28 99 -111 72 -123 -117 -92 -93 -23 38 60 3 -99 1 -6 15 -64 -38 -36 -43 16 19 -1 -6 -60 -68 -6 30 56
7191 56 -51 -50 8 -107 16 28 15 -66 -8 -51 -57 -123 -91 -43 30 -93 -50 -85 -58 -14 -29 -75 61 153 76 18 -27 27 75
7220 75 -79 48 -5 -60 68 7 0 92 51 -69 -71 13 -121 -83 8 22 151 -98 52 -76 104 29 92 -106 -68 62
7246 62 -56 -35 77 -129 15 -32 20 -75 -16 27 -73 24 34 -54 -106 -36 15 62 108 -100 40 -127 -11 105 23
7271 23 -68 50 -28 -36 13 -76 -31 -102 86 -83 -116 -130 39 16 -19 83 -230 3 6 -58 -27 26 -6 38 43 49 67 -49
7299 -49 83 -51 -75 13 62 -28 40 70 -28 208 -5 -25 -13 -58 -73 10 118 -80 -8 78 -2 -2 -54 78 -84 39
7325 39 37 35 -28 37 35 27 86 65 -48 38 13 22 -22 -57 78 -18 -105 -22 111 76 -22 -132 -26 -45 -29 -86 40 -81 47
7354 47 -5 -64 35 -21 -42 -68 -121 -114 44 22 -10 31 11 -27 -10 -53 -98 -41 -62 -29 23 -44 18 34 34 26 77 153 -45 -33 69
7385 69 76 24 -60 119 -22 -32 82 127 56 80 91 -56 63 24 -58 47 212 -64 -5 34 -124 14 -6 54 -14 -111
7411 -111 25 -10 82 -14 -31 -24 -118 183 -94 -100 12 -50 20 30 111 -29 -105 -8 18 158 -24 -27 -43 -88 -1 -81 -67 17
7439 17 7 64 -16 10 80 81 64 30 121 -22 -14 3 -7 -109 69 63 -52 14 36 58 93 -22 -51 21 68 85 13 104 97 125
7469 125 -13 -42 -50 -16 74 64 -7 -63 91 -18 61 -53 22 -69 73 28 -91 59 83 92 86 25 52 19 -37 70 68 66
7497 66 72 -80 70 0 -143 92 -23 21 104 91 -38 -18 -28 -106 18 -15 23 -41 7 22 -114 -163 -2 57 -39 -143
7523 -143 -101 3 1 15 141 -36 77 -143 -174 -105 -165 -55 55 -35 -77 -53 -55 2 -78 -12 -100 62 -58 -73 -4 28
7549 28 -51 27 11 78 24 -61 31 14 65 112 40 -16 -85 -65 14 -7 -8 17 27 24 40 3 -27 -51 100 -26 76 72 15 1
7579 1 -4 -64 25 3 39 -24 -45 -9 -10 53 -110 92 -5 -58 -29 -53 202 -55 19 -71 -4 -62 136 -29 -11 58 -36 -21 -77
7608 -77 -59 -61 56 -27 -18 -12 55 -64 -3 14 -82 118 74 138 76 16 -2 17 -9 49 28 79 1 35 45 -93 44 76 17
7637 17 37 -46 16 3 -90 55 9 49 -80 5 95 -49 -81 47 -11 7 109 -55 77 -54 95 -70 44 86 -65
7662 -65 38 56 29 42 -21 28 -23 13 -23 -98 -15 14 -51 -53 28 -16 27 -22 -31 -69 -120 88 43 -97 7 5 -121 91 31
7691 31 -90 -30 -38 -14 -51 -36 17 -117 41 6 -63 53 78 -115 -38 -106 122 -43 -32 -51 2 -17 14 82 118 -51 93
7718 93 53 36 -44 55 3 -8 -7 15 109 -71 -61 -36 80 -112 -46 -65 -59 62 -43 -93 38 12 9 78 -41 33 12 -4
7746 -4 13 13 -10 -29 -146 18 -73 -26 -25 16 45 15 -92 28 -29 -30 3 165 -18 -40 -124 -126 70 -133 71 -31 38 4
7774 4 -39 6 -60 -49 -119 -16 -149 -20 41 -66 45 79 -52 -17 -59 54 10 -109 2 124 7 -32 -68 36 50
7799 50 -16 16 118 82 -43 67 -113 -3 2 -19 -53 -149 68 -36 -38 -56 49 -62 -127 -45 -96 -4 -27 -100 -5 -64 -104
7826 -104 4 85 66 -26 29 -48 -10 72 2 60 -85 3 8 -108 -5 -72 61 5 -44 10 -19 42 -34 28 61 3 -37 15
7854 15 -150 -37 4 36 57 -80 -22 -94 101 -6 -122 48 -57 -4 24 -108 5 43 -39 -12 -29 -110 118 45 -21
7879 -21 37 -126 63 58 16 -5 -70 -114 -9 40 -11 178 -40 46 115 74 61 -72 -49 7 19 -45 120 58 -12 -171 -36
7906 -36 42 32 -11 5 150 19 22 -5 8 0 31 -35 85 139 3 9 -20 -109 -53 -87 -62 -46 28 -72 76 10 -137 -22
7934 -22 -14 59 -82 61 -77 162 -3 -3 45 -22 16 18 92 -35 78 14 -26 59 -62 53 153 91 -98 -74 45 35
7960 35 -22 -68 -26 37 -37 -14 -49 64 -6 -32 -14 42 80 -70 -107 67 -4 33 32 75 126 -27 -62 51 118 34 -41 42
7988 42 -95 88 59 -72 202 9 41 6 18 -3 101 42 23 10 0 -67 20 21 47 13 -101 -12 0 139 -21 41
8014 41 -40 -38 3 20 -69 -36 30 -20 49 -16 -58 -62 41 -4 -40 -14 -35 -63 45 -3 -79 114 -5 36 3 -18 18 59 13
8043 13 51 118 63 49 22 -55 -121 85 -7 61 82 -58 23 56 18 54 -11 -99 -60 -37 -13 -90 84 32 88 0 -45 -58 -31
8072 -31 70 -145 -188 -33 -103 -61 1 19 20 -20 84 24 17 119 -37 160 86 63 80 139 -44 44 -2 -64 17 -33 40
8099 40 46 25 70 -88 3 47 12 -60 30 21 -12 -43 -8 -28 -7 55 -160 73 -36 20 121 7 -45 0 43 -155 10
8126 10 46 39 155 12 127 -17 -11 -73 15 20 67 27 67 37 26 -9 -67 115 -99 -41 2 -45 -78 -7 -32 -79 -70 -107 -42
8155 -42 -116 122 18 29 71 80 37 -68 -38 -33 -153 -76 194 2 -52 -104 20 -64 49 91 -60 -80 -53 -15 49 -86
8181 -86 22 -94 -58 25 -79 -137 -36 61 -17 40
8191D0
$$ Imaginary data points
##PAGE= N=2
##DATA TABLE= (X++(I..I)), XYDATA
0 0 0 0 0 0 0 0 0 0 0 0 0 4 -8 8 -8 8 -12 12 -16 20 -24 28 -35 36 -44 51 -59 69 -79 87 -103 115 -131 144
34 144 -162 182 -203 226 -252 280 -308 342 -379 419 -463 514 -568 630 -696 774 -861 959 -1075
53 -1075 1205 -1357 1530 -1714 1852 -1682 -434 29041 465079 397463 -153430 -397165 -165508
66 -165508 120384 60496 -98990 -79788 37546 -2213 -150698 -155181 -13204 28657 -63439
77 -63439 -96562 -18688 -28982 -144261 -174337 -31660 108199 30214 -164848 -200021 -56761
88 -56761 47447 -6556 -75687 -33191 29801 7771 -43745 -34780 5881 -3162 -40897 -26361
100 -26361 24709 5398 -79594 -84397 31129 97585 -5307 -142291 -119588 24300 80825
111 80825 -20559 -112926 -57977 49774 50143 -46021 -98040 -58154 -6247 2260 -10734 -28568
123 -28568 -66216 -86964 -37427 45596 61755 -24323 -92318 -30942 63914 52481 -40891 -70847
135 -70847 10692 69390 16113 -58200 -48812 19192 48895 24517 13118 29022 21589 -7129
147 -7129 11920 74310 86191 13751 -49493 -10628 72080 77097 10091 -28592 7707 51817
159 51817 30978 -15932 -18877 15474 34916 24410 10455 4105 -1987 3031 25391 34376 -641
172 -641 -49468 -47526 13796 55577 16451 -50565 -48588 20809 56271 8833 -48169 -36434 19766
185 19766 40345 4829 -30250 -21214 5107 5742 -7238 -6119 1889 2250 2448 18927 34391 15154
199 15154 -16028 -14093 21884 44576 14741 -27927 -22101 21266 46059 27647 -5010 -17582
211 -17582 -9637 4037 13540 11524 -8139 -29905 -26569 -2488 10015 -9875 -31572 -16317 9432
224 9432 -1408 -38484 -45839 -3685 30712 6106 -46398 -60770 -22386 15742 13152 -12843 -29408
237 -29408 -25673 -9500 8892 17355 4287 -17396 -17357 9809 29896 13788 -18088 -18152 17825 39402
251 39402 16681 -14046 -9314 22947 38744 20924 473 4184 20670 28346 23467 15680 8524
264 8524 960 2352 17491 22593 3298 -15772 -5802 24757 34267 5149 -20183 -5349 27162
277 27162 31906 3853 -16005 -3707 14584 12161 186 -2904 3373 8182 6793 6547 8336 3671
291 3671 737 10619 21884 14167 -9321 -16247 8385 30475 17652 -13685 -20823 5108 27823
304 27823 16891 -9116 -14502 3636 18288 13820 -63 -6414 -956 9340 14347 7585 -8018
317 -8018 -17323 -9267 8447 14496 50 -17564 -16648 654 10452 956 -14782 -19521 -11393 -3669
331 -3669 -6346 -14456 -17935 -13352 -3950 1023 -3888 -12057 -14681 -8743 -2490 -5987 -14042 -12802 -2813
346 -2813 3704 -2893 -16755 -18848 -5001 8605 7401 -7512 -21428 -18304 -1415 12894 10533
359 10533 -7755 -21582 -14222 3345 9402 -2224 -15313 -10707 5114 9050 -2970 -12941 -5188
372 -5188 12396 16775 1677 -15070 -16964 -3418 10572 11484 -310 -13846 -16581 -3398 13961
385 13961 18088 5850 -7115 -6582 3575 8205 2853 -3257 -1883 3556 3427 -1736 -2320 5665 14476
400 14476 13899 3700 -5803 -5264 4262 12466 8683 -4615 -14180 -9688 5453 16031 11240 -1035
414 -1035 -4806 4297 14675 13444 2899 -3360 2284 11298 11888 1837 -6152 -408 13575 21770
428 21770 15983 2957 -1790 7347 18730 17946 4298 -7631 -5458 5945 13043 8931 -501 -2886
442 -2886 5121 13745 13350 4104 -3655 -1359 6507 8482 982 -7773 -7594 992 6946 2556 -6707 -9129
458 -9129 -1444 5426 2163 -7296 -11349 -6353 -611 -2562 -10370 -15463 -12131 -3323 1780 -5 -5109
473 -5109 -7611 -4496 336 171 -4596 -8170 -7121 -3887 -4148 -7928 -8872 -2988 4746 5712 -2341 -10544
489 -10544 -10039 -1344 6213 4637 -6500 -15955 -14852 -3685 6867 5610 -5753 -14449 -11533 -2143
503 -2143 2515 -1921 -6841 -5602 -3915 -7236 -13134 -14001 -8199 -3533 -5315 -9859 -11277 -8577 -4607
518 -4607 -2269 -975 -982 -2799 -5690 -6036 -3577 -132 1689 1624 2455 3940 4785 4787 6068 8500 9246 7542
536 7542 6182 7559 9486 8996 6065 4307 5765 8794 10899 9510 5928 3043 3359 7646 12261 11680
552 11680 5682 -1097 -3325 151 4508 5147 1142 -5274 -9592 -8464 -3572 1137 2254 -733 -5339
567 -5339 -9200 -10928 -8098 -3481 -1786 -5365 -11130 -12128 -6753 -1063 35 -1124 792 3919 2459
582 2459 -4787 -8894 -3839 3698 3701 -4132 -10071 -8202 -2188 2630 5192 4798 -452 -7083 -8829 -3768
598 -3768 219 -4363 -11746 -12566 -7612 -6031 -10041 -10197 -2645 3032 -3175 -14621 -16286 -7050 -330
613 -330 -4996 -13162 -14199 -9672 -7486 -8466 -8181 -6447 -7714 -10458 -7785 -626 2044 -3751 -9082 -5069
629 -5069 2386 2748 -3295 -4655 1742 5793 1925 -1221 4542 13833 15620 8427 2060 2673 8119 13893
645 13893 17107 14807 7242 1513 6293 18468 23193 13452 1073 1230 11789 16987 10791 4166
659 4166 6189 11636 11582 7396 4784 5184 5689 7155 10395 10611 4329 -1274 3541 14841 17753 8599
675 8599 353 4627 13168 12300 4586 3086 11640 17392 12977 5644 5424 11334 15448 15612 14095 10712
691 10712 6383 5935 12458 17996 13400 3920 3951 14630 20697 12147 721 2727 14861 19231 8996
706 8996 -3688 -6012 534 5753 5030 -829 -7889 -11241 -5934 3317 4615 -6600 -18227 -15408 -3147
721 -3147 92 -11916 -22694 -16785 -2525 322 -11874 -21184 -15545 -3212 -99 -7793 -15414 -15349
735 -15349 -10034 -4128 -1371 -4498 -11178 -13928 -7377 1064 -1193 -12629 -17767 -7858 3757 760
749 760 -13433 -18704 -7275 6062 4245 -9273 -16954 -10799 -300 2858 -2846 -10521 -14378 -12205
763 -12205 -5802 -1341 -4740 -12278 -13027 -3076 4980 -1498 -15673 -17536 -2639 9772 2133 -16086
777 -16086 -20474 -4784 11296 9715 -4182 -12618 -7288 3225 7637 2797 -5084 -7711 -426 10114
791 10114 12199 2798 -6590 -1770 13212 19253 7165 -7378 -5072 11196 20079 11158 -2545 -4033
805 -4033 5165 12551 11447 6252 2980 2721 5614 9047 7058 -913 -5883 584 10632 7635 -9168
820 -9168 -17860 -4002 16289 15474 -6882 -21976 -12102 8035 12895 802 -11112 -10211 -784 7079
834 7079 8322 1977 -7760 -10981 -2038 8907 5498 -9944 -15537 -131 17100 12499 -7620 -14882
848 -14882 262 15449 9912 -7147 -12789 -3335 5869 5535 -82 -4023 -4733 -1073 6611 10347 1579
863 1579 -11959 -11941 4004 13858 1901 -17093 -17252 877 11194 656 -14103 -12705 827 7317
877 7317 535 -9296 -11826 -6729 1218 6379 2401 -9206 -15242 -3869 14045 15538 -3040 -17227
891 -17227 -7636 12741 15813 -621 -13220 -6611 7869 11403 2593 -5438 -4705 1889 8213 9019
905 9019 1357 -8254 -6515 9034 20751 10749 -10286 -14803 4403 21605 13667 -7890 -13954
918 -13954 1181 15803 13087 781 -4300 487 6294 7666 5568 361 -4586 -2506 6654 10780
932 10780 660 -12140 -8018 11220 20136 5064 -14063 -10561 11002 21342 7635 -11104 -11731
945 -11731 2215 10648 5643 -3258 -5545 -1146 5363 9434 6538 -2408 -8555 -2110 10208 10448 -5027
960 -5027 -16902 -7343 12444 16184 -1328 -16061 -8761 10121 16102 3235 -11577 -12192 -1623
973 -1623 7146 5599 -3435 -10841 -9351 496 8114 3988 -7273 -11557 -2538 7710 4879 -8432
987 -8432 -14510 -5317 6439 5173 -7434 -13995 -6199 6521 9473 -645 -12031 -12227 -1767 7623
1001 7623 5634 -5980 -13834 -8415 4218 8994 332 -10594 -9720 1739 8858 2618 -8615 -10288
1015 -10288 93 10346 7683 -4417 -11723 -5376 7283 11530 2845 -8694 -9829 549 10776
1028 10776 8979 -2211 -9017 -3138 7937 9726 331 -8359 -5059 5871 10380 3057 -6945 -7281
1042 -7281 2702 10935 8255 -1387 -7245 -3461 4926 7780 1935 -5954 -6061 2117 8629 4826 -5189
1057 -5189 -8451 88 10282 9270 -2229 -10024 -4811 6596 10247 2855 -5849 -5683 2281 8223
1071 8223 5703 -1768 -4751 737 9203 10490 2225 -6363 -4203 6641 12975 6049 -6171 -8925
1085 -8925 1257 12190 10835 271 -6411 -1586 7979 9876 2176 -6233 -5481 2648 8375 4794
1099 4794 -4174 -7758 -1029 8531 9195 -159 -9171 -7087 2454 7332 1573 -7104 -8066 -400 5428
1114 5428 2659 -4945 -7929 -2290 4736 4959 -2510 -9650 -7794 1526 7376 2493 -7074 -9584 -1449
1129 -1449 7148 5885 -2894 -7652 -2591 5074 5507 -1804 -7326 -4098 4043 7483 1921 -6317 -8314
1144 -8314 -1004 7411 7204 -2513 -11402 -9087 1876 8027 2128 -8430 -10309 -1905 5353 2222 -6407
1159 -6407 -9648 -3750 3499 3270 -3679 -9395 -7067 385 4935 1680 -5237 -7675 -1961 5488 5768
1174 5768 -1546 -6758 -2666 5175 6959 -443 -7215 -4130 5521 10540 5284 -3171 -4184 3235 10114
1189 10114 8706 1013 -4158 -1121 5792 8371 3816 -2299 -2615 3536 8393 5542 -2343 -5718 -682
1204 -682 6912 7368 -907 -8324 -6772 1548 6375 1963 -6332 -8856 -3013 3571 3277 -3079 -7295 -4424
1220 -4424 1813 3419 -1912 -7953 -6887 231 4991 1381 -5871 -7482 -1155 5736 5081 -2431 -7712
1235 -7712 -5012 2211 5254 893 -5199 -6184 -943 4226 3390 -2045 -5927 -3308 2200 3222 -1606
1250 -1606 -6478 -5049 1023 3458 -1106 -7420 -7693 -1694 3259 637 -6523 -9755 -5208 1673 2815
1265 2815 -2930 -9124 -8700 -2260 2863 1386 -4816 -8255 -5034 831 2647 -1503 -6025 -5128 460
1280 460 4016 1511 -3044 -3518 1470 5863 4397 -1227 -3944 -455 5450 7476 3834 -1119 -1163 3875
1296 3875 8811 8168 2694 -1334 452 5605 7198 3453 -647 1017 6101 7803 3238 -1488 279
1311 279 5989 8068 3348 -2459 -3003 1947 6116 5292 829 -2125 -810 3722 6853 5402 755 -1992
1327 -1992 683 5702 6763 2694 -1667 -521 4810 7637 4697 323 334 4928 8403 6057 1481
1342 1481 7 3571 7342 6807 2633 -190 1085 4401 5755 3758 582 -750 1382 4262 4138
1357 4138 651 -2636 -2069 1218 2528 -550 -4277 -4294 -725 1454 -774 -4777 -5431 -2204 655 -785
1373 -785 -4754 -7379 -5810 -2396 -1078 -3054 -6118 -6255 -3324 -351 -614 -3401 -4849 -3201 -1296 -1597
1389 -1597 -3905 -4877 -2939 -407 -402 -2611 -3899 -2822 -206 1499 464 -2382 -4191 -3260 -232 1722
1405 1722 160 -3061 -4442 -2339 775 768 -2255 -3879 -2033 1113 1627 -840 -2856 -2030 -2 612
1421 612 -506 -1375 -1051 -579 -798 -1325 -1227 -292 216 164 -644 -1238 -998 -198 1439 2314 1122 -1204 -1873
1440 -1873 -52 2465 2748 745 -95 1245 2968 2609 1518 1787 3167 3005 858 -193 671 2549
1456 2549 2458 1893 1795 2005 815 -536 375 2834 3420 528 -2469 -2269 247 1413 251 -561 -343 -62
1474 -62 -1137 -1457 -22 1725 823 -1842 -3135 -1587 -35 -806 -1921 -1463 -308 -385 -1597 -1370 547
1491 547 1517 255 -1262 -1400 -838 -888 -841 773 1797 936 -1342 -1523 987 2713 1222 -1112 -950 738
1509 738 851 -728 -1074 682 2063 889 -899 -1218 153 1052 338 -599 -921 -1009 -1050 -415 452 280 -980
1528 -980 -1394 -288 1011 542 -808 -1016 -271 118 -911 -1629 -1112 169 640 63 -544 -880 -642 -107
1546 -107 955 1087 -595 -2288 -1503 1004 2286 606 -1683 -1267 1256 2276 744 -1323 -1401 318
1562 318 1918 1517 270 -674 -510 764 1956 1885 -138 -1440 -338 1963 2647 653 -961 -42 1787
1579 1787 1637 -178 -651 1086 2581 1727 -37 -305 646 1158 1401 1234 753 -482 -934 423 2445
1596 2445 1745 -692 -1614 739 2939 1533 -2134 -3250 -400 2245 1756 -670 -1845 -971 441 1318
1612 1318 1023 -164 -1649 -1721 326 1458 -82 -2611 -2250 1084 3129 293 -3302 -2943 1049 3348
1628 3348 816 -3014 -3433 -889 1006 543 -838 -1669 -1653 -698 197 -39 -1529 -2859 -1937 308 -144
1645 -144 -2839 -4487 -1944 2285 2649 -1265 -4695 -3684 -225 961 -1040 -3430 -3476 -1830 -74 146
1661 146 -899 -2274 -1974 254 1809 227 -2928 -3443 92 3506 2164 -2146 -3838 -286 3971 3677
1677 3677 177 -1992 -269 2668 3622 1632 -827 -939 843 3165 2873 328 -1677 -554 2878 4322
1693 4322 1708 -2367 -2939 542 3498 2054 -1695 -2636 312 3115 2227 -1068 -2190 -27 2579 2331
1709 2331 -777 -3031 -2215 906 2975 2401 -449 -2451 -1410 1712 3436 1088 -2010 -1619 2214 4183
1725 4183 1929 -1545 -950 3094 5419 2837 -1062 -1518 1659 4651 4364 1495 -891 -529 2302 4885
1741 4885 4451 1149 -1382 53 3538 4438 713 -2944 -2232 1391 3104 593 -2356 -2066 1221 3324
1757 3324 1632 -1662 -3048 -1124 1291 1021 -1653 -3919 -3106 496 2286 465 -2900 -3836 -835 2153
1773 2153 1537 -1951 -3939 -2013 1011 1882 -335 -2407 -1890 560 1913 719 -1824 -2765 -476 2412
1789 2412 2197 -1493 -4231 -2574 1980 3603 256 -4053 -4058 -113 2946 1605 -1884 -3841 -2780 -328
1805 -328 614 -537 -2780 -3187 -1395 754 -128 -3240 -4359 -1373 2211 1461 -2684 -5005 -1922 2827
1821 2827 3547 -239 -3813 -3107 284 2517 2089 -14 -1079 130 2603 3914 2749 382 439 3001
1837 3001 4683 2516 -1045 -1272 2539 5794 4231 -188 -1663 1610 5201 4983 1382 -1371 -407 2242
1853 2242 3533 1811 -1084 -2132 -414 2146 2216 -793 -3118 -1967 1334 2746 -331 -4090 -4146 -626
1869 -626 1798 13 -3661 -4490 -1908 1163 976 -1780 -3851 -2751 -2 1369 -606 -3565 -3973 -1235
1885 -1235 1990 1744 -1788 -3848 -2330 1208 2247 -294 -3056 -2683 -110 1242 -456 -3140 -3208 -861
1901 -861 1257 157 -2868 -4273 -2203 969 1476 -1648 -4650 -4281 -1214 1159 -267 -3539 -4783 -2760
1917 -2760 208 648 -2119 -4306 -3466 -125 1458 -587 -3489 -3525 -256 2559 1682 -1417 -3177 -1382
1933 -1382 1822 2627 353 -1951 -1387 1691 3821 2818 -26 -913 1589 4335 3853 799 -1187 196
1949 196 3245 3991 1800 -443 -172 2205 3716 2733 33 -883 1130 3708 3517 289 -2207 -825
1965 -825 2517 3721 1372 -1801 -2157 1088 3625 2942 -64 -1699 -437 2246 3084 1123 -925 -544
1981 -544 1726 3473 2135 -281 -623 1720 4212 3374 425 -1471 413 3597 4581 2081 -963 -912
1997 -912 1808 4216 3436 546 -1247 302 2966 3373 736 -1471 -915 1504 2668 902 -1692 -2412
2013 -2412 -57 2018 1291 -1607 -3232 -1761 908 1387 -1083 -3579 -3155 -427 1232 -443 -3395 -3969
2029 -3969 -1717 744 163 -2496 -4056 -2503 356 1368 -756 -3262 -3249 -611 1346 193 -2409 -3474
2045 -3474 -1789 735 1322 -798 -2897 -2646 77 2071 827 -2265 -3320 -790 2147 1680 -1477 -3408
2061 -3408 -1650 1403 2346 70 -2500 -2056 264 1937 1070 -1134 -2028 -690 1199 1254 -664 -2071
2077 -2071 -1019 1313 2055 351 -1921 -1619 960 2922 1888 -995 -2221 -347 2422 2887 484 -1779
2093 -1779 -1236 1466 3221 1956 -544 -1105 661 2636 2211 -190 -1461 -323 1874 2547 750 -1478
2109 -1478 -1215 1055 2929 1931 -817 -2041 -302 1957 2026 -97 -1958 -1375 938 1995 766 -1216
2125 -1216 -1977 -376 1309 1155 -1021 -2340 -1285 1160 1593 -451 -2600 -1753 886 1776 166 -2097
2141 -2097 -2289 -754 1049 1021 -332 -1895 -1825 81 1247 626 -1359 -1802 -365 1173 593 -1343 -1808
2158 -1808 120 1725 1207 -710 -1540 -548 1189 1679 762 -892 -1441 -177 1744 2024 332 -1490 -834
2175 -834 1570 2520 1083 -1378 -1109 1011 2209 939 -1016 -1469 -432 1122 1121 -48 -1116 -1063 35
2192 35 1050 629 -1096 -1687 -627 654 383 -1328 -2197 -1031 937 1038 -486 -1958 -1352 368 987
2209 987 63 -1036 -1458 -662 457 757 -73 -732 -433 540 1251 735 -571 -670 1004 2257 1274 -684
2227 -684 -1246 464 2202 2099 651 -485 -275 812 1479 1404 666 -399 -164 699 1409 488 -980 -752
2245 -752 939 1439 198 -1453 -1117 648 1518 240 -1055 -1171 57 549 200 -286 -580 -482 -44 415
2263 415 415 -398 -1099 -456 942 1126 -346 -1334 -253 1046 1023 -311 -860 100 941 815 92 -46 23 297
2283 297 344 367 187 -691 -1054 -93 1072 358 -1337 -2039 -711 375 -386 -1872 -2030 -723 -379 -1353 -2067
2302 -2067 -1738 -936 -1050 -1437 -1549 -1579 -1950 -1899 -1083 -453 -1005 -2236 -2151 -647 529 -459 -1783 -1612 -257
2321 -257 288 -546 -884 -123 722 368 -299 65 886 1140 726 628 915 821 607 746 1542 1731 961 -136
2341 -136 647 1840 1619 339 -63 551 1071 518 -170 -196 383 504 28 -121 12 97 -74 -260 180 -24
2361 -24 -624 -887 -173 698 641 46 -325 358 1056 785 234 172 875 908 696 628 1233 1539 1454 1299 1332 1685
2383 1685 1582 1513 1507 1533 1377 1257 1234 1565 1550 1042 724 812 1081 890 444 328 379 330 -3 -277 -203 -160 -298
2406 -298 -510 -471 -513 -758 -921 -946 -689 -953 -1320 -1418 -880 -407 -636 -1049 -971 -545 -298 -546 -721 -526 -215 -525
2428 -525 -882 -503 87 333 -61 -133 157 236 30 -110 117 427 6 -529 -400 231 244 -292 -583 -63 258
2449 258 -348 -1084 -902 -270 -174 -1063 -1362 -859 -579 -923 -1056 -630 -455 -987 -1588 -1163 -333 -349 -1320 -1522 -578
2470 -578 -1 -591 -1069 -501 596 845 12 -353 360 1011 596 427 816 1573 1237 817 1289 1881 1725 1057
2490 1057 1030 1843 2059 1201 791 1522 2319 2044 1066 804 1319 1568 763 192 569 705 369 -91 34 316
2510 316 44 -315 -174 428 41 -921 -1276 -280 270 -602 -1712 -1506 -537 -66 -649 -1106 -735 -130 -461 -841
2530 -841 -554 -242 -385 -769 -319 274 -26 -902 -737 219 752 -66 -1156 -689 -7 12 -805 -1345 -526 -11
2550 -11 -591 -1124 -1019 -723 -535 -942 -1091 -1059 -1246 -1442 -1113 -637 -719 -1678 -1968 -1192 -498 -845 -1629 -1683 -966
2571 -966 -423 -817 -1280 -1200 -761 -413 -591 -596 -576 -580 -347 75 339 70 -185 -146 771 1198 854 246 301 1262 1611
2594 1611 1175 462 628 998 1246 1082 743 603 832 1016 941 885 695 618 834 1097 750 164 101 466 874
2615 874 692 279 -106 211 838 755 393 64 61 239 460 378 38 -150 71 551 835 291 -27 -44 601 880
2637 880 559 128 48 542 867 762 259 155 651 1026 1152 496 201 228 845 967 881 361 -156 -174 320
2658 320 831 425 -134 -479 35 459 24 -437 -314 15 224 -349 -779 -700 -308 -6 -389 -544 -792 -739 -471
2679 -471 -393 -363 -526 -876 -741 -255 -222 -551 -953 -609 -200 -46 -764 -1119 -701 -80 281 -230 -696 -819 -443
2700 -443 -109 141 5 -587 -941 -331 185 17 -780 -903 -231 555 142 -536 -525 31 438 50 -343 -454
2720 -454 -48 138 24 101 -41 -140 -80 418 584 212 -519 -58 646 841 204 -672 -269 430 716 353 -8
2741 -8 88 201 433 552 383 206 49 220 588 400 -162 -179 423 1064 626 -194 -388 333 902 839 105 -159
2763 -159 188 482 462 302 53 -75 24 387 641 279 -395 -280 358 749 296 -364 -345 271 545 89 -495
2784 -495 -487 -153 254 -15 -199 -427 -451 -263 -91 -181 -478 -787 -491 -50 -34 -502 -735 -490 -20 143 -321 -791
2806 -791 -363 119 164 -274 -492 -499 42 189 137 -137 -457 -112 424 559 185 -236 -366 285 789 641 -32
2827 -32 -301 100 722 622 -92 -406 -122 271 404 167 -273 -26 93 297 59 -200 -394 -279 -128 -115 -349
2848 -349 -829 -684 -250 -15 -243 -519 -786 -592 38 84 -520 -851 -549 1 188 -318 -511 -501 187 520 -9
2869 -9 -345 -345 142 556 618 262 -111 19 526 900 493 9 5 369 847 631 227 125 332 666 653 215 -94
2892 -94 -3 409 453 196 -109 -182 106 340 379 -108 -443 -294 330 328 60 -312 -609 4 437 243 -153 -206 60
2915 60 324 387 221 -47 115 508 410 428 160 49 289 618 660 214 33 351 429 685 278 -125 -48 343
2937 343 607 79 -341 -392 -71 228 -21 -482 -670 -484 -192 -267 -369 -808 -1089 -662 -450 -244 -873 -1410 -1172
2958 -1172 -711 -536 -934 -1130 -949 -431 -329 -817 -1007 -745 -459 -224 -241 -448 -484 -323 52 356 205 15
2978 15 -69 209 429 482 156 125 323 727 424 110 184 571 793 676 319 160 31 379 489 400 154 -277
3000 -277 -240 178 503 134 -270 -498 0 374 -22 -456 -400 45 182 12 -210 -174 35 198 168 373 116
3021 116 76 226 543 617 362 8 274 949 863 483 208 452 857 832 644 462 566 609 526 443 333 313 419
3044 419 360 430 198 172 33 82 383 184 -285 -478 -91 240 150 -420 -616 -445 -106 -112 -465 -582 -415 -451 -524
3067 -524 -274 -321 -364 -464 -69 -16 -146 -424 -456 81 329 -24 -515 -328 120 379 6 -210 -102 87 238
3088 238 25 11 -2 -101 -157 16 274 74 -246 -52 130 159 -187 -514 -218 -15 -137 -618 -696 -302 -123 -311
3110 -311 -602 -601 -442 -394 -449 -327 -364 -635 -635 -472 -194 -286 -455 -528 -111 115 80 -102 -106 241 426 311 159 273
3134 273 488 483 660 606 703 580 604 701 986 815 503 299 667 922 673 399 238 530 685 555 175 466
3156 466 572 321 75 219 250 118 6 -103 205 -8 -135 -239 110 256 -64 -502 -391 180 190 -80 -278
3177 -278 -84 48 21 -166 -155 26 14 -202 -353 -114 -212 -129 -171 -11 86 -227 -367 -144 133 -85 -386 -589
3199 -589 -274 -112 -224 -442 -414 -181 -171 -345 -427 -410 -276 -465 -469 -413 -260 -275 -535 -506 -211 -208 -542 -469 -104 -17
3223 -17 -244 -455 -431 -97 124 -112 -187 -59 165 102 89 92 171 204 -2 39 272 223 54 -8 366 594 412 155
3247 155 125 604 579 201 -102 204 430 297 189 175 497 345 236 -62 37 223 -42 -47 176 329 34 -390
3269 -390 -140 186 342 -32 -276 -67 82 -18 -220 -115 276 45 -378 -343 56 263 25 -290 -100 196
3289 196 64 -150 32 324 240 -111 -163 101 458 147 -34 57 321 269 -4 -149 286 369 156 31 73 238
3311 238 68 -199 167 370 186 -159 -197 49 274 15 -284 31 339 203 -138 -209 282 68 -251 -231 -56
3332 -56 150 -173 -321 -121 255 -92 -376 -143 52 173 -216 -422 -107 125 -77 -455 -345 30 111 -401 -242
3353 -242 -21 126 -62 -491 -307 46 -13 -417 -218 86 48 -230 -361 -11 283 -289 -439 -165 95 -14 -241
3374 -241 -240 182 212 -22 -81 -36 304 69 -145 -8 214 161 -70 -86 102 449 20 -47 119 280 304 -63 -5
3397 -5 159 149 25 -20 139 191 -6 -3 220 387 308 81 48 196 316 235 107 306 256 199 28 200 276 278 94
3422 94 -3 42 250 127 103 -46 93 80 25 5 68 27 -142 -123 -8 1 -101 -67 -130 -101 -129 -40 -249 -285 -21 -115
3448 -115 -198 -228 -177 -216 -256 -350 -218 -188 -75 -130 -188 -164 -80 -145 -72 -30 11 -124 125 134 129 137 30 48 235 239 75 -5
3476 -5 86 226 178 -19 46 147 110 74 86 163 126 -64 16 15 111 -74 -26 -15 -125 -112 -302 -117 -76 -20 -149 -206 -271
3503 -271 -89 -169 -122 -222 -80 -126 -394 -237 -107 -22 -141 -117 -139 -64 -113 19 -88 91 -49 -125 -113 15 26 86
3527 86 -21 -34 83 107 -10 102 70 101 -9 -47 -5 158 92 68 166 193 189 104 71 228 145 -41 -55 39 63 162 65
3554 65 200 66 -25 23 122 207 154 141 66 140 12 137 149 140 235 115 20 216 254 167 301 168 125 191 224 177 221
3581 221 257 93 55 85 25 217 116 -25 40 50 -63 -114 35 -12 -50 -171 -177 -228 -256 -264 -267 -371 -270 -394 -278 -389
3607 -389 -202 -326 -265 -393 -484 -236 -364 -233 -441 -382 -330 -87 -320 -147 -193 -157 -133 -66 60 7 29 -20 112 169
3631 169 75 202 178 119 177 220 112 215 272 303 175 199 90 194 205 27 109 29 80 -33 -63 137 -6 -92 30
3656 30 72 166 57 -113 -65 18 7 -80 -45 -42 60 54 -81 -31 -2 86 169 72 -129 -118 0 75 96 -119 -26 -25 78 56
3684 56 135 57 43 -21 24 138 117 41 135 40 53 -63 25 118 -12 -15 -140 -39 -184 -46 -90 96 2 -115 -133 -65
3710 -65 -46 74 -13 -1 2 -147 -102 -44 50 -10 85 -17 9 -40 70 108 86 77 -39 43 -53 49 260 86 51 17 175
3737 175 118 -77 -8 -23 -8 70 95 1 102 -41 -44 -46 49 75 -128 -162 -36 -65 -197 -197 -176 -162 -257 -277 -279 -180 -68 -245
3765 -245 -198 -276 -197 -252 -339 18 -64 79 -51 -297 -175 -30 57 -168 -24 94 -35 -91 30 21 191 147 67 35
3789 35 195 194 76 172 304 247 270 199 196 153 155 143 89 369 160 220 59 194 178 132 110 59 84 63 203 52 106
3816 106 117 69 84 -8 143 2 -87 -44 -7 55 50 -3 57 148 57 -100 -16 108 -20 0 -88 18 19 59 -64 -44 -33
3843 -33 30 -174 -205 -121 -26 -193 -290 -186 56 -152 -263 -259 -86 -69 -101 -78 -63 -22 -61 -60 31 -153 -117 -36 -46 83 -45
3870 -45 -151 -59 -111 7 -33 -15 -25 57 -27 -17 -123 -213 -15 127 25 3 132 -109 139 118 118 125 -7 -56 39 111
3896 111 36 141 91 26 137 -86 176 -40 137 38 -59 30 -28 222 -63 39 104 154 56 18 38 -111 -23 23 -8
3921 -8 69 92 -79 -5 -57 -9 -50 -82 -142 21 -225 -45 -8 -30 10 -4 -23 16 -35 -62 -8 -24 22 4 1 -124 0 147
3949 147 166 24 -15 -22 52 53 76 83 69 -52 14 -17 170 9 146 130 227 103 28 52 92 131 82 24 197 209 91
3976 91 67 9 155 4 7 59 24 -71 16 -109 -21 30 40 21 -38 -68 70 -11 -97 -94 39 -55 -31 -342 -29 -63 -214
4003 -214 -109 -42 -109 -45 -111 -66 -151 -329 -229 -90 -8 -145 -163 -125 16 108 -56 -6 -41 -108 27 -151 -20 69 -13
4028 -13 11 51 -85 -5 200 -53 -13 48 -39 47 -175 31 62 -8 -22 -31 133 136 -44 -15 14 -1 142 20 -49 61
4054 61 203 235 67 131 117 147 170 71 184 246 -11 -160 66 350 195 12 96 282 169 136 120 122 175 60 -29
4079 -29 42 171 58 -16 17 105 69 -144 -187 -40 -34 -39 -155 -38 -2 37 -71 -198 -15 6 -103 -145 -134 -16 -87 -307
4105 -307 -138 -166 -46 -95 -156 -143 -35 -27 -121 -84 -105 85 -227 -86 119 47 -96 -92 112 98 138 -67 15 85 60 -9
4131 -9 -81 51 75 -35 29 90 83 182 92 -99 43 67 -73 -163 -105 140 -138 -235 -39 152 141 -220 2 -92 -32 43
4157 43 -144 -32 92 64 -19 -175 36 5 -86 15 -42 17 -13 -7 22 102 -18 -45 -18 155 182 110 -81 -28 48 -46
4183 -46 -27 3 44 144 11 -53 7 163 -3 17 102 -61 -31 11 -128 55 24 -166 204 46 219 -91 6 91
4207 91 218 30 62 1 -2 43 -31 -4 103 110 120 102 47 168 235 130 65 112 118 164 92 184 131 130 22 93 65 137 41
4236 41 22 110 23 50 -100 -18 -20 72 -82 -199 -18 -153 -43 -208 -230 -117 -31 -147 -228 -78 -191 -317 -328 -96
4260 -96 -12 -196 -226 -340 -140 -109 -207 -157 -132 4 -93 -180 -157 -56 -3 -33 -140 22 -55 -12 29 -16 82 -65 -9 36
4286 36 238 128 98 54 65 210 181 44 96 155 156 70 117 239 236 164 296 144 38 -6 147 16 81 -34 176
4311 176 35 55 38 87 20 140 107 -10 140 29 95 -29 73 25 69 24 161 -107 -55 -48 95 -25 -63 -66 42
4336 42 -28 -154 22 25 -45 -116 -134 -174 -79 -176 -27 -155 -85 10 10 -106 -76 -73 -118 -91 16 -2 -69 -166 -200 -73 -179 25
4364 25 -59 36 -1 57 19 -88 81 12 -94 72 49 -163 49 12 -15 20 55 -69 59 -37 -33 120 199 100 24 -11
4390 -11 -101 69 -26 31 -36 82 54 89 119 11 8 63 6 46 -3 76 47 -53 -27 -63 -62 -92 -65 -118 -84 63 37 -154
4418 -154 -6 -185 -41 -134 -103 -45 -38 27 23 1 -76 -31 -73 63 23 -72 -118 -76 8 54 63 95 54 -12 -40 -19 -17 -166 -29
4447 -29 2 148 -9 52 136 162 40 141 73 -78 101 212 119 129 76 87 60 137 72 0 181 -42 120 235 184
4472 184 101 14 106 57 -38 47 56 -2 1 39 22 150 -72 41 -3 -102 -111 -188 35 -15 46 -145 33 -82 -119 -49 -173
4499 -173 -26 -89 -48 -30 -14 -90 -80 -97 -24 -27 -86 30 -154 19 -91 -128 -70 36 -99 -37 -141 -66 -23 -91 33 -77
4525 -77 -21 86 -54 -23 -29 -156 36 -32 -21 10 -89 113 13 34 36 76 18 10 -32 3 35 79 20 -37 57 283 147 -50
4553 -50 57 37 39 80 56 22 86 90 152 49 37 31 62 131 110 8 56 -18 145 141 -40 16 1 113 -13 26 -79 -68
4581 -68 -210 -191 -22 -156 35 -82 -147 -74 -114 -126 -13 -84 -225 -43 -33 -91 -118 -164 -221 -17 -50 -10 -136 -84 39
4606 39 13 -33 -38 83 132 -22 23 118 151 30 113 48 11 69 100 116 237 57 -11 149 101 112 177 19 107 91 8
4633 8 -54 -52 38 121 69 17 -26 20 -36 83 91 1 -39 28 -220 0 45 -113 -57 -115 23 -103 -181 -143 -112 -107 -25 -11 -45
4662 -45 -99 -90 5 -76 78 -34 54 -8 -7 -77 62 -93 -87 12 -63 -176 -149 13 146 21 42 -11 -130 -85 31 -126
4688 -126 -51 -24 -11 32 34 125 70 114 117 61 -2 -88 46 117 9 -108 -33 41 135 156 22 184 163 225 333 196 108
4715 108 132 189 185 157 111 172 140 290 194 198 202 219 162 263 -27 151 77 7 114 131 68 14 54 10 -11 123 -66 -123
4743 -123 -10 -117 -85 -146 -101 -140 -9 -77 -171 -75 -224 -134 -129 -29 -210 -277 -165 -112 -44 -184 -48 -209 -80 -146 -38
4768 -38 -61 -69 -50 101 -114 -182 8 105 -17 -143 -10 -7 3 43 -45 -44 60 -94 115 32 -25 -70 -135 -2 -39 30 33
4795 33 10 -104 -22 64 -99 -74 -117 -92 74 -38 95 -81 -72 -85 54 22 74 -61 -69 89 116 -45 -163 54 -39
4820 -39 -52 29 20 -46 40 81 190 45 27 39 22 79 54 120 51 -41 -68 38 -5 29 71 41 106 -84 -60 115 66 4
4848 4 -112 -60 -2 4 38 -13 187 -6 45 -174 1 27 -17 38 32 91 0 -48 -124 14 138 132 61 90 123 15 171 -68
4876 -68 15 178 158 107 166 67 78 23 3 53 79 165 32 -36 19 123 -73 27 179 77 61 -108 -64 4 -16 -34
4902 -34 -48 -120 -134 -167 70 -15 -47 -141 -84 -90 -113 -84 -265 -80 -128 -72 -143 -56 -110 45 -21 -64 27 -93 -29 -67 -17 -61
4930 -61 1 -71 10 64 129 -29 -22 -11 -5 69 -152 -7 9 168 117 7 114 55 125 -11 101 81 139 147 24 128 46
4957 46 122 -62 127 141 45 68 -4 99 59 -61 100 72 38 112 -82 213 -8 41 12 29 -6 -52 -174 81 37
4982 37 63 105 -125 -37 14 41 -64 -98 25 89 67 -154 -120 23 -181 -98 -106 44 -90 -86 -139 -162 71 -169 -29 -134
5008 -134 -103 60 -53 -94 -65 1 -81 -66 -84 120 -61 30 -51 35 -63 16 -71 54 56 -176 8 -53 -3 79 75 -7 -5 74
5036 74 28 -30 65 110 218 -24 -22 -75 90 157 35 28 3 52 103 159 137 40 -102 20 -19 23 19 127 156 -8 -65 -18
5064 -18 -22 79 -45 -85 122 40 -66 -25 -46 74 101 -141 -27 21 43 -122 -118 -43 -35 -38 -54 -132 -66 -144 32 -17 -51 28
5092 28 -10 15 -27 -31 -33 -6 -63 -64 126 -38 -58 49 20 104 -26 -183 150 142 -2 119 71 28 24 46 50 156 77 170 -67
5121 -67 43 58 60 -144 -12 152 6 -13 110 62 44 34 -84 -16 -25 -4 37 -87 -60 -24 27 -65 -65 -36 -22 -14 -62 33
5149 33 -143 67 3 -143 -9 -139 -76 -51 -42 -48 -62 -10 -125 -82 -65 -40 -53 -99 96 -50 -8 -12 -12 -63 48 82 35 -41
5177 -41 34 6 -61 79 -38 48 -58 15 -9 33 -69 -151 -55 3 61 15 -78 6 -149 12 89 62 18 -12 18 -52 -77
5204 -77 53 116 53 17 5 54 68 52 126 131 120 22 129 132 58 80 50 101 20 80 54 25 -22 -25 79 23 99 12 -38 -3
5234 -3 7 -75 -107 -14 45 -210 84 121 -50 46 26 -62 -57 -87 -66 -109 -113 -3 -80 -77 -96 -60 47 6 -161 -22 -4 -51 41
5263 41 -29 3 12 38 24 -27 30 -10 -22 39 -37 31 23 91 157 46 70 3 75 92 91 68 61 -32 -31 -77 132 -6 112 14 -3
5294 -3 105 -126 80 84 -73 -137 -46 -72 -113 84 65 -137 -53 -63 23 -89 -44 -94 4 -12 -39 25 -110 21 116 -97
5320 -97 -51 -18 -1 -45 -73 -35 -43 10 72 20 -58 37 -35 172 168 -51 -101 -46 128 39 66 -47 115 66 60 64 -24 16 93 27
5350 27 36 -3 -29 2 136 113 45 34 83 127 100 114 118 149 64 206 170 -17 161 165 147 113 60 80 110 65 181 -7 31
5379 31 91 105 87 188 33 -12 26 -62 -30 -41 28 3 42 -133 -12 -95 -61 -32 -107 -113 -62 -145 -35 30 -102 -130 -179 -190
5407 -190 -73 -49 -155 -77 -29 -159 -123 -24 -70 -164 -79 -44 -75 -90 -17 -96 -31 80 -67 -51 23 13 4 132 -35 -148
5433 -148 -163 -146 34 95 -210 74 70 -14 3 25 -7 -44 -31 -108 23 19 25 22 -63 87 -15 -39 59 25 10 17 8 52 -61
5462 -61 -10 -9 -35 12 -34 60 94 28 -11 -63 -6 12 49 113 2 31 47 13 -48 42 27 6 -11 71 -21 100 -27 -14 -44
5491 -44 -12 -2 -136 42 -46 -83 -99 -63 -149 -128 118 -47 -96 -2 13 -13 74 -20 -60 -103 57 55 36 14 10 -48 62 174
5519 174 -2 0 37 123 31 7 130 69 40 70 78 5 20 224 36 64 109 22 104 28 -26 38 -86 7 -9 98 77 -26
5547 -26 27 -167 22 -39 -125 -30 62 41 36 -85 11 -55 -33 110 -86 -163 -175 -65 20 -55 -28 -70 36 -26 -64 18 -66
5574 -66 109 -97 -64 -111 -125 -102 35 -56 -195 -64 -78 -42 -18 45 78 -35 -112 -84 -32 41 17 90 46 44 32 -58 47
5601 47 -73 40 118 -57 18 34 12 115 44 109 -80 -44 71 -27 -21 -22 55 46 7 122 92 -37 -95 13 85 -14 7
5628 7 -7 51 -136 -81 -6 -2 57 -98 58 -210 -64 -17 15 20 -22 -55 -38 -2 -116 -133 -154 -59 89 12 -50 -24 -18 -23 -64
5657 -64 -45 -152 -17 -47 -74 -102 159 -45 -153 -161 -69 85 28 -28 -136 127 124 88 68 -36 30 32 99 12 -56 37 16
5684 16 -19 63 -110 -86 121 136 -2 81 139 -13 -2 22 62 -15 57 47 16 -60 99 117 -4 98 19 91 40 -107
5710 -107 77 -74 -69 44 44 13 171 15 41 -107 37 -35 61 6 -32 21 21 -78 13 75 -120 -3 83 -15 -94 -116 -57
5737 -57 -51 -33 19 19 -72 -69 -75 -106 -42 -94 126 -13 27 -112 -146 -51 -51 -67 -83 24 -72 -95 -4 -105 -22 15 -3 9 40 22
5767 22 -37 82 182 -28 60 27 104 95 95 106 -26 -73 -22 57 17 -78 23 -121 75 116 43 80 31 15 -26 -85 -74 -99
5795 -99 -36 -143 -3 60 32 -23 -16 19 1 -61 -191 -10 -122 -33 -25 -82 -100 18 103 -30 -20 -89 51 -59 35 -89
5821 -89 -97 -18 6 -90 -120 0 32 -70 -99 44 -103 66 -92 -24 93 -11 -67 -36 -56 14 -103 -135 10 104 -37
5846 -37 73 -81 -23 52 13 -27 -23 26 112 91 9 38 71 -68 143 2 90 -21 97 46 73 109 48 119 45 100 -30
5873 -30 105 54 -68 -181 59 101 64 -69 30 -45 15 70 -167 -157 -22 -5 -82 6 18 -41 -16 -163 -34 -29 -90 -39
5899 -39 74 -2 -9 -100 32 64 -27 -52 -137 88 -54 16 4 -49 -53 26 -62 95 -16 -15 69 23 -46 -49 62 -112 75 127
5927 127 77 -53 -117 -69 -49 39 80 56 62 106 30 -43 37 -28 -42 -81 57 91 70 115 -25 -14 4 -49 -43 -10 119 16
5955 16 -101 79 11 84 -34 2 30 -68 -50 -157 27 61 -1 58 141 25 -60 44 -106 51 49 -28 79 -1 15 56
5981 56 9 -45 -144 -169 -24 -67 -35 55 104 -50 -5 -74 -131 28 -78 5 80 -80 -49 5 -32 -76 -111 -20 -27 -6 77 -43
6009 -43 138 6 46 36 3 -38 19 119 6 59 0 107 199 148 95 -9 44 69 -25 74 80 -4 -1 117 50 -45 -27 -37
6037 -37 13 182 37 40 4 53 18 -47 -165 94 -28 -105 28 21 27 -18 8 -9 -112 -120 -54 -59 119 -22 -166 -54 -51 -8
6065 -8 5 -18 -42 -20 59 -126 -20 -184 -33 -103 36 -2 -25 -30 -121 140 13 -85 115 17 -78 -10 47 6 -146 -73 -6
6092 -6 3 -16 -1 74 83 -7 26 -137 51 25 32 71 53 59 -25 41 60 118 -108 -115 -29 48 7 120 -6 -80 84 112 135 -42
6122 -42 -29 50 69 62 -35 -4 -72 -96 83 -4 16 -112 -53 52 -84 60 -124 58 -48 -35 -75 13 -240 99 -5
6147 -5 -67 -21 -107 -57 70 43 -29 -240 -72 -92 56 -59 -25 -118 2 -50 -47 14 -81 17 36 162 -38 -10 45 88 13
6174 13 37 -67 87 43 -46 65 -8 96 22 27 49 29 -17 -29 45 129 53 8 -9 -33 56 58 44 -25 109 -9 28 39
6202 39 -20 -12 0 146 99 30 -114 -53 93 -125 9 -43 61 20 -59 -69 -124 17 -34 -35 -46 -47 127 -10 -31 -79 18
6229 18 -25 -33 38 -144 -52 -76 -141 -39 -60 -48 15 -1 -42 -54 -11 -86 -81 46 -67 50 -42 15 -23 20 -90 8 47 1
6257 1 -12 -80 -122 14 60 -51 -69 95 21 153 -119 -14 2 -116 -30 -69 33 35 76 -77 3 -125 -31 95 -52
6282 -52 -90 129 -31 60 -40 -47 96 62 6 -99 -32 -31 69 -42 70 -4 -66 -60 -98 -82 -147 -2 -62 -102 -6 90 -50
6309 -50 75 -37 -112 -102 -82 69 -17 -11 -91 -65 24 74 -108 27 -10 70 47 119 -7 14 -32 10 11 -133 32 28 11 -39
6337 -39 143 23 103 99 2 48 45 111 39 177 92 10 83 7 69 109 65 -27 26 44 -37 122 100 -97 107 109 21 124
6365 124 25 198 41 1 96 -7 74 116 7 71 62 22 7 8 -121 108 51 -48 -18 128 132 91 -88 -90 -30 21 62 113
6393 113 9 -14 -8 56 -129 30 94 4 -95 -88 110 10 -31 -137 37 -20 -48 -178 91 46 101 116 104 54 6 95
6419 95 -30 -31 32 -17 -17 -8 74 35 28 -58 -7 50 16 94 175 128 -58 97 34 41 -51 45 -52 -88 -154 37 -72 7 27 27 -178
6450 -178 -147 75 -4 -41 93 -39 39 -157 -35 54 -85 -16 21 -86 -112 -128 -65 -84 -69 -71 -142 10 -40 18 -6 4
6476 4 -31 -107 79 1 -29 65 48 59 -54 33 -58 68 -112 134 -37 34 67 -5 -129 97 -49 55 53 -85 -37 -18
6502 -18 60 -32 37 -5 36 71 0 49 61 4 74 -35 18 1 39 -58 1 14 19 56 10 -9 60 -43 43 57 -45 79 66
6531 66 39 28 -18 58 51 -63 50 -41 -27 -47 31 13 91 -104 -54 -146 49 -27 -100 2 -32 -17 -52 -34 -157 -33 66
6558 66 19 -94 -38 -50 -100 -19 -133 -42 -10 -65 -28 -96 62 -77 -61 45 1 51 26 -45 118 83 3 -61 -31 21 -26
6585 -26 90 147 -6 -83 -79 9 49 -48 -16 6 61 31 -61 -106 -33 137 -175 177 12 108 75 115 -115 198 136 135 -63
6612 -63 60 94 99 -58 -11 114 -118 44 60 107 19 50 -76 6 -11 28 40 121 -48 4 -21 -112 -78 54 -151 169
6638 169 67 -59 -117 -41 80 -95 78 -106 14 -117 -79 -54 34 26 70 14 -87 -85 78 196 -3 -27 0 -123
6662 -123 -19 -52 -35 36 15 14 -60 82 41 -74 -29 -16 -10 6 -81 -65 -71 147 91 84 34 176 -67 2 54 34 120 -21
6690 -21 -6 28 16 95 14 -18 -74 54 8 51 -8 20 47 47 -5 37 4 27 -68 25 -43 42 -6 31 0 -76 -67 -130 106 -54
6720 -54 -19 -75 0 -41 29 97 -76 98 -89 58 -25 -1 18 -27 17 49 96 -29 49 -78 33 39 -68 7 61 -26 3
6747 3 -5 73 96 38 30 89 -38 5 -7 116 81 12 -2 28 -48 26 -47 -51 -21 -71 65 -4 22 -124 -91 149 -9 -2 -58 -130
6777 -130 88 95 32 41 43 80 38 -93 95 -10 -63 -5 56 -7 -183 2 50 -129 138 55 -29 -94 -39 47 -8 -149 -38
6804 -38 -36 -89 -42 -28 -86 -78 -55 68 -8 -90 -37 -40 38 -67 44 -18 41 43 42 21 -30 -76 -53 9 -3 10 -74 75 61 11 69
6835 69 -24 3 2 69 -87 62 -175 -3 -68 35 29 -41 51 1 40 -24 59 -26 -32 152 -22 -97 20 48 -49 -21 -53 15
6863 15 90 37 38 8 107 -121 -120 -42 9 67 2 -8 16 13 -80 -170 -62 115 9 -144 -165 -91 -78 -81 -53 -105 -115 -91 -86 5
6893 5 -43 -53 -19 -4 127 -113 -150 -80 13 94 -84 -81 -79 -30 -108 29 -75 53 -211 -51 3 79 9 65 24 87 41 5
6921 5 -47 -130 -86 47 37 -24 92 36 136 -106 -85 -80 -31 1 24 -41 -18 86 -20 -23 -74 53 1 -75 -94 12 -52 -118
6949 -118 -55 -73 0 -16 3 -49 43 44 27 -54 -20 -6 11 -60 -118 -130 -11 43 150 -20 17 -61 -61 -50 -9 -12 -48 -66 -17 -26
6979 -26 -73 5 75 -14 -83 39 -70 25 28 -40 10 -18 42 -101 64 113 46 27 -22 49 -4 133 -2 97 -39 152 -68
7006 -68 139 2 -12 140 -51 243 -49 17 -88 88 72 -21 -38 -5 -2 71 13 -70 92 118 -50 54 57 18 16 49
7032 49 -37 -12 -120 47 109 -5 79 19 -125 36 6 -34 24 -46 -195 86 -104 -39 -13 63 24 48 30 -37 -86 -42
7058 -42 132 30 -94 50 -113 -67 72 -17 -66 38 -14 36 2 -15 56 -140 -24 4 -50 -10 -38 2 93 -63 -6
7083 -6 -70 -57 49 94 19 17 -21 -12 -36 80 32 103 17 51 -140 36 -14 50 17 -52 16 21 -85 -49 6 -77 38 68 152
7112 152 30 4 -57 -16 -63 46 -29 131 75 -10 -85 20 -12 46 4 -120 -157 -68 -72 117 -44 -105 31 -128 -84 -31
7138 -31 44 33 37 -100 -44 9 -66 42 -27 26 8 -70 -53 34 97 141 37 -17 17 -70 15 -105 78 110 11 80 -17 -10 55
7167 55 108 -23 9 18 83 -9 -79 -18 126 116 3 63 -35 119 19 -33 -66 -35 -65 33 -65 52 -13 15 66 19 74 -79
7195 -79 7 -3 -14 -162 -61 12 -138 -125 -99 51 6 32 -5 -46 -101 -8 51 -43 54 -45 -29 -88 -141 12 -133 114 -77
7222 -77 -75 33 -43 66 51 -62 -10 38 55 -160 -11 -65 82 35 -37 -45 97 74 -4 -51 103 -66 -16 26 -35 -146
7248 -146 -18 -47 15 113 40 -43 -44 30 -67 -5 54 104 -81 89 9 -67 4 52 -36 -22 -115 -22 -33 139 -17 -19 -48 -49 81
7277 81 44 -9 -17 80 54 118 -104 -62 45 71 154 -110 34 72 33 15 34 -23 -22 -121 -58 -4 93 11 -63 70 3 -24 14
7306 14 60 -127 2 -90 -41 -21 -71 16 32 56 -97 -76 20 1 -55 9 85 -14 -14 139 102 25 19 97 42 49 -56 86 8
7335 8 17 28 59 48 51 105 24 -18 7 -82 94 48 119 -30 71 110 -54 -15 -121 73 -55 4 -88 98 1 27 128
7362 128 34 12 93 16 3 -43 15 -46 78 -41 20 -148 -84 92 57 127 -121 39 103 17 -24 -108 -25 15 102 -54
7388 -54 -10 -41 -143 -43 84 22 -23 38 42 -67 -94 72 -3 -33 -67 -25 -12 -2 10 127 -43 -30 72 13 -46 -30 96
7415 96 78 50 -25 -24 -21 24 64 98 50 70 -17 -7 85 -7 85 104 13 19 -19 -83 -58 -64 -74 -4 -113 153 -17 -18 -26 8 95 1
7447 1 -89 -20 96 15 -100 -30 -140 -35 80 3 21 11 -45 -27 -35 -49 -75 49 -75 30 -16 -60 -37 0 -26 -86 27
7474 27 -18 43 -107 -38 -98 103 -24 33 110 18 -21 -63 -90 -63 -84 -20 22 -42 23 -42 21 -10 80 -29 -67 41 -93
7501 -93 -15 -42 23 -2 64 -29 62 23 -134 77 42 -18 -125 25 17 28 -127 -8 102 24 -40 -129 27 -6 11 -39 116
7528 116 -181 106 81 -3 -66 -49 105 -123 36 -5 61 31 -24 1 27 -8 -33 -23 -95 -135 40 -77 127 53 55 38
7554 38 -82 -95 -136 19 -44 -30 4 -96 36 0 -171 -89 13 -59 -4 4 -56 83 2 -32 79 68 -4 -33 204 -58
7580 -58 -47 -6 -138 1 -52 -36 -41 -84 -90 -67 6 -61 48 104 -24 -83 -129 50 31 -43 118 -37 -86 0 -105 -9 20
7607 20 -41 -73 38 -59 -18 -7 -19 -210 19 -16 -20 88 -6 92 -59 11 -89 1 50 -45 -68 24 -83 72 3 -63 106
7634 106 -107 -77 -117 -40 -4 149 -3 39 -58 -83 20 47 -162 -12 -17 119 138 61 -54 10 -133 -77 -82 -28 -76 53
7660 53 -5 85 42 94 29 25 78 -40 168 -7 72 -20 51 10 15 -23 -13 25 -30 53 -10 46 -2 15 2 -68 -50 3 -83 13
7690 13 -26 -149 73 -82 -53 -58 22 -58 -56 -20 -81 -83 3 -28 -28 -77 -10 -25 49 -140 20 130 -97 66 71 32 -30 -86 1
7719 1 -14 115 -79 46 -24 52 -25 -6 -41 137 -96 41 -107 -1 150 29 64 21 -110 -15 1 -158 -39 -45 38
7744 38 138 -113 -88 60 -53 -51 26 12 -76 -39 49 -12 -9 34 59 94 62 -9 -54 36 15 59 -43 -84 -46 146 -66 75
7772 75 -24 -34 -31 27 -98 -62 67 -36 4 -101 -50 -10 51 -1 -104 36 -5 28 138 -7 -72 9 34 -132 -28 -43
7798 -43 -37 -46 -72 71 54 60 9 25 -91 72 -45 77 -42 -126 13 -107 29 51 25 65 44 -55 131 72 60 -98
7824 -98 -5 5 6 -26 52 49 83 2 70 -89 -110 22 8 82 69 106 26 75 -51 16 -20 8 -38 -16 -39 133 13 46 -11
7853 -11 -74 9 -44 -93 -74 33 6 -82 14 -1 18 -61 -79 96 65 -13 1 -105 -28 21 -88 -60 -30 -31 -94 125 93 -9
7881 -9 -38 -10 44 -7 -18 20 37 81 -134 -3 -131 -23 -33 -30 -25 -2 63 74 -119 140 108 7 78 6 -56 -147 -6 39
7909 39 -36 -44 -101 -31 47 31 -201 -2 -117 -53 158 -122 -134 103 -85 -72 6 -15 -149 -90 -60 11 28 -31 115 -101
7935 -101 44 -72 -51 -1 79 28 -58 -20 23 -72 10 -86 -14 -142 -62 43 -25 -108 6 -102 77 -71 -72 -49 78 -78
7961 -78 -65 -93 44 -31 -46 30 54 -10 -10 37 -149 -9 0 -23 -60 -39 -5 -69 -9 25 48 -42 -19 -24 -19 85 -130 -48 -16 -7
7991 -7 22 -61 75 -43 14 27 -104 35 -72 62 42 16 -64 1 101 -34 -18 -62 28 64 -90 -74 78 -102 -36
8016 -36 39 -32 -8 -27 -32 43 118 107 -24 -3 -74 -2 -38 -7 83 83 118 17 22 -109 4 22 -1 -50 102 2 -60 -102 -11
8045 -11 39 -33 12 64 -64 -22 -99 -41 49 56 -33 -74 -20 6 33 -93 -33 -98 -37 -83 -46 -18 -125 63 113 54 -81 -25
8073 -25 82 -42 1 -48 119 -17 13 74 -77 -161 9 33 -131 29 -14 54 -91 2 -76 -43 -26 -56 -74 -48 -1 33
8099 33 77 -85 28 -5 35 -91 -76 -186 -93 -94 -42 -33 37 1 -51 -84 -19 -91 99 136 -7 -73 10 42 -36 65 -80
8126 -80 -79 9 30 -109 70 -33 -18 22 36 -16 -94 64 -29 90 19 36 51 -84 -37 -31 -27 8 112 53 129 -4 -33 -87
8154 -87 -59 -12 -39 17 -8 -11 8 46 -43 45 -18 -65 -41 -38 -131 39 2 98 37 29 -11 9 90 -56 47 118 95 -7 19 117
8184 117 33 73 -49 7 34 4 162
8191A62
##END NTUPLES=NMR FID
##END=
