##TITLE=1H_IAMT-120
 CDCl3, 32 sc, 
 6.3.2019
##JCAMPDX= 6.0         $$ Bruker NMR JCAMP-DX V2.0
##DATA TYPE= NMR FID
##DATA CLASS= NTUPLES
##ORIGIN= UXNMR, Bruker Analytische Messtechnik GmbH
##OWNER= root
$$ XWIN-NMR		Version 3.5
$$ Wed Mar  6 14:42:30 2019 Russian Standard Time (UT+4h)  she@DPX200
##.OBSERVE FREQUENCY= 200.1316
##.OBSERVE NUCLEUS= ^1H
##.DELAY= (6, 6)
##.ACQUISITION MODE= SIMULTANEOUS
##.ACQUISITION SCHEME= undefined
##.AVERAGES= 32
##.DIGITISER RES= 18
##SPECTROMETER/DATA SYSTEM= spect
##.PULSE SEQUENCE= zg30
##.SOLVENT NAME= THF
##.SHIFT REFERENCE= (INTERNAL, THF, 0, 15.7039)
##AUDIT TRAIL= $$ (NUMBER, WHEN, WHO, WHERE, WHAT)
$$ ##TITLE= Audit trail, XWIN-NMR		Version 3.5
$$ ##JCAMPDX= 5.01
$$ ##ORIGIN= Bruker BioSpin GmbH
$$ ##OWNER= she
$$ F:/spectra/data/she/nmr/H-F/1/audita.txt
$$ ##AUDIT TRAIL=  $$ (NUMBER, WHEN, WHO, WHERE, WHAT)
(   1,<2019-03-06 14:41:43.84 +0400>,<she>,<DPX200>,
      <continue with go, POWCHK disabled, PULCHK disabled
       configuration hash MD5:
       00 E9 B6 7A A2 85 ED C7 34 08 36 98 17 FE 4E 26
       data hash MD5: 16K
       8D 30 1F 34 64 37 DF 80 21 F2 C6 08 36 13 EC F4>)
$$ ##END=
$$ 
$$ hash MD5
$$ 42 29 44 14 CA 3E 0F F4 9F DC DB C0 FE 48 6C 8D
##$RELAX= 
##$RELAX= 
##$RELAX= 
##$RELAX= 
##$RELAX= 
##$RELAX= 
$$ Bruker specific parameters
$$ --------------------------
##$DU= <F:/spectra>
##$EXPNO= 1
##$NAME= <H-F>
##$PROCNO= 1
##$TYPE= <nmr>
##$USER= <she>
##$AMP= (0..31)
100 100 100 100 100 100 100 100 100 100 100 100 100 100 100 100 100 100 
100 100 100 100 100 100 100 100 100 100 100 100 100 100 
##$AQSEQ= 0
##$AQ_mod= 1
##$AUNM= <au_zg>
##$AUTOPOS= <>
##$BF1= 200.13
##$BF2= 200.13
##$BF3= 200.13
##$BF4= 200.13
##$BF5= 200.13
##$BF6= 200.13
##$BF7= 200.13
##$BF8= 200.13
##$BYTORDA= 1
##$CFDGTYP= 0
##$CFRGTYP= 5
##$CHEMSTR= <none>
##$CNST= (0..31)
1 1 145 1 1 1 1 1 1 1 1 1 1 1 1 1 1 1 1 1 1 1 1 1 1 1 1 1 1 1 1 1 
##$CPDPRG= <>
##$CPDPRG1= <>
##$CPDPRG2= <>
##$CPDPRG3= <>
##$CPDPRG4= <mlev>
##$CPDPRG5= <mlev>
##$CPDPRG6= <mlev>
##$CPDPRG7= <mlev>
##$CPDPRG8= <mlev>
##$CPDPRGB= <>
##$CPDPRGT= <>
##$D= (0..31)
0 1.2 0 0 0 0 0 0 0 0 0 0.03 0 0 0 0 0 0 0 0 0 0 0 0 0 0 0 0 0 0 0 0 
##$DATE= 1551868757
##$DBL= (0..7)
120 120 120 120 120 120 120 120 
##$DBP= (0..7)
150 150 150 150 150 150 150 150 
##$DBP07= 0
##$DBPNAM0= <>
##$DBPNAM1= <>
##$DBPNAM2= <>
##$DBPNAM3= <>
##$DBPNAM4= <>
##$DBPNAM5= <>
##$DBPNAM6= <>
##$DBPNAM7= <>
##$DBPOAL= (0..7)
0.5 0.5 0.5 0.5 0.5 0.5 0.5 0.5 
##$DBPOFFS= (0..7)
0 0 0 0 0 0 0 0 
##$DE= 6
##$DECBNUC= <off>
##$DECIM= 24
##$DECNUC= <off>
##$DECSTAT= 4
##$DIGMOD= 1
##$DIGTYP= 9
##$DL= (0..7)
0 120 120 120 120 120 120 120 
##$DP= (0..7)
150 150 150 150 150 150 150 150 
##$DP07= 0
##$DPNAME0= <>
##$DPNAME1= <>
##$DPNAME2= <>
##$DPNAME3= <>
##$DPNAME4= <>
##$DPNAME5= <>
##$DPNAME6= <>
##$DPNAME7= <>
##$DPOAL= (0..7)
0.5 0.5 0.5 0.5 0.5 0.5 0.5 0.5 
##$DPOFFS= (0..7)
0 0 0 0 0 0 0 0 
##$DQDMODE= 0
##$DR= 18
##$DS= 0
##$DSLIST= <SSSSSSSSSSSSSSS>
##$DSPFIRM= 0
$$ [...]
##$SUBNAM2= <"">
##$SUBNAM3= <"">
##$SUBNAM4= <"">
##$SUBNAM5= <"">
##$SUBNAM6= <"">
##$SUBNAM7= <"">
##$SUBNAM8= <"">
##$SUBNAM9= <"">
##$SW= 24.9336934301222
##$SWIBOX= (0..15)
0 0 2 0 0 0 0 0 0 0 0 0 0 0 0 0 
##$SW_h= 4990.01996007984
##$TD= 16384
##$TD0= 1
##$TE= 0
##$TE2= 300
##$TE3= 300
##$TEG= 300
##$TL= (0..7)
0 120 120 120 120 120 120 120 
##$TP= (0..7)
150 150 150 150 150 150 150 150 
##$TP07= 0
##$TPNAME0= <>
##$TPNAME1= <>
##$TPNAME2= <>
##$TPNAME3= <>
##$TPNAME4= <>
##$TPNAME5= <>
##$TPNAME6= <>
##$TPNAME7= <>
##$TPOAL= (0..7)
0.5 0.5 0.5 0.5 0.5 0.5 0.5 0.5 
##$TPOFFS= (0..7)
0 0 0 0 0 0 0 0 
##$TUNHIN= 0
##$TUNHOUT= 0
##$TUNXOUT= 0
##$USERA1= <user>
##$USERA2= <user>
##$USERA3= <user>
##$USERA4= <user>
##$USERA5= <user>
##$V9= 5
##$VALIST= <valist>
##$VCLIST= <CCCCCCCCCCCCCCC>
##$VD= 0
##$VDLIST= <DDDDDDDDDDDDDDD>
##$VPLIST= <PPPPPPPPPPPPPPP>
##$VTLIST= <TTTTTTTTTTTTTTT>
##$WBST= 1024
##$WBSW= 4
##$XGAIN= (0..3)
0 0 0 0 
##$XL= 0
##$YL= 0
##$YMAX_a= 729257
##$YMIN_a= -1338989
##$ZGOPTNS= <>
##$ZL1= 120
##$ZL2= 120
##$ZL3= 120
##$ZL4= 120
##$ABSF1= 10
##$ABSF2= 0
##$ABSG= 5
##$ABSL= 3
##$ALPHA= 0
##$AQORDER= 0
##$ASSFAC= 0
##$ASSFACI= 0
##$ASSFACX= 0
##$ASSWID= 0
##$AUNMP= <proc_1d>
##$AZFE= 0.1
##$AZFW= 0.1
##$BCFW= 1
##$BC_mod= 2
##$BYTORDP= 1
##$COROFFS= 0
##$CY= 11.3945322036743
##$DATMOD= 1
##$DC= 2
##$DFILT= <>
##$DTYPP= 0
##$F1P= 18.9103706918063
##$F2P= -1.10871071338519
##$FCOR= 0.5
##$FTSIZE= 0
##$FT_mod= 4
##$GAMMA= 1
##$GB= 0.15
##$INTBC= 1
##$INTSCL= 1
##$ISEN= 128
##$LB= 0.24
##$LEV0= 0
##$LPBIN= 0
##$MAXI= 10000
##$MC2= 0
##$MEAN= 0
##$ME_mod= 0
##$MI= 1.114404
##$NCOEF= 0
##$NC_proc= 0
##$NLEV= 6
##$NOISF1= 3.799351
##$NOISF2= 2.8
##$NSP= 1
##$NTH_PI= 0
##$NZP= 0
##$OFFSET= 15.70392
##$PC= 1
##$PHC0= -8852.612
##$PHC1= 0.4001408
##$PH_mod= 1
##$PKNL= yes
##$PPARMOD= 0
##$PSCAL= 0
##$PSIGN= 0
##$REVERSE= no
##$SF= 200.130013532006
##$SI= 16384
##$SIGF1= 3
##$SIGF2= 2
##$SINO= 400
##$SIOLD= 16384
##$SREGLST= <1H.CDCl3>
##$SSB= 0
##$STSI= 0
##$STSR= 0
##$SW_p= 3612.71676300578
##$SYMM= 0
##$S_DEV= 0
##$TDeff= 0
##$TDoff= 0
##$TI= <>
##$TILT= no
##$TM1= 0
##$TM2= 0
##$TOPLEV= 0
##$USERP1= <user>
##$USERP2= <user>
##$USERP3= <user>
##$USERP4= <user>
##$USERP5= <user>
##$WDW= 1
##$XDIM= 8192
##$YMAX_p= 0
##$YMIN_p= 0
$$ End of Bruker specific parameters
$$ ---------------------------------
##NTUPLES= NMR FID
##VAR_NAME=  TIME,          FID/REAL,        FID/IMAG
##SYMBOL=    X,             R,               I
##VAR_TYPE=  INDEPENDENT,   DEPENDENT,       DEPENDENT
##VAR_FORM=  AFFN,          ASDF,            ASDF
##VAR_DIM=   8192,          8192,            8192
##UNITS=     SECONDS,       ARBITRARY UNITS, ARBITRARY UNITS
##FACTOR=    0.0002004,     1,               1
##FIRST=     0,             0,               0
##LAST=      1.6414764,     0,               0
##MIN=       0,             -1338989,        0
##MAX=       1.6414764,     729257,          0
$$ Real data points
##PAGE= N=1
##DATA TABLE= (X++(R..R)), XYDATA
0@%%%%L2l2L2o4O4r6J28j60J92k24K88l52M16n12O08p04Q33r76J136j315J519
25H13j744J991k269K581k922L296l708M161m662N215n816O475p200P991q861R818
41E159j0870J2039j3331J4761j6367J8170k0204K2532k5227K8378l2118L6656
53A9578m2296M9518n9166P2793r3660J30045k11624P20411j82484j261848M85490
64c73243O26620J00861m22817o6220K0562J10651J40039J67605k37050l29028
74b62020L9779M37425J38448k42264k31809n06q9015j15951J42013L59337O6058
85B41495k84323j87626J91164K12152m0789r5041O9860k153k21361j64406J54978
96a26050K63592O3206j49853j40252l383R7592P3159l9217j44055q1984J49853
$$ plain form
0 0 0 0 0 0 32 0 32 -32 32 -64 64 -96 96 -128 160 -192 224 -288 320 -384 449 -527 609 -706 813
25 813 -931 1060 -1209 1372 -1550 1746 -1962 2199 -2463 2752 -3064 3411 -3789 4202 -4659 5159
41 5159 -5711 6328 -7003 7758 -8609 9561 -10643 11889 -13338 15040 -17078 19578
53 19578 -22718 26800 -32366 40427 -53233 76812 -134812 585599 403115 -858733 -373243
64 -373243 253377 354238 -68579 -134799 -114237 -3586 136453 304058 67008 -262020
74 -262020 -222241 215184 353632 111368 -120441 -120947 -209962 -325913 -183900 175437 241495
85 241495 -42828 -230454 -39290 172862 132073 37032 106892 104739 -116622 -281028 -126050
96 -126050 137542 200748 50895 -89357 -92740 4852 78011 38794 -105261 -187245 -37392
107c7392K63081K1285l17186l05519L9522K84413J96621m3339j56007o5968Q6290
118c4199J15114j3359j28820n8334J03151R6402n8887r9450J9932R0904O2138
129I4592K6363n5721j49767m3027J84381J39062j71690k50464N0894K63366Q9566
140A77555j46195j26183m679L3185R0979J47345k8943k96966k05330J85848L07874
151A34490K2786j84525o1126R9383O4855L424K3695l9949j70768q8046J75616
162b0165K01115o6342j89230j1211J22599L4692m2778K1729L7841p6905j15502
173a04157K7661J24801K1378r2268m9127J6219m677J1524J03428P0478j10085
184A5175j55897M8867J98519N4009j58114j27616M5998J02007N0875J6573l8955
$$ plain form
107 -37392 225689 246974 -70212 -375731 -336209 -51796 144825 101486 -54521 -120489 -34199
118 -34199 80915 67556 -61264 -119598 -16447 79955 21068 -78382 -58450 32454 94592
129 94592 120955 65234 -84533 -127560 56821 195883 24193 -226271 -175377 87989 177555
140 177555 31360 -94823 -99502 -66317 24662 172007 143064 -153902 -359232 -173384 134490
151 134490 157276 -27249 -88375 11008 75863 79287 102982 63033 -107735 -195781 -20165
162 -20165 180950 114608 -74622 -85833 36766 71458 28680 50409 88250 11345 -104157
173 -104157 -76496 48305 69683 -22585 -71712 -55493 -60170 -48646 54782 125260 15175
184 15175 -140722 -91855 106664 160673 2559 -125057 -79059 22948 73823 90396 51441
195E1441j15336o1528J12101J55579o569j33660o8716N0228N1274j7148l9053
206b1387k2524j4266J7807O2349L9128l8272n8466o604L1321J4668j6200k0705
218c3151J653K3477J9975ol247J3214K1424j0254m8287l0893K0708L5403J3595
231B3611M360r013l2968j5183M1980M6608j7101n1951j7388J4513q64j6709K262
244b7843J2359r039o164M6957O2521j2839p9312m7273K6600M5489J3941j4256
256A1141j8686k0659p631M1619O4937K577p5637n2005L4506N4618N863k8160k3712
269a1229k0818q936L4605N0109j0326p5679l1505O3027O7871j1139m6271k0574
281b0865p939o930K3480M5526p2n8972l5917M0491O2247J3843k4721k3867j7844
$$ plain form
195 51441 -63895 -125423 -13322 142257 135688 2028 -66688 -16460 34814 17666 -21387
206 -21387 -43911 -58177 -40370 21979 61107 22835 -35631 -42235 -10914 3754 -12446 -33151
218 -33151 -31498 -8021 11954 11948 8701 21915 43339 33085 -15202 -46095 -25387 10016 23611
231 23611 27971 18958 -14010 -29193 12787 59395 42294 -9657 -27045 -12532 -13396 -30105 -27843
244 -27843 -15484 -24523 -30687 16270 78791 65952 -13360 -60633 -34033 11456 25397 11141
256 11141 -7545 -28204 -35835 5784 70721 73298 -2339 -54344 -19838 34780 40643 12483 -11229
269 -11229 -32047 -40983 -6378 43731 33405 -42274 -73779 -10752 57119 45980 -291 -20865
281 -20865 -28804 -35734 -12254 33272 33200 -25772 -61689 -21198 41049 54892 30171 6304 -11540
294a1540n243K4904K9523k0631o0534k3959M4079O3751J8051l5041m0261o191
306b3092K6930K7277k241l9991m6223k084M6084M3061k401l5044j2272L2421L6615
319D9040n345l4126k1823o48N471L872k326o002N479K2170J8125p593k3166p808
333d680J6749R814k0842k9563j327K3694K1784k055k4299k0230P791K9735K0998
346B7569n865k2387j5515J0267K4872N930k5565k7906J790K6007K0395l379j1837
359D376k473K573K209K213j082p311l479N22r653j3440Q544K5118O798k6562k4900
374c6547J6769M0809J6753k7747m2504j6365K4113M0313J3304l0073l3121Q610
386b5686M6901L3808j8051n4471l5969J7465N0045K6877k3632m1122j0865L3387
$$ plain form
294 -11540 -16783 8121 37644 17013 -43521 -67480 -23401 40350 58401 23360 -16901 -23092
306 -23092 3838 31115 28874 -11117 -57340 -59424 -13340 29721 27320 -7724 -19996 12425 49040
319 49040 43695 9569 -12254 -12902 -7431 -3559 -5885 -11887 -6408 15762 33887 26294 3128 -4680
333 -4680 12069 21883 1041 -28522 -29849 -6155 15629 13574 -10725 -30955 -23164 6571 27569
346 27569 21704 -683 -16198 -5931 18941 24871 -694 -28600 -26810 -803 19592 16213 4376
359 4376 1903 4476 6685 8898 7816 505 -2974 -2452 -12105 -25545 -17001 8117 14915 -11647 -36547
374 -36547 -19778 21031 37784 10037 -32467 -48832 -24719 15594 28898 -1175 -34296 -25686
386 -25686 21215 55023 36972 -17499 -53468 -36003 14042 40919 17287 -23835 -34700 -1313
398a313L8430p89l7593l4397K329L1926K0129j6032k8622n111K1286J9994K174
411A2411j0692p716L877R797N22j0483p768N737Q739l321q899K165J7693J3411
425B5473o480j8535j2903N455K1815J1436j7163k6529j779K2022J4568j2411k3078
438a8109p915J4234K2198R499j1039j7466k824J6928J0341j4318k0586J39J8890
451b8J4907m546j2269k313J2524J1881m784j6174j0809R959J9152L435k1368k2039
465b2472L019K5124K0069j0051k9147j3646J6938K5326M207k1703k4877p06K8188
478B69K7132l945k9313j9726J2334K4569N757j8765j9383L374K1142J9426J315
491B4186j2690j2663j256M349J064k386l158j232q42M94J377K898K663P91m190
$$ plain form
398 -1313 37117 36328 -1265 -35662 -33333 -1407 18722 2690 -25932 -31043 -9757 10237 12411
411 12411 1719 -5997 -2120 7677 8199 -2284 -10052 -4315 4424 1103 -7796 -5631 12062 25473
425 25473 18993 458 -12445 -6990 14825 26261 9098 -17431 -19210 2812 17380 4969 -18109
438 -18109 -26024 -11790 10408 19907 8868 -8598 -11422 5506 15847 1529 -19057 -18918 -28
451 -28 14879 10333 -1936 -4249 8275 20156 15372 -802 -11611 -1652 17500 20935 -433 -22472
465 -22472 -19453 5671 25740 15689 -13458 -27104 -10166 15160 19367 -2336 -27213 -27919 269
478 269 27401 23456 -5857 -25583 -13249 11320 17077 -1688 -21071 -17697 3445 22871 24186
491 24186 11496 -1167 -2423 1926 2990 604 -2554 -3786 -4628 -4134 -2757 141 2804 3595 -595
506e95n991J307J1507P597j1782j7529n215J1187J4182M975n146j2039l867J6080
520D671K0360k944k4763j6613J2126K3142L659j4085j3968l683O798J1265M733
533A0698r222j1692M866J8647O663j4144j7253m83P735J718m971l35M461L979
547F67M994L388m341q359l08Q510M140j0372r861N491J3860K820r373o935O83
562d996N512N989L221m589j2059l905Q562P677n463q995K628Q806J906l017j130
577A47k009n174k449M167O469Q89j256j251l29r64K451L943j157o586l933K951
593d091P505L559j459p763o135K298R918L842n439p971j268P082P216o71q541
608a918r354j203J0130J0984k093j1341l740O147O744K375j030l809o139K54O283
$$ plain form
506 -595 -6586 -5279 6228 13825 2043 -15486 -20701 -9514 4668 9643 4497 -7542 -11409 4671
520 4671 25031 22087 -2676 -19289 -7163 15979 19638 5553 -8415 -12098 -5300 5965 10698
533 10698 1476 -10216 -5350 13297 19960 5816 -11437 -11920 -4185 -2467 -7438 -7773 -3312 667
547 667 5661 9049 4708 -3651 -3959 4551 8691 -1681 -11542 -6051 7809 10629 1256 -5679 -4996
562 -4996 516 6505 9726 5137 -6922 -10827 -2265 5412 -51 -9046 -6418 2388 4294 1277 147
577 147 -1862 -7036 -9485 -5318 1151 2040 784 -467 -796 -1760 691 4634 3477 -3109 -7042 -4091
593 -4091 3414 6973 5514 -2249 -8384 -6086 3832 7674 2235 -5736 -7004 78 7294 6623 -1918
608 -1918 -11272 -12475 -2345 8639 6546 -4795 -8535 -2388 4356 6731 5701 1892 -4247 -3993 2290
623B290M592m987r373R25Q664M764j956j547J283k494m132J560M027k704p003
638f091m4O565L218l300K13K755k314m036J755N577k459n660J103O491n63n364
654b154%O299m4o170l06M673O11m484R07M172k191n382K807N302l71o803k042
671e176M674J850k055k65J846j508j701L471M369k279o571j329L974K538l73q40
687F25Q06j815M5J821J806j772l735j373J936K894J458l97k957j928j04K335K914
704B559n34m509k786J827N320L127j721o166k272M264N364N01n224m314M68L740
720c56N016L53l360n867K34P046L800m268p539n78M072J899O68N40j977k333J141
737a509N235j104n198k583L962K670k695j268L376K956l108j842J707K097k109
$$ plain form
623 2290 6882 1895 -7478 -6553 2111 6875 4919 3372 4655 2161 -1971 -411 3616 912 -6091
638 -6091 -6135 430 3648 348 561 3316 1002 -3034 -1279 4298 1839 -3821 -2718 3773 3210 -2154
654 -2154 -2154 4145 4101 -2069 -2375 2298 2909 -1575 -668 3504 1313 -4069 -1262 4040 3669 -3134 -5176
671 -5176 -502 1348 -707 -972 874 -634 -2335 1136 5505 3226 -3345 -4674 -700 1838 1465 625
687 625 1431 -384 -339 1482 3288 1516 -2219 -3592 -1656 1238 2696 2299 -658 -2586 -2690 -355 2559
704 2559 2025 -2484 -5270 -3443 1877 5004 3283 -2883 -5155 -891 4473 4974 -250 -4564 -4096 -356
720 -356 4660 5013 1653 -4214 -3980 3066 6866 2598 -4941 -5519 -1447 452 1120 1660 -317 -2650 -1509
737 -1509 3726 2622 -2576 -5159 -1197 1473 -1222 -2490 886 3842 734 -1108 599 2696 587
752E87j012J199q03k593K69M788J797n198k758L388L583q85m020l94J752k23M7
769d76J473j252k588j49L493K457m153k049L581K550o64k376M76P73j74q54l0
786C8o45j546K445L442m04m195j898K992M638j106n468k712P37L944K653j262
802A653m452k315L505N734J247m917m219O87K633K399L19l055k341J298M004J871
818D051k103k967n04R91J606N07r4j479q88R18J598j412r15L06J113k444n37J992
836b61O69P21k536r84J014J919R15l67j045k534k98M647J886l324m003R15L778
853A112K109j389l012j117P79K197J203l10k749j996J831L398r24l517p32K109
869a008J005k38n73M7P22N2J489m33k233j415J879K936j221k907L1L128J880j582
$$ plain form
752 587 -425 774 -29 -2622 -2353 2435 4232 -966 -3724 -336 3247 2362 -1658 -2052 -300 -523 -476
769 -476 997 -255 -2843 -2992 501 2958 -1195 -3244 337 2887 2223 -153 323 1096 922 68 38
786 38 -607 -2153 292 3734 3330 -865 -2763 229 4867 3761 -1707 -4419 -3682 262 2915 1653
802 1653 -2799 -5114 -1609 4125 5372 455 -3764 -3077 -444 1955 2274 -781 -3122 -1824 2180 4051
818 4051 1948 -1019 -1523 -532 1074 1581 1487 8 -880 38 1636 224 -691 -385 728 -1716 -2253 -261
836 -261 408 1129 -1407 -2391 -1377 542 1457 1090 45 -2489 -2787 1860 3746 422 -3581 -2666 1112
853 1112 3221 1832 -1180 -2297 -1518 679 1882 1572 -1177 -3173 -1342 2056 1132 -2385 -3117 -1008
869 -1008 -3 -241 -814 -767 -45 7 1496 1063 -1170 -2585 -706 2230 1009 -1898 -1867 1261 3141 1559
887A559j725k12P67J115N54l54k887r89J586J964j0j538j295M71K062L77l14j778
905f47j181Q06J139R39l53n37l61m43R08q69P08R01k54n8l42L83J217K03j342
924H17j789o14J841J579j188j566p46N15K778R25j657j955j095K034J630r4j925
941e10j836M02K006Q89p70m47j026K25J697J679j344j266j145J540J248p48r38
958c44O0k09l43K67N01L36m27K78L96o53l9j84N81o25q31k84J146N27o36m43O24
979c02R76n02J77j01n09o49O31M60Q8K15q42N70J97J24qr7K77r66k52J15J31K5
1001b42N95K65m71k42J34O4k1o0j295N99O55R9N83p28q61N47J048j55j51j037
1021f74J5LJ407L60j007l81o34J99J148L84l81j432L26J22R82L90p35n26p29R12
$$ plain form
887 1559 -166 -378 389 1504 2058 1704 -1183 -2172 -586 1378 1368 -170 -1465 -994 1068 1445 1131 -647
905 -647 -1828 -1022 117 1056 703 166 -195 -638 270 -599 109 1010 756 698 356 739 1956 2159 817
924 817 -972 -1586 255 1834 646 -920 -1666 -1151 1627 2552 895 -1060 -2155 -121 1509 1415 -510
941 -510 -2346 -1944 62 951 181 -266 -1292 -1067 630 2309 965 -301 -1446 94 1342 594 -344
958 -344 -284 -493 -836 -569 -68 268 -159 119 515 -138 -177 -361 220 -405 -1236 -1520 -374 153 -483 -926 -302
979 -302 674 172 349 248 -261 -910 -279 181 269 484 -358 212 409 533 525 428 705 -261 -513 -398 -267 -242
1001 -242 353 618 147 -95 39 103 82 22 -1273 -674 -19 80 663 -65 -926 -379 669 514 363 -674
1021 -674 -659 -656 751 1111 104 -277 -911 -712 436 820 439 -993 -667 -545 437 827 92 -434 -1163 -251
1041b51Q06L88j124m8k40O3N11Q76r16j079L10J381L05r41j54j184L81N88J298
1060I70K24j039R8j87M10j78j477K47N1O74J0O14m35l41P33n06N20n48L55l79
1080a84o03N09L74P2J70k80m40J87K35Q6rM05j355O95m5K80M52j48k73r71Q56
1101A3J02o1M48k57k18M80n44L58j84n17O27l47K19l09j81P70J74q37j55M60P59
1122H00m57m26k85l76J021L95p77k60l23N08R63l20j63q88J68K67O53j49j012
1141f61L95J3N45K41P5j458P13L85L27j76m26J72n56R1J72Q7M17q67N34n43L32
1162a88K6j21M46k45r1j15O04J50q9n59m9M54M7j73j47L98n08J19M15n17k64N5
1184c52L56M66M35n36m71J65m50P96k48k33k24j86J34L64j51N2j21oN05j23p89
$$ plain form
1041 -251 555 943 -181 -229 -469 -406 105 981 65 -1014 -704 677 982 41 -113 -1297 -916 -328 970
1060 970 1194 155 253 66 476 298 -1179 -932 -881 -207 -197 417 -18 -359 374 -132 388 -160 195 -184
1080 -184 -787 -278 96 168 338 58 -382 -195 40 126 117 522 -833 -138 -183 97 549 401 128 -843 13
1101 13 115 54 502 245 27 507 -37 321 137 -380 247 -100 119 -190 -371 399 573 -264 -419 41 800
1122 800 343 -83 -368 -744 277 672 -105 -365 -688 -180 783 463 300 -588 -420 -153 500 351 -661
1141 -661 -266 -253 292 533 608 -850 -137 248 575 399 -27 145 -411 -320 -148 -61 356 -511 23 -520 -188
1162 -188 -162 -283 163 -82 -173 -288 316 466 377 -182 -231 223 270 97 -50 348 -160 -41 374 -143 -407 -352
1184 -352 4 470 905 369 -102 63 -387 409 161 -72 -296 -482 -348 16 -135 -83 -204 -210 295 172 -617
1205f17P96N37p26rl72N08K35m91Q86q92o83Q29J05R9k07l07N46l17M88p06O8
1226b30M88n05O48n55j65Q2R0l3J76J80l7k31L44R2m26M86m25l98o29J220J4N21
1248G07m96J86J56o41k22P10k74J86m51l21O15p3J17k71o27J17R23L24n07N7n92
1269c77L83J98j26L50q58j4N33j33KK51j67k56N86K26n02n71L96M10j57j97k01
1290b24N12l62L76k87L42ml85k26J45J72m2K45m23O1L3l70N48P82j406K56m99
1311g56N93N58k77l03p8M2M13M15l18L14m68l94l9N42K18j049R79K14j06j132
1331f32R11k52K11n00J83J50l96L84L19n27o9n07M12R70jo80l66M61n6r0K2j23
1353a76o12O74L27l85Jj06N14Nl72R75o89O07m49j116O61Q14j064m71O06L93j59
$$ plain form
1205 -617 179 716 -10 -19 -391 117 352 -139 747 -145 -828 1 106 205 -2 -309 237 -80 408 -298 -230
1226 -230 258 -247 401 -154 -319 -237 -147 -180 -4 176 139 -92 252 344 -82 404 -21 -419 -1048 172 186 707
1248 707 211 397 553 -88 -310 400 126 312 -139 -460 155 82 199 -72 -699 -582 341 665 158 215 -377
1269 -377 6 204 78 428 -430 -444 89 -44 -42 209 42 -214 372 598 96 -475 -79 331 174 -23 -224
1290 -224 288 -74 302 15 357 353 -32 -258 -113 59 17 262 -161 -100 -67 -437 111 893 -513 -257 -756
1311 -756 -163 395 118 -185 -263 -221 192 607 289 603 135 -259 -298 244 462 -587 392 606 500 -632
1331 -632 279 27 238 -262 -79 71 -325 59 378 -149 -218 -725 -313 657 656 -24 -390 71 15 -75 -53 -176
1353 -176 -788 -114 213 -172 -171 -277 237 242 -130 845 156 763 314 -802 -141 673 -391 -862 -256 137 -22
1374b2j72K62o10R50n58O47j124N69N1j86J84o38P02j26m40Q25k55J65r8no7J53
1396B07qn27M10K89j106N83R9j07M81J16j169j6O72l65J64j26L64J56j84J21l02
1417b48M03K97l38m84J70M08K49m28J61j78M0L64k34n52J70o5k85J47L67M8q12
1438h00O30k52N19j13J75j29l98k87R48K87o70O1J68j90L9K81J22J8o79M16L20
1459D66K87m89l71m81K92K77K89n00l00M89qk0l44K27j49M66O13j281Q81m81K70
1480A33J72l1m62l28L03J91k09O44m57K49K55l04n07p4j82R60k31P8M87q29K69
1501A27k15j43k2M39k32n86Q30J04l65O0n7k75J49L90K5l41K24O77r64L10k91
1522a56j13R8P77k69l5o13P9P90r95L68R7l26M45O7p56K95O05l89J48j11j24l53
$$ plain form
1374 -22 -194 68 -542 408 -150 497 -627 -58 -7 -193 -9 -647 55 -71 -511 314 59 224 126 121 54 207
1396 207 199 -328 82 371 -735 -152 -53 -160 321 437 -732 -748 -76 -441 -277 -403 -39 117 -67 54 -248
1417 -248 155 452 114 -370 -200 208 457 29 190 12 52 416 182 -370 -200 -265 -550 -403 -36 12 -800
1438 -800 -170 -422 97 -16 159 30 -368 -655 293 580 -90 -29 139 -51 -12 269 391 409 -270 146 466
1459 466 753 264 -107 -588 -296 -19 270 -230 -530 -41 -49 -69 -413 -186 -335 131 744 -537 344 -137 133
1480 133 305 274 -188 -516 -213 -22 -231 413 -44 205 460 156 -351 -425 -607 353 122 200 687 -142 127
1501 127 -88 -231 -253 186 -46 -632 198 302 -63 -3 -60 -335 -186 204 229 -112 112 789 -175 135 -156
1522 -156 -269 -171 606 337 302 -311 -232 558 -437 -69 28 -298 147 214 -542 -247 358 -31 117 6 -118 -471
1544d71O35J04j1o11L62L58j96o12M53Q2P7O4j66p6m91N94m43O58q8o19M50r4
1566d1Q11p76j84J49N54n16K72k32%l11M66m12q6P80n25k30J025r18l52J527o50
1587C51l36m6l67J83L63l06K01j45J73k00K21J060j563L59k5Jl3L67O9k24K85
1608C88l84m9l2p6q4L52l47K46K81j061P18k29R61J48j069k32N41R3r3l47J93
1629h2m6p1O47n6m48k97R84j127O10k27m29N28K68J75r20L13K12O51q08j17L20
1650H0o75M90J48k24Q81n73l13l72L02J075r33L22j49j5J3L28k99Q09j430J79
1670c56K43L59j25k22L89n53K97O12o54L1j93k56P30k40k2J06q28R89l22J0k24
1691b29j75P12m29k11k9M85r6j44l84P58n05K18l75N24K6k10j29K07J01j65J73
$$ plain form
1544 -471 164 268 257 -354 8 366 170 -442 11 93 170 234 68 -8 -499 95 -348 310 222 -397 53 -41
1566 -41 770 -6 -190 -41 513 -3 269 37 37 -274 192 -220 -306 474 -51 -281 744 -174 -526 1001 351
1587 351 15 -31 -398 -215 148 -158 43 -102 71 -129 92 1152 -411 -52 -77 -76 -109 258 327 103 388
1608 388 4 -45 -77 -153 -237 115 -232 14 295 -766 -48 -277 684 832 -237 -469 72 165 72 -275 -82
1629 -82 -128 -199 448 392 -56 -353 631 -496 114 -113 -542 -14 254 429 -491 -178 34 685 -123 -240 80
1650 80 -595 -105 43 -181 700 127 -186 -558 -256 819 -114 208 59 44 57 385 86 895 -535 -356
1670 -356 -113 246 121 -101 288 -265 32 644 -10 21 -172 -428 302 62 40 146 -682 307 -15 -5 -229
1691 -229 -404 308 -121 -332 -361 124 28 -116 -500 258 -247 -29 -404 120 146 -64 -193 14 115 -50 123
1712A23k10j89O78n15J18J04k68N30k58J37k34L69l80j44j19RQ88k65Jj69k90
1733h4L26p60O63L52o05K63k75l26N47j55J68l76J53K58M46j505O40K01n94M86
1753a77q91J190P88q80M93q96P62l39J50Q39q62kq71M41k07J010l10j62m46K50
1773a20l38N64J19o2q1n37J229q65L65m06L4J20j76J06R24p87m91K09m4O47n56
1794a46j07N43K8m16L27j04j26K4j50N06n6l10m72J32Q05o3l60L09l47l05O53
1815C65o18o4L94P4R9K53l04R5r79N56M40K04j10r93L5M20o8m08R15j30L36m05
1837A07o85M16J19J98M60J59q35r9m5K09M91k76j10j2M87l66N5j60l73K20L76
1858C36L45n29L5k35k36O27m97J12j40O00p53M53j3M0Q0L49m95o56M83j43M02
$$ plain form
1712 123 -87 -276 402 -113 5 109 -159 371 113 250 16 385 5 -139 -258 -249 639 374 375 206 -84
1733 -84 242 -518 145 497 -108 155 -120 -446 101 -54 114 -262 -109 149 595 -910 -270 -69 -663 -177
1753 -177 -1068 122 910 30 523 -373 389 50 200 1039 177 175 -696 -255 -462 548 238 76 -370 -120
1773 -120 -458 106 225 163 82 -455 774 -91 274 -132 -98 22 -154 -48 876 89 -402 -193 -237 410 -146
1794 -146 -253 290 318 -98 229 125 -1 23 -127 379 323 13 -459 -327 478 415 55 364 17 -288 365
1815 365 -253 -317 77 151 250 503 199 294 -685 -129 311 515 405 -588 -553 -133 -201 -609 306 176 512 107
1837 107 -578 -162 -43 155 615 774 -61 -160 -205 4 495 219 109 97 584 218 273 113 -260 -40 336
1858 336 681 152 187 -48 -284 343 -154 -42 -182 418 -335 118 105 145 225 574 79 -577 -94 -237 165
1879A65m7q63P09j16M66o12P4Q6O10l44m26M47p0J66k42Q2L46j41l85j35K25l97
1901d02P99o63J66j58p6Q52k17k62K31J2m81QL1M2Rk49L86J08q3K62l46l84Q72
1924D57R5o68J6J75o38J41P19J3j13j94J91l90N16k35K72l91P6M15p02J69N6k69
1946b89P76q89M68m54K79N62l34M07j059R57k36k87J25k70M59J92k93J37m80p0
1966b99l4J78j9L34J85j04jl86l03Q37l82jj00O69q09K60M39l56j4j35Q5k48R5
1989a09J36l55K04j21L04K69q7m73l4j99K94L02J22n55K15L22q6m80l30M23K14
2010b4K98j77N12r45M67L46k31J16J50k22n88M80J47o17M96j57l08N93k17k21
2030a02o10R10j38k59O5M29J49p7n52J59J50P7k56O53m91j30o00J31N70l58J02
$$ plain form
1879 165 118 -745 -36 -152 314 -298 -224 -138 472 128 -298 149 79 245 3 85 431 290 -95 -230 -5 -402
1901 -402 397 -266 -100 -258 -334 518 301 39 270 282 -199 -191 -160 -118 -109 -358 28 136 53 315 -31 -415 457
1924 457 552 -116 -100 75 -563 -422 297 310 197 3 194 -196 320 85 357 -34 42 457 -245 -76 -20 -289
1946 -289 487 -402 66 -388 -109 453 119 526 -533 424 188 -99 26 -244 215 407 114 251 -229 -299
1966 -299 -333 -155 -174 160 345 241 240 -146 -449 388 6 5 -95 574 -235 25 464 108 94 -41 44 -204 -109
1989 -109 27 -328 -124 -245 59 328 241 -232 -266 -465 -171 131 253 -302 -87 235 149 -331 -661 -238 -24
2010 -24 274 97 609 -336 131 477 246 362 512 290 -298 182 329 -288 208 51 -257 336 119 -102
2030 -102 -712 198 60 -199 -134 295 444 367 -185 -26 124 201 -55 598 107 -23 -623 -492 78 -280 -178
2051a78J55M4J33n59L75j09Q54o42q9j89J35M35Nm82K55l97L00J61O4J01o14P14
2073D72q12O88p37O12m03O5j44L52k5J5K5J67p37N61l37L59l61K36k86O25p19
2094c84j60K15rO50k97j53J33N60k51k21n35P23l71N98q79N8L94K37J99o41j22
2115b56j81O88j01j25m56K78L62o36J116n85k5J24n1j85J3L1l45N82n44N07L19
2136E30p59J41J53LN3k6J2j47j26J30k21N34l89J57m21M83l29J04j99l24N62J14
2158C5J66j30K29k89q2j61j70P49j78k72M40n5j51k57l38Q87j010L20Q88q63J67
2179g5K76o10M34n45N26l27Q71l83k24L32k33m75P28p22j34P11O1m7j04N3m65
2200c52M3M13K2l4k94K93N90m67n41RM62J15k98J15m25L62m2P81p36n74k25R92
$$ plain form
2051 -178 -23 21 154 -405 -30 -139 715 73 -16 -205 -70 365 370 -112 143 -254 46 207 271 372 -242 472
2073 472 -340 348 -389 223 -180 -115 -259 93 68 83 108 275 -462 99 -238 121 -240 -4 -290 335 -384
2094 -384 -544 -329 -338 312 15 -138 -5 555 304 83 -452 271 -100 498 -381 -323 71 308 507 -134 -256
2115 -256 -437 251 150 25 -431 -153 209 -427 689 104 79 203 152 -33 -20 11 -334 248 -296 211 530
2136 530 -229 -88 65 68 121 95 107 -40 -166 -36 -257 277 -112 45 -376 107 -222 -118 -317 -641 -79 35
2158 35 201 71 300 11 -71 -232 -402 347 169 -103 337 282 131 -126 -464 423 -587 -267 621 -242 -75
2179 -75 201 -409 25 -520 6 -321 550 167 -57 275 42 -433 295 -427 -561 150 211 164 60 113 -352
2200 -352 -309 104 126 92 -202 91 681 214 -327 -318 144 259 -39 76 -349 13 -29 752 16 -558 -783 209
2222B09l31K59k14L95j1k98m7j99k20M10L70l47L07K41l28l35l13L18L84m13L56
2243A93J86l77J95K08q96O04K19l38l02J17k1k97K35Q54l75k93l05M48r5l6K1
2264e5j06K18n94M93J09N50r58M39k23M56n01r0r5k25J146n65M49l71j13o8L82
2285B78ml49O20j47K37q07k20K25K19K09n64j2J1J94m89N54L3j22j51J30M21o48
2307c82K46q5L04K97j47j2q1Kk6N94n79o1J57n32R1K21P2Oj51Q5k7k07K01K90
2331B76J3m42j50L31n27Q33L64j170L90L72q83P04N4J0K60j15K85q7p22Q7K62
2352A45J45k11M15k47Q0Q6r98N06l48J05N25JK46n3o83J86j3j08K41l64N24L14
2374D94n27J55J55k63l29M59M76l73p98M79J54nJ85o61O19j37L48l56m45J143
$$ plain form
2222 209 -122 137 -77 318 307 9 -38 -237 -457 -47 323 -24 283 524 196 -139 -452 -134 250 -163 193
2243 193 379 2 197 405 -491 113 332 -6 -308 -191 -212 -509 -274 580 205 -88 -393 55 -40 -76 -55
2264 -55 -161 57 -537 -44 65 615 -343 96 -127 329 -172 -262 -357 -582 564 -1 448 77 -36 -104 278
2285 278 274 -75 545 398 635 -172 -392 -167 52 261 -303 -315 -304 -110 -599 -45 -12 -134 -285 -155 266 -382
2307 -382 -136 -221 83 380 233 221 140 142 116 710 131 70 227 -305 -214 7 79 85 -66 19 -8 -215 -14 276
2331 276 289 -153 -303 28 -499 334 698 -472 -82 290 -593 111 165 175 435 320 605 518 -204 -117 145
2352 145 290 79 494 247 327 413 -585 -79 -427 -322 203 204 450 397 -286 -100 -113 -221 20 -344 180 494
2374 494 -33 122 277 14 -315 144 620 247 -551 -72 82 77 262 -399 220 83 431 75 -370 773
2394G73p76l20O69K89m18j06n83M51N21m72J23K6m1K85l53M49j316J004l0m40
2414b65j6m1PK23j01k22n3J045k29m79M47k14Pk32J89J55j017M79J66P05l36k39
2436b1J42P6n75O48n69K88L6P7k89M7K40j51L18l13O0j02J25M95r12J02P09n85
2458a54n77L80M76K78m79K25j02k63K51J8J79m33M04l82R2O88n71j86L04j18j22
2479i2r1J34K65R38j007l34M02r35O51l7rM48k25J80N2o48P52q55pL54j37N5R8
2502d8L79o18J61N15p31k59Q43M0o16Q06o70j13L66k45P73l20n03j5k72Q02j47
2523A28q1J05j88N78o66k36K35J60J5j38j72J58O80o33N85l34k19J02l00Q62j069
2544d28J77j97P94o04J23L44j081Q81n6K40n98Q94p84N51K77j97K7p24P3L19l51
$$ plain form
2394 773 -3 -323 346 635 217 111 -472 -21 500 28 151 177 136 421 68 517 -799 205 175 -265
2414 -265 -281 -322 -315 -92 -193 -415 -468 577 348 -131 316 102 109 -123 66 221 -796 -317 -151 554 218 -21
2436 -21 121 197 -378 270 -299 -11 25 102 -187 -140 100 -51 267 -46 14 -88 37 532 -380 -278 431 -154
2458 -154 -731 -351 125 403 -76 149 47 -216 35 53 232 -201 203 -179 -87 601 30 -156 148 30 -92
2479 -92 -183 -49 216 1154 147 -187 215 -720 -69 -106 -115 333 108 288 340 -308 444 -411 -418 -64 -201 -146 -48
2502 -48 331 -287 -126 389 -342 -601 242 282 -334 472 -198 -311 55 -190 583 263 -240 -255 -527 275 128
2523 128 47 152 -36 542 -124 -360 -125 35 50 -88 -260 -102 578 -55 530 196 -23 79 -221 641 -428
2544 -428 -251 -448 346 -258 -135 209 -872 9 -47 193 -405 489 -295 256 533 336 363 -361 -288 31 -320
2565c20K10J81m0n7l5J26m81O37k1j28Lr4o5k9L11m26J24j46l17O3P13J49K29
2588E87q58K83m51N69O25j112k7J70J12m00M70n32N98K70J77m38P3J1q09L47O75
2609C40p75M02L0N7L98n82J42k37P88r09P55m07Ko5j23J79J10l61n2Q8j18L99
2631F1o51R78p05J97K21r80R37j01J51j39K04o86M61n1K19o5q45P67J57O7J7K95
2653E09n68O11l86r38J226m54n17L80l97L18L47j20k93O43m01L28m25N67o76P3
2673a73l34O64l24Q02r72J9J60N53k61j80N09l68k46k20J98M85o06O35n84m5Q6
2694b02k29N03j77N3l20P64m50R8oO6n0K9n31N74j49l08K50j73J33K61J07m06
2716a63L23p81J41J345J02j196m77O60j12J21M19l75n1J86P1k25j10k52L96K19
$$ plain form
2565 -320 -110 71 31 -26 -61 65 -416 221 200 72 75 -19 -84 -113 198 -228 -104 -250 -567 -504 209 358 587
2588 587 -271 12 -439 130 755 -357 -384 -214 -102 -502 -32 -564 34 304 481 43 116 127 -682 -335 340
2609 340 -435 -33 -3 54 452 -130 12 -225 563 -346 409 2 4 -61 -184 -5 105 -256 -308 -220 -338 61
2631 61 -590 388 -317 -120 101 -879 58 -43 108 -31 173 -513 -52 -103 116 51 -794 -27 130 197 214 509
2653 509 -59 552 166 -772 454 0 -517 -137 -534 -216 131 11 -282 361 -40 288 -137 430 -246 -173
2673 -173 -507 157 -167 635 -337 -318 -158 395 134 -46 463 95 -151 -371 -173 312 -294 341 -243 -288 -202
2694 -202 -431 72 -105 -52 -372 392 -58 40 34 100 50 79 -452 122 -27 -335 -85 -258 -125 136 243 -163
2716 -163 160 -621 -480 865 967 -229 -706 -46 -158 -37 382 7 -44 142 213 -12 -122 -374 22 241
2736B41n35K94J89K32r37M65k14O08k87m49N57n55L45J5j41k14N59k92n0l27o3
2757e59M17L80o07M12J3M5q35P80O31o68m22P30j026J275l99o19L81L2j64K50
2777D7k41j81K22J25m4M4L21l99N2n2r3J95K6K32j57J11l63K54j66K05m89P82
2799D31K37p10N31m18L48m06q3M67r3q8m80L1L74l57O34l04k7j05N08r45R45n10
2821b0k50J44K90m43O86n10J7M14l64L23J83j53m69j34M09j13k62nM56N9m66L19
2843A11P5p27O65O2j23L78n46n12L42K2J60O0N08m41J15K23j278P70l8K7N5K40
2865A48r5k53k75R86o70J38l06M80J19l78N70n52l96J148o59j6k88P35r3n61L16
2886I8j51J41o92R04n88R3L28j7L83q51J23Q99r84O6j48J244q56j18k3J64k54
$$ plain form
2736 241 -294 0 189 421 -516 -51 -265 343 56 -393 164 -391 -46 -31 -172 -386 173 -119 -169 -496 -559
2757 -559 -142 238 -369 43 56 101 -734 46 677 9 -413 317 -709 566 167 -452 -71 -39 -203 47
2777 47 -194 -375 -153 -28 -72 -28 293 -106 -54 -106 -199 -4 22 254 97 208 -155 99 -67 138 -351 431
2799 431 668 -42 489 71 419 13 -70 397 304 216 -264 -233 141 -216 418 114 87 -18 490 -455 490 -20
2821 -20 -270 -126 164 -279 407 -103 -86 328 -36 287 470 317 -152 -286 123 10 -252 -257 199 258 -208 111
2843 111 186 -541 124 186 63 441 -105 -617 -275 -253 -93 -33 475 34 149 372 -906 -136 -174 -147 -92 148
2865 148 53 -200 -475 511 -159 -21 -327 153 272 -106 464 -88 -484 664 5 -11 -299 436 343 -218 98
2886 98 -53 88 -604 300 -288 -195 133 116 499 -352 -229 670 -314 -248 -396 848 -8 -126 -149 15 -239
2907b39k28N79L0L13J31l19J06L3n25N78p81L68j30K17k01l28K86L98l23K31J28
2928C24n97R74m29k2j0n29M12l13L69k31p88R05m81P42k76n49Q62n43j19O90j3
2949C78m9p80O67j75%m67N78P3p48M68m16M82M88m15l28N48m8o79K65Lj07L78
2971A16L09l68j85R3k03K31l13M57j90j41k94K68N32n75M39J97o80J19J61m27
2991d54M71L61l61J14K35l99l06M27K50j12j74k49R53n34n06O36k55M82k52m30
3011a03J49o9l2K70J72%k10K17o57R8K71l31m75L24L63J99m95O66k36L89q58N59
3033B11k76Q9mN14o56O71j117M96J12L65k10j0j47n0j09K31K89l43k50k03M87
3054I0n66L49j34J41j39L31K47p34N07j46K7Nn80P06J36p24O68l45N94m37J71
$$ plain form
2907 -239 -467 112 142 455 586 267 373 406 -119 459 -322 46 -84 133 -68 -396 -110 288 -35 196 324
2928 324 -273 701 272 250 240 -289 123 -190 179 -52 -840 65 -416 326 50 -499 363 -180 -299 391 378
2949 378 329 -451 216 41 41 -426 152 225 -523 -55 -471 11 499 84 -244 304 256 -423 -158 -155 -262 116
2971 116 425 57 -128 -35 -238 -7 -320 137 -53 -194 -488 -220 312 -263 176 373 -307 -188 -27 -454
2991 -454 17 378 17 131 366 -33 -339 88 338 226 52 -197 756 222 -284 352 97 579 327 -103
3011 -103 46 -23 -55 215 387 387 177 394 -263 -165 106 -225 -700 -376 -13 186 -309 357 121 510 -348 211
3033 211 -65 24 20 534 -122 549 -568 -72 40 405 195 185 38 -12 -121 110 399 56 -194 -397 90
3054 90 -476 -127 -261 -120 -259 72 319 -415 92 -54 -27 -22 -602 104 240 -484 184 -161 433 -4 167
3075A67P18j338J69j26j91M6L10P31k23k98K40j94k93q2P08l45j28J46P14r42
3095b11K47N53o59N67p35n1N85p46J61M79o57K61nM06p24O40l9l54N54m52J6M72
3117C08k94J62j3J18L0P6pn99q6K91J39o83O97m45M43k0o80N4N23M6K27m92K27
3140B2n06R44m18j29PJ72j09l21J97j14J55j34N94k74o7j4J79j09N8J16o04K58
3162i7M77m50J20l02j34Q07o57L68N84n61K46k86K15p18P77l70Lj2q7j21l89M77
3184a10j117J210J15l6l56m2Q36j59l46o44Q24p94P94m53j05L50l19N59l87p5
3204b55K23J91l16P5M0j31N25n41K85j92M41o81M54k00J00K60l63M27o82m29O95
3225g4N0j7j59J12R2l2j15J87k97K7j5O2R1Q38r48M84q4k90M1Q7p66J013n03K60
$$ plain form
3075 167 885 -453 -284 -410 -601 -555 -245 486 263 -35 205 11 -282 -364 344 -1 -129 17 731 -211
3095 -211 36 589 -70 497 -238 -289 296 -450 -289 190 -467 -206 -211 195 -529 111 72 -282 272 -180 -164 308
3117 308 14 176 163 281 311 387 380 -219 -305 -14 125 -558 139 -306 137 117 -563 -509 14 60 287 -205 22
3140 22 -484 460 42 -87 -80 92 -17 -338 -141 -255 -100 -234 360 86 19 5 184 75 133 249 -355 -97
3162 -97 380 -70 50 -252 -386 421 -236 132 716 155 401 115 330 -388 389 19 22 10 -77 -198 -587 -110
3184 -110 -1227 -17 98 62 -294 -336 500 341 -5 -649 175 -619 175 -278 -383 -33 -352 207 -180 -255
3204 -255 -32 159 -157 -82 -42 -173 352 -189 96 -96 345 -336 118 -82 18 278 -85 342 -340 -769 -74
3225 -74 -24 -41 -200 -88 4 -28 -143 44 -253 -226 -241 -179 -88 750 -198 286 202 -88 -47 40 -726 287 -216 44
3249D4M15q46L54o6k19M22K84k66m98N39O59o87N61J32n35l44L41m96Q16k56j68
3270A86L89m11l18PK51M87o5l5j015N76N8k01M02m46k83O2N8p10J027m33M47P15
3292G48l97O37p61j36n44M10p14J329o76o04O22N20k59k63O23o91q8L84n27J93
3312a94N43o65M77j44j66L29L01p63M68P9O45p75r8L55p79N45M3J75j70k91Q1
3333dol94K74L81l45J41K18n02O53m42N1m99O31K53m25j38j08L90l06K24l26K19
3355f0k5j53j93O15o35N83l25L90m07K05j22n2M69l06l90K28r6L89k25l30K60
3376a80J71N89m88K70p05P02l88J0n85L57O46l01R0o42Q74k32M87k86n41k05R13
3397E56l13k59N64q59J54k63P60p4m07k47N00K62K51k59n85K2M85p62J401j219
$$ plain form
3249 44 459 -387 -33 -99 -318 104 388 122 -376 163 822 135 696 828 293 -51 290 -206 610 354 186
3270 186 575 164 -154 -147 104 591 526 491 -524 52 110 -91 311 -135 -418 -356 -298 -1008 19 -414 33 748
3292 748 351 988 227 91 -453 -43 -757 572 -104 -708 -86 434 175 -88 535 -156 -244 140 -387 -194
3312 -194 349 -316 161 17 -149 180 481 -282 186 265 910 135 37 392 -387 158 201 376 206 -85 -4
3333 -4 -10 -404 -130 251 -94 47 265 -237 416 -26 25 -474 157 410 -15 -153 -261 129 -177 47 -279 -60
3355 -60 -85 -238 -431 184 -451 132 -193 197 -210 -5 -127 -179 290 -16 -406 -178 -274 115 -110 -440 -180
3376 -180 -9 580 92 362 -343 359 -29 -19 -604 -247 399 98 188 -454 420 188 675 389 -152 -357 556
3397 556 243 -16 548 -311 -157 -420 340 266 -141 -388 112 374 625 366 -219 -197 288 -474 927 -292
3417b92P40j20m99O00k54n85R4J5K81l68M28M26n54M67m12p0K5K60l58l6N73K27
3439E88n89L07n98q6J62M20r1M13p35N9j76J82j24K77J75m87J02K53k09L00m77
3460c34N84o3j26l56M79n62K66M80n13m50M14J85K1N63n33j82m83J298n15j69
3480Dk38L76l62j7o5N59o52K67m3M8J13J69K19j39n8N0k67j7L45j53j63m1j58
3503b23p21O73M72l65l50K64O82n66j57K56k33J30Q97n06p37J55L83j79N83p17
3523b59L65k13PL54j31Rl28k47k40Q04k46K78j9k77L74l93Nk30L94m60K94M23
3545B64Qo05J17M58q92P25J12l04K89l25K36m1L90k85L30j27o87L63j59O29o61
3566a65M29m16K92M26m17K51l05O22l19k77j62j15N20o39O65q02M73lK8k15J67
$$ plain form
3417 -292 448 328 -171 429 175 -410 -316 -301 -20 -388 40 466 -88 379 -33 -103 -78 182 -176 -212 361 588
3439 588 -1 306 -292 -378 -216 204 113 526 -209 -150 -326 -144 -268 9 184 -303 -201 52 -157 143 -334
3460 -334 250 187 61 -295 184 -378 -112 368 -145 -595 -181 4 25 588 55 -127 -610 688 173 4
3480 4 -234 142 -220 -237 -302 257 -395 -128 -171 -123 -10 159 378 239 181 231 -36 -53 292 139 -24 -65 -223
3503 -223 -944 -271 201 -164 -514 -250 432 -134 -291 -35 -268 -138 759 253 -484 -329 54 -125 458 -259
3523 -259 106 -107 -100 254 123 132 -196 -443 -683 121 -125 153 134 -143 231 -162 -157 -387 7 -453 -159 264
3545 264 272 -333 -216 242 -650 75 187 -117 172 -153 83 42 432 147 477 350 -337 26 -133 496 -165
3566 -165 264 -152 140 566 149 400 95 717 398 121 -41 -156 364 -275 390 -412 61 58 86 -129 38
3587C8nN8l35L58n89L86J56kk34J15J9k8K55r6j50Q5J74m58J81m09K80K83L02
3610C84k59J4n4K44l91M38k8l53J06j14K33k49J68K38l9j63r6l86M97n85K50J90
3632D5j73k35N55M4q6P9K6J06o64q3M52n5r3kL49j38p14Q31J16n64OL73o79K21
3656b83j32R90l74L4J44l07L77k69o25N80p92R41m99O05m13Q7J33o17N03q5M16
3677D14q10m2j1L44K29n17M80n25Q77k14oQ9n10J46P3J99l94K21o04P95n11R3
3699a84O2k03M92N23n96m61M16K08j16kl54J3K87j56M05l24J73r3k44O03j49l79
3721g9k30J78m70P77k12k37l4l3K99P27o33j10q94J312k41o2K1j72P11m29k99
3742a10k18n8N22n09N4J25O13k6o98K60J37J44K21m03r23P80M6o69J005r9k59
$$ plain form
3587 38 33 91 -244 114 -475 -89 67 65 -169 -54 -35 -63 192 96 -54 31 205 -253 -72 -481 -201 82 384
3610 384 125 139 85 329 -62 376 348 -5 101 -13 220 -29 139 377 338 175 79 -307 190 -395 -145 45
3632 45 -128 -363 192 236 150 229 255 361 -303 -386 66 11 -82 -84 265 127 -587 244 360 -204 -198 175 -504 -283
3656 -283 -415 575 201 235 379 72 449 180 -445 135 -657 284 -215 390 -23 64 197 -420 83 -2 414
3677 414 -396 -438 -449 -105 124 -393 87 -438 439 225 219 308 -202 -56 17 216 -178 43 -561 234 -277 -184
3699 -184 -122 -325 167 690 94 -367 49 257 141 139 -215 -202 85 -71 334 10 183 90 -154 449 300 -79
3721 -79 -309 -131 -601 176 -36 -273 -307 -340 -41 686 53 -57 -951 361 120 58 79 -93 618 189 -110
3742 -110 -328 -386 136 -373 -319 -194 419 393 -305 -45 92 236 457 54 -869 -89 -43 -712 293 194 -65
3763f5m35J96K07k97Q58p71J63J83R8J6m93j70N90n99M48L41K28l23J38r3j50
3784G0k6J77M08l37o58K81L21M55k13l51m94M80J2j74J66J0K72o89L55m6j94M83
3806C08j43l68O56k82k20j31N6L81l13j91N37m79J20L73l17N37k09k29p8J24l30
3827a98K22K13j36k88Q0Q95n84l25M31j49n23J08N36m37j79M69J2k33j66j54Q4
3848c22J80L95n42P45K42n24n60N38p3l5M69m84k82M45j33k42l88N84r5k49J94
3869a37K30r9j27L79l49m69K73P16k09n39L96m46J34N03o64J82m3J00J27L4L75
3890C67r99P57M51o65J7K12j60K11q0J66n62N07l27j86O64n30Q14j071M16K83
3910B85k47K26l98j98O92q52O49j06k35J37n62P75M02l90K61n45n50L21M46k70
$$ plain form
3763 -65 -500 -304 -97 -394 464 -307 -144 39 137 153 -340 -510 80 -519 -71 270 498 175 313 220 70
3784 70 44 221 629 292 -366 -85 236 691 478 127 -367 113 125 -49 117 127 399 -290 65 19 -175 308
3806 308 165 -203 453 171 -49 -180 -124 257 -56 -247 290 -189 -69 304 -13 524 315 86 8 132 -198
3827 -198 24 237 101 -187 -107 788 204 -121 310 161 -362 -254 282 -155 -334 135 147 -86 -252 -406 -322
3848 -322 -142 253 -289 456 698 174 -386 152 79 44 513 29 -253 192 59 -183 -571 13 -82 -331 -137
3869 -137 93 -6 -133 246 -103 -572 -299 417 208 -331 65 -381 -247 256 -408 -226 -269 -169 -42 -8 367
3890 367 -632 125 576 -89 -72 140 -20 191 111 277 -285 222 -105 -291 373 -157 657 -414 2 285
3910 285 38 264 -134 -332 360 -492 157 51 -184 -47 -609 166 568 178 439 -106 -656 -335 111 -159
3930a59M22o72M5M73j77j81O62m53R1l56K28M06j33m30q8l73P08j80Mj80M60N35
3952F52q60Q62p92L45J23m36M52j22L3j88n0k20m1l87J198k29L07j171N13P1m51
3973c91R94l46l8q25O71j80m66N07J47L08J58m83k40K48k69J1j18Q13m10J06j95
3994BN28m67k81l7M26k73j75M08k92j57o7M52j05pL69m65j15O04l92k13k51J14
4016c94K46Jk72q3R94m37k18M73o56L17M0n94J27K24P80q4n74K77j41j76L30m84
4038c04P20o55R4n3m0L44l0K13j45j39j19l25R39m96n8l87M37k41j10J39J56k28
4060b88L32P8N61o93Q1k55K0l1J59P76n66k1j17M43m66J24m9m7l0J9L58m84J99
4083A03k6M39r55M30K0J08l9r05L25N41m39L59k26M84o95Q34n35m95Q09k77J9
$$ plain form
3930 -159 263 -409 -364 109 -68 -249 413 -40 51 -305 -77 329 196 -234 -322 -695 13 -167 -163 -343 117 652
3952 652 -208 654 -138 207 330 -106 346 224 257 69 19 -201 -242 -629 569 340 647 -524 -11 60 -391
3973 -391 603 257 219 -606 65 -115 -581 -74 73 381 539 56 -184 64 -205 -194 -312 501 91 197 2
3994 2 530 63 -218 -255 171 -102 -277 131 -161 -318 -385 67 -38 -45 324 -141 -256 348 -44 -257 -508 -394
4016 -394 -148 -147 -419 -502 492 55 -163 310 -346 -29 11 -583 -456 -232 548 464 -110 167 26 -150 180 -304
4038 -304 416 -239 -145 -198 -238 106 76 289 144 5 -114 -439 500 4 -54 -441 -4 -245 -355 -216 -60 -288
4060 -288 44 122 683 -10 71 -184 -164 -195 -36 740 174 153 36 479 13 137 88 41 11 30 388 -96 103
4083 103 77 516 -439 -9 11 119 80 -825 -500 41 -398 -39 -265 219 -476 358 -177 -672 137 -140 -121
4104a21K33o00L72M09j73Lm27L30o48R74l32j76M29o68O5Q58m72p5n9k88N69m1
4126A62J20p42O54m27LO65o11J24K84K07q61L59m9L93L42k57r56M70K90m88O80
4147C62j92n72L93l1j52M22R4j10o8l47L39J46j196J310m56Q93o86k75M06m31
4167a51K13n72Q64N5k00k1j78K40j5Jm34J27j51m04J172l35k92O7O17j454P82
4188f9L78l67K22j37k70M14J71n11L29K65q66O02R9K02l92k10L4k41L50n0R6L06
4210C55j0j40M3j76l05M88L98p93K83n39M7K39J75j95L35m33J177m79l31k00J14
4231E3j72R0J30o53M40M98n15j17L31j46O5l22L74k36O0L77R2p82M70p03J030
4252C64m0o15J05m6k84N44j31K25J33p6k85N14Qm70j26K15p8J59K89p13N5J02
$$ plain form
4104 -121 112 -488 -116 293 120 123 -304 26 -622 352 20 -156 273 -395 -330 528 56 -19 -78 -366 203 162
4126 162 282 -460 194 -233 -230 435 -176 -52 232 439 -422 -63 -112 281 623 366 -590 -120 170 -318 362
4147 362 170 -402 -9 -40 -192 230 324 214 146 -201 138 284 -912 398 -58 835 149 -126 280 -151
4167 -151 62 -510 354 409 209 188 10 250 235 236 -198 -71 -222 -626 546 211 -81 -14 603 -851 -69
4188 -69 309 -58 164 27 -243 171 342 -169 160 425 -441 161 260 462 70 -140 -106 -347 3 -47 49 355
4210 355 345 205 248 72 -233 255 653 -140 143 -396 -349 -110 65 -130 205 -228 949 470 139 -61 53
4231 53 -119 -29 101 -552 -112 386 -129 -246 85 -61 4 -318 56 -180 -120 257 349 -433 37 -666 364
4252 364 324 -291 -186 -232 -516 28 -103 122 255 179 -106 408 416 -54 -180 35 -43 116 405 -308 -253 -151
4274a51J04M10o99o6K94L41o0J04m1o44M75J11j24q41N38J201p83k03J74L11q54
4295d03K29Q4j4O99p06L29p04L52L17j28k6P6n1J46m53k53O31K9r7L60J74m12
4317A79k89L1L60p58M78L73m06l42J57L04k34J51J59k93K25n76P06l00L25m18
4337a68Q7k95j63O98o27k63N16L03l40L7O3N07l33R0M28k74n88K67k75l6J06j94
4359d54N19j29L8M01K79n33J91j23Q4k90m25P23k21J96J00m74P4J65l65j88L77
4380e5N3n51K22M19L08k30l92m1K77o44P09j28J002j022k22O76l78m4o63Q76j55
4401A7P6k81K17K20m17J92j02k15L63m00J03P80p99M15l34L1J34l05k75M83O37
4422E40r21qL67J09k09M21l25J35k09O6q8L69M1r77M62P43n78O43q84Q72j078
$$ plain form
4274 -151 -47 363 -336 -402 -108 233 173 277 236 -408 67 178 54 -787 -249 952 169 -34 140 451 -403
4295 -403 -174 -90 -104 595 -111 218 -486 -134 183 55 29 105 54 200 -253 -506 125 154 57 417 591 179
4317 179 -110 -79 281 -477 1 374 -32 -374 -217 87 -147 4 163 -130 95 -481 225 -75 250 -168
4337 -168 -81 -376 -539 159 -468 -731 -215 88 -252 -215 -152 355 22 112 540 266 -322 -55 -330 -366 -260 -454
4359 -454 65 -64 -26 375 654 121 312 189 273 -17 -442 281 60 256 356 -118 -44 121 -244 -432 -55
4380 -55 -2 -553 -331 88 396 166 -226 -267 10 -634 75 -53 949 -73 -295 381 3 -41 -704 172 17
4401 17 93 -188 29 249 -168 24 -78 -293 70 -330 -227 553 -246 169 -165 -134 0 -305 -580 -97 540
4422 540 -381 -389 -22 87 -122 299 -26 109 -100 -34 -122 247 288 -689 -227 516 -62 581 -303 569 -509
4443e09L39l7M49l70J59K98q76Q54%k34j41j69K65O55q19N70r59K26p5Q80o69
4464a63p8J64l1K6L64n31kP4J7l5L49m49L44k03L24l99L09n2L34m53N3l34LM46
4488G7M09j42q9k06m3L08M29o59n2k97n3M28l82L2L1Q7M13%j131Q12l6r9p3N97
4512C61n2M16j162O34J46N00p93L55O5l91j4j53L6L71p07O95J01q95L72J9j46
4533b42J91K47K99m68M54m16M15m74N32r58M12L04j56j89k27j67k84R61k41pj99
4554b13L22j15L02k65R2j69L48j018q1M34K96Pj05p9L04n09M44n44L30J43Q8k37
4576b25P8K4K96j30k51L36m62J50l07l25R08m48L72j3j05L42l49M86l12o26J71
4597c90J31O93o89K76o6j72N50o86N15k34Q4j91l36M56j60J9O65p07M79l05J73
$$ plain form
4443 -509 -170 -207 242 -128 31 329 -547 307 307 73 -68 -237 28 683 -136 434 -525 -299 -374 506 -163
4464 -163 -241 -77 -108 -82 282 -249 -251 -177 -160 -195 154 -295 49 -154 170 -229 80 28 362 -91 -38 -372 -369 77
4488 77 486 344 255 49 6 314 743 84 32 -265 -318 110 -272 -240 -209 -122 291 291 -840 -28 -64 -163 -236 361
4512 361 309 725 -437 197 343 843 50 405 470 79 65 -88 -52 319 -388 307 408 -487 -115 -96 -242
4533 -242 -51 196 495 27 481 65 480 6 538 -420 -8 296 140 -49 -276 -443 -727 234 -7 -14 -213
4554 -213 109 -6 296 31 123 -46 302 -716 -797 -363 -67 -60 -165 -244 60 -449 -5 -549 -219 -76 12 -225
4576 -225 -147 -123 173 43 -208 128 -334 -184 -491 -816 92 -356 16 3 -102 240 -109 377 65 -561 -390
4597 -390 -259 434 -255 21 -45 -217 333 -353 162 -72 12 -179 -515 -59 -219 -200 465 -242 237 -68 105
4618A05o2j69J15M01k08N82p04K52l83n9l4Q0J51J18J08k56J48m09L59j16j4m41
4640d36L77K94N3p19M26m2m55Q42j55K75o30L44k8j86N22m53r7j98j49N96j44
4661C7J28n83J058l71k02n02Q43k57j23N49n87j72O57j054K35O37K01k02m39m37
4681e84M92n2m98P89k15K88k34m4J1J38o57O60J06l83l34J315q36n41R9K60L84
4702A64o06M43J86J8m63j45J92K23k60R7P04m29l32M73R5n25M8O8j7P68j56m19
4724A27j53j87L57L28P5m10K50k41k69M21j31j82J81k39l09L40j53L8M5L82j130
4745h60N95M13j3j65M0M87r91O55k81K26k84rk8K0N10q36R32j41k54L01m12k61
4767c56M43l45O03m33O60k67R8q30QM57j4J28K52q16J30K06M63m44R00j211O77
$$ plain form
4618 105 43 -126 -11 390 182 764 60 312 -71 -130 -164 -84 67 185 293 37 185 -224 135 19 5 -436
4640 -436 -59 235 288 -431 -5 -47 -502 340 185 460 -170 174 146 -40 482 29 -68 -266 -415 181 37
4661 37 165 -418 640 269 67 -435 408 151 28 577 -10 -182 475 -579 -344 293 494 292 -147 -584
4681 -584 -92 -144 -642 147 -68 220 -14 -58 -47 91 -566 94 200 -183 -517 798 -38 -579 -480 -220 164
4702 164 -442 1 187 205 -258 -403 -211 12 -248 -151 553 124 -208 265 360 -165 -117 -49 -66 702 546 127
4724 127 -26 -213 144 472 547 137 387 146 -123 298 167 -15 166 -73 -382 -42 -195 -157 -112 270 -860
4745 -860 -265 148 135 -30 10 497 -494 161 -120 106 -178 -187 -215 -195 315 -521 411 270 16 317 -95 -356
4767 -356 87 -258 345 -88 572 305 403 -427 -419 38 24 152 404 -412 -282 -76 387 -57 843 -368 309
4788C09r60L36L93L33n54J82q8j01P63m69j31K34l51l56K43J23K2p0L32m07P68
4809E51o72J69L57m54m42R04m35O1n33P79L67P7j55l86m65K67N00k73k57N44k82
4830B22k65N08l99j5L76l1j209R73M51j059M98K11j1m60O6O65m73k29J47N1L51
4851C68J59r45K8J038m47m24R25j105j56L82Q9M23n43L56n23P93K8r3n15k7K29
4872D0L0n72L49P20o58L41K56o19K64K2k39M74n48N14k62M1l07m09M82J38P91
4893H48m04k19n5k96K02n8l57J035r08O30o72N6J17K51Q5p60K17M27R1p02N86
4914A14o15P54m90Q9ML1K27j59L16k46n00M25J28k63K17l57M38k10K40k64k22
4935c43O94j50J89l86l85N53o42K17N85L2j14p99M78N9m80J76P33j023N51K84
$$ plain form
4788 309 -651 -315 78 411 -143 39 -49 -150 613 144 13 247 -104 -460 -217 -94 -72 -142 190 -217 551
4809 551 -121 48 405 -49 -491 413 -22 39 -494 285 652 729 574 188 -277 -10 490 217 -40 504 222
4830 222 -43 465 66 51 427 396 -813 160 611 -448 50 261 250 -210 -144 521 48 -181 -34 17 368
4851 368 527 -418 -390 648 201 -223 702 -403 -559 -177 -88 335 -208 148 -375 418 446 353 -162 -189 40
4872 40 70 -502 -153 567 -91 250 506 -113 151 173 -66 408 -140 374 112 153 -154 -563 -81 57 848
4893 848 444 225 170 -126 76 18 -339 696 -212 418 -254 -198 -81 170 255 -505 -288 139 230 -472 114
4914 114 -501 253 -237 -148 -144 -113 114 -45 271 25 -475 -50 78 -185 32 -325 113 -97 143 -121 -343
4935 -343 351 201 390 4 -381 172 -470 -253 332 364 250 -549 -71 -12 -492 -316 417 -606 -55 229
4955B29k71M5M9l12M31p31P91M7l37Q9j23K9K97l97j58JK05J10l10L71j26M20
4977C49o52K97P5r5l30L11K83l30L56m92N38o01J42J32O75q35J46K47M55n32q84
4998g45O98M91K04p03K83k15n79P62L87n31J34m21K73m3m00M23n42R73K04o39
5018A4L2J90p52R34p21N25m25R5M74p0l72k78O99j44j83J59k62J28j48O0K95L1
5040B81n2l58J89Kk46O03o06J31Qn04Q39n99J67K43J36M75m97m25j42P80k19r00
5062f94O89j61p3L41m44M09rn27Q54j49k08p49N05L78J97j78k56L68k65nj29m1
5084a47O8k7L36p48P69K64j007L02j43M71j16j3m72L81J40q6L9m2m22K62O30m47
5106hk44O44o31N93K26m88m43J82N26m47J64m34N9N98j39j44N87j216P19m21K38
$$ plain form
4955 229 -42 3 52 -260 171 -560 231 278 -59 30 -93 -64 233 -164 -322 -321 -116 -6 -316 55 -71 349
4977 349 -303 -6 69 -26 -356 -45 238 -92 264 -228 310 -291 -149 -17 658 -177 -31 216 671 139 -745
4998 -745 -47 444 648 -55 228 13 -566 196 583 52 186 -235 38 -5 -405 18 -524 449 653 14
5018 14 46 236 -516 418 -303 222 -203 -108 366 296 -76 -354 345 201 18 177 -85 43 -105 -45 250 281
5040 281 229 -129 60 62 -184 419 -187 -56 -48 -552 287 -312 -145 98 234 709 212 -213 -355 425 206 -694
5062 -694 -5 -166 -239 102 -342 67 58 -469 385 236 28 -721 -216 162 359 181 -75 293 28 23 -106 -147
5084 -147 -79 -106 230 -518 251 515 -492 -190 -333 138 22 9 -463 -82 58 -28 11 -31 -453 -191 439 -8
5106 -8 -252 392 -239 354 580 92 -351 -169 357 -90 74 -360 -301 297 158 14 601 -615 104 -317 -79
5127g9K36K5j72R5O4l75o31N81O85j220O79P6J71n57L79L96j79J97o95M14m81
5148c91P02p52K35R4L63p07R00q96M97K04M6m34O12r57P28l32J6JK00J43n90L69
5170E1M48n73o25J31M24J57j37n8O63p16j20K5L82m26O73m04K80r3l85M55l44
5191a92o31J519l41o63K92m06M88l67L71k09J48j26L02j99J36p78Q43L98p52K94
5211A27j18m54N13k93N53p26J00K02O3l99P52o78j03N12j48L31n5k50Nn1J36J3
5233C2l42L91K29n1p78M93k87n0K91M94m39l68N3K43K25j65L0O07j428J347k20
5254C07o75P14n67N38n14J07L25M5l47O76l11k35L61o71O01m24o5J99l12L08J7
5275G7K07J36q56J124r80L24k39L36K72q64P59K77p37N85j080O76P25j042L41
$$ plain form
5127 -79 157 182 10 105 169 -206 -837 -256 429 -791 -112 -36 135 -422 -43 353 174 371 -324 90 -391
5148 -391 311 -441 -206 -112 251 -456 444 -452 45 249 295 -139 473 -484 244 -88 -72 -71 129 272 -318 51
5170 51 499 -74 -699 -568 -144 13 -124 -182 481 -235 -355 -330 52 -374 299 -105 175 82 -303 152 -192
5191 -192 -823 696 355 -308 -16 -422 66 -301 70 -139 9 -117 185 -14 122 -656 187 585 -167 127
5211 127 9 -445 68 -225 328 -398 -298 -96 -33 -432 320 -358 -461 51 -97 234 179 -71 -66 -117 19 32
5233 32 -310 81 310 259 -519 -26 -313 -363 -72 422 -17 -385 -332 -89 136 -29 1 608 -820 527 307
5254 307 -368 346 -221 317 -197 -90 235 280 -67 609 298 63 424 -247 354 -70 -135 64 -248 60 77
5275 77 284 420 -436 688 -292 32 -207 129 401 -463 296 573 -164 421 -659 17 742 -300 41
5294D1L9J62Jk20k50K35l5L36l72k7K89k7k18K54K81m22m7n20O18l4P1K45j7j68
5318B15m53N7L74l66N63o6q81M54LM39K76n12J0J67k03M26k79m37J33m66K64j7
5340b99M28j5Q4n18P55m03n8l94J275l40p00L9j38P26J49q19L26K53k85J91m64
5361b07N70l26k38l05P36n34O41j4o43J01Q22q44R7j05K31J92n04M67k67J37l02
5382b95K65L8L66j160P32K74n34J17LL40j38l23K63J18K69l76k56J02N15l95J9
5403e6N87j077K66K88q3M32L5k91j31J81K0m18L84j55m5o16L14Q29l81l73Q35
5424E45p58R87j286P09m05J26k34J6NQ25k71K61o06n63N28Q74m40j70n02Q28l62
5445A07n84N72k78J76m60K86j79O48l73O70q50L84m5o08M14M55o98J09L51Q7J6
$$ plain form
5294 41 80 242 243 23 -227 8 -27 309 -63 -90 199 172 -46 208 489 67 20 -500 118 84 155 400 383 215
5318 215 -238 -181 193 -173 390 324 -557 -103 -100 339 615 103 113 280 77 503 224 -213 -80 -546 -282 -299
5340 -299 129 114 198 -320 435 32 -26 -420 855 515 -185 -146 -284 442 591 -228 98 351 66 257 -207
5361 -207 363 37 -201 -506 230 -304 337 323 -320 -219 603 -241 -144 -249 -18 174 -330 137 -130 7 -295
5382 -295 -30 8 374 -786 -54 220 -314 -197 -194 146 8 -315 -52 66 335 -41 -297 -195 320 -75 -56
5403 -56 531 -546 -280 8 -75 357 392 101 -30 151 171 -247 137 -18 -63 -679 -365 464 83 -290 545
5424 545 -213 774 -512 197 -208 -82 -316 -300 -295 530 259 520 -86 -649 -121 753 313 143 -359 469 107
5445 107 -477 95 -183 -7 -467 -181 -360 288 -85 585 -265 119 74 -534 -120 335 -363 -254 97 184 200
5466B00l87J10N35q16P6O53m85j05M26j36n54N62K34J08j64j86N5r03O55m6N29
5487C61l68L11k15n57M09l76k6l64O44J8N02l10o2O3p60R30o76P28j47K66p94
5508d23L02l20J5O42k57J99l36M07p31P38p30J06J52L45l76M95K71j77N1k15N1
5529B09l30K19l00L36m5M94k63o49k36K21M66j85k67M32j42P5q6M9L69j98n30
5550c61K55N69m68j66J58n48Q30K09K01r31M88p2J50k80J11j56j75K00L6J62m92
5571b80N60MJ86o81K15j73N6K16J74p85J10O14n07J74j07M8N02M82p6r18K48L51
5593D13j80J61l12M82m64n5P90j167L42L74q0j131J165K02j70M5n00L12J38l75
5613a0j54O49j184Q40n80M60J38j06k64n92O27L15j81K66K55o18k50J79P93j30
$$ plain form
5466 200 -187 -77 458 -358 -282 371 -114 -219 207 71 -483 79 313 421 257 71 126 -777 -122 -168 361
5487 361 -7 304 89 -468 -59 -435 -461 -825 -181 -163 339 29 -33 30 -730 200 -476 252 105 371 -423
5508 -423 -121 -441 -426 216 -41 158 -178 229 -502 236 -494 -388 -236 109 -267 228 499 322 373 158 209
5529 209 -121 98 -202 134 89 583 320 -329 -565 -344 122 -63 -330 102 -40 35 -51 -2 367 169 -361
5550 -361 -106 463 -5 -171 -13 -561 269 478 679 -252 236 164 314 34 145 -11 -186 14 50 212 -280
5571 -280 280 284 470 -211 4 -169 -113 103 277 -508 -398 216 -291 -117 -224 -176 326 808 732 -186 62 413
5593 413 233 394 82 564 100 45 835 -332 10 384 304 -827 338 540 370 415 -85 227 365 -10
5613 -10 -164 485 -699 141 -439 21 159 53 -211 -803 -176 139 -42 224 479 -139 -389 -210 583 453
5633D53k00o0ko14Q4K30J2j05%J5J89k09N43l52j12j27M0rM26o56jJ90m7Q86k06
5658C68l3o18M59l22M02J07o27M59J26J8p54N85k6J83j61k39J69N18o80M01n60
5679b25J27N82p61N18n13o58J308p47L90j96O04q34Q46q3k6l53p4L91jL15p81
5700a71PL23n01K66M05m06P00l16N60r91L1k69O09q0j1l42P2j15Pj25M08k97j11
5723c47Q72n1m77k19o77O37o6M02l31O17k26M47k56m34l00K43K43l43O19l36J48
5744A65l87N38l99J16k35M07k77k49N47m83k60J12R67q84N31j4k85r7n6P20L7
5765E14j034N4L68m70P85n4j62k22N31J82l84O39p23n09N16l9M63j90L60j267
5785f42P29p00O54J67l58L06j87k03M18k55J9R4k6L88l40l13J53J88K5l38L49
$$ plain form
5633 453 253 193 191 -423 -339 -109 -97 -202 -202 -187 2 -207 336 -16 -128 -255 -215 -224 202 -454 -455 -265 -312 574 368
5658 368 335 -283 176 -146 256 363 -264 195 321 339 -415 170 144 327 166 -73 96 614 -66 335 -225
5679 -225 -98 484 -277 241 -272 -930 378 -369 21 -175 429 -405 441 358 332 -21 -95 296 295 610 -171
5700 -171 -164 159 -342 -76 329 -77 623 307 867 -124 -93 -362 247 167 156 -186 -114 -229 -222 -347 61 -236 -347
5723 -347 525 474 -3 -222 -899 -262 -328 74 -257 360 134 581 325 -109 -409 -166 77 -266 353 17 165
5744 165 -222 316 -83 33 -202 205 -72 -321 226 -257 -517 -405 562 -322 209 195 -90 -187 -243 477 514
5765 514 -520 -466 -98 -568 217 163 1 -221 310 492 108 747 24 -485 31 -8 455 265 625 -642
5785 -642 87 -613 41 208 -150 156 -31 -234 184 -71 -52 42 16 404 64 -249 -96 92 117 -221 128
5806A28j86N89m36O1l00l88P17j45k22j35K32N53n7m78J67J74q11J024p32L62
5826A17q5j81k04k80L64j88O51l12qO7J8O05n36N01m05m54P87m46Rn46M77J49
5848A00k07l29J07N29q8o53Q9L42p5L57mL34q72M79r8n9l66L65M12k54l50M9J86
5871fm77L57L8M57l96q2j35J69J28l02J04R8J06j93j80O39n13k0k44L9O69j82
5893G4J62m06O97p09j48K4jJ40L36o8j38q1Q5K18M89j574J326n53M21K78l68M1
5915B45k61L67n77L58M74q05J91N98j114P35l09K39k89P6N8qn23O92n49K06l99
5936e95J88O19j3j2k23K2l39N82k48j12N17J25p15m56K26O75L30o59j06L63m9
5957A20K10k51j13j5Jk61K66K37j77m44K63L2j89N22l84nl43J01J124j125L95
$$ plain form
5806 128 -58 531 95 156 -144 -532 185 40 -182 -317 -85 468 411 -67 100 274 -537 487 -245 117
5826 117 32 -149 -353 -633 -269 -457 194 -118 -126 -59 -41 564 28 529 124 -330 457 11 20 -526 -49 100
5848 100 -107 -436 -329 200 112 -541 -452 -110 -185 172 168 502 -370 109 11 -48 -414 -49 363 109 -241 -192 -6
5871 -6 -483 -126 -88 369 -27 -109 -244 -75 53 -249 -145 -47 59 -134 -314 325 -188 -208 -452 -413 256 74
5893 74 236 -170 527 -182 -330 -306 -307 -167 169 101 -37 -118 -33 185 674 -900 426 -127 294 572 204 245
5915 245 -16 351 -226 132 606 -199 -8 590 -524 211 -98 141 -148 -72 -14 -22 -545 147 -402 -196 -595
5936 -595 -407 212 199 187 -36 -14 -353 229 -19 -131 386 511 -204 -660 -434 241 571 -88 -194 169 120
5957 120 330 79 -34 -49 -48 -309 -43 194 17 -427 -164 -132 -321 201 -183 -188 -531 -430 694 -431 -36
5978c6k63L18j13n7L79l04M13l94j61P73k61J36j035J57J003o88P87q54N01o93
5998c92M97q41R47J7J19j39n0m35J034l39n09j26L51l33J77j94O02r69N07N11
6018D35p80M09m9j09M2M95n53L04o2n9M1l9j63jj59P08o50K90J26K9k55m61L15
6041a46J74l45L38l91N9K69J23K96j10k72K50n6l37L18k58L9L87n97m86P10J14
6062G9o20J04O62j26Nj92K10k24K18N44r29P64n54o8P0N87q68N46J85o51k48K72
6084b34M40k92J15O6L39p25L67p2N55l81l71j53L90J5O13o18Q8l3m18L82l74N37
6106B36m3j95K55O8n25L31n80P67m74N1J28j96O39n16L64m26J66K74l47N35p1
6127D41l45l95O58m32N90P6p01K12m78K23Q9p8L47k57l07P75P9j151L10J333j813
$$ plain form
5978 -36 -299 19 -94 -151 228 -76 337 -57 -218 555 294 430 -605 -448 555 -133 654 -200 301 -392
5998 -392 105 -736 211 228 347 208 158 -277 757 418 -91 -217 134 -199 -22 -216 386 -583 -76 435
6018 435 -345 64 15 -94 -52 443 -110 194 132 73 114 75 -88 -89 -248 460 -190 100 226 255 0 -461 -146
6041 -146 28 -317 21 -370 -311 -42 81 377 267 -5 245 189 -148 170 -88 -49 338 -259 -745 -35 79
6062 79 -541 -437 225 99 104 -88 122 -102 116 660 -269 495 -59 -127 -57 530 -338 208 393 -258 -506 -234
6084 -234 206 -86 29 95 434 -291 76 4 559 178 -193 -346 44 59 672 54 142 109 -309 73 -301 236
6106 236 193 -2 253 321 -204 127 -453 314 -160 -109 19 -177 462 -54 310 -116 50 324 -23 512 441
6127 441 96 -299 359 -73 517 593 -108 104 -374 -151 -62 -140 207 -50 -357 418 497 -654 -344 989 -824
6148h24O97K71k61L38j47J67j48l05J45j56N22j81j37k72J00M36m60l87L63L70
6168A31k2m49J62N66k53K39P3q86O54m11J38K10j71k1L01j24k38M68o21M83J20
6189C49k10m73J8O23p83M17O48n68m27k2Q28l57q8o4J58j05K29K57p92%K40j22
6211b44O02j16k9k04J19j67J69%n79kM16k92K03K17l42L80m72M78o08K17K87m07
6233c74O15l84M79r58P74M76p21M18j2o36P04r15O05k07K37P95j090L19N58j426
6253g43N56P19l85P8O5o15MR30q4k38j04J34K53m78l03K64k39K28k40o45J177
6274C34q41J007o09n38J064p7n76P83K98n01R2j88k17j16n46M94k67P17k91j98
6294a76l51O57K01k86J49Q5j95L96o44k11N55j90N1m42L64k63M15k76Q6J43l24
$$ plain form
6148 -824 -127 144 -117 221 74 241 93 -212 -67 -223 299 118 -19 -291 -191 245 -215 -602 -239 131
6168 131 109 -340 -178 388 135 374 447 -439 215 -196 -58 152 -19 -40 261 137 -101 367 -254 229 349
6189 349 139 -334 -316 307 -476 -59 589 21 -406 -428 400 43 -45 -109 49 -56 173 430 -362 -362 -122 -244
6211 -244 358 242 213 9 128 -39 130 130 -449 -451 -35 -327 -124 93 -249 131 -341 137 -471 -254 33 -374
6233 -374 241 -143 336 -622 152 628 -93 325 313 -323 381 -534 71 -136 101 896 -194 125 683 -743
6253 -743 -187 532 147 225 290 -325 -321 609 525 287 183 317 570 92 -211 53 -186 42 -198 -843 334
6274 334 -507 500 -109 -647 417 340 -236 547 845 344 436 248 31 -85 -631 -137 -404 313 22 -176
6294 -176 -527 130 331 45 194 279 84 480 -164 -375 180 -10 41 -401 -37 -300 115 -161 -75 68 -256
6315b56Jk83M75R77n84k05k17K14J53l83K00l09L68n03M23l8l95O34M53r93o8
6336c36O39j34l54K25l59K82n85J274j061P56m42o31R45o88R12p37l30M35L47
6355A58K60m00J19Q4k03p5k62L15J6q6j86K18n97K62L54M6K04m20L27m07j54O69
6377B42j53o07L87K51P9O59m54o57L42L10o79P02m6k13j95L61l77L02j51q90N69
6398b18j08M48m68K07M50K85p31M43k14k39p6N30j5q81M75K09k45P2jJ42K29q5
6420B09m37K39k80k32J033n77j01O74J85j062Q37p02L2K95K05n30M77L55o61N64
6440E23n21K00m81M19j15p24O01j22j81L25n22P47m28N94q50R94k74p6K38m39
6460i2pK92m18M44L99r35N91l30l33M7P52l95J05p01O98k28L7q5l75P31L34j112
$$ plain form
6315 -256 -255 -538 -63 914 330 125 -92 122 275 -108 92 -217 151 -352 71 33 -362 272 725 -268 -336
6336 -336 303 169 -185 40 -319 -37 -622 652 -409 347 -95 -726 219 -469 443 -294 -624 -189 158
6355 158 418 18 137 221 18 -57 -319 -4 12 -74 -260 -42 -639 -377 -23 23 227 -193 134 -273 -427 242
6377 242 89 -518 -131 120 199 858 404 -253 89 399 -280 422 376 163 -32 329 -48 254 103 -787 -218
6398 -218 -326 122 -346 -139 311 596 -135 308 94 -145 -221 309 294 -587 -112 97 -148 -76 -77 65 294 209
6420 209 -228 11 -269 -501 532 -45 -146 528 713 -349 488 -214 -182 113 318 -212 265 620 -41 523
6440 523 2 202 -279 140 25 -699 -98 -220 -401 -76 -598 149 -279 315 -535 459 185 109 347 -92
6460 -92 -99 193 -225 219 618 -317 274 -56 -389 -342 410 15 120 -581 117 -111 -74 -159 -534 197 531 -581
6482e81Q02q40PO84m80R79M9Q1r79N39Q7k83L77q42N42L4p41J99O47K30m43K42
6504C10n81p4M99q23Q37j97j5j28J9M03q9j88K76j70n59N92o5J20j45K22j47n77
6526d80K02M93k70k79M31lJ93l90Q3J71m69N2j5J01J97J01K3R9k08K43K87p40
6548a78O14m60K74j66J07n34n7L3M41K59m65J66n10O36j42j70K20n3K29m98q1
6569c35K92j28L72m23l4J47L76m58O4L24l0j66j8J77K30l26j4k10l00K12M21k
6591A71l39J66j23K33j116Q57K86j62Q31n32n66J77J49P5L46O7j34j29J83M26
6611H66j285O11q3M53j060O31m30Q9L07k98M09m59M77j8p6j93j45J73j28j65K33
6632i1L86j11r8j57l00K28J19K71j27r0M1K31o01M34j98L1K72l88N17j51l57N87
$$ plain form
6482 -581 221 -619 -612 72 -408 571 620 701 -278 261 348 65 442 -400 142 176 -565 -366 281 511 68 310
6504 310 -271 -345 154 -669 168 -29 -44 -172 -153 250 161 -27 249 79 -480 112 47 167 22 244 97 -480
6526 -480 -278 215 -55 -334 97 94 287 -103 -20 151 -318 -266 -281 -180 17 118 141 240 32 275 562 -178
6548 -178 436 -24 250 84 191 -343 -400 -367 74 333 -132 34 -476 160 18 -152 68 15 244 -254 -335
6569 -335 -43 -171 201 -222 -256 -109 267 -191 -127 197 167 1 -17 160 390 64 50 -160 -460 -248 173 171
6591 171 -168 -2 -125 108 -1008 -151 135 -27 804 272 -294 -117 32 107 453 520 386 257 440 866
6611 866 -419 192 109 562 -498 133 -297 -208 99 -199 210 -249 228 210 134 -59 -204 -31 -159 -324 -91
6632 -91 295 184 86 -71 -371 -143 -24 247 120 30 71 302 -299 135 -63 -32 240 -148 369 218 -139 448
6654D48j45l32P60l33l55p0K73N67j100J58j98L66J30o68K59k30N16r6L4L14j15
6675A83m86M31j90J46m44M34J73l59J82m63P09n48Q23l64q46R54k63O98j144J77
6695a97M56l52k20J33k08M14j95l60J037m88M05r96P02j74k48Q4K53K09j20J35
6715B70k82K01J12P0o75J7N04m29J93K18l70j1l2o7N66j077N56Q82r75K90r6M08
6737B73L37p73p3L41K6k85m56P23k48RO21p27K00R7k28N41k85N78n88J17L0p5
6759A55l7n33J35M83l95M18k07j77q8O91o84K93O19o00j59k82K21N20l10M99p61
6780a99K55k10J84l71N27l47r6K62L2j92J44Q2j46L79J56r11M18J90l37L13p67
6801f34M60n19Q0L78O97n18J67o9M30K06j157L98K48j12n61O06N45r05N2K76L06
$$ plain form
6654 448 303 -29 731 398 43 -27 246 813 -287 -129 -327 39 169 -499 -240 -470 46 -50 -16 298 183
6675 183 -303 128 -62 84 -360 74 247 -112 70 -393 316 -232 591 227 -619 335 72 770 -374 -197
6695 -197 259 -93 -313 -180 -388 26 -169 -529 508 20 425 -571 131 -43 -291 -207 46 255 135 270
6715 270 -12 189 301 371 -304 -287 217 -212 -19 199 -171 -182 -214 -281 285 -792 -236 646 -329 -39 -135 273
6737 273 610 -163 -236 105 131 -154 -610 113 -135 -126 495 -232 -32 65 -163 378 93 671 83 200 230 155
6759 155 118 -415 -280 203 -192 226 19 -158 -246 445 -239 54 673 73 -86 -368 -147 373 63 562 -199
6780 -199 56 -154 30 -341 186 -161 -257 5 37 -155 -11 71 -75 304 460 -451 -33 157 -180 133 -634
6801 -634 -174 -693 -613 -235 462 -56 111 42 472 678 -479 -81 167 55 -506 100 645 -260 -208 68 374
6822C74k48J29j26K45J36p52J42L67K31k69l52J95p1P6k27m4l37L05NL65P59o95
6844B08r0k22k44J33j51L56n87K47NK34M75l15j04K06l1m64Q09m10l59Q02j84
6865C14n37K36l30l39R45m75J10K48p43K99K04N3q22L73L53l83R05l55q9K35p0
6886A32m83K71n01L35J53N46n14M33o50R3N00l87j15K79N9J82m42m7M83o41J58
6907a56O2n5k41J64m0M49l87j22J73J79K8l57K94J22l16O70l54k81n1M74N5J55
6929D65p57M86R5k66K31k22o9l4N31n03k20K40l71N20r2m13k96N53M50Q7k06n83
6951c74N62L88m91K52l40K49k62K14J33k13K21j11k40j47M59n62K00Q7O7j21K62
6972B33o15O90m93l88P82j06m01M50J2o68L24O64n93K23j1o19L69N34L43j150
$$ plain form
6822 374 126 255 129 374 510 -242 -100 267 498 229 -123 72 1 77 -150 -194 -531 -226 -221 144 903 208
6844 208 118 -104 -348 -215 -366 -10 -597 -350 -345 -111 364 49 -55 151 120 -344 465 55 -304 498 314
6865 314 -223 13 -317 -656 289 -186 -76 172 -571 -272 -68 -15 -837 -464 -111 -494 411 56 -33 202 132
6886 132 -351 -80 -581 -246 -93 453 -61 372 -278 -185 315 -72 -187 92 151 333 -109 -156 327 -314 -156
6907 -156 -94 -149 -390 -226 -266 183 -204 -326 -153 26 54 -303 -9 113 -203 467 113 -168 -219 255 310 465
6929 465 -292 194 289 23 254 32 -37 -71 460 -43 -263 -23 -394 126 34 -379 -675 -122 328 415 209 -374
6951 -374 188 576 85 337 -3 246 -16 198 331 118 339 228 -12 -159 300 -262 -62 25 92 -29 233
6972 233 -382 308 -185 -573 209 103 -298 152 164 -504 -180 484 -109 114 103 -516 -147 387 730 -420
6992d20L3K09J45L34k46j51k96R60m62K90l90n18J31K44k57j43J43K10L20K04
7012C40o10N53m75J02N0Q1J97Nj61k18J053j067M45o79K78nN56p20K75J75K3m51
7034b53K64P0j42j32l7N58J15j57K13o22M2Q34l02k4j9q91M84l3J84k64j68J20
7056a60L22K1k78L14k91n47P99Oq00M05o6N79l02M60n35n1m08M50L41l84j4m6
7078a85k2j02j11J30N76l72q1N01n41j70P38p52N40R2q8n16M85l50K98L44L60
7099G74q31K67K17m45J97J30J13p34p6J42J99R4m77J96j3J9J08k07K99j62J25
7120f5N54n99R5m1k68P59j08k80L33k40L14l50j3K74p48N06o7p4m7M12J46j017
7142e24O44o96K92P94j011J87M40j93N9j80K55j01o7Q4P0j12P52n40k69L04o25
$$ plain form
6992 -420 -387 -178 -33 301 55 -96 -392 568 106 396 6 -512 -381 -137 -394 -537 -394 -184 136 340
7012 340 -270 283 -192 -90 -40 41 238 243 82 -136 917 -150 295 -384 -106 -111 445 -275 0 175 198 -253
7034 -253 11 81 -61 -193 -230 328 443 286 499 -123 -81 753 451 427 408 -483 1 -32 152 -112 -280 -160
7056 -160 162 183 -95 219 -72 -619 180 186 -614 -209 -275 304 2 462 -73 -124 -532 -82 259 -125 -139 -185
7078 -185 -207 -309 -420 -290 286 -86 -167 334 -207 -377 361 -391 149 241 153 -363 122 -228 70 414 774
7099 774 -57 210 427 -18 179 309 422 -312 -388 -246 -47 47 -430 -234 -247 -228 -120 -327 -28 -190 -65
7120 -65 489 -110 -15 -56 -324 435 327 47 380 140 454 104 91 365 -383 123 56 -18 -65 347 493 -524
7142 -524 120 -576 -284 510 -501 -314 126 -67 -8 -188 67 -34 -101 -17 53 -59 693 153 -116 188 -437
7163d37M67MR5j74j33O10q89N56N08j070N77Lj028R32J78m18l27l4J015m82l26
7184c73J053n67j62m0L42m83m59O23L02q21R17l79r9p3K82l85K76L41m44k49K62
7205a36N88m26j06R4J75j77k21nJ48k65L78j63n2M28J24l27J22J52l63L01p80
7226e11R37p45M89l58R0L28j61M29n30l18L66K70k42l85mO40p74K65M1p8J13L28
7248A90k52q6M62j65l28O15m3n30l41N10l31Q96M70r24l3J88k00m55k06O57k70
7269a76M12p67P18J2oq7m16R96n15J49j26m97Q6M89l82J68j64K73Jm35Q16k29
7291C20j18r3r2m41L54j06m5P34k07m79l04M92Q1J04o13K65k93P36o51K6m62P73
7313a9J00k38l30j78N01K89P4o96L90n0Q22p62r5M62j64j00j25k6K68QJ72n41
$$ plain form
7163 -437 30 34 129 -45 -178 432 -457 99 607 -463 114 117 -911 21 199 -219 -546 -580 435 -47 -373
7184 -373 680 113 -49 -89 253 -230 -689 -66 236 -585 332 -47 -146 -219 63 -322 -46 295 -149 -398 -136
7205 -136 452 26 -80 14 189 12 -209 -214 -66 -331 47 -116 -168 260 384 57 179 331 -32 269 -511
7226 -511 426 -319 170 -188 -98 230 69 498 -32 -350 16 286 44 -341 -345 295 -479 -214 -173 -251 -138 190
7248 190 -62 -148 314 149 -179 436 393 -137 -478 32 -299 597 1067 143 110 298 98 -357 -563 94 -176
7269 -176 236 -531 187 199 193 106 -310 686 171 320 194 -303 -217 272 -110 58 -106 167 168 -267 549 320
7291 320 202 109 17 -424 -70 -176 -221 513 306 -173 -477 15 96 200 -413 -148 -441 295 -356 -330 -792 -19
7313 -19 81 -157 -487 -665 -164 125 199 -497 -107 -157 665 -97 -192 270 106 6 -119 -145 123 131 303 -238
7335b38J45j31k12J99P89n52l46O47o39M73L11l94M78j021P79l93k06Q17m17l8
7355E1O7r0J93m16L92n41L23j08j55m37Q44J6j26P1l72J47J50l48L85K12j04k79
7377a25m23K98l1M49l73J60m10L24n35R58n99M23k59j66o07R14K27j98J7L30l00
7398G4l20p5j29M63r3O28l17j70k76J61M38r30Q77r7O2p9N8m22N4k48J24L45r
7421A19jk35K47k56P6L68J21m18L02r7O5q51O63j29n15J0M10K49n4M20o06m00
7443e12N10M11q4Ol36L62p61L84J8O9JJ68n44L79N61n08j84k51P24m92j13J12
7465h0K64k64N64j01j87o84O13J38K63o3m02M1K99n24K19O45p61p3J27K36MK2
7487B96l47j23M12m29Q0J83L12q79K10O90m73Q25n80J23n80N42L6Q5o06l76K82
$$ plain form
7335 -238 -93 -224 -436 -237 552 0 -346 301 -338 135 446 52 530 -491 288 -105 -311 506 89 51
7355 51 118 28 221 -195 197 -344 -21 -129 -284 -721 123 139 13 84 -288 -141 9 -339 46 258 154 -125
7377 -125 -548 -250 -281 168 -205 -45 -455 -131 -666 292 -307 116 -143 -309 -916 -2 225 27 44 374 74
7398 74 -246 -321 -450 13 -80 548 231 61 -215 -54 384 -546 331 234 296 217 275 -147 -93 -341 -217 128 119
7421 119 118 -117 130 -126 -50 318 439 21 323 226 291 -560 103 -26 -541 -531 -121 128 74 494 -112 -512
7443 -512 -2 409 325 331 -5 357 -404 -20 -2 67 68 236 -308 71 632 124 -60 -311 413 -79 -192 -80
7465 -80 184 -80 484 383 196 -488 125 263 526 463 61 102 401 -123 96 741 -20 -93 34 270 274 296
7487 296 -51 -174 238 -191 -111 72 384 -495 -285 405 -68 757 177 300 -280 262 298 383 -223 -599 -317
7508c17M59J06p66M62J95l57L13J95p7m52k77M0K62p0L39J1K63k92n9k72M02k27
7530a19O2j34L8o8K83m11L1K31n33N14j12M00J58K59l21n18j23N49Q8k97L12p36
7552d47O2O08k21K7K29r9m44P83q59P12n5n09k99J73N70ro45L26l80N02K67j63
7574A29M32j314R26n52K61J72k4l60j26M50K12m89mK43J7o1L24p16R7L47O26r40
7596c50N06k48j50r8N99n55K03k70j00M9O18m94M59J000j064mM8l66P54n07n55
7617e25N38j83n58M27N2M97k68P68o92l40M72o29L72J41l30L27j08k57J47n52
7637g01K19N47j43m55K88J73j1q7j08L48K70o07p4q6M53p33J084o8k19l11M47
7658B26P8j6q1n71j28l5j79L05J105j135N57m12N80k62J77m79L60K21m81Q5k16
$$ plain form
7508 -317 142 248 -518 -56 139 -218 95 290 213 -239 -516 -476 -214 -284 55 66 329 37 -22 -294 108 -119
7530 -119 -57 -191 -153 -221 62 -349 -318 -87 -620 -106 -218 182 340 599 278 -240 -363 186 274 -23 289 -447
7552 -447 -385 223 2 29 258 159 -285 498 -361 351 296 -213 -512 -339 231 222 -423 -97 -477 25 292 129
7574 129 561 -753 173 -379 -118 54 30 -330 -456 -6 206 -283 -287 -44 -27 -88 236 -480 -383 -36 590 -350
7596 -350 156 -92 -242 -340 259 -296 -93 -363 -463 -414 204 -290 169 1169 105 101 149 -217 537 30 -525
7617 -525 13 -170 -728 -301 -249 248 -20 748 56 -284 188 -441 -69 72 -258 69 -39 -296 -149 -701
7637 -701 -482 65 -78 -533 -245 -72 -83 -170 -278 70 340 -267 -341 -427 26 -707 377 309 90 -221 226
7658 226 304 288 207 -364 -492 -527 -706 -401 704 -431 126 -286 294 32 209 -270 90 311 -170 -85 -301
7679c01L15n2j63K12m16P68m25m94P96m71L30o05J199k92j48L07l68o15M31n5
7699d7L38m91R0R0K6l04Q22p49N42l32o3J95P0j45m93R11o79L07m48J092q18J
7721h5j25J1O3K96J73l26n02M26j80K32K4L58j91k15L76o88j9L3Q24p72M84M00
7743E97n06L03m37j24Q22n24k99j03K90j37P8J21m41K78k05K66L05o9n13L92O2
7764A56p45Q03q32J496q49l06L66n32O21L4p0K46o19O87n20k44L37M23n07N78
7784E23m12J96k75j54P6K67k65P97k67n97L55l24P9J5N4j45P18m84K64o45L44
7805A20J61n49o45J553n67K89N0n44oj80J55K00Q6m92K16k25O51m00J75L19p72
7826d05O87k8l56P0N50n62l86N10n48K52K66K34m26P5L17p87K64K26k56M85m25
$$ plain form
7679 -301 14 -38 -201 11 -405 363 -62 -556 240 -231 99 -506 693 401 253 560 192 -423 8 -47
7699 -47 291 -200 -110 -20 6 -298 524 -225 317 -15 -78 117 187 42 -451 460 -219 88 -360 732 -86 -85
7721 -85 -210 -199 -136 160 333 7 -495 -69 -249 -17 7 365 174 -41 335 -353 -372 -339 485 -287 197 597
7743 597 91 394 -43 -167 655 131 -168 -271 19 -118 -40 81 -360 -82 -287 -21 284 215 -298 94 156
7764 156 -589 214 -618 878 29 -277 89 -443 178 212 142 388 -231 456 -64 -308 29 452 -55 523
7784 523 111 307 32 -122 -46 221 -44 753 486 -111 244 -80 -1 14 68 -77 641 157 421 -224 120
7805 120 281 -268 -913 640 73 362 412 -132 -138 -318 -163 37 123 -369 -153 -378 273 -127 48 367 -405
7826 -405 282 254 -102 -32 518 -44 -430 80 -468 -216 50 284 -142 -67 250 -537 -273 -47 -303 182 -243
7847b43M98p84J38K08o8N13K27j07P4rl06j58N29j044L93n8o5N07l44L01K70l20
7869A52k6l11N62k05n59N92m82P43R2p86J30M73Mo14l03Q86m90L55rk46K98r18
7891f62PN32K4J62L75j73q07O67K19m7k83K48k6q69N48J53k03j43J30N49p45L73
7913B9M76l27m41J08m67L36L04Q31m78n24k23N18j90L50J69r59M28R8n03L49K16
7934A00R4P9q33P54q77Q19n50K78j04N29o45O79n12q1N78m05k87P9L19l67M77
7955A24o6m06L31k68L22k78O28l05O81r37P42n86k79O21p06N07K16j05R9o77P08
7976C66j63j94k05N4j78P50m94Q3j4o00K56N70N99j007k89P66j42p36n4Q33k80
7997g9n60R28J27k87k13L34L3o59N94l47j04J55Q1j83N99j197P97O17j131Q43
$$ plain form
7847 -243 255 -529 -391 -183 -251 262 489 382 456 447 141 -17 512 -532 -139 -197 -262 245 -99 202 472 152
7869 152 126 -185 377 172 -387 205 -277 466 558 -228 -98 375 379 -235 -538 348 -142 213 204 -42 256 -662
7891 -662 -655 -123 -99 63 438 265 -542 125 344 297 14 262 236 -633 -85 68 -135 -278 -148 401 -344 29
7913 29 505 178 -263 -155 -622 -286 18 849 371 -153 -376 142 -48 302 471 -488 -60 38 -465 -116 100
7934 100 194 273 -560 194 -683 136 -414 -136 -240 289 -356 323 -189 -270 308 -97 -384 -305 14 -353 124
7955 124 58 -348 -17 -285 37 -241 387 82 763 -174 568 -18 -297 324 -382 125 341 236 335 -342 366
7976 366 203 9 -196 -142 -320 430 -64 19 5 -595 -339 231 830 -177 -466 300 158 -578 -632 201 -79
7997 -79 -639 289 416 129 -84 250 283 -376 218 -129 -233 -78 3 -180 419 -778 19 636 -495 348
8017C48K33p07m30O13n1l56O51k53o5P32l13n42O87j77n92J23L30q22N66n1L75
8038B99m81j55M40m12n4M49k72N46n66M08p55M05L02P3l26K1J61j003J079J18
8058B77O5l42j66J73j90O1p4M03J30m42K22m26K32O56n04q5J28R6p6j13k7l33
8080c35M94J95K4j83k9r05J073m31j47P12J84j150N05K71p4j21k93J85R3J1k92
8101b13M56K13n92j11Q75m01l33L55j85O0k93L73M44p84l80L86M72p72M65k36
8121b01J63m81K99J62K40L60j007P34q6n98L03k71K50N43m32l38l94Q78L32l49
8141A07j02q9Kj62L12J0K75j77m98k22M60N35m20m77P09J67o27j38J04L38K17
8162C24l13j71M90n04K1O32n64k38k19j1O13o8L4j41O87n39m28L61j02J26J082
$$ plain form
8017 348 581 -126 -556 57 6 -350 301 48 -17 715 402 -140 547 370 -222 -99 231 -591 -25 -76 299
8038 299 -182 -337 103 -309 -363 86 -186 360 -206 202 -553 -148 154 227 -99 -78 83 -920 159 277
8058 277 342 0 -166 7 -183 -122 -196 207 337 -105 117 -309 -77 579 75 -10 118 214 138 25 -2 -335
8080 -335 159 354 378 195 166 -739 334 -97 -244 468 652 -498 7 278 204 83 -210 -25 68 79 -213
8101 -213 243 456 -136 -247 628 227 -106 249 64 124 -169 204 648 -136 -516 -130 342 -430 35 -201
8121 -201 -38 -519 -220 -58 182 542 -465 269 183 -415 -112 -383 -133 410 -22 -360 -754 124 456 107
8141 107 5 -84 -82 -244 68 78 353 176 -322 -544 -84 451 31 -446 263 430 -197 -335 -231 107 324
8162 324 11 -160 330 -174 -153 479 -85 -323 -542 -553 60 -8 26 -115 572 33 -395 -34 -136 -10 1072
8183A072q00M4q06J52J055j603P31L58
$$ plain form
8183 1072 272 316 -490 -338 717 -886 -155 203
8191B03
$$ Imaginary data points
##PAGE= N=2
##DATA TABLE= (X++(I..I)), XYDATA
0@%%%%%%k6N8o4O4o4Q5j17J28j60K05k37K88l52M16m80N50o40P41q48R70j109
27e92J266j435J617j819K045k292K567k871L197l558L952m381M861n385N955o598
43c471P306q089Q973r968J1104j2409J3921j5697J7834k0454K3747k8043L3904
56A8658m2414N5974q0994J42224n60914q71523J107293R60953j40365p46924k14849
67c72881J42162K17410J83288J22491k52054l47459K9775L85261J14449k15996
77F446j09109J33675j8256j81657m095K01097P015k01354j0822L03190J68523
88B94653k12554k65887K548P3420n5771Q233K26070J73775j29791k75443r7876
99b58623J54059K27629R9196r1110j89411r7227J22701K03085j2666k49461j51005
$$ plain form
0 0 0 0 0 0 0 0 -26 32 -32 32 -32 53 -64 64 -96 109 -128 160 -192 224 -256 294 -346 395 -453 517 -592
27 -592 674 -761 856 -963 1082 -1210 1357 -1514 1683 -1875 2077 -2304 2557 -2828 3127 -3471
43 -3471 3835 -4254 4719 -5249 5855 -6554 7367 -8330 9504 -10950 12797 -15246 18658
56 18658 -23756 32218 -48776 93448 -467466 -1338989 -231696 729257 588892 -158032 -372881
67 -372881 -230719 -13309 169979 292470 40416 -307043 -277268 107993 222442 6446
77 6446 -102663 31012 12756 -168901 -172996 28101 35116 -166238 -177060 126130 294653
88 294653 82099 -183788 -181240 -107820 -163591 -155358 70712 244487 114696 -160747 -258623
99 -258623 -104564 123065 222261 131151 -58260 -155487 -32786 170299 157633 -91828 -242833
110b42833J59813K49376K1341k04113j73321M0138J88615J24861p0526j75642
120h2291o4590J15998J13429l9633q1646K2664M8016l1742n6834l3823j2316J01961
132h07K30411Q7494k42896k74174O3427K53057M0844j84242j00761P2515Q3665
143B8533N3281N8853o1360k16750p4340K45942K32264j34617k99749n9286J77036
154e0193J29170N303r059m8306j32313m0580J80884J63213j12766k01022J6303
165i9366J47963K2792p0870J2761N9566l4984p4087L5453Q7073l7672j32884l5312
177a19567P8779N6174K0312N0835J040j38352j24575R4295K01604J4101j86848
188e2202j08495R5339J22314J4955l6426m6812o9036p160J21114J11746o0332
$$ plain form
110 -242833 -83020 166356 187697 -16416 -189737 -149599 39016 163877 93351 -82291
120 -82291 -146881 -30883 82546 42913 -38733 -16069 31947 205 -56629 -90452 -102768 -807
132 -807 229604 317098 74202 -199972 -136545 116512 157356 -26886 -127647 -55132 28533
143 28533 81814 140667 79307 -137443 -211783 34159 266423 131806 -167943 -227229 -50193
154 -50193 78977 84280 75221 26915 -105398 -145978 34906 198119 85353 -115669 -99366
165 -99366 48597 71389 519 13280 72846 37862 -36225 -772 86301 48629 -84255 -119567
177 -119567 -40788 15386 35698 86533 87573 -50779 -175354 -81059 120545 134646 -52202
188 -52202 -160697 -65358 56956 71911 35485 -11327 -80363 -87523 33591 145337 85005
199H5005j42863j9572J09209O9955m3278p3308l2569k868K3695N2432K3139m4695
211D282m8108J6476M7014J3241k1260k2340k433M742r608k5874j3366K0588L7076
224D30J4952j4334J80L3858K3797j9038l3366k3328k2004K167M7292M0467k3021
237B8052m3013Q134M0165Q219k6216j7980m563j8859j0946L7129M3670k5077o9851
250e1136j8022N3857M8179p373l4393k1503l687J0737L7147L8226j9460p1541
262c8969k1879O5766O1696j4959n1016k4571J494J4054L7299L5113k6624p2497
274c5093j8155O5415M9046m0626o1665p449K2852J5011K1935K7013j8242n9227
286c9185k2142M8679N0133j5470m7444j7614J3327K4646L7626K4106k7590n5108
$$ plain form
199 85005 -57858 -77430 31779 101734 58456 -14852 -47421 -50289 -26594 25838 48977 4282
211 4282 -43826 -27350 19664 32905 11645 -10695 -13128 -8386 -17994 -43868 -57234 -36646 430
224 430 15382 1048 1228 35086 58883 39845 6479 -16849 -38853 -36686 10606 51073 28052
237 28052 -14961 -6827 33338 41557 15341 -2639 -7202 -26061 -37007 122 43792 18715 -51136
250 -51136 -69158 -15301 32878 25505 -8888 -30391 -34078 -23341 13806 52032 32572 -38969
262 -38969 -60848 4918 66614 51655 639 -23932 -22438 -8384 28915 64028 37404 -35093
274 -35093 -53248 12167 61213 20587 -41078 -48527 -25675 -10664 11271 38284 20042 -39185
286 -39185 -61327 -12648 37485 22015 -25429 -43043 -29716 -5070 32556 56662 29072 -26036
298b6036q504M9298M2045j6012n2865k9648K1869M3948K4809j3249l9926k8945
310c3216J3738L9500J4884l4240m5866k907M4045L7606j1482l3886j1107J1916
322a1015Q015j572p751n388O124J9098J2243r974j5454N250K3212Q326k3981k6882
336a9749L373K3064J0793j4257k2556n647K1552K9957N755k2134k7207r999J4090
349a2965J9642m694k8403j7509J6816L2575J4652j4590j7395j344P262N513K794
362B354J839j865n12K992m919r642N717J6797k542k7048j0326K8521M0234K057
376D3657m0068l5732J250L1494K4934j0348m2026k5345K5177M9963J9538k9064
388A3430m4685r537L8978M5187r83m5158m1507N200M3438L3376j2287l5248j4061
$$ plain form
298 -26036 -34540 14758 56803 40791 -12074 -41722 -19853 24095 48904 35655 -4271 -33216
310 -33216 -19478 20022 34906 666 -45200 -48107 -4062 33544 22062 -11824 -22931 -11015
322 -11015 -3000 -4572 -12323 -17711 -11587 7511 19754 9780 -5674 -424 22788 31114 7133 -19749
336 -19749 -16376 6688 17481 3224 -19332 -24979 -3427 26530 32285 10151 -17056 -27055 -12965
349 -12965 6677 1983 -26420 -43929 -27113 5462 20114 5524 -11871 -13215 -5953 -440 2354
362 2354 4193 2328 1816 4808 -111 -9753 -4036 12761 10219 -16829 -27155 1366 41600 43657
376 43657 3589 -32143 -30893 601 25535 15187 -26839 -52184 -27007 22956 42494 13430
388 13430 -31255 -40792 -1814 43373 42390 -2768 -44275 -39075 4363 37739 25452 -9796 -23857
401b3857K4038L5307P147l2330l3936K13K3848J5246o514j2218j759J0358J0602
414A6145l496j5108p557L960M614n114o575N773J7427Q298j0499j6212k535J3776
428B897J7168J198k2970k0175P570K6746J0059j8115k0034J266K1716J6551l709
441B0168j7979j5687L489J8015N377j6657j8591O646J9281P209j2656j3889L688
454a1586J5662J0075n498j3096k719J3755J2104r695k5431j5111J3251K9305J3446
467B4462j5341k2282J225K6115J8903j0875l2019k0668P748K7980J6162j6194
479E216k7718m069K5474K6049k238k6063j5344Q315K0576P082j1107j7278o863
492a7968Q471J2525M892j140j985j564k249p55P66P11l98K25k397j968M436Q790
$$ plain form
401 -23857 181 35488 42635 10305 -23631 -23418 430 15676 9162 -3056 -4815 5543 16145
414 16145 12649 -2459 -10016 -6056 -1442 -6556 -13131 -7358 10069 18367 7868 -8344 -10879 2897
428 2897 20065 21263 -1707 -21882 -14312 12434 22493 4378 -15656 -14390 7326 23877 20168
441 20168 2189 -13498 -10009 8006 13383 -3274 -21865 -15219 4062 11271 -1385 -15274 -11586
454 -11586 4076 14151 8653 -4443 -7162 6593 18697 9002 -16429 -31540 -18289 11016 24462
467 24462 9121 -13161 -11936 14179 33082 22207 -9812 -30480 -22732 5248 21410 5216
479 5216 -22502 -26571 -1097 24952 22714 -3349 -18693 -10378 10198 17280 6173 -11105 -17968
492 -17968 -9497 3028 7920 6780 4795 3231 982 227 993 1704 1306 1531 -866 -2834 1602 10392
508A0392L21j4574j4886J674J6777J0654j845r641q551J971J5405J2270j1941
521H026k5325p634K0869K3424l065j9336j0475N831J1401P103j882j1300q354
534a0717Q481J6023J476j7238j3036N765J2035R39q745k293M329J983Q4M77k387
549b824m570L856J0188K003j1667r491O439J0498j946j2538k409Q410J0422N602
563A1973N11p036r387k634P757L605q446q942M681J1194J430l041j884M41l490
578c268j063M003L771l819m686j141J366K190M076L107j334n271j487N148N597
593G189M86n888o748j657O780R405R96q664p023K103P664L792m643q333o552M845
609f248J1996N957p615j1845k128Q413O354l70l210l565j322K573N414K380o825
$$ plain form
508 10392 10713 -3861 -18747 -17073 -296 10358 8513 -1128 -9679 -7708 7697 19967 8026
521 8026 -17299 -24933 -4064 19360 16295 -3041 -13516 -7685 3716 10819 8937 -2363 -10717
534 -10717 -2236 13787 15263 -1975 -15011 -9246 2789 3728 -5017 -7310 -2981 -998 -914 -437 -2824
549 -2824 -7394 -3538 6650 8653 -3014 -12505 -6066 4432 2486 -10052 -12461 -4051 6371 11973
563 11973 12484 5448 -3939 -6573 1184 4789 -3657 -12599 -7918 3276 4706 1665 -219 222 -3268
578 -3268 -4331 -328 3443 -376 -5062 -6203 -4837 -2647 1429 4536 3202 -2069 -3556 1592 7189
593 7189 7675 1787 -4961 -6618 162 9567 10563 1899 -5124 -3021 4643 8435 3792 -4541 -11093 -6248
609 -6248 5748 11705 4090 -7755 -9883 -1470 4884 4514 1304 -2261 -3583 -1010 4404 6784 -41
624d1p573J749R608L200l257k484K397M2k389J667K437l715p729L8N851K307m690
641b582l84M175J020l374K791L986l126q060k75N261n65n854J189Q602J317l480
657F41l22O067m78n814j241L117k379n028L183P292k214m616n76N617K380l867
673A762k334N92j638j802L219K418l305n591R60N246L448k586j260l34M27M05
689c73J252J589k010l136l09L206K440J8j211k074o82K101L365J277k703n302
705b552j731K665L896P4l708m557Q74N938O022k170o399l141Q75L828J830j544
721B00l952k461M055P541L391o233o069K377L807J629k757j970j615j01J770L521
737C133j16m642o09L805K403m294k432J630J941l227j938L793K429j735j763J995
$$ plain form
624 -41 -7614 -5865 3743 6943 3686 1202 3599 3641 1252 2919 5356 1641 -6088 -6050 -199 2108 -2582
641 -2582 -2966 1209 2229 -1145 1646 5632 2506 -5554 -5829 -568 -1133 -6987 -5798 2804 4121 641
657 641 319 6386 5908 94 -1147 1970 -409 -5437 -2254 5038 2824 -1792 -2368 3249 5629 1762
673 1762 -572 20 -1618 -3420 -201 2217 -1088 -6679 -5719 -473 2975 389 -871 -1205 -778 -373
689 -373 879 2468 458 -2678 -2987 219 2659 2677 1466 -608 -1290 811 4176 5453 2750 -2552
705 -2552 -4283 -1618 2278 2352 -1356 -5913 -5039 899 6921 4751 -1648 -4789 -3914 -86 1744 200
721 200 -3752 -6213 -2158 5383 8774 2541 -3528 -1151 2656 4285 1528 -442 -2057 -2158 -388 3133
737 3133 3017 -1625 -2234 1571 3974 -320 -2752 -1122 819 -2408 -4346 -553 1876 141 -1622 373
753C73k13j858J49L700O46n020k205N454L844k697l598L72K266L71m42Q39j269
770G12k868M56L538J467m178j967K823K134j846k872Q49K627j19j248K11Q2j107
787a306J258J931r48l964j091N445M185k548m716j581L029L139j4l256l443k15
803d095M728M606j409m170l312K113M118J03k271l939j168J827L776J097k312
818c08j696Q56K135K147j77k742j861l75J090J214q08q14J931M47n13n94J551
835A483P46p03l284p93J601J764L83j273j721k81M81L563P87m315k406K122M284
852B438P71k650k883oJ580K354K10q76k174q39K802K540j098m101M27K628J133
869B256j690j236J17N96R87l57P08k032j69K172R08k554k525P85K844R71j573
$$ plain form
753 373 160 -1698 -1549 2151 2797 -2223 -4428 1026 4870 2173 -1425 -1053 1213 1584 1142 1981 712
770 712 -2156 -1700 1838 3305 -873 -2840 -17 2117 271 -2601 -1752 875 756 -492 -281 -199 -1306
787 -1306 -48 1883 935 -3029 -4120 1325 5510 2962 -1754 -3335 -306 2833 2819 -437 -3880 -4095
803 -4095 633 5239 3830 -340 -3652 -1539 2579 2682 411 -3528 -4696 -2869 907 2004 -308
818 -308 -2004 -1148 987 3134 2957 215 -1646 -2021 -931 283 -525 -1339 592 1039 526 -68 1483
835 1483 2229 1526 -1758 -2551 -950 814 1197 -76 -1797 -2078 -1597 1966 2753 -1562 -3968 -1846 2438
852 2438 3209 559 -2324 -2330 -750 1604 1814 938 -1236 -2075 727 3267 2169 -1932 -1505 1123 2256
869 2256 566 -670 -553 43 1030 673 1381 -651 -820 1352 2260 -294 -2819 -2034 810 1781 208
886B08j595J021J780J092o18k015j649J38J393J308r3k322M5J418J795N44j443
903A007j457l41L14O40l81p42p52K58R58J076n0j2J13J4p19m40O92O36j031j353
923a570l55J325K024P94q56k763RK354O24J61j466k303K72J992J377j299k106
940a786m85J034K214N67o22j418l36M04J105J89j053k050KJ743J261n8j319m19
958a027J380K56k65M9k53j46j67J11k87l50Q63J83j37r46O49N60L94j387o32O13
978e39r4P82q7r3j9L25j59O59j23j238m77J02J032j21j70J092o76N76p88O16K00
999H00j040L52M54j213j10M59N71M6o45r67J437P13Ol83j315j21M07J251j12p50
1019a60j25L46K44J062j315l01P65r17O47P22o05J72j263l0P72N59j58j051m92
$$ plain form
886 208 -1387 -366 1414 2506 1888 -127 -1776 -1638 -245 1063 970 -1352 -1307 111 1906 2450 1007
903 1007 -450 -791 -477 163 -218 -960 -1712 -1454 -496 580 530 518 631 645 -74 -514 178 814 -217 -1570
923 -1570 -1925 -600 1424 2218 1362 -1401 -1392 962 1586 1747 281 -2022 -1750 242 1619 320 -1786
940 -1786 -2271 -1237 977 1544 922 -496 -832 -428 677 866 -187 -2237 -2235 -492 769 711 -608 -1027
958 -1027 353 609 344 393 140 -6 -173 -62 -349 -699 164 347 210 -736 -87 473 867 -520 -1152 -539
978 -539 -633 149 62 -31 -50 275 116 775 652 -586 -1063 -961 71 -50 -220 872 196 772 -16 600 800
999 800 -240 112 566 -647 -757 -298 273 319 -326 -1293 144 857 863 480 -835 -956 -549 702 590 -160
1019 -160 -285 61 305 1367 52 -249 516 -401 246 968 363 535 -728 -758 14 573 415 -636 -1128
1038a128J839QK81o91r13p32Q01L19m19Q92l34p5J1L89J50J92j537K34L72R55
1058F14m61l86P8o72J209L19j04l67J70r86P15j56Q4k75J84L94j96M48J18l74
1078C56o62k82J67J76k19M67n24J38L1O79j34j61P54o80j14O58q69M21P0p8o50
1099d56J000N4m33p29P46o7l05K11O31j173J97M18k86n8q22J238p2k38q64J044
1119C6O85m83K83o83j24M12J87j40k59p20N34L04J109M10j751J56r4O17N2k59
1139B72j68n56J82K45R09n33o34l9j41Q71M35j404n52N14M59O3M42j96o55M86
1159@M34k78O2N33j75q46K01n87J510m30o88p9J72P90k61k16q73K10L82o7K93
1180H7l17k36J83j51J378n06l78o65P8Q06M74m19r45N4N95M28K17o42l38k97J394
$$ plain form
1038 -1128 711 719 1000 309 -604 -1336 -535 -216 -635 257 -77 -152 -141 248 398 590 -947 -713 -341 614
1058 614 153 -233 -155 -827 382 701 597 230 400 -586 129 -27 57 -218 -34 360 164 612 730 356
1078 356 -306 -588 -421 -245 -464 3 -521 -383 -352 327 193 32 786 106 -8 650 -219 202 272 194 -456
1099 -456 544 598 165 -564 182 115 -190 21 652 -521 -324 94 -192 -250 -1072 166 94 -144 -1008 36
1119 36 721 238 521 -162 -286 126 313 173 -86 -806 -272 32 1141 1551 -200 -44 -138 479 531 272
1139 272 104 -452 -270 -25 884 351 -283 -322 -463 408 843 -561 -1113 -599 -140 -77 365 169 -486 0
1159 0 434 156 218 751 576 -270 -69 -656 854 424 -264 -343 -171 619 358 142 -731 -521 -139 -206 87
1180 87 -230 -466 -283 -434 944 438 60 -605 -527 279 753 334 -611 -557 38 466 683 41 -297 -594 800
1201H00j092M13P0J82J0m54q4Q6Q5l11j3M06o24k32P78J95n48M44m27K54n4J73
1223E7J1q30K13O73M27l36m97M10J41O17p50J13n41K90k24M96Rl36k98N64q48
1244f39L22q9M04j67n80Q07M7m89L93L55j04q81M94J94j8j05J44j4q05J131l6
1265C64K4r76N39M34K79p23k00m0p2N95j45l23Q9l68N0J30Q20o1j291M86M01K61
1287B73k92J06q6K71l00m42O23L61k59J06k67k82J143K0p03k33p73P27j49M32
1307B76pj02j81l61J96K19J01j59k77k18J551j055N2j80J46j14M94K04l38n2n75
1328c80N46j33q8K0o8M34n32o9P75k94m88K41J77k28J27J35o09j44P3J227p74
1349e2l11O90n19O2L5K70K64m20l29k00O69O13j183R10o48K74k92K64J41n42J43
$$ plain form
1201 800 -292 121 191 373 383 -71 -155 -69 16 -295 -308 98 -526 -758 20 215 -333 111 -316 -62 -116 57
1223 57 68 -762 -549 124 551 215 -282 128 269 886 136 249 -292 -2 -226 270 279 -57 -355 209 -639
1244 -639 -317 -406 -2 -169 -749 58 105 -384 9 364 260 -621 -127 67 49 -56 88 74 -731 400 364
1265 364 388 -588 -49 385 664 -59 -259 -299 -371 224 79 -244 -155 -523 -473 -343 477 416 -875 -389 12 273
1287 273 -19 87 1 272 -28 -470 153 514 255 361 94 -188 955 975 272 39 -734 -7 -156 276
1307 276 269 167 -14 -375 -179 40 141 -18 -295 -513 1038 -17 35 -145 1 -113 381 585 247 195 -380
1328 -380 166 33 -55 -35 -103 331 -201 -270 505 211 -277 -36 141 -87 40 175 -434 -578 -505 722 -52
1349 -52 -363 327 -192 -130 -95 175 439 19 -310 -510 159 772 -411 499 -149 125 -167 97 238 -304 -161
1370a61Q6P98m87r6r5n42Q11o9o09L41L35p62K37l7P04p14N3j6M78qK2m48L46
1393A67mJ86K4k06k44o78L86K84l47L23O58o62N61n66n06R13o41PoJ24M55L96
1415F24o00m90P03n57J02L67j27j54m07O07l43j11N49k68J27R9k08l05R46k99
1435B55j68N65r43Q0M34l56M37J07o3j57k60K27M00l18k32M37j74k35J08K52r52
1456e56M52N83p31M31R7j56k96O66m09l72M90k44k89M00j99L19p45J013l26K05
1476C33k54m55M43m48J226m28n65L04k30J34N6K7P2m73J95Q6J41O54j110K86k22
1497b28K17P15l69l06j39J48k06N48M6p10O86r43J65K7M59M00j008K82K75l59
1517c00O19k02j83j43n46N46k17K79M22M5n12M63J67k16m45M01j25j18m03O62
$$ plain form
1370 -161 -75 723 236 140 45 -497 314 245 -364 -23 312 -450 -213 -250 454 -260 -207 -223 255 247 269 -179 167
1393 167 163 349 373 167 -77 -755 -369 -85 -432 -109 549 -113 448 -118 -624 289 -352 -345 -351 -227 228 624
1415 624 24 -466 237 -320 -218 149 22 -132 -539 68 -275 -386 163 -105 22 121 -87 -392 554 255
1435 255 87 652 -291 -211 223 -133 304 411 348 191 -69 158 558 240 8 445 271 36 144 396 -556
1456 -556 -104 479 -252 179 276 120 -176 490 81 -291 199 -45 -334 66 -133 186 -559 454 128 333
1476 333 79 -376 67 -381 845 417 -148 156 -74 60 116 143 215 -258 -63 23 164 818 -292 -6 -228
1497 -228 -11 704 335 29 -110 38 -168 380 426 -284 402 -541 -376 -349 110 510 -498 -216 59 -300
1517 -300 319 117 -66 -209 -755 -209 -426 -147 275 320 -192 271 438 222 -223 178 53 -65 -468 194
1537A94L5m4j80j54L08n57P67l97j88K23L79R9j415J183j292R37K06J04k30L87
1557C65n76m6P59k86m4j74j13M88k65l20J51O51o64L21J90n07q3k46O48n30P75
1578D94o20M36o5N9p28O45O8m7n9l19K28P32q73O8k30K92O9O03q18j69L61M14
1600E41o83M77q7l33j71L89J36o20P06j5p43J57p4M90m19P4K79k37J64L68j071
1621f72M41M79J2l7o41N01J68J5j11m60N34N72j037J68o0l85M46J08L2L41n88
1642a74l26k51J230J04j21q73L39J50J0j19K45k84k00L64p35Q18r9M39m34J16
1662A99m90M99k56M47j49j90J29L68j55m6L09p98J93k96L17o8m0J13l68P37q18
1683c63J79n1j41N76K44j179m0Q15L47j06o2K46J15l58o84N99k26L56r47Q38j9
$$ plain form
1537 194 229 185 5 -149 159 -398 369 -28 -216 7 386 485 -930 253 -1039 -102 104 208 -22 365
1557 365 -211 -257 502 216 172 -2 -115 373 108 -212 -61 590 -74 247 437 -70 -153 -399 249 -281 494
1578 494 -126 310 245 304 -424 221 289 242 183 -136 92 824 -49 19 -211 81 150 753 -65 -234 127 541
1600 541 -142 335 248 -85 -256 133 269 -351 355 340 -403 -246 -320 170 -249 -175 104 -133 31 399 -672
1621 -672 -231 248 260 223 -418 83 251 266 155 -305 229 801 -236 -68 -128 -513 -67 41 73 414 -174
1642 -174 -500 -751 479 583 462 -411 -72 78 88 -31 214 -70 -270 94 -641 177 78 517 83 199
1662 199 -291 208 -48 399 250 60 189 557 402 356 665 -133 60 -236 81 13 -27 86 -282 455 -363
1683 -363 -184 -235 -376 200 444 -735 -775 40 387 281 219 465 580 222 -462 137 -89 267 -680 158 139
1704A39j84J05M61p44P09j025k34O30M79o92K55J170p97q8j50l57L77J25m80L82
1724H1k39K14k1j45p5N14m0p05P58p54P41J23o91K90k92N56K45m26l74K08l42
1745c74Q14j55k33j41P7m42J1P83Q2M5m55m4j27J27L21l56K55n15P87k67L5J55
1767C83l05P5n45q9O88n27J50L1K00N7k1j41O7j85Nj14K56L0j72o1j88j25K99
1790b32l77N88K1l79L87K85l2k64M98p97K80J79K90n52R3j74j99qK95m8L64L51
1812E69m12p46J004q76Q67K6j46k74K71l01j44J60n77J09O81m65k0M11O65m39
1832C63m35L80n10O5M64Ol18K05m03k05K69k37L77k7L61n01J42k38L49J58n92
1853c27J51K37L42m3m00k7QJ06j8P7J50R9m51Q2R0k56M70m86J54n05M96m0M57
$$ plain form
1704 139 -45 60 521 -223 486 -539 -773 -143 336 -356 -101 1069 272 184 34 -323 54 179 -301 81
1724 81 -158 56 35 -110 -185 329 289 -416 342 -412 329 452 -239 51 -241 315 560 134 -240 -32 -374
1745 -374 440 285 52 -89 -12 -454 -443 340 422 467 12 -32 -159 -32 289 -67 188 -327 460 193 228 383
1767 383 78 153 -392 -481 207 -320 -170 -139 61 118 97 -44 23 -162 -157 -271 -15 15 -157 -218 -406 -531 -232
1790 -232 -609 -21 0 -379 8 293 261 -3 495 -302 -22 157 447 -105 -12 -186 -385 -393 -98 -146 218 569
1812 569 157 -589 415 -461 406 432 286 12 283 -18 -162 -2 -579 -470 211 -254 -274 137 802 363
1832 363 -72 308 -202 -137 327 333 15 220 -183 -388 -119 -356 21 -6 355 -146 -4 -242 107 265 -327
1853 -327 -176 61 403 360 -40 -67 -59 47 29 106 256 355 -96 -14 76 -180 290 -196 -42 -547 -51 -91 366
1876C66n9l76K31j36N36m73J00o24M04j02M12K26l32j17k36k12J99r7J4N71n93
1897b98L65r6m42M01M69j235J082L39m98O00k77p22j73N35L6K25l01o61P41j68
1917g8j59m36K31P3L93o48M21l3J33M67r78P72l28J33M4L4l37R95n5o78J07j8
1939E5k10J74L19l22l70L31l88J39k42M74mm91P62L81k06m66N82j95k54L01p30
1960c60j47K71K60J4j80L10j96O5K10m73q8K65K32K69k34l60N5k24k34P54n92
1981c83P07j89l06O09k7J10m23K46o07k68N02K74N11n91J61j40r67M87K22l3J52
2002D7j47R08j074M04m93L07k8M02n86J77J20J38j48K17o51N76K93K39k78l51
2022G2L08q38N20K5J11k4p8m21Q78K9n43p02R91n32N83K79o79O36l91p30P15m14
$$ plain form
1876 366 307 -69 162 26 562 89 189 -435 -31 -133 279 505 173 56 -180 -392 -193 -290 -276 295 -298
1897 -298 67 -29 -471 -70 399 -836 246 585 87 687 410 -312 -485 50 86 311 10 -651 90 -78
1917 -78 -237 -673 -442 -369 24 -624 -203 -236 -103 364 -614 158 -170 -37 7 41 -296 699 644 -34 73 55
1939 55 -155 19 338 16 -354 -23 -411 -272 -514 -40 -44 -535 227 608 402 -64 518 323 69 370 -360
1960 -360 -507 -236 24 38 -142 168 -28 37 247 -226 -314 -49 183 452 218 -142 -87 -311 -545 209 -383
1981 -383 324 135 -171 438 411 521 98 344 -263 -531 -29 245 756 165 326 186 -781 -294 -72 -105 47
2002 47 -100 808 -266 138 -355 -48 -76 326 -260 -83 37 175 27 244 -407 169 462 701 423 72
2022 72 380 -458 62 87 198 174 96 -325 553 582 39 -663 328 -204 379 658 -21 615 224 -506 209 -205
2044b05N22n70M23j7p58M32L58M52j298O56k47L49k16J21J46o99L76L72j01K39
2064C35j060J038n84L98j64M74J82o71o82P04J79n13M33K23L4K6j17k48N15N6
2084E58m15J51k46O9o26J014r77M37l7N1Q8j07o4Q74r16J36M5Q9P8k90J39j39
2106h8L3K21m23j48O8O03L80m31Rl31j82K44K93o75P31nj39k13ML74n98N92r5
2129B24l78K36K53l50L5P3K05k98j2o6rL0O29r36J31J07J38Rk32j86J01L44K7
2152G5m14M50p59M97J31m74Q91k69m27K53k7J40M48q96M60k27l37N64l40K75j57
2173a43R6p0K59o04L90N76m71k99l2L92J97m36l56J16O01o39M52J96j34o94R14
2194C11o70M07L09p1m92lJ18j8J35j29L06n36O84l06n47M00O47n68N9l97N18m61
$$ plain form
2044 -205 317 -253 170 153 -605 -173 185 637 -661 -5 -252 97 -119 2 148 -551 -175 197 96 335
2064 335 -725 313 -271 127 -37 437 619 -52 -734 -30 149 -364 69 292 326 352 235 -13 502 558
2084 558 143 294 48 117 -509 505 -472 -35 -72 -21 67 -40 -104 770 -146 -10 35 124 202 -88 51 -88
2106 -88 -55 166 -257 -405 -337 266 646 215 224 -107 -289 -45 248 -427 304 299 160 -53 -49 325 -273 319 224
2129 224 -154 82 335 -15 20 93 298 0 -12 -78 -87 -57 572 -364 -233 -126 12 21 -211 -397 -296 48 75
2152 75 -339 111 -648 -151 -20 -494 397 128 -299 -46 -73 67 515 -381 79 -148 -485 79 -261 14 -143
2173 -143 -47 -117 142 -462 -72 504 33 -266 -298 94 291 -145 -501 -385 216 -423 29 225 91 -603 311
2194 311 -359 48 357 286 -206 -209 -91 -109 26 -103 203 -333 351 45 -502 -102 545 -23 36 -361 157 -304
2216c04M71o47N41J25k42K39j36k67J28j026Q91M91j18M61j446J208l24j81j81
2235c17O6n3N51J39m53J49p31L55N46j70J75p34L91L5j54N14o60K41K13k64K10
2256D9Qm3l23j43O97J0m38L99q3L95o19p4R58j057n2N22R9o11J33K41k15J21L04
2279B78l02k34N0J55M51n59L6l70N09J25j14K90om65N73o83K04k47J58J89R7j76
2301d1M56J28r93K82M23J5l65l6%K09N73q90K17J22J91K4K63j98k02j61N9k24
2323a48L1K98k16p9K5Q5P1O7l77P27k76m36K77q7m6k8k09L06l73M42k4m7q3J02
2347BL2j59J86l14K46M11Q3k34J80o97N24o54J25O79p33P7M18m8k15J36j51J84
2369G8m18J04J44J57kn14J070m95j8m82J59M16m59N23O0m48kL91J18l11k9P2l15
$$ plain form
2216 -304 167 -480 61 186 -56 183 47 -220 -92 -1118 -227 264 146 607 -839 369 45 -136 -317
2235 -317 -251 -304 247 386 -67 82 -649 -294 252 82 257 -477 -86 -51 -205 309 -351 -110 103 -161 49
2256 49 57 14 -309 -452 245 255 -183 216 133 528 -91 -165 793 -264 -316 206 305 -306 -173 68 -147 -26 278
2279 278 -24 -258 -208 -53 398 -161 -125 -495 14 139 25 315 309 -156 417 -266 -62 -309 -151 38 135 -41
2301 -41 415 543 -450 -168 255 270 -95 -131 -131 78 651 -239 -22 100 291 315 578 380 178 17 76 -148
2323 -148 -117 181 -35 -114 -89 -4 67 134 -243 484 208 -228 49 -38 -84 -112 -321 -15 -388 54 30 -17 -100 2
2347 2 34 -125 61 -253 -7 404 487 253 433 -264 260 -394 -269 410 -323 -246 172 124 -91 45 -106 78
2369 78 -340 -236 -92 65 63 -451 619 124 106 -376 -217 199 -260 263 323 -125 -127 264 382 71 42 114 -201
2392b01J65j8j68M21j45q0m13L02J36l14L06p50O66K88m54K80o38M94J27j32J55
2413B7k9K26o10l2M50k38N55j70M4l05p40J229j31o52j8M8J98R5P94o35K7p9q7
2436c3l21M77K06m50L8K55k04jN17p50P12k47k96k29M62j43J19k75k0M03k10j32
2458a22q8P6J20l62J59N26p0j3K3M23q21K25p67J083n65N78m20j55Q1J55l13K90
2480D3J24j4l14n2K78l73L82N5K55q42L96J89j01l30L03O5k76p90J314m15J59
2501E6l46K48k68K85J51p05N90k37m1L58o32N80M9l32O59k90M70o04O13n66J57
2522A95Pom04K25j56R6M98o08L1m59O64n42L78J65o5J17n11K65j67K22J96q9M6
2545I8n29L32K9O32l44J58n22J63M41p08P78q38P44j74l02K35L05m14j117R41
$$ plain form
2392 -201 -36 -54 -222 199 54 -26 -439 -137 -1 -315 -9 -759 -93 195 -259 21 -617 -123 4 -128 27
2413 27 -2 224 -386 -418 32 -206 349 179 223 -82 -822 407 276 -376 -394 -346 -148 -53 741 106 133 54 -33
2436 -33 -354 123 329 -121 -83 172 -32 -33 484 -266 446 199 -97 -326 136 -7 112 -163 -183 220 10 -122
2458 -122 -210 -134 -14 -376 -217 309 239 226 249 672 -149 76 -691 392 -173 405 -15 -170 -89 66 -247 43
2480 43 167 153 -161 -213 65 -308 74 129 384 -458 -62 127 26 -304 -1 64 -212 -1002 312 -103 56
2501 56 -290 -42 -310 -25 126 -579 11 -226 -267 91 -541 39 88 -244 415 125 595 -9 604 38 195
2522 195 202 196 -208 17 -139 -43 455 -153 -122 -581 83 -459 -81 84 19 136 -375 -110 -277 -55 141 52 98
2545 98 -431 -99 -70 562 218 376 -146 17 458 -250 528 -310 434 260 -42 193 498 84 -1033 -92
2565i2N13m91Jl30l83Q25R9j12L1J28q08P21n08k63N62R6J75L32n89P3k95K60
2587e5O4k33j46J80M3k32J49J92J44l70N1l20N50K55o85J94L20l66J58k89J64
2608b32K88l44JL00j24K27k38M31m57K71L84r36K40J72L30j93J50J43l54k27M26
2629B58m23MN5m8P41n77O3o7L22m14k5J32N24q14L86q7n72L12N48K69j086M07
2651i2L6N87p89l47O27k8l47R21j015K32O26N8m02l04j35Q2R4J19l8k91N19q3
2673C0j77M9j23K86k37O2L99m66j91j67O60K09m28N05o7j01M09n42l62K56R1m93
2695c98rJ141j264M48Q2m77M13k33P61j91k25K02l54p8N11n35J89k45P08q11M25
2716F0l17o4kN18k01o03N50k95N20k60M84p08P4k23K01M82N8J22p08l0L88R1l34
$$ plain form
2565 -92 421 -70 -69 -399 -782 43 142 30 61 189 -619 102 -406 -669 -107 -11 164 496 -93 -20 -315 -55
2587 -55 9 -224 -370 -190 -147 -379 -230 -38 106 -264 -213 -533 17 272 -413 -219 101 -265 -107 -396 -232
2608 -232 56 -288 -287 13 -111 116 -122 309 -148 123 507 -429 -189 -17 313 120 270 413 59 -168 258
2629 258 -165 -161 -106 -154 587 10 73 6 328 -86 -111 21 545 -269 117 30 -542 -230 318 587 -499 -92
2651 -92 -56 531 -258 -605 22 -6 -353 568 -447 -215 411 469 67 -237 -372 -290 -196 -77 -115 -406 113 30
2673 30 -147 -98 -221 65 -172 -110 289 -177 -368 -535 125 334 -94 411 344 243 652 110 -252 4 95 -398
2695 -398 -407 734 -530 -82 0 -477 -64 -297 464 273 48 250 -104 -182 329 -206 -17 -262 446 -365 60
2716 60 -257 -321 -323 195 -6 -609 -59 -354 166 -94 390 -318 -244 -467 -266 216 274 396 -312 -342 46 137 -197
2739a97P56q05j37L11L13j40K25m37k54k00J083r76O65o50M95k38J77n30R01l32
2759C0p54O29r8L82o54N74l9k08K58m32K57N16q38P40k82p1n94N38P1l23P3N24
2781B99m38p81J652o12k90N16l90j76O87J11n74j18N4q6o74N53L61m32O76n69
2801b31Q1J32N82j053O80n07M94j24M29n71j66P54j10l42n65O18J49m31j92M48
2821G5l25J08L74j12N10r02K15L24l96L8j81N97j13l4n45L7P04o79Q09j083K03
2842c76M93k61K48o60Q01k52j53J9N56o06N38m82m70O24J55j93r0j97o2J74q5
2863b79Q5J77L81o53q3J061o86J86J73j39k94J35R6O5l02L24j18k43n84O67J81
2884A50j91k1l84O18m96K13L07k70k8r6j8K29L26k87j26K84k7m51R7o5K91M0j70
$$ plain form
2739 -197 559 -246 -383 -72 241 101 326 -111 -365 -565 518 -458 207 -443 52 -186 -9 -539 362 30
2759 30 -724 -95 -193 189 -465 109 70 -138 120 -312 -55 461 -377 363 81 10 -584 -46 25 -298 -225 299
2781 299 -139 -920 732 120 -170 346 -44 -220 467 578 4 -114 -60 -146 -820 -267 94 -338 338 -231
2801 -231 -150 -18 564 -489 191 -316 178 54 483 -88 -254 500 390 48 -517 101 250 -181 -373 75
2821 75 -250 -142 232 120 630 -272 -57 267 -129 -91 -272 325 212 178 -367 -330 374 -305 504 -579 -376
2842 -376 117 -144 104 -556 245 -7 -160 -141 415 -191 347 -135 -605 19 174 -19 -109 -306 -368 -194 -279
2863 -279 -194 -17 364 -289 -372 689 3 189 362 223 -71 64 160 225 -77 247 129 -114 -698 -31 150
2884 150 -41 -62 -446 172 -324 -111 196 -74 -102 -198 -216 13 339 52 -74 210 183 -268 -171 -236 55 95 -75
$$ [...]
8191D02
##END NTUPLES=NMR FID
##END=
