##TITLE=1H_IAMT-118
 CDCl3, 108 sc, 
 4.3.2019
##JCAMPDX= 6.0         $$ Bruker NMR JCAMP-DX V2.0
##DATA TYPE= NMR FID
##DATA CLASS= NTUPLES
##ORIGIN= UXNMR, Bruker Analytische Messtechnik GmbH
##OWNER= root
$$ XWIN-NMR		Version 3.5
$$ Mon Mar  4 14:22:00 2019 Russian Standard Time (UT+4h)  she@DPX200
##.OBSERVE FREQUENCY= 200.131
##.OBSERVE NUCLEUS= ^1H
##.DELAY= (6, 6)
##.ACQUISITION MODE= SIMULTANEOUS
##.ACQUISITION SCHEME= undefined
##.AVERAGES= 108
##.DIGITISER RES= 18
##SPECTROMETER/DATA SYSTEM= spect
##.PULSE SEQUENCE= zg30
##.SOLVENT NAME= CDCl3
##.SHIFT REFERENCE= (INTERNAL, CDCl3, 0, 15.7039)
##AUDIT TRAIL= $$ (NUMBER, WHEN, WHO, WHERE, WHAT)
$$ ##TITLE= Audit trail, XWIN-NMR		Version 3.5
$$ ##JCAMPDX= 5.01
$$ ##ORIGIN= Bruker BioSpin GmbH
$$ ##OWNER= she
$$ F:/spectra/data/she/nmr/H-F/1/audita.txt
$$ ##AUDIT TRAIL=  $$ (NUMBER, WHEN, WHO, WHERE, WHAT)
(   1,<2019-03-04 14:11:25.75 +0400>,<she>,<DPX200>,
      <continue with go, POWCHK disabled, PULCHK disabled
       configuration hash MD5:
       00 E9 B6 7A A2 85 ED C7 34 08 36 98 17 FE 4E 26
       data hash MD5: 16K
       55 46 50 8B 8F D9 E3 CA 7F 59 83 2E 9D 3A BD F6>)
$$ ##END=
$$ 
$$ hash MD5
$$ 40 61 B2 D6 4A C2 B0 15 C9 16 3D 70 90 E4 95 01
##$RELAX= 
##$RELAX= 
##$RELAX= 
##$RELAX= 
##$RELAX= 
##$RELAX= 
$$ Bruker specific parameters
$$ --------------------------
##$DU= <F:/spectra>
##$EXPNO= 1
##$NAME= <H-F>
##$PROCNO= 1
##$TYPE= <nmr>
##$USER= <she>
##$AMP= (0..31)
100 100 100 100 100 100 100 100 100 100 100 100 100 100 100 100 100 100 
100 100 100 100 100 100 100 100 100 100 100 100 100 100 
##$AQSEQ= 0
##$AQ_mod= 1
##$AUNM= <au_zg>
##$AUTOPOS= <>
##$BF1= 200.13
##$BF2= 200.13
##$BF3= 200.13
##$BF4= 200.13
##$BF5= 200.13
##$BF6= 200.13
##$BF7= 200.13
##$BF8= 200.13
##$BYTORDA= 1
##$CFDGTYP= 0
##$CFRGTYP= 5
##$CHEMSTR= <none>
##$CNST= (0..31)
1 1 145 1 1 1 1 1 1 1 1 1 1 1 1 1 1 1 1 1 1 1 1 1 1 1 1 1 1 1 1 1 
##$CPDPRG= <>
##$CPDPRG1= <>
##$CPDPRG2= <>
##$CPDPRG3= <>
##$CPDPRG4= <mlev>
##$CPDPRG5= <mlev>
##$CPDPRG6= <mlev>
##$CPDPRG7= <mlev>
##$CPDPRG8= <mlev>
##$CPDPRGB= <>
##$CPDPRGT= <>
##$D= (0..31)
0 1.2 0 0 0 0 0 0 0 0 0 0.03 0 0 0 0 0 0 0 0 0 0 0 0 0 0 0 0 0 0 0 0 
##$DATE= 1551693917
##$DBL= (0..7)
120 120 120 120 120 120 120 120 
##$DBP= (0..7)
150 150 150 150 150 150 150 150 
##$DBP07= 0
##$DBPNAM0= <>
##$DBPNAM1= <>
##$DBPNAM2= <>
##$DBPNAM3= <>
##$DBPNAM4= <>
##$DBPNAM5= <>
##$DBPNAM6= <>
##$DBPNAM7= <>
##$DBPOAL= (0..7)
0.5 0.5 0.5 0.5 0.5 0.5 0.5 0.5 
##$DBPOFFS= (0..7)
0 0 0 0 0 0 0 0 
##$DE= 6
##$DECBNUC= <off>
##$DECIM= 24
##$DECNUC= <off>
##$DECSTAT= 4
##$DIGMOD= 1
##$DIGTYP= 9
##$DL= (0..7)
0 120 120 120 120 120 120 120 
##$DP= (0..7)
150 150 150 150 150 150 150 150 
##$DP07= 0
##$DPNAME0= <>
##$DPNAME1= <>
##$DPNAME2= <>
##$DPNAME3= <>
##$DPNAME4= <>
##$DPNAME5= <>
##$DPNAME6= <>
##$DPNAME7= <>
##$DPOAL= (0..7)
0.5 0.5 0.5 0.5 0.5 0.5 0.5 0.5 
##$DPOFFS= (0..7)
0 0 0 0 0 0 0 0 
##$DQDMODE= 0
##$DR= 18
##$DS= 0
##$DSLIST= <SSSSSSSSSSSSSSS>
##$DSPFIRM= 0
$$ [...]
##$SUBNAM2= <"">
##$SUBNAM3= <"">
##$SUBNAM4= <"">
##$SUBNAM5= <"">
##$SUBNAM6= <"">
##$SUBNAM7= <"">
##$SUBNAM8= <"">
##$SUBNAM9= <"">
##$SW= 31.0741737793586
##$SWIBOX= (0..15)
0 0 2 0 0 0 0 0 0 0 0 0 0 0 0 0 
##$SW_h= 6218.90547263681
##$TD= 16384
##$TD0= 1
##$TE= 0
##$TE2= 300
##$TE3= 300
##$TEG= 300
##$TL= (0..7)
0 120 120 120 120 120 120 120 
##$TP= (0..7)
150 150 150 150 150 150 150 150 
##$TP07= 0
##$TPNAME0= <>
##$TPNAME1= <>
##$TPNAME2= <>
##$TPNAME3= <>
##$TPNAME4= <>
##$TPNAME5= <>
##$TPNAME6= <>
##$TPNAME7= <>
##$TPOAL= (0..7)
0.5 0.5 0.5 0.5 0.5 0.5 0.5 0.5 
##$TPOFFS= (0..7)
0 0 0 0 0 0 0 0 
##$TUNHIN= 0
##$TUNHOUT= 0
##$TUNXOUT= 0
##$USERA1= <user>
##$USERA2= <user>
##$USERA3= <user>
##$USERA4= <user>
##$USERA5= <user>
##$V9= 5
##$VALIST= <valist>
##$VCLIST= <CCCCCCCCCCCCCCC>
##$VD= 0
##$VDLIST= <DDDDDDDDDDDDDDD>
##$VPLIST= <PPPPPPPPPPPPPPP>
##$VTLIST= <TTTTTTTTTTTTTTT>
##$WBST= 1024
##$WBSW= 4
##$XGAIN= (0..3)
0 0 0 0 
##$XL= 0
##$YL= 0
##$YMAX_a= 1408060
##$YMIN_a= -1011855
##$ZGOPTNS= <>
##$ZL1= 120
##$ZL2= 120
##$ZL3= 120
##$ZL4= 120
##$ABSF1= 10
##$ABSF2= 0
##$ABSG= 5
##$ABSL= 3
##$ALPHA= 0
##$AQORDER= 0
##$ASSFAC= 0
##$ASSFACI= 0
##$ASSFACX= 0
##$ASSWID= 0
##$AUNMP= <proc_1d>
##$AZFE= 0.1
##$AZFW= 0.1
##$BCFW= 1
##$BC_mod= 2
##$BYTORDP= 1
##$COROFFS= 0
##$CY= 11.3945322036743
##$DATMOD= 1
##$DC= 2
##$DFILT= <>
##$DTYPP= 0
##$F1P= 18.9103706918063
##$F2P= -1.10871071338519
##$FCOR= 0.5
##$FTSIZE= 0
##$FT_mod= 4
##$GAMMA= 1
##$GB= 0.15
##$INTBC= 1
##$INTSCL= 1
##$ISEN= 128
##$LB= 0.24
##$LEV0= 0
##$LPBIN= 0
##$MAXI= 10000
##$MC2= 0
##$MEAN= 0
##$ME_mod= 0
##$MI= 1.114404
##$NCOEF= 0
##$NC_proc= 0
##$NLEV= 6
##$NOISF1= 3.799351
##$NOISF2= 2.8
##$NSP= 1
##$NTH_PI= 0
##$NZP= 0
##$OFFSET= 15.70392
##$PC= 1
##$PHC0= -8863.75
##$PHC1= 18.20014
##$PH_mod= 1
##$PKNL= yes
##$PPARMOD= 0
##$PSCAL= 0
##$PSIGN= 0
##$REVERSE= no
##$SF= 200.130013532006
##$SI= 16384
##$SIGF1= 3
##$SIGF2= 2
##$SINO= 400
##$SIOLD= 16384
##$SREGLST= <1H.CDCl3>
##$SSB= 0
##$STSI= 0
##$STSR= 0
##$SW_p= 3612.71676300578
##$SYMM= 0
##$S_DEV= 0
##$TDeff= 0
##$TDoff= 0
##$TI= <>
##$TILT= no
##$TM1= 0
##$TM2= 0
##$TOPLEV= 0
##$USERP1= <user>
##$USERP2= <user>
##$USERP3= <user>
##$USERP4= <user>
##$USERP5= <user>
##$WDW= 1
##$XDIM= 8192
##$YMAX_p= 0
##$YMIN_p= 0
$$ End of Bruker specific parameters
$$ ---------------------------------
##NTUPLES= NMR FID
##VAR_NAME=  TIME,          FID/REAL,        FID/IMAG
##SYMBOL=    X,             R,               I
##VAR_TYPE=  INDEPENDENT,   DEPENDENT,       DEPENDENT
##VAR_FORM=  AFFN,          ASDF,            ASDF
##VAR_DIM=   8192,          8192,            8192
##UNITS=     SECONDS,       ARBITRARY UNITS, ARBITRARY UNITS
##FACTOR=    0.0001608,     1,               1
##FIRST=     0,             0,               0
##LAST=      1.3171128,     0,               0
##MIN=       0,             -1011855,        0
##MAX=       1.3171128,     1408060,         0
$$ Real data points
##PAGE= N=1
##DATA TABLE= (X++(R..R)), XYDATA
$$ [...]
3219b67R96l08p50k830o15j752K245L239M088L448R26l236l114l955k205k759
3235f849J797L668M09K611l50l28Q2K64J3J182J906j870k319m058k062J327J324
3252c253K505L402L171J989k125k473l077k336k166J473J30J552Q04Q88j350j377
3268b243J871L780L479l71m161j037m811l478nJ222M109M267J606K72n41k832
3284A127j136m83k41J084k200L47j945j102M3K623L278K530K836J25k106m929
3300a49l492k684k52J914K324K695J923l61Q64j373J96J670j152N91k590k074
3316a950l324j937J975K282L344L595J345K998l207l380k496l540o89J604O4K390
3332i26J075l2K96n0J978J662J406j003j028l655l875l121R83J923K415M729K311
$$ y = [-267, 729, 421, -329, -3159, -3774, -5526, -3281, -42, 4046, 7494, 8420, 5184, 2070, -1885, -4090, -6849, -5052, -1384, -975, 1636, 1286, 958, 1040, 1304, 1317, 2499, 4405, 2535, 216, -3842, -5904, -4577, -3253, -748, 2654, 5825, 7814, 5689, 3216, 139, -2197, -4363, -2890, -2760, -1208, -404, 484, -866, -2243, -372, 3408, 6887, 6516, 2355, 1318, -3493, -6971, -6976, -5754, -1645, 2622, 4228, 4500, 3959, 1127, -9, -492, -733, 351, -1849, -1502, -3447, -4549, -4506, -1883, 1395, 3925, 6761, 6886, 4780, -149, -3641, -6325, -6577, -4663, -2339, 356, 2279, 1918, 2782, 1409, 1605, 3275, 2123, 2714, 124, -1950, -5274, -7211, -5236, -2954, 390, 3985, 5330, 8328, 5121, 1741, -755, -4295, -4984, -3380, -3316, -926, 149, 117, 413, 363, 2341, 4003, 5409, 4406, 3378, -277, -4152, -7273, -6290, -4367, -1952, 2777, 5088]
3349E088M39m48j903k685k358j212J225J526r12n08k43p54J083K734L265J710
3365F047K78l302m320l184j294k34R71M274K857R63Q96j176k590J791M94nj133
3382A333k266j422k573j6R55K512L582J582L298n13k170l676k069l436L66q6K760
3399a839K140L42l3O27j8o12K005J56Q40k208k350l035p93p23J980L119L604K845
3417F047J072k999k926k752k382P30K94O26J054M87J97j306J760J860J599K774
3433F135k57k496l359m457k504J248K301K532L470L18J524q25l096j72j198J615
3449G79l54L73k427k199n51o12K828L565L540J173o22k833k713l799j794J009
3465d637J004J543J912J516R27r14j63J260nr03j80j200k988k194L00P71K11M911
$$ y = [5088, 5527, 5079, 3176, 491, -1867, -3079, -1854, -328, -1240, -1748, -1991, -2745, -1662, 1072, 4337, 6047, 6325, 3023, -1297, -4481, -5775, -6009, -5038, -764, 2093, 3056, 3952, 2776, 186, 1977, 2471, 2466, 1333, -933, -2355, -4928, -4944, -3989, -1477, 2105, 3687, 6985, 6472, 4302, 626, -1443, -4879, -4513, -4599, -1839, 301, 643, 610, 1237, 1219, 607, 2612, 2768, 3608, 1400, -950, -3985, -4778, -5501, -3521, -402, 3202, 6047, 7119, 4120, 1194, -1558, -3940, -3210, -2916, -2290, -1236, -749, -552, -1858, -98, 1762, 3361, 6135, 5878, 3382, 23, -4434, -6938, -5690, -3389, -857, 2613, 2931, 4455, 3630, 534, 362, -836, 779, 425, 798, -1629, -3828, -4379, -4991, -2163, 1402, 4942, 6115, 5493, 2660, -53, -3852, -5646, -4637, -3633, -2090, -178, 1338, 2265, 1351, 1188, 2448, 2443, 1540, 1360, 160, -2828, -5022, -4722, -3951, -3740, 1171]
3483A171K433L052q83r46l844k728p63j574J442J666j12R30j251J876L76J206
3499B051J419J073j605k208j151m674j596P08K436L172L290J901O66k985k359
3514A38j126l46j19L94l63j193R5m95L88K660K241K556J288j390k718l911k671
3531d572j263J45L746R85K944M29Q23p56j387J624j610L59k3j693k868o04k009
3548e730N44L558M057K084M32M85l774j116k253j715M60n08J010L722j122j94
3564f0K852o65P98J246n65j237j631l864k053j244Q79K562L249K138K251J17n90
3581D183k685l508j052J071O72L84P74j202o28R10K193K792P14J301j846k443
3597A630l627k845j484J174L298K203K242J28j79n76j427m33K34M02r52j462j067
$$ y = [1171, 3604, 6656, 5773, 4827, 983, -1745, -2508, -4082, -2640, -974, -1086, -156, -1407, 469, 845, 2051, 3470, 4543, 2938, 730, -421, -5095, -6691, -5983, -3547, -375, 2915, 4816, 5482, 2497, 138, -988, -1334, -1453, -1059, -1422, -2615, -2520, -3015, -2627, 33, 2274, 4830, 6118, 4728, 2010, -1901, -4572, -5835, -5690, -1944, -959, 1985, 2414, 3237, 2481, 1094, 2718, 1108, 1467, 1444, -249, -3117, -3721, -5730, -5186, -1628, 2429, 4513, 4945, 5430, 1656, 540, -1713, -3428, -2968, -3476, -2466, 1256, 134, -60, 2792, 2127, 2925, 4171, 3606, 2369, 738, -3126, -5179, -6423, -5544, -2982, 267, 2405, 4656, 4773, 4183, 1498, -2010, -3062, -1991, -1319, -935, -161, -1363, -1991, -1081, 1112, 3904, 4618, 5919, 4073, 1630, -1997, -4842, -6326, -5152, -1854, 349, 2591, 2719, 2540, 1964, 537, 104, 338, 740, -212, -1674, -2741]
3614b741k093P71J754K938K242J607J689o83l347l488j263k373J038J966J374
3629f09J575J219k45o38Q54M3L53j163q47j980k014M65k098J070K865K560M316
3646E726L53k67k845l174j161k332J193P23k60L320j491O68j137K437O02O76J319
3663D350o43n065r89k664j996J526L238L278M934j198l19j709k077j153O92j514
3679a309L15k178L90K40j589L026R61K822K936o19j918k214k444l104o62J799
3695c548K305L003m50P86M15j575Q33J724j919j43j562n52k361j477o80K630K318
3712b53L325K411j223J165m131j973k160j557R23J662J374N55L92l95Q76J468
3728B459N5J523j016j707k355l023k28j895K258K787K405K804L80N32k682l318
$$ y = [-2741, -4834, -4063, -2309, 629, 2871, 4478, 6167, 5484, 2137, -1351, -2614, -4987, -3949, -1983, -609, 966, 2185, 1940, 1302, 2156, 2199, 2552, 1389, 542, -1438, -3452, -2987, -5085, -4015, -1150, 1410, 5726, 6079, 5812, 2967, -207, -1368, -3700, -2507, -1784, -2044, 1276, -215, 453, -684, 1753, 2355, 3031, 4350, 3707, -1358, -2347, -5011, -7007, -5481, -2243, 1035, 5969, 4771, 4452, 2743, 666, -487, 205, -1309, -994, -3172, -2782, -2542, -4131, -1105, -144, 2678, 5614, 4995, 3077, 863, -1581, -4685, -5347, -3548, -1243, 1760, 1310, 2096, 2511, 936, 1769, 3493, 1574, 1431, -131, -683, -3044, -4521, -5201, -2571, -253, 3072, 5483, 4260, 5425, 1294, -679, -2839, -4396, -3473, -1811, -437, 118, 510, 115, 991, 2459, 2514, 4037, 3021, 1314, -1041, -4064, -4292, -6187, -3929, -1142, 1263, 4067, 4447, 4979, 2297, -1021]
3744a021j75m45N79j809J862K0j646R38L25M100J240j14j45p22m007k674k228
3761e922L42K273J596J395K780J66L92j651P81r99L13r66k067K6j550J75o67J940
3779a643L319J780J296o7j571k060l704j303J9J282J108K0J903J524R89l324J932
3796A500j044L032j038k468m88l270K67k114L397K487K486J790K15j53l266l266
3812a933k0j224l93K501q35R40m75j75J611J980J251O60L80l234j084k464l272
3829e786J249Q56L111L022K92k14L28j754L37r55j979J463k69j941m26j278J899
3846b045J218L560N64K217r43j644k304l456o09L76N70J394J270R18K98P20j193
3863I11K54n09M53P44k528j093p67k013N99K773J705J947K070R07j841k467j706
$$ y = [-1021, -1196, -1641, -1062, -2871, -1009, -989, -2635, -1697, -1372, 2728, 3968, 3854, 3709, 2987, -1020, -3694, -5922, -5580, -3307, -1711, -316, 2464, 2630, 3022, 1371, 2152, 1153, 1466, 500, -1567, -1541, -3091, -2916, -3583, -1643, 1676, 3456, 4752, 4685, 3114, 1054, -2650, -3953, -3934, -2652, -1544, -1524, 379, 1903, 2892, -432, 1500, 456, 3488, 2450, -18, -506, -3776, -3509, -5623, -2226, 261, 2747, 4537, 4752, 4599, 1333, -1933, -1953, -3177, -3570, -1069, -1904, -964, -1439, -1614, -3, 1977, 3228, 3888, 4268, 1034, -50, -2514, -5786, -4537, -3681, -570, 2452, 2744, 2530, 2858, 1104, 1441, 486, -1493, -30, -299, -2240, -2666, -3944, -2045, -827, 2733, 3297, 5514, 4571, 2927, 623, -2833, -3442, -3066, -2496, -1102, 168, 1086, 1384, 2104, 911, 1165, 656, 1109, 1853, -675, -1768, -2535, -4548, -3949, -1176, 529, 2476, 4546, 5453, 3612, 1145, -561]
3880e61l070J635m00J179K354j255J091k69L11J058o23J199Q47k240m193j077
3896d014j622O83J770L255K462J309m97k61p80k639q44r99R29J350l23k746O73
3913b294J169M11L774J876j69j671k807j292k409p04q40J827L049J250J337l91
3929B116J204j384q25j274K26J02k482q84J675k225J038K752Q60K996L63L59l151
3946A466j539j965j495P9L58J347K279m99M48R20P12m48L69k37k04j682k630j157
3964c878o00P67J864L550J329K218j069k597k305o80M49j026L05L31J81L11j37
3981i87l2R70K789J158n2j442j651k110k374n84J362K97K104K364R91P9l32j527
3999A023j080J06j372J509j376j482l79l65J456K616K290J757lO6k263l391k155
$$ y = [-561, -3631, -1996, -2396, -1217, 1137, -118, 973, 704, 1015, 2073, 1450, 2649, 3496, 1256, -2937, -4014, -5636, -4953, -3183, 72, 2534, 3843, 3346, 3085, 2305, -334, -1178, -2177, -1248, 102, -221, -2967, -2294, -1125, -714, 3060, 4936, 4767, 3096, 289, -1003, -3412, -4116, -4956, -3129, -80, 1170, 2507, 2116, 3320, 1936, 1111, -163, 63, 165, -2317, -3201, -1526, -3751, -2713, 39, 899, 3895, 4258, 4617, 1466, -73, -2038, -3533, -3454, -3096, -1749, 530, 31, 479, 1399, 2111, 1663, 2032, 1795, 1591, -91, -2721, -3878, -4478, -3711, -1847, 1703, 3032, 5250, 4181, 1584, -721, -1401, -952, -1978, -1673, -1342, -1161, -850, -987, -1019, -49, 2740, 3898, 3846, 2404, 753, -1357, -3731, -4315, -2953, -2656, -552, 1812, 2803, 2882, 2550, 1023, -57, 49, -1323, 186, -1190, -2672, -3051, -3416, -1960, 656, 2946, 4703, 4700, 4766, 2503, -888, -3043]
4016c043m83j97J62M231J14k5R22M04n47j26o38n17J56o34k733n38j655J625L627
4035A05J027L477J33O40l036k254j561j347M78M64J132O95Q27r02J691j879K007
4052A697J739j454J31j848k733k659J028J380J375J376K585K654k134r76N42k637
4068F6L55j193q01q49N53n49J516P27J653Q31K508j231k091l70k707j883j176
4085d641n13M057K43K533L42l26M07p52q44J45q28J508l358p02J81m21J220J030
4103g19L226J427k54M72l765j211q27j545r92K027J795N03P21j10K127j759K005
4120C121j698P64M99l750j596k235n52K256K563J569K282N67q04j822j472k239
4136b547N15O6Q32Q67M76j403K357k068K332J608Q59M19j882k964j557j918l62
$$ y = [-3043, -3526, -3723, -3561, 670, 784, 759, 1681, 2085, 1538, 1412, 774, 257, 413, -221, -2954, -3492, -5147, -3522, 105, 1132, 4609, 4742, 5382, 2346, 92, -1469, -2816, -2338, -1874, -742, -47, 780, -122, 1569, -310, 1697, 3436, 1982, 2113, 265, -2468, -5127, -4099, -2719, -1344, 32, 2617, 5271, 3137, 2161, 2703, 66, 421, -772, -1573, -2422, -1869, -2418, -902, -175, 1478, 2309, 4817, 3586, 1495, 1125, -1582, -3465, -4641, -5154, -1097, -854, 1679, 2021, 1695, 2102, 1350, 506, 651, -177, 1331, -2027, -2729, -2548, -2969, -1749, -719, 2507, 3934, 3680, 4152, 387, -824, -1651, -3196, -4188, -2161, -366, 137, 858, 748, 2875, 1116, 3121, 1423, 2187, 2686, -1064, -2660, -4895, -5447, -3191, -628, 941, 3223, 3790, 2986, 1164, -308, -2547, -2032, -1966, -1134, -267, 209, -1194, 1163, -905, 1427, 3035, 3894, 4313, 2431, -533, -2090, -4008, -4370]
4153d370P93J740K843J075J543o78m61k241k62J6n64k95l02j651k09Q22J413J151
4171C63J646J368K03l60k328k489j135l45J49J561J721R10K67q6Ml53K88Q3n4
4190A413n0j929j878j761P71J920J551K970R75N25o91k401k350j576j81J182m35
4207a945L46Q77m54J719q92K929M6J457j096q21l506o32j591j512K291J511J886
4224F13K911j586J827k219k218L45j8n2j608P7j182K54Q6J275L165J664O54p8
4242C910j752j184k307k289j87O88K267J757J428k55P94j169j827J329j093n86
4258d76k29o84r21L02j711J797K609L396q77Q0j520j258k455l21o93n81J870K459
4276G87N52J30j186K23R45N4N02q84j88k449j365j561P36J754P04L549N02k23
$$ y = [-4370, -3577, -1837, 1006, 2081, 3624, 2946, 2485, 244, -18, -2, -566, -861, -1163, -2814, -3023, -2201, -788, 363, 2009, 3377, 3580, 3220, 892, -1597, -2732, -3077, -2928, -1367, 354, 1264, 1531, 1445, 1449, 1096, 1384, 1467, 1413, 1363, -566, -2444, -4205, -3434, -1514, 37, 3007, 3982, 4507, 3816, 1415, -935, -2511, -2692, -1510, -1945, -1599, -722, -1176, 543, -349, 2580, 2626, 4083, 2987, 2166, -1340, -1972, -3563, -5075, -2784, -1273, 613, 3524, 1938, 3765, 1546, -672, -327, -345, -397, -2005, -1928, -3110, -2856, -2770, -1495, 1670, 3334, 3988, 3910, 2158, 974, -1333, -3622, -3809, -3121, -854, 903, 2331, 2076, 2870, 1701, -126, 1203, 110, -476, -705, -1389, -2310, -2008, -3719, -1922, 687, 4083, 3206, 3286, 1766, 508, -1947, -2268, -2961, -3542, -1672, 787, 1339, 1469, 283, 506, 1451, 1505, 2007, 1123, 935, -1514, -2879, -4440, -3704, -1950, -1246, 2303, 2805, 2582]
4294B582o33M2j759k662K175l37k34j85K76r76N43O21L058J038m54L69k675j579
4312g90j903r92K25Q45J758J620Q22J607r99j293M59r9k399O51j77K7j814p0L82
4331b140J304K951J418l88j6Q3l610j690l111J495J837J997K00M68q5N13K20Q16
4349B262k55p5j196k61k206j356k63L13K427K154K028n16K31j407j867j625r2
4366a704k37k32J750j025O86J261j626K108J173O28L50j155k058j857n06j868
4382d312J559J445K917N22J584k226O17j890J475k874Q63o00j486R27j349J762
4398a066Q48K84Q30J966n5J5J4l638k166o15N43L31K844O12J635l57j271P70r34
4417E90p99P33p17K13k561m38l56J563M98K266K210N47j134q21j354k916R67j644
$$ y = [2582, 1949, 1991, 232, -2430, -255, -592, -826, -1011, -735, -1711, -1168, -547, 2511, 3549, 3095, 3464, 789, -790, -2693, -3685, -3460, -2615, -857, 763, 1585, 3192, 2193, 900, 1359, 1260, -1139, -488, -665, -638, -2452, -2522, -2140, -836, 2115, 3533, 3145, 3129, 3212, -398, -2088, -5199, -3704, -1867, 130, 330, 798, 713, 1226, 1446, 2262, 2007, 1932, 736, 475, -1731, -3087, -3350, -3037, -610, 1544, 3572, 3056, 3287, 1880, 13, -1612, -1704, -1941, -2173, -423, -1448, -762, 499, -1127, 981, 2154, 2782, 3132, 1977, -81, -1938, -2444, -4312, -2753, -1308, 1609, 2131, 3715, 1489, 2106, 216, 1691, -1183, -320, -920, -2406, -1479, -2828, -1066, -218, 66, 896, 2862, 2807, 2822, 2836, -802, -2968, -3583, -3040, -2709, 135, 747, 2382, 2025, 754, 1524, 590, -209, 524, -193, 20, -2541, -2979, -3335, -1772, -1274, 992, 3202, 3749, 2615, 1794, 440, -2476, -1509, -3153]
4435c153R99J836P09L02J57N72j27O90R62Q1j562k267r91k865J837j075L213K305
4453A623R79m51J080p53k776j4k79j781J845N93j334O8j799K422J757O37J273
4470C090j038P25k249k612j128j18r11K156J419J455J295m60k20j98r57J05n06
4487a52N01j868O53k11j649J211J775O33K897p50L3r54l156j420j101O11J840
4504a107p50J905J568j800J976m84j16R73M93k086j439l90j697O43J491O59K034
4521A873K367k53j623j304o61k357J095j750J274RJ085M41o99j24N92J530P58
4538B253L95o46j871j987j838m30K397R81J708J542P56j941j30m47k57j470R20
4555f5K80j744M96j249Q94n12J745K495K08L81n19j805l012p37J210j494K538
$$ y = [-3153, -2154, -318, 391, 693, 850, 1422, 1295, 1985, 2947, 3028, 1466, -801, -1792, -4657, -2820, -3895, -682, 1623, 2602, 2151, 3231, 2478, -298, -312, -591, -2372, -527, 66, -1268, -1200, -2999, -577, 1180, 1817, 3090, 2052, 2777, 528, -2084, -3212, -3330, -4241, -2085, -666, 789, 2084, 1624, 1404, 1206, 249, 354, -152, 349, -1519, -866, -1077, -2726, -1515, 260, 893, 3790, 3040, 3073, 2119, -1037, -2457, -3558, -2947, -1107, -1857, 48, 1616, -184, 1792, 1308, 1192, 2165, 2658, 572, -867, -1257, -2954, -2311, -820, -161, 1873, 4240, 3987, 2364, 1060, 399, -1958, -863, -2613, -1339, -1330, -245, 196, -503, -627, -35, 1495, 2253, 2648, 2002, 131, -1856, -3694, -4124, -1727, -746, 962, 2504, 3260, 1319, 1189, 742, 485, -985, -65, 215, -1529, -1033, -2282, -1388, -1900, -155, 2340, 2548, 2929, 2410, 605, -2407, -3144, -1934, -3428, -890]
4572h90N07J325Q78K72j746J109j07j594J123k49j717j261o90K99K425J094J724
4589B502J146J293l407o63j232o41k203J207J050j2Q99k86J81J505M11J099j380
4606A469M30r79j618j870k248J276J063K129K554J168j218Q69j577j894N57j274
4622a163r7J44M93J68j87j77M75J246J844L48j178l48j579k594j39R58m11J385
4640h12K645r9J83o38K19k20j568J066j498J50q76r19M42j08J65K644K109J752
4658D637j051j609j356l660m32M30J543J592N47Q68j289L30J760J09k72O13k287
4675D73j69k054j468r68J366J490J816J849J681j727P60j810j937j535R28p72
4691b077J313J050m81j271J818J709K54P01R79k038j046j567k298J133j531P87
$$ y = [-890, -383, 942, 1820, 2092, 346, 1455, 1348, -246, 877, 628, -1089, -2350, -3040, -2741, -316, 778, 2502, 3648, 4941, 1534, 871, -361, -1002, -3205, -1998, -948, -960, -61, -347, -166, 1339, 1750, 2849, 1469, 1899, 920, -698, -2568, -4816, -3540, -2477, -348, 2206, 3374, 2156, 3025, 1448, -446, 111, -1163, -1260, -1116, -623, -455, -642, -819, -344, 902, 2746, 3094, 1916, 1568, -11, -2605, -2744, -1786, -2197, -812, 1833, 1734, 1917, 1279, 1498, 1278, -290, 776, -722, -572, -1448, -2367, -1925, -2033, -1868, 776, 2885, 4637, 3586, 1977, 621, -3039, -3471, -3041, -1498, 94, 641, 1509, 220, 550, 2310, 2419, 2147, 2760, 473, 304, -1750, -3218, -4186, -2820, -1330, 486, 2335, 4016, 2289, 3049, 1239, -698, -2233, -1305, -2077, -764, 286, -195, -1466, 352, 2061, 2315, 3016, 3995, 1957, 911, -656, -2954, -1821, -3352, -2565]
4707b565J625K360J240q01J05p57j07j227r75J366j158J26o34L33L02Q05J451
4724A489J380J451j976r24k507p63j694J219R0R35K706q43Q02r17Q00n8m34K82
4742A038n11j147q85j392J92N23R58J726K781R3p73l64j899q99k240J151r8J552
4760a94r2r74Q70P0J011J156K26l16q30j007j532o68l32K94J279J691J209K74
4778B135L20R4k423q31o7r93J469j062J660j597q04K313O38Q65P10M91o58Q1k726
4797c85k505K88j076J540J542K334p35O17j49K07j318M39r01J205r99r42r52O6
4815a724m37K357J428J687k87J59k016j314j136r95N92N29J037k22R66j43j36
4832C45J009Q74n70J050j225k190q88k45j667N17J007K874J849o8j5j557j023
$$ y = [-2565, -940, 1420, 2660, 1859, 1964, 1207, 1100, -127, -1102, 264, -894, -768, -1402, -1069, -767, 38, 1489, 2869, 4320, 2344, 1420, -1087, -1850, -3544, -2325, -2235, -1300, 1406, 563, 1365, 448, 1248, 1190, 756, 1038, 527, -620, -1505, -2897, -2705, -2182, -1224, 502, 3283, 3376, 2603, 2239, 340, -559, -2799, -1648, -1746, -194, -286, -1260, -390, -320, 691, 1847, 2073, 1757, 927, -80, -1612, -2280, -2612, -2318, -1039, 652, 1861, 2135, 2455, 2549, 126, -705, -772, -1765, -296, -1358, 302, -1295, -2099, 214, 852, 1717, 2427, 2918, 2260, 2341, -385, -2890, -2602, -3678, -2138, -596, 1738, 1003, 1620, 1471, 1678, 360, 799, -102, 1103, 104, -838, -1790, -1724, -2161, 196, 1624, 3311, 3024, 3183, 1167, -147, -1283, -2278, -1686, -1157, -120, -342, 624, 481, 345, 1354, 2228, 1658, 2708, 1483, -707, -1595, -1840, -3507, -2990, -1983, 891, 2740, 2672, 2657, 1100, 77]
4849G7q88o94J038q07n7J66l93K042k94R6K434n22j7k42j545j200j915r25R48
4868b698K758K72M39J138J22n26j195j608J306Q91j303n45j058L13J8J169J09
4885c98K170O93J227k424l18k258r35j015J130K52J874J2J058r2l5q66J26K25
4903D26J9l69q95j457p31N96J261j22L552J046k61m33k812N25j148n61p87J116
4921a035o99R78J136K08M49l50l1J109R4j52k999L75k186p46J981K011J718K53
4939B114l15P01j474k037N02l11J775j027M7j546n22J260J114M11R69Q01Q79k483
4957H58r94j039k807Q09Q87J369Q22J759R2n0k345R57R58r90l73n49r47M93j555
4976b645k77J578J677K006O47O90j598k026k454J196R77k252J581l17L235j420
$$ y = [77, -811, -1505, -467, -1274, -1331, -1165, -1558, 484, 190, 286, 2720, 2198, 2181, 1939, 394, -806, -2721, -3646, -2698, 60, 332, 771, 1909, 2031, 1505, 310, -1298, 8, 899, -404, -949, -2007, -1694, -1676, -507, -398, 1772, 2465, 3692, 1268, 950, -1308, -2243, -3258, -2128, -1876, -2, 10, 1068, 976, 941, 75, 201, 426, 445, 76, -819, -2276, -3007, -2411, -1150, -1272, 2280, 3326, 3065, 2632, -180, 345, -803, -1364, -2151, -1035, -1734, -756, 380, 588, 1037, 687, 656, 1765, 1859, 1707, -1292, -917, -3103, -3849, -1868, 143, 1861, 2114, 1799, 2500, 1026, -1011, -509, -820, 955, -72, -25, -1571, -2093, -833, 281, 692, 1661, 2462, 3341, 858, -136, -1175, -3982, -3173, -2286, -917, -95, 1664, 1756, 1706, -639, 318, 1276, 286, -87, -636, -1583, -1090, -2645, -2922, -1344, 333, 2339, 2986, 3676, 2078, 52, -2402, -1206, -229, -2481, -900, -1217, 2018, 598]
4992E98k41Q05n2J36P79j232O74k468r17k69j704K396J408J94L041q02j065m16
5010H65j698K58k05L07k90j376R23N87k71O98J026R56O52r87K67j486j714j592
5028c080J46J794J938R02j47n20P25j036j327N38J221j451N4J31k311K80N64l87
5046a966L185R18R47K81l492k24q84j408m89J227P38J577K86j4j435J330n02O18
5064F93J271r75o78r51j552%M58P71K077J580K052k945p39p35p43q99q21K121
5082a5r65Q69Q89o70L90L97r40K497j537P01j392j750r78k0p15J798J152L12K331
5101B354k11p25O6j817P24k191R67nk29o20J18P86J402J372L45J368o18j540j275
5120B71l236J022j037J188P76J060J222j660j65J022J448r70j118Q16r89k462
$$ y = [598, 357, 1162, 1110, 1246, 2025, 793, 1467, -1001, -1918, -2187, -3891, -1495, -87, 107, 3148, 2346, 1281, 865, -833, -575, -780, -473, -763, -2139, -1216, -629, -900, -202, 824, 1780, 2432, 1445, 1712, 226, -1488, -3080, -2934, -1140, 798, 1700, 1553, 1033, 1758, 722, -605, -67, 1154, -297, -243, -112, -2423, -2143, -1579, -1966, 1219, 2137, 3084, 3365, -127, -351, -1235, -2643, -3132, -1905, -1167, 410, 696, 682, -753, 577, 75, 693, 1964, 989, 311, -640, -2192, -2192, -1734, -963, 1114, 2694, 4746, 1801, 1062, 327, -416, -1315, -2136, -15, -980, -111, 778, 108, 498, 895, -45, 2452, 915, 1616, 224, -1526, -2504, -2524, -3239, -1441, -289, 23, 2354, 2143, 1418, 1484, -333, 391, -1800, -833, -838, -1067, -1687, -1569, -783, 619, 1991, 2336, 3704, 3086, 1546, 271, -2965, -1943, -2980, -1792, -1016, 44, 1266, -394, -559, 463, 1911, 941, -177, 639, -350, -2812]
5136b812K93o52P16J312K328J208J085q37k096m04j452Q7M34n87l98J006j25J677
5154G83j71J175j879J814p22m05q87q13j082j133K264N02K154m98J590j167l68
5171A157k86j388N57r37m54N00n42Q4J70l17O39J854R67j072R83n26m081J96o88
5190c184Q40Q0K995Q99K77k380J641r62K7K98M92P75j927j459l3l28M83J247J188
5209I69J486O79j038n16k150k087k0P49J035K087r75P02q07J084K53n47j74O98
5227A428L12j564j152j086Q23N89J397k38K267Q80j926K6k113n11K55l30k19J47
5245a015j31J05P99K46l7J691J035l16j450q85j818M58r54L60R57K078J369j137
5263A355M01n13j042K85p78m49P05p13j279j6L14K35P45L180K34L53j044k578
$$ y = [-2812, -2519, -3171, -2455, -1143, 1185, 2393, 3478, 2641, 545, 141, -1311, -1224, -790, -1377, -1775, -769, -894, 783, 612, 1787, -92, 1722, 1000, 595, -292, -1105, -2187, -3320, -1056, -554, 1600, 1102, 2692, 1525, 1157, 871, -517, 40, -897, -1351, -851, -1393, -1309, -1139, -1456, -817, 1037, 2004, 932, 1915, 1389, -2692, -2496, -3184, -2344, -2264, 731, 1630, 1907, -473, 1168, 206, 233, 531, 1023, 1798, -129, -1588, -1621, -1949, -1466, -219, 969, 2455, 3134, 2096, 1580, -570, -2657, -2677, -1928, -893, 1194, 219, 921, 114, 1198, 1451, 904, 730, 1428, 1740, 176, -976, -2062, -1239, -650, 747, 509, 2776, 3656, 1730, 1756, -357, -868, -613, -943, -1162, -1015, -1146, -1041, -242, 4, -33, 1658, 2693, 2377, 927, 42, -1776, -1318, -2272, -1912, -955, 1123, 2492, 1355, 1756, 1243, 201, 486, -292, -741, -36, -749, -2028, -2044, -1730, -1495, -750, 2430, 2664, 3017, 1973, -605]
5281f05j517q34P31J094J360l20M87j94M92K23L57k61m84J088j485j087j446j27
5299b528O16K12P72K482J73J00n95o35l90j813R50K10N93j069j05J177K80m09
5317B1J178O80r70N15k80k551q94n60p63K456k00K948O39N16j018j762m89N00
5335c4k354K649j455K02N90j053L17j92K157J255N58M20j470m243J648j428k84
5352b717J551M49J918J23J064k130j384K317j41K10l01p71j327j438J531j121
5368b167K160J138J325O30o90m23k514m96O0j534J835m91J547J58k55J50l58R51
5386A026J412O5j711j203Jk618q0N39O73J379K160J074o31j681m47r17Pp58L60
5405a350J291n71m73J21M28J418rQ0K021k115k76l00k081j153P3J830J534M43
$$ y = [-605, -2122, -2956, -2225, -1131, 229, -91, 396, 202, 694, 917, 1274, 1013, 529, 1617, 132, -955, -2401, -2528, -1912, -1700, -928, 1554, 1727, 1827, 1232, 597, 207, -1606, -656, -446, 147, -922, -1027, 150, 430, 21, 1199, 1879, 909, 1424, 1144, -1407, -2301, -2861, -3624, -1168, -1368, 1580, 2219, 2735, 1717, -45, -534, -34, -2388, 261, -1194, -992, -402, -1455, -1138, -1330, 827, 2082, 2640, 3060, 1590, -2653, -1005, -2433, -2717, -1166, -717, 1201, 1324, 2388, 258, -1126, 1191, 1050, 1260, 959, 188, -1139, -2577, -1046, -2167, -7, 1131, 2456, 3086, 2396, 1973, -541, -1037, -977, -2511, -676, -1167, 380, 538, 283, 433, 75, 1026, 2438, 2503, 792, -411, -410, -3028, -3108, -2569, -1896, -517, 1643, 2717, 2086, 405, -42, -959, -952, -1710, -1350, -59, -630, -1103, -982, -554, 864, 855, 935, 2956, 841, 565, 265, -1816, -2969, -2896, -1066, 468, 911]
5423I11P52M72j400j138K049k245J868j862l04j484P78j08q2J286J622J075J031
5440C221l16k599p96j969nJ184l03J029P46%M82p01r3J196K31r28M84j215j479
5459a831l99j090J282J763J185J76J055n76j647M85j147O28j372K46J796k057
5475a503J211n34M98J192R4N39K9L42j372k211Q60j100M07J304Q42J068L27k36
5493A757r08k71j94L49o49r12O28j44j648J438J60M76M14J421J09O75l247n04
5511a050o57j445K001n52K079J644j295J66O7p0J190j165j48K39j642j820J425
5528a033k185J463J758N53K510n87K42j883l85j824M1J02J223n65J56j48N67P86
5546G91L6n70J444n24k6j243j769j74M8P60k33K578J89P26j29o88p22l34k662
$$ y = [911, 1663, 2135, 735, -403, 1646, -599, 1269, -593, -897, -2381, -1603, -1711, -1793, -507, 1115, 2190, 3221, 2905, 306, -490, -2459, -2464, -1280, -1583, -554, 192, 192, 674, -27, -120, 1076, 1307, 379, 863, -352, -1831, -2230, -3320, -2038, -275, 910, 1086, 2141, 1565, -82, 403, -744, -116, -1488, -1242, 554, -1503, -292, -826, -328, 864, 958, 1497, 1526, 1868, 496, -1715, -855, -1955, -1548, -244, 598, 1666, 1993, 1757, 849, 578, 384, 733, 84, -828, -200, -344, -1992, -554, -394, 82, 496, 1917, 2026, 2701, -546, -1050, -1707, -3152, -1151, -1703, 376, 2020, 725, 891, 958, 888, 2078, 913, 765, 1004, -638, -2458, -1033, -3218, -1755, 3, 556, 3066, 2479, 2721, 838, 453, -1371, -1330, -1228, -5, -570, -414, -562, 5, 791, 827, 257, 1701, 1177, 1151, -92, -1861, -2035, -1987, -1227, -1460, 1118, 1307, 2033, 1904, 1216, 494, 160, -2502]
5565b502J535K92O5l74o74N17N67L03J139J252L60k07j793j077n72j365N56O94
5583a284J964O40k62J018k120J779j732J71k3J027j988j242j7L33JJ760K018R82
5601C025J86j610n93j756p15M79P26R3R03l83M51j438J000N44J436j347j090J219
5619A130j703m69j219L37N60K559N24J221Q77k857r33O00k135L90Q53j993J252
5636a006N0M20O92J075l53O23n44O11j90k098%j724l82J588J367N28J403o23j17
5655A320j434J14L90k90R46j179n14n28r0R57q45K326O39N27L10j877j684r02
5673a814j79Q39M3P86M13p8P59m42n31J404n68J48K6j630J167k195L60K58P44
5692d90J375M70J093m96P11l168q44r2P33K01n32L28L56p26J382o88L41R35N95
$$ y = [-2502, -967, -675, -610, -984, -1658, -1141, -574, -271, 868, 2120, 2480, 2273, 480, -597, -1169, -2534, -1978, -1284, 680, 1320, 1058, 2076, -44, 1735, 3, 174, 151, 1178, -810, -2052, -2069, -1736, -1735, 25, 2043, 3025, 3211, 1601, 1008, -748, -1463, -984, -258, -165, 738, 355, 806, -632, 368, 912, 2348, 1001, -89, 1130, -573, -1042, -2261, -1924, -1364, 1195, 1719, 2940, 3817, 960, 27, 627, -1508, -1118, -265, -2258, -1006, -956, -536, 156, 1231, 878, 1501, 957, 1568, 1378, -720, -720, -2444, -2826, -1238, 129, 657, 2060, 1437, 1320, -114, 0, 390, 100, 1046, -133, -647, -1175, -1265, -308, -1153, 1173, 1812, 2339, 2649, 772, -912, -1814, -1993, -1154, -1111, -325, 88, 10, 769, 327, -204, 1200, 632, 780, 806, -824, 343, -1852, -1492, -1234, -490, 885, 1355, 2448, 1952, 2663, -505, -1349, -1441, -708, -507, -1039, -711, -355, -1081, 301, -387, -46, 889, 1484]
5711A484J28j7l018K19k025K184p75J305K573N40O4k278J73j046j32M91m25p37
5729a292q02K40J030K12l92K075k43p68P54j80q07k423l05j45J778Q28J182n5
5747F87N36P93j514o94J497j324P06j040j76j471M61mR85K008P91M92j599J092
5765B226j178k019n75M19R64j3J221O36q60n6M46J9J21P94k348K96j493j84K99
5784a285M25M45M07Q34J404l68k13j678l48j055P95o69O41n16R00k51M52J80J694
5803A794N54j16j270j88j715k032N43R44n75K538Q85J126k018k11n4k05m94l44
5821h38J026o78n79k18J044p18R58M48K571j080K96r95j803j606p18J681l5M46
5839g98J216O40r56l05J270j54j69M03p4k793N27r59k97J547J044j33R51Q30J248
$$ y = [1484, 1612, 1595, -1423, -1204, -3229, -1045, -1820, -515, 2058, 2598, 2662, 384, 557, -489, -621, -130, -555, -1292, -2094, -1854, -824, -612, -1004, 1071, 828, 60, 814, 634, -173, -2596, -2901, -3046, -1268, -440, 742, 687, 1223, 2016, 502, -192, 1305, -19, 687, -353, -529, -2000, -1539, -1543, -558, 1450, 2241, 2733, 1134, 2226, 1048, -971, -1546, -1127, -163, -176, 1045, 1681, 821, 765, 1211, 1230, 1351, 2145, -203, 93, -1400, -1584, -1285, -860, -415, -8, 826, 2230, 1862, 1649, -29, -377, -1432, -637, -1306, -665, -1181, -281, -532, -80, 100, 1794, 2348, 2232, 962, 774, -941, -2973, -2430, -1486, -2061, 477, 1362, 2488, 470, 259, 205, 0, -494, -838, 188, -490, -1069, -1287, -243, -961, -3, 445, 3016, 1936, 2232, 1237, -566, -2172, -2890, -1209, -1244, -798, 418, 1058, 102, -203, 1067, 913, 744, 1147, 1073, -1720, -1193, -2152, -2449, -902, 142, 9, 960, 1790, 3038]
5858C038j716k233K63j055N69P24j47l84k38J367Qk08L26J938n1j652l23j390
5876a164j164j10J003J35O36J419J045Q09k767Q22q48J6Q44j950N57K98J83j068
5894a304J344R13o0J151l79O60k184o24o39j124P15M08K312R56j442p23M62m89
5912d7M06k80M74k34j604j31J61j752K375J093K63P22J221j513p23m23r83j090
5930b065R7K331L70L54j239P42o98J151j174K049J05k237l4p25j172k51J560N95
5948b41J748J99Q3P60k037r29j662J523m14R67r0q46k36M93J378k63J082K76J062
5967B853j895N76k980J08m98k27K475n46K092j640K81o04n96n7R36K20L7j259
5985g24j090K96j00P45J140R15K86P55j51k506j083O43L33m27M41L04K2O75R71
$$ y = [3038, 1322, -911, -648, -1703, -1134, -410, -557, -941, -1179, 188, 196, -12, 314, 2252, 2201, 549, 226, -1164, -2328, -2438, -1435, -1300, -664, 755, 1800, 2609, -158, 664, -184, -168, 676, -1274, -717, -419, -236, -1304, 40, 953, 893, 2044, 1665, 2325, 141, -483, -1122, -2246, -1531, -1123, 1189, 2145, 703, -20, 442, -47, 359, 79, 553, 319, -1285, -1416, -1255, -3007, -632, 461, 724, 1446, 2667, 1154, 431, 8, -975, -2065, -1968, 363, 733, 1087, -152, 590, -108, 1043, -131, 1918, 2023, -214, -248, -973, -2145, -2396, -836, -241, 1507, 1706, 1789, 2549, 512, -417, -2079, -556, -970, -3, -93, -939, -1175, -682, 696, 433, 1515, 1791, 2853, 958, 1534, -1446, -1338, -1836, -2063, 412, -134, 1958, 318, 599, -5, -601, -658, 278, 498, 535, -724, -1814, -1518, -1618, -873, 267, 1182, 1468, 2223, 2072, -434, -1517, -874, -541, -968, -527, -223, -201, 474, 1445]
6004A445j362J004r37j00L83j145R92k160n42J511L67O3J959m24N51j511j1j088
6022a005Q6q3j98R80k43J25j975K318j108J079K059L79l16j130j611q48J55n95
6040a931J042M23J820R63l19n23j244j23KN26k55m16m64j40j372J175J171R56
6058A291L19J65j39j868j32j116r17J21J178J316J015j080n68L73J12N64p64O18
6076D88K96m40j6j819j374Q66L079L82J245l81q47j202n33J243k029J28J538r50
6094c26Q86j085O69r30M25J22J158R00j820j408J65L55J34j406J165J709Q00J271
6112B784n55j491q79j78k68j76J541j845m2J927q47k55R47m7l88K601j790L81
6130A420j844r77M15j404K427Q57Q20k24N74m68j931M37P52k51k93o27j593j49
$$ y = [1445, 83, 1087, 150, 50, 433, -712, 280, -1880, -2422, -911, -544, -481, 1478, 1054, 1605, 94, 83, -1005, -919, -1002, -1200, -220, -463, -338, -2313, 5, -1103, -24, 2035, 2414, 2098, 968, -643, -1491, -1336, -1931, -889, -466, 1354, 2317, 1998, 1475, 231, 108, 110, 636, 381, -35, -499, -639, -2011, -836, 335, 1291, 1610, 1775, 1636, -232, -364, -1480, -2397, -2276, -1098, 218, 1233, 153, -415, -42, 70, 634, -130, 488, 784, 344, 328, -1491, -2865, -1999, 1080, 1462, 2707, 2326, 1479, 277, -256, 987, -1042, -914, 624, -326, 560, -525, 144, -786, -361, -239, 919, 1819, -1, -1409, -1244, -889, -755, -2161, -996, 713, 1513, 2784, 2229, 738, -141, -319, -587, -763, 778, -1067, -1109, 818, -29, -284, 663, 616, 228, 2829, 1039, 1420, -424, -1401, -986, -2390, 37, 894, 1714, 1490, 2064, 1596, -335, 102, 854, 603, 310, -317, -1910, -2059]
6148b059P50O42O08P23R62l69p2m7j206J79p65q6M00L67L98p09N28J32L9J58J048
6169A621q70M48j115j492o5J4K46N37K362L97j9O39j938j415J23j070J102j48
6187f43J459l67q9j026P24M85R82r6j54R37k317k90q67L04j058P83Q08J923J49
6206A647j692J336j709L64j84r02N22L46k88j021M86R6J404P72R85n96j320J768
6224B014l343o4k49Q37N84L47K048k037M66M82n97k49m48P14N27j577j106O17
6242a034k297K639J062K66L39J025o90j924M01q19n21J290j06Q60L00j298M92
6259a5j2M98O88j12j96j481L40j002k1j1o43J539K3L137j893L23j571P62r81j4
6279f42J815o41M51j436n52J58K1P37L351j280P0p83k536m05k000K423r2K112
$$ y = [-2059, -1309, -667, -59, 664, 1626, 1257, 1185, 1138, -68, 111, -654, -740, -340, 27, 425, -284, 244, 376, 415, 573, 1621, 751, 1199, 84, -1408, -1473, -1459, -1213, -676, 1686, 2083, 2064, 2703, 765, -650, -527, -1597, -495, -643, 816, 449, 360, -666, 58, 543, 1525, 1429, 1275, 2212, -105, -395, -1262, -958, -2016, -1233, -425, 1498, 1647, -45, 1291, -418, -54, -238, -1140, -618, -272, -560, -1581, -1095, -999, 405, 1177, 2162, 1566, 246, 2014, -1329, -1393, -1642, -805, -221, 126, 2174, 137, 603, 1085, 488, 239, -209, 505, 1032, -545, -1651, -1034, -3331, -692, 370, 636, 975, 2000, 1310, -614, -213, -1032, -1553, -263, -369, 491, 791, -507, -15, -27, 471, 1159, 1047, 851, -630, -290, -1292, -1313, -1324, -1967, -428, -405, 2732, 839, 1162, -409, 353, -628, -642, 1173, 532, 983, -453, -1005, -847, -826, -89, 3262, 1982, 2052, 1269, -1267, -1672, -3672, -1249, -1341, 771]
6297G71J1K1L38J07r25q1j31L90R38j432m15o15O56L3j749K162K472j085P47r47
6317A266o02p20j055m81Q32O96L46O2J27m28j15J124k35l64n8k97N6j273k9j18
6337a266M39J210J316J390j766J61O49j900j287kQ10J133l35j446j13P00M13M45
6355E51J042j08n51J882l050j864R83m4Q45J930j721K101p98j038P26j533l08
6372i55N68l27J098j190m95L40m27N52P29K184m68J032k704N99r39n57L77j12
6390f95R52k18k24M36P76p41L37n59M15M96k95j230j238l83N55J222R01J061j543
6409B5J735j139K55j915l58M85N37J542k384Q58K21m0P8J158R46N3n70l71j431
6428c15k009N31P18K26J058R56m12J084p68r07k00J375j549K32p37r25R74J21
$$ y = [771, 782, 803, 1141, 1248, 323, 242, 111, 501, 1439, 7, -408, -1023, -367, -334, -2083, 79, 2551, 1466, 2213, 1266, 664, -56, -1111, -1592, -760, -64, 282, 344, 471, 43, -72, 1052, 817, 453, 395, 98, 154, -1119, -1148, -1266, -827, 383, 1699, 3089, 1323, 1484, 2133, 233, -1054, -1056, -246, 887, 552, -894, -1007, -307, 106, 551, 1593, 1485, 934, 2816, -234, -2098, -1115, -1159, -314, 1616, -105, 1996, 1198, 160, 886, -647, -955, -387, -714, 384, -806, -1301, -961, -1388, -836, -107, 2077, 1609, 2641, -63, 536, -403, -960, -583, -695, 257, 39, -185, 251, 1027, 286, 623, 64, 479, 975, 680, -550, -1788, -2171, -1616, -394, 507, 1568, 25, 1760, 621, 876, -1039, -1397, -912, -375, 1167, -1217, -359, -138, -178, -100, 1058, 2004, 2057, 1487, 1116, -315, -2324, -1793, -1075, -849, 209, 1165, 753, 1837, 1069, 162, -38, 1337, -212, 20, -717, -1642, -668, -547]
6446e47n83J205J670j449J039r87J285j888p93o26k49J842P18q15J049m37n04
6463g0j72n72J580j028P01k79p28j032l8M79J104J240M85J144j627m5k190m21
6481a469J280Q95j807J367J010j966N86L41J187q39L58k0l55m08r05p65P31j266
6499b045J139J510k65R58N92j864M37p88l03J2N30j479J610k262J804j413K215
6516C88J1J156o31k44n48j657n03o66J195P85J023r74K761j996N04l00K96j006
6534d06M70l0j95J197k954N94o8J187J878n0M57o51j100j231j291N02Q39N01N87
6553B36l1K92M48p68L37J70L30J46j455J068j231l41m38J330M21O64o44K048p84
6572A798j749o18j59K99l94k53p42K95R90N24J01j116J810p54J212n45j95j730
$$ y = [-547, -1130, 75, 1745, 296, 1335, 348, 1633, -255, -1048, -1674, -1923, -81, 637, -178, 871, 434, -70, -242, -814, 766, -262, 439, 160, -568, -1600, -1638, -1159, -55, 1185, 1670, 2814, 1187, 1142, -1048, -1469, -189, 706, -1101, 266, 1276, -690, -104, 237, 1424, 585, 943, 923, 568, 160, -745, -1510, -779, -2045, -906, 604, 339, 1297, 1889, 25, 462, -326, -629, -617, -87, -1566, 44, -2218, -414, -1827, 388, 399, 1555, 924, 680, 132, -1525, -2028, -2694, -1499, -714, 309, -665, 2096, 100, 604, 304, 600, -406, 64, 34, -161, 1036, -1918, -1324, -1392, -205, 1673, 1623, 2080, 1429, 329, -902, -2193, -1691, -852, -351, 236, 205, 497, 945, 177, 514, 684, 1014, 1160, -295, 773, -458, -799, -1237, 93, 514, 1178, 534, 2582, 1798, 49, -569, -728, -429, -823, -1076, -1818, -1523, -533, -9, 92, -1024, 786, 32, 1244, 699, 504, -1226]
6590a226n93O07l06J93J955J543j449J10j370P14j183K21J357o36j487L61L26
6607h63K27M14J080n52P20P62k030q0j312j71M93k44Q02R66M8n42L47k3Jk67J325
6628A101o21m57n95n58l98n02Q71K315P96l10L39o92k742J908j616O11L79j552
6646a723K238j92j106M90k7P26K26k36M91l71m98o21j621J077P55K43J85Q13K092
6665B941k808L39k044J691j149J665j236k62l40N23J182j198Q83J094Q23j800
6681C04K95o05j366J73n70O20Q70l54J002q75J196p09K1J54N59J151k471m75j377
6700b457J921rR48Q32j95P10K31k56j205p6p24p09j045K026m8O28k39k33k69J12
6720e7O42p40J944k238k54j269K32Q85j101K639J818m29j478J72k59j642K99J07
$$ y = [-1226, -1819, -1212, -1518, -1325, 630, 2173, 724, 834, -536, 178, -1005, -784, 573, -63, -1550, -1189, -863, -636, -222, 858, 306, 1026, 1788, -242, -322, -1634, -1805, -1312, -1556, -754, 212, 260, -282, 65, 42, 43, -224, 1101, 480, 23, -572, -1130, -1528, -2030, -1159, 1156, 1952, 1642, 1981, 1289, -1453, 455, -1161, -550, -171, -1723, 515, 323, -783, -293, -320, 406, 632, 396, 887, 516, 18, -603, -2224, -1147, -392, -149, 36, 849, 2941, 133, 472, -1572, 119, -1030, 635, -601, -863, -1203, -680, 502, -696, 187, 1281, 2104, 304, 599, -6, -1372, -1199, -1769, -1149, -279, -633, 369, -506, 690, -19, 2, 156, 715, 1866, -605, -1080, -2457, -536, -545, 403, 1235, 1040, 1750, 1981, 1725, 520, 444, -280, -989, -2034, -8, -56, 572, 333, 100, -169, -57, 585, -155, 1789, -449, -703, -1972, -1740, -855, -1956, 683, 2501, 2072, 594, 766, 507, -1135, -836, -729]
6738g29M95N81j493J222n34j041J655O99P77j145J009k76k363L46q60L76L61J618
6756F98J17K03k87j290K88l20M35J2r1lj133J104J424o29k149K082k3R97J106
6775B541j947k260J376m97k74O31m88J049J049j212K90n64O02M23j194J446p42
6792B29j426N83m65j188K346O60n62Q62j49J04j103o4M40l99Q5o72Q74n41l35
6811g21R51o57M29k6J562J58j383o54j398k18J287O26J113p51L71m10n61o20R67
6830F5o97K190j964J2L82j361L11R03N36L41K11K392j931j291k138J58J103r93
6848a771P44J030k61k05J097j178J670j037J235k9l28j898P64j176O73P98K11
6865C39K97J337j391O90J32k853J001k24p6J14L39J565p16p67r3j18P09J372n84
$$ y = [-729, -234, 347, -1146, 76, -458, -1499, 156, 855, 1632, 487, 1496, 1220, -1143, -797, -1657, -1281, -920, 698, 815, 1018, 731, -559, -271, -591, -156, -144, -235, -238, -1371, -267, 1157, 528, -1621, 461, 438, 1435, 2541, 594, -1666, -290, -787, -1061, -430, -918, 131, 1180, -32, 258, -306, 296, 719, -475, 971, 229, -1197, -614, -1079, -2267, 79, 739, 177, 1039, 890, 994, -109, -173, 267, -132, -47, -719, 155, -386, -721, 230, -427, 2, -24, 1538, 1696, 313, -341, -1739, -1957, -670, -44, 1069, 318, 689, 279, -282, -902, 65, -632, 1558, -406, -394, -12, -1373, -1062, -159, 377, 718, 929, 3321, 1390, 99, -2039, -1881, -778, -1771, -1027, 3, -258, -463, 634, -544, 1126, 89, 1324, 1295, 967, -931, -167, -1343, -670, 128, 339, 636, 1973, 582, 1272, 1404, -1449, -448, -672, -748, -634, -295, 1270, 554, -213, -306, -424, 285, 1657, 1073]
6884A073o39l18j881J143J11K38K79J217J285m98j016J36j595M01N02p93R23o42
6902g4q82r4M58L55L41Q27J116j318J79n54k09j320L79O73O19J8k77L14k41o09
6922b99j86J595m03Jn58q37M1k87P6O71R34J47J12k49N81j443j108K07K44J143
6942C82j029R15J012j52r76r22Q85J553p97p40J650j349k432O74o81J831o1N62
6960C25O92M97j87j256p08k05L74J6O27r51K79L79o19J95P57K208k203J027M98
6979A745l088N81j422M33M65J317N33j39J58K84k507K886j984L15J024m19N93
6996G75j568r68K57J630j211K208Q65l85j418m70L41r84J11m9P00R46o90J208
7014A298k4k297J293L59l02k8K30j255O2p7O83p80R13J152p24j37j46p03K07j038
$$ y = [1073, 434, 116, -1765, -622, -511, -273, 6, 1223, 2508, 2010, 994, 1130, -465, -64, 438, -355, 568, -74, -956, -1050, -592, -237, 104, 931, 2047, 729, 908, 354, 145, -1175, -796, -123, 496, 514, 237, 551, 310, -299, -485, 1110, 707, 708, 150, -687, -646, -933, -857, -186, 748, 895, 1007, 758, 1339, -104, -1212, -1005, -761, 382, -647, 268, 1280, 1128, 152, -770, 115, 1668, 871, 131, 1781, 432, -2000, -1326, -2007, -176, -237, 325, 1017, 1514, 1327, 71, -637, -842, -468, -452, 175, -776, -497, -118, -737, -542, 215, 2423, 220, 1247, 1745, -1343, -762, -2184, -1751, -1286, 31, 564, 425, 583, 867, -1640, 1246, -738, -423, 601, 182, 775, -793, -1761, -1504, 126, -1085, 1123, 1988, 1603, 185, -285, 56, -928, -817, -866, -166, 780, 90, 1298, 1274, -1023, 270, 629, 327, 299, 529, -726, -664, -741, -58, -838, 75, 1227, 503, 366, 220, -483, -276, -1314]
7034a314j56O41L97R29k23M42j482L40K408l97r67N97r22q26j077N10P6J80J015
7053A71O58q2l9J427k929q95K249j265L97n63J511n43K49J33J50j46J747j457
7071G73M16j226l44r27n99Q61O31P91j93J346k028O09j30ln10M14k47%l56o55
7091a377l57J202m06L141q7K69r80j247m56n80m88R27Q94l27J001j711J197q8
7109E27M3r33J028O19j02r83n08p67N45o03P73J805p61M78l53n94j245l84m63
7128a878K307r37p2Q3m78J39P30J231m00r87O48q61R23l57j857L2M57J122O02
7147D47n22M53J60R45L10r70K78j394Q21o43j542O17L66j217K274J432n40Q18
7165B093j054p77q24n51P32K83J111l28O22j200p9L60O62k16o65N79P53k576P54
$$ y = [-1314, -1470, -829, -432, 497, 274, 716, -766, -426, 1982, 1585, 618, 1215, 293, -533, -1610, -1100, -1024, -844, 171, 829, 747, 708, 2135, -794, -1689, 560, -705, -308, -871, 640, 97, 346, 479, 629, 483, 2230, 773, 1189, -37, -381, -1308, -1907, -1046, -415, 376, 183, 1529, -499, 110, -20, -23, -533, -119, -366, -366, -722, -1377, -1734, -532, -938, 2203, 2116, 2385, 1405, 158, -298, -878, -1366, -439, 455, 128, 1129, -582, 615, 527, 570, -363, 665, 1284, 1182, 199, -309, -1076, -531, -1134, -361, 1444, 683, 1161, 808, 214, -1031, -1415, -1878, 429, -508, -580, -497, -975, -836, -106, 1125, 725, -262, 386, -475, 448, 91, -1766, -1734, -1277, -155, 447, -75, 378, 538, 1483, 1793, 823, 1101, -293, 528, -115, -1657, -1040, -674, -1891, 383, 1815, 1275, 2093, 1039, 262, -562, -1113, -381, -98, 1013, 685, 1307, 107, 28, 388, 1050, 834, 169, 748, 1501, -1075, -321]
7184c21p38L97l53P85r4J056K88p24j58j58k20m31Q26r27O23J47N75J90l73j12
7204B78N62K16M5r43o31m48o97j25R95O9K060j325l62O91j12p6n25K92k83o33
7224i52K68j026N47j91O50J207M89N18r1m41j641K5K1J94p06J292r71J392r02
7243c18R40M44m94m98k57O42l51O61p60l35j419Q99nJ795o29P85l67m21J30q06
7263c64r20J13K48K557o85j029N59n15M37k0k55k28R45r62j514J080j136J073
7281f16k49J824n00J652j914K37j070j47r64M33J965q40N53j144L53K06L31J769
7299A879j282j005J413L73k029K0k65r5L39K784n27j540j28N49n03m28O68N1l31
7318e7m91p35J105j093J759j1Q77J129j150K57j804k62j149M81J579l24l59Q63
$$ y = [-321, -1059, -662, -1015, -230, -324, 732, 1020, 296, 138, -20, -240, -671, 155, -772, -149, -2, 573, 763, 390, 278, 840, 1056, 1101, 158, -473, -921, -1618, -1743, -748, -679, 1381, 56, -306, 385, 273, 197, -328, -36, -319, -952, -684, -1710, -1163, -1354, -704, 503, 992, 1510, 1419, 978, -663, -638, -617, -423, -1129, 163, -808, 584, -318, 622, 1066, 572, 74, -183, 459, 108, 769, 9, -326, -1745, -846, -851, 944, 315, 1100, 733, 312, 442, -364, -1284, -1171, -923, 1634, 949, -80, 479, -36, 401, 381, 126, -102, 843, -119, -1633, -553, -1689, -616, -865, 959, 459, 2111, 197, 434, -636, -783, -1747, -1314, 651, -189, 364, -780, -427, -221, 110, 1879, 597, -408, 1005, 1378, -651, -631, -896, -991, -652, 2132, 1605, 65, -63, 486, -17, -445, 223, 274, -57, -548, -1283, -178, -1271, 488, 477, 1354, 2483, 1333, 1590, -214, -476, -1625, -1144, 435, 111, -248, 615]
7336F15L80o89j98j39p87J681L16K57k545j07K58m22R42K184k13m32K85j494P67
7355F59j746M09l15R06n64J743l90j458O22J61j25M62K79o06J65O8j070p29J016
7374e13Q9K6J223l3K01j600Q69P12l78Q40k391O03m51P99j056J378J59p62K335
7393B050k207J861j221j014k53j33J22J20J031m16P03J83q77K30J162r08p23J212
7411I22k88j457P63Q66j704P80N09Q76M0j109k95n88j38Q4R96n76L41m86J211
7430G47m70j171r6J210P14L28qk89j316l87l50j057J725R21J207l67r55R85j543
7449a72P77j571j3K167j534N0k14N9P7J489j611J170J162j331r24J196k741M61
7467a503J961m30Q57K18q42o86J207p71J066k010P16Q01j249N87j439o7J79K696
$$ y = [615, 995, 306, 108, -31, -818, 863, 1179, 1436, -1109, -1216, -958, -1380, -438, 1746, 1533, 1101, 1386, -108, 659, -1087, -678, -993, -87, -651, 1092, 702, -756, -134, 27, -98, 364, 643, 37, 202, 270, -800, -1529, -513, -424, -398, 825, 792, 993, -607, 262, 974, 596, 1436, -955, -352, -803, -4, -1060, 318, 477, -285, 2050, -157, 1704, 483, -531, -784, -917, -795, -675, 356, -60, 643, 826, -51, 179, 1341, 433, -290, 922, 634, -823, -60, 806, -898, -118, 391, 1267, 1307, 198, -97, -685, -823, -739, 257, -319, 22, -464, 747, 277, -894, -990, 220, 934, 1262, 1254, 965, -351, -738, -1088, -2145, -420, 501, 1708, 1341, 386, 1371, -172, 605, -966, -979, 1188, -346, -296, -510, -451, -374, 1115, -496, 674, 1836, 505, -419, 777, -1964, -1503, 458, 28, 885, 1103, 261, -425, 782, 11, 1077, -933, -217, 584, -665, -78, -1517, -1584, -1405, 1291]
7485A291l4r9N58j095j007J120k230N30o05R12J089m79l71M75L78q74J025nr11
7504c32N33J321k050j532O83J017j725K216R3K006j843O52n08j190n29J353j19
7521D6k87p64lJ566j384L35J453k63l30O36o22r75k49M8k72Q52J91K62n41M86
7541A85Q46q68K04K10j666N75J074p88j73j074J281N57J604r34R73j175j302L53
7559a18j583O62L45P36M12l6j41o47M69N65n60l10Q90m47j705l26J921q57L42
7578c88R41j691J522J081r49j185O95p04k31M45j59K95R42j306R5K49P44m5M76
7597H27P37j247p94q22Q88r56J491j9Q30L52k70J84q51n43j90P87j557O31Rq09
7617a322N54J027o83K0J260M14o70k04j252J63l84n46J338l81J880j546J960q26
$$ y = [1291, 1257, 1158, 1716, 621, -386, 734, -1496, -966, -1571, -659, 430, -49, -420, 55, 433, -441, 584, 579, -332, 201, 1522, -528, -2060, -1377, -360, -2085, 131, 224, 2230, 387, 1039, 531, -659, -1188, 165, 46, -241, -1005, -1008, 558, -826, -491, 962, 699, 369, 1005, 383, -592, -841, -793, -1065, -213, -22, 240, -301, 185, 1031, 163, 367, 577, -1089, -514, 560, -228, -401, -1475, -194, 363, 1967, 1033, 2006, 831, -471, -118, -1701, -1039, -694, 42, 454, 418, 277, -370, 99, 664, 104, -206, 684, 237, -1468, -1794, 127, -730, -388, 553, -1138, 384, 1465, 516, -669, 26, -678, -909, -464, -623, -328, 614, -692, -597, -348, 396, 351, 827, 1564, 317, -477, -1299, -411, -1367, 124, 105, 935, 1287, 1017, 1201, 350, -193, -383, 404, -1153, -522, -513, -1322, -768, 259, -424, -404, 856, 1270, 600, 396, -856, -693, -1077, -1623, -285, -666, 1214, -332, 1628, 802]
7635H02j131P98R26r76m5m81Q8L28j565J033o12L7R63K417k520M22K12j916k11
7654a431P88j14N16j8j63J198j71j158J436j71l3J30J23j080o90o94J007N46M44
7673D65K03J116o00j096n69l04k64O76J61k90j03j052J738n47Q79P88n95o28L5
7692A3j49j466K786k275l8J053P32M04j617J119r73J98L84l6m93k09L16K59j033
7711a025QL40o70K116M85k18l32o31M5o11j141J512O89n89O57j13L26j276n06
7730i34R26J030j276l34L52K42p69j002J419k40P97L58J576l34q48k311O43O73
7748c2p87N14n73J729j411R55L4J37O60l26M20L67k426m54J52k09M29K495j15
7767A559j410nK26L66O07k603M18J034j169K22j25n08N97J86P06J850n31o48p82
$$ y = [802, -329, 469, 1395, 419, 374, -107, -19, 309, -1256, -223, -835, -798, 165, 2582, 62, 484, 696, -1220, -1431, -643, -757, -241, -259, -422, 776, 605, -553, 883, 712, 679, 809, 932, -148, -838, -1532, -525, 21, 465, 668, 1784, 1184, 88, -481, -785, -1049, -373, -212, -502, -605, -1657, 81, -466, 413, 1201, 606, -22, 13, -136, -1602, 1184, -1091, -1129, -76, 656, 1060, -557, 562, -411, -213, 171, 135, -358, -567, -251, 8, -1025, -1017, -677, -1347, 769, 1254, 1036, 704, 73, 118, -493, -1634, -122, 567, -22, 635, 522, 848, -428, -934, -8, 1022, -254, -588, -236, 6, -763, -1765, -346, -586, 211, 569, 2145, 1811, 963, -1348, -705, -32, -819, -305, -878, 851, -560, 395, 429, 566, 1226, 900, 1320, 1687, -739, -1193, -1041, -1250, -821, 1674, 1559, 149, 144, 370, 736, 1343, -1260, -842, 192, -977, -755, -880, -1388, -791, -605, 101, 1951, 1420, 772, -10]
7786a0k92j93j72q68k74K078j18M36J14J99k275J675Q04Lj975J074k90n55r1k83
7806a013M04J187M5J089j005p06K73n9r27M03p16L59R09O90j668o51Q73M61Q98
7825H46k14L73j080n47n17M47p43R57n0J845j361J315j78p57q27P66n17M78n7
7844A79K57j945J566J92p69J225Q9R5Q14n45j623m32K5N66o91O82J717j087j714
7863a399J555J03j715J268J72m36J201m56j160K60l10R25N04K62J3J142r06k112
7881a089R72k254K407j87J85m19k70R75j167R20m57j199L033r71l47j220l1l20
7899a439J02J021K47J006l26N83p63m89n69L4Q02q96k11J750m95l16L0j92N02
7918C81l53K13k48k06m2j129J511r73P48l02J685l40m76p39J01m74J149j502R95
$$ y = [-10, -302, -495, -667, -1535, -1809, 269, 151, 587, 701, 900, -1375, 300, 1104, 1107, -868, 206, -84, -639, -730, -1013, -609, 578, 623, 1712, 707, 1, 274, 215, -712, -309, -1025, -666, 243, 933, -735, -1386, -513, -52, 846, 632, 1005, -75, -622, -1139, -692, -1435, -478, -528, 1317, -44, 1271, 1093, 336, -491, 275, -242, 236, 179, 436, -1509, 57, 249, -520, 705, 794, 889, 1703, 1158, -465, -897, -872, -306, -997, -315, 1402, 315, -1399, 156, 259, -1456, -188, -16, -452, 749, 293, -867, -607, -917, 8, 512, 774, 787, 1929, 1023, -1089, -117, -2371, 36, -151, 34, -385, -655, 320, -847, 73, -384, -1583, 1450, 479, 132, -1088, -1119, -1439, -1337, -316, -69, 937, 611, 1194, 431, -58, -627, -593, 209, -687, -898, 852, 357, 41, 71, -121, 381, 28, 241, -7, -213, -255, -1384, 127, -846, -98, -400, 1285, 945, 469, -270, -169, -643, 506, -996, -1]
7937ak58j405J028j107J000J449P02j50N11p33p53R88j394m04K46l90L90O62R5
7956D76l88K20l24L24l60k47j08K41M49O5j256R52M76P69l39q11Q53q81q13k05
7976i07j085J755R7K31m36J7R5J303l42j482J338q13J04n99J07P47j620J230K04
7995e6m70Q47R87r75n40k73J42k23J435j485j72P39Q2j069L84J11J685j52m04
8014E93m78m50K40M48m50j682J375L07N00M7m67O49q07q13K149j579O46l77L83
8033B34n95K96J6N57n97K96K007M61k334j339M5o84J183Q70L25n08K72R32j013
8052D24L19q60O32n58r07M9Q51N25j447K47J50R90P50M0p89k89l8j022j71J324
8072B20k58k26P20j407Q55N02P09m73R75j310j32J095k562J378k052J607L64L98
$$ y = [-1, -259, -1664, -636, -1743, -743, 706, 1408, 1258, 1769, 1036, 283, 1271, -123, -527, -281, -671, -281, 381, 476, 88, 308, -16, 308, -52, -299, -407, -166, 283, 348, -908, 44, 520, 1289, 950, 139, 992, 111, -702, -907, -1992, -237, -140, 91, -345, -328, -233, 1070, 728, -754, 584, -229, -125, -724, -617, 130, -1490, -260, -56, -526, 321, 1308, 333, -207, -480, -338, -561, 874, -611, -783, -44, 38, -1031, -647, -536, 1149, 997, 593, 115, -335, -95, 353, -97, -1779, -404, -97, 403, 450, -17, 632, -175, -988, 1161, -418, 228, -149, 234, -361, -65, -49, 508, -89, 207, 2214, 2675, 341, -998, -953, -1637, -454, 416, 741, 233, 505, 1437, 424, 743, -117, 515, -43, -950, -901, -50, 475, -972, -725, -575, 415, 1165, 1205, 416, 127, 89, -933, -1104, 220, -38, -264, 456, -951, -96, 406, 1115, 642, 1617, 307, 175, 1270, -1292, 86, -1966, -359, 5, 403]
8090D03M50o10J044j614L50K11L20N44j791j56m45J442l55P05M31o05L31K80Q65
8109A800j978J89r86LJ086n8L51L8M3k29j192J814R52q31n70k45O01j116j583
8128a911J581j094J316J067j90O56J7j053q79K64j61n62J015q72J303R98j372
8145A23m45m54J249M55n44K7r52l22J179j344m2J42J663m93J058j236n92O99m99
8164c28J045k31j229J008L5p74o23K242m38p44N94m05P8O7k77o24q47J649k54
8183e6r32K746l6j516L76J04j794J931
$$ y = [403, 853, 243, 1287, -327, 23, 234, 554, 1098, -693, -849, -1294, 148, -207, 498, 929, 324, 655, 935, 1800, -178, 11, -975, -972, 114, 56, 407, 445, 488, 259, -933, 881, 1833, 1002, 432, 187, 788, -328, -1911, -330, -1424, -108, 959, 769, 1425, 1442, 389, -490, -226, -387, -949, 66, -806, 497, 1495, 123, -322, -776, 473, 928, 384, 411, -541, -863, 316, -1028, -1070, -928, 735, 242, 1300, 64, -528, 171, -328, 717, 486, -743, 265, 300, -474, -1097, 1145, 707, -37, 557, 152, 230, 297, 20, -604, -1451, 198, -56, -988, 1758, 1722, 206, 582, 686, -1108, 823]
8191H23
$$ Imaginary data points
##PAGE= N=2
##DATA TABLE= (X++(I..I)), XYDATA
0@%%%%%%%%%%%J08k16K16k16K16k47L55m32M63n70O54p53Q86j005J169j338J518
28H08j723J949k196K469k767L098l464L861m300M785n310N883o524P223p991Q852
44D653r808J0870j2065J3433j4991J6781j8894K1406k4456K8266l3181L9786m9203
57b7403O3848r0033J51647n81800n28114K55747q0477L28868N54966N08594j85391
68C70452n44455l82653J39590K53180J36398R0895L18636K77917j16378m96248
78D7334l06785J49868L40125O9404j33339k2283J32733p8021m04908l57041J00124
89d62789L93848K16752j10887j22181P1825M9177k13127k74026N5200L75829K57575
100B37196r9434j97399L4728J65394l4865k21878l4587L02107K92261r9506l70224
$$ y = [0, 0, 0, 0, 0, 0, 0, 0, 0, 0, 0, 0, 108, -108, 108, -108, 108, -139, 216, -216, 247, -323, 331, -422, 464, -541, 628, -710, 808, -915, 1034, -1162, 1307, -1460, 1638, -1826, 2035, -2265, 2520, -2790, 3093, -3431, 3792, -4199, 4653, -5155, 5715, -6350, 7083, -7908, 8873, -10021, 11385, -13071, 15195, -17986, 21800, -27403, 36445, -53588, 98059, -483741, -1011855, -756108, -836585, -507717, 47249, 555843, 370452, -174003, -556656, -417066, -163886, -27488, 63407, 382043, 659960, 543582, 47334, -259451, -109583, 230542, 299946, 166607, 144324, 277057, 199036, -205872, -562913, -462789, -68941, 147811, 36924, -85257, -13432, 35745, -177382, -451408, -396208, -20379, 237196, 137762, -59637, -24909, 140485, 105620, -116258, -150845, 151262, 443523, 344017, -26207]
111b6207k13053P3668Q4655q9536o0822J92363K65950k2841l24034k43973Q1657
122b82173K13869O7732k5203J09845J93699l8938l47123k97075R8526L70112K40173
133C03444l0137q0548J0808o8002k89060k87111O1967L87660L12741k2849j94730
144A04183j01077l2623j36737j74881P3694L72183L22677o0392l27210k18182
154a78365K4620N9322l5997K1725K34358K67839k5232l29791k89814k2323J20996
165a52662M3185R97J23534J99745J7186k46939k46968J6807K02558J13965k9167
176D2241J3776J39219P1372j73971k64865n6949J91159J76028j7895q7975L922
187C6062L3082j17656k17068n6178K05310K49399M1615j23689o7512K6259l1171
$$ y = [-26207, -239260, -165592, -80937, -170473, -231295, -38932, 227018, 204177, -119857, -363830, -282173, -68304, -572, -25775, 84070, 277769, 238831, -108292, -405367, -306841, 63271, 303444, 273307, 192759, 203567, 135565, -153495, -440606, -378639, 9021, 321762, 298913, 104183, 3106, -29517, -166254, -341135, -267441, 104742, 427419, 367027, 39817, -178365, -153745, -94423, -130420, -108695, 125663, 393502, 368270, 38479, -251335, -273658, -152662, -109477, -108480, 15054, 214799, 231985, -14954, -261922, -245115, -42557, 71408, 42241, 56017, 195236, 266608, 92637, -172228, -229177, -38018, 138010, 120115, 32140, 36062, 69144, -48512, -265580, -321758, -116448, 132951, 174566, 50877, -16635, 9624, -21547]
198b1547j35067m1624K06859K88568P4951j96723k20788n5460L3917j5447j1002
209i3363J26253K05079L7557k13729k54342o0711J08138Q9333J5039N9312J25006
220A43572J8923j96110k42666k3197K17575K18524M9863m1000k897p941j36992
231b346k03675m6723J84947K21249M6153j04114p7870r123n2923j22436l8986
242b05847J57915K15122L9489j59295j54910j4805L9835k4510k7287J04651J97686
253A68044Q6277j26218j87246o4986N0998L4833j905O0656J43882O8545j20400
264A12480k05908q4748Q3029R5800J5059M836O9725M5081j07661k14991j07351
275b94649J04137J92049J05303N053M449Q639p6544j57225q4268J09139J95367
$$ y = [-21547, -156614, -198238, 8621, 297189, 372140, 175417, -45371, -100831, -66914, -82361, -93363, 32890, 237969, 275526, 61797, -192545, -253256, -145118, -55785, -40746, 18566, 143572, 162495, -33615, -276281, -299478, -81903, 136621, 186484, 145484, 142587, 134646, -2346, -206021, -252744, -67797, 153452, 199605, 95491, 17621, 8498, -44425, -166861, -205847, -47932, 167190, 206679, 47384, -107526, -122331, -82496, -107006, -134293, -29642, 168044, 254321, 128103, -59143, -124129, -73131, -38298, -40203, 20453, 164335, 232880, 112480, -93428, -178176, -95147, 653, 15712, 20548, 90273, 135354, 27693, -187298, -294649, -190512, 1537, 106840, 111893, 116342, 124981, 48437, -108788, -193056, -83917, 111450]
286A11450Q6929p3443j03270m2553l0910p7538m0783J05592J99840R5081j08081
297A22314j85295r5310R555K5840J9261Q4052J47885P6860r1681j72352q3283
308a42154N1357P8593K7968K6164O6242L4780r3316j70982p8910Q7603J41831
319B9176O0739j8083m775J3280n4754j31100q2174O7992J49949Q2614k3530m3439
331D5895m126k0335q5944o5585N8043J54710R5678n1487j17582o3695j3153k4877
343i2458l1695N0708J41989J11338l0715j32970r9740j4422K2168J3662M6694
354a5441J00495P2128n6846j47041j00354K8851R4932O0752K7119M0411K5000
365A30006o4325j50203j14149L5095J34784J06693J8986j9218j5296m6019r9898
$$ y = [111450, 198379, 124936, 21666, -20887, -51797, -129335, -170118, -64526, 135314, 230395, 122314, -62981, -158291, -148736, -122896, -103635, -19583, 128302, 205162, 113481, -58871, -142154, -90797, -12204, 15764, 41928, 108170, 142950, 49634, -121348, -200258, -112655, 29176, 89915, 71832, 67057, 80337, 25583, -105517, -187691, -119699, 30250, 112864, 89334, 45895, 41769, 21434, -64510, -130095, -72052, 82658, 178336, 126849, 9267, -54428, -67581, -92458, -124153, -73445, 68544, 179882, 149167, 16197, -83543, -97965, -75797, -62135, -15441, 85054, 157182, 100336, -46705, -147059, -118208, -23276, 37476, 64595, 105006, 130006, 65681, -84522, -198671, -163576, -28792, 77901, 96887, 77669, 62373, 16354, -83544]
376h3544p6160M2830J37294J00254j1079p4536m9335k5061l8603k9367N0940J33620
388G7253J05182k5658j16841j00217l1096J95J378M0316R4228P9352k2393j07641
400e942q5930j224M6398L5682K9087N8494M8111l8473j23448j02661J1277R5610
412c3019Q2278K8223J3003J4122l0988j01098j00705k009R3313R2124J7248l0474
424D2018k5653k8253n4935n4631K4030J10363J05897Q016p3800p4790l7341k2548
436h1627j5872L1529J00257J02976J1379q4645r5952m2413L684J4633L2429O8279
448D4657O1053j6991j00411r8035j2366O1980O8913M0476L5764K6868k7100j00869
460a6061j10526k1822P6671R6903M5832O91r478k9556o4578o2263M794Q4930R1398
$$ y = [-83544, -159704, -116874, 20420, 120674, 109595, 35059, -14276, -39337, -77940, -107307, -56367, 77253, 182435, 156777, 39936, -60281, -91377, -91182, -89804, -49488, 44740, 124092, 101699, -5942, -91872, -93096, -46698, -11016, 18071, 76565, 124676, 86203, -37245, -139906, -128629, -33019, 49259, 77482, 90485, 104607, 73619, -27479, -128184, -130193, -36880, 55244, 72492, 42018, 16365, -11888, -66823, -121454, -97424, 12939, 118836, 126852, 53052, -21738, -59079, -81627, -97499, -65970, 34287, 137263, 148642, 63997, -31955, -74368, -70684, -56051, -23622, 44657, 105710, 88719, -11692, -109727, -122093, -60113, 8800, 49276, 85040, 111908, 84808, -16061, -126587, -148409, -71738, 25165, 70997, 71688, 62210, 32654, -31924, -94187, -89393, -4463, 86935]
473H6935K2947m3691n4452m2407l9978l3718K0619Q9626R9560K3304o4509q3687
485a9451m7609j8296k231K4996P0464P5005J5057o3032p9825k6990K1997L5246
497a4669L1680M5289M6039q216q4132j02182l5201M7453P1715M9348K4966J3978
509H6068j3125o9550q7920l2336M9713Q0609M4207l092k3562l1538m9684m7797
521i8007K183P8583R9546M3364l5341o5337n1653l4989k2047J1233O8218Q8161
533H3914L7931m3630q1393n3072j1395J0875K6702M8825N1902O299o3647q7405
545g4094m0771K7113N7901N2826M0177K9749l654o3381q7811m6336L1112P2289
557d880N4826J9610k62k0681m6710n8449k1270M4315P4296M1576j1111m1819m5363
$$ y = [86935, 109882, 66191, 11739, -30668, -70646, -104364, -83745, 5881, 105441, 128745, 64236, -19451, -67060, -85356, -87587, -62591, 7873, 82878, 97935, 34903, -44922, -71912, -49915, -14669, 17011, 62300, 108339, 100123, 15991, -86191, -121392, -73939, -2224, 47124, 72090, 86068, 72943, 3393, -84527, -116863, -67150, 13459, 57666, 54574, 31012, -526, -50210, -98007, -95824, -17241, 82305, 125669, 90328, 24991, -26662, -61651, -83698, -72465, -4247, 83914, 121845, 78215, -3178, -56250, -67645, -56770, -30068, 18757, 70659, 76958, 13311, -74094, -114865, -87752, -29851, 22975, 63152, 92901, 89247, 25866, -61945, -108281, -77169, -4880, 49946, 69556, 69294, 48613, 1903, -56546, -77816, -33501, 40795, 82371, 71260, 29441, -15922]
570a5922m5757l8531l939N5201Q9507N3520j3974n5585m9053l0253j1085J0768
582e5103M8497O6731L4704l0121o6071m8456n386K1084L3419M2917M3430P767
594I3412n6811q9871n8003P199N1841N4653L8229K5638k46m2037o8245m3586K0975
607f6852O3489N5292J4236j4171l0948m6798m4056j6630M7125P8978N5919q44
619I4740m4827n2505m2194k8992k644M1060O7684M6609r439n1835n0179k0516
631e3038K380K1633L9449M4746J9850l5158o8440n2530l769L3628M3720M2702
643C5173L8587J2545l2002o8440n6819m849L9563M8812L0589J1605q425l3891
655A2448m8858l2216J4856N6821N4388J8615j7724l9774m8496n0813j9422L1068
$$ y = [-15922, -61679, -100210, -104149, -48948, 40559, 94079, 80105, 24520, -24533, -54786, -65871, -55103, -6606, 60125, 94829, 64708, -1363, -49819, -55205, -34121, -702, 42215, 85645, 93412, 36601, -53270, -111273, -104074, -52233, 2420, 40649, 66287, 66041, 24004, -44241, -87827, -66852, -3363, 51929, 66165, 51994, 21046, -25752, -69808, -86438, -39313, 39665, 95584, 94740, 49913, -2592, -44786, -73778, -76422, -35362, 32322, 78931, 69492, 17657, -32522, -53038, -50658, -29025, 10424, 55170, 75020, 39862, -28578, -81108, -84877, -51249, -7529, 35173, 73760, 86305, 54303, -14137, -70956, -75805, -36242, 12570, 43159, 54764, 46339, 12448, -36410, -68626, -53770, 3051, 57439, 76054, 58330, 18556, -29940, -80753, -100175, -69107]
667f9107P0972O4924J7810l1070m8404m0394k4798J454L2034N6928M2059o756
679F5652m8518n2885k1941J1242K6908M1827M8350K4208k5844o9948o8127j9016
691h8092K4272M6344L7636K6447O544k3332n0035m4241j982L9385M9983K6350
703D9279k318k0795l4430l7719k0869K2613N6811N6117K0277j9782l9628m0207
715a0651l5157j7802J4613M6074M4674P812k9056m1933k7358p199J1816K8792
727a5375M5311L1612m720m4601n5119k4762J2110L7413M2173M3092K2054j5229
739G3959n1506o1509k8324J5766M1313L6889J9025m196l1409m9819l8879Q0M4510
752c4100N7365L9078M516k2160m5908m8179l0615J2274N2410O1919L2108j1644
$$ y = [-69107, 1865, 66789, 84599, 53529, 5125, -35269, -60067, -58613, -26579, 30349, 72408, 65652, 17134, -35751, -57692, -46450, -19542, 22285, 70635, 94843, 68999, -949, -69076, -88092, -63820, -17476, 20160, 46607, 53151, 29819, -20216, -64457, -66439, -27054, 22929, 49279, 46961, 26166, -8264, -45983, -66852, -44239, 12572, 68689, 88966, 69184, 29556, -10651, -45808, -63610, -48997, -2923, 41751, 49563, 20507, -21426, -48784, -55983, -44167, -15375, 29936, 61548, 56828, 12227, -42892, -67654, -55544, -18131, 24042, 67134, 89188, 73959, 22453, -39056, -67380, -51614, -10301, 26588, 45613, 41417, 10008, -39811, -78690, -78610, -34100, 23265, 62343, 66859, 44699, -1209, -49388, -80003, -67729, -15319, 46600, 78708, 67064]
764F7064l7110l8774k8286r964J6870M2655M2207O735l6399n2404l2494p005K0868
777d6037L4837M4858L1606k225l9739n4051l1174M886K7805L3354K5288J6871
789D6279n947l1629l5322j3560K0073L6401K7600O646j2890k8636m2755l3434
801f7174l760L3744N0641L6235N996k0112k9879l5303k1899q52L3990M5769K7126
814E4522p877l3913l4616j5760J989K5631M1175L4149P063l6218n6973m8778j3122
827h2728J8320M0851M5692L5680K897l3948m9452l2995L328L1403M0485K8366
839D7899N167j9323m1519m0357j3459K5930M9762M2128J5025j5724l8419m6932
851b9822l9611n698K7300N0246L8100R275j7885k6484k6009j3330O462K5895L7522
$$ y = [67064, 29954, -8820, -37106, -47070, -30200, 12455, 54662, 61397, 24998, -27406, -59900, -66905, -46037, -11200, 33658, 65264, 63039, 23300, -30751, -61925, -57039, -29234, 4120, 29408, 46279, 40332, 8703, -26619, -40179, -20106, 16295, 43895, 50541, 37651, 9015, -33740, -67174, -70934, -37190, 13451, 49686, 55682, 35570, 5691, -29612, -51511, -52363, -18373, 27396, 54522, 46645, 12732, -21884, -37644, -35655, -10024, 31151, 65300, 72363, 36145, -20828, -69606, -82728, -64408, -23557, 22135, 57815, 60712, 26764, -22688, -55683, -52355, -20952, 19533, 47899, 53066, 33743, -7776, -48133, -61592, -35662, 14100, 56228, 71253, 55529, 17110, -29822, -69433, -75131, -47831, 2415, 40515, 49790, 31905, 5421, -20588, -33918, -27456, -1561, 35961]
864C5961J8128j2178l3517l4332j8365K057J9168L4126L6516J4145k0144m2430
876h65m0517j6985R326K3763L0029K3882O655j9880l2376k4667L751K8304L3237
889B3657K3581L323j6699l4908l8862j7685J5370M2070M1141J7321p765k7825
901B2719l7779l0428q022K0666L8108K9364J620k6747l5465k3644m459K0879L9484
914F296M2210K1973j3599m1907m2738k2821N261K7107L4790L2275P555k0833l7991
927b422l4187r483J6230K7658K5377J0419j0189k8308l3603k1488Q360L2516M1160
940B2040K9181P939j3357l0526l6003k1411L898K8198L1340J7623m222j8482k5372
953i154k2923o090J6212L1715K6924J678k3357l6021k8062j1302J3060L2295M4178
$$ y = [35961, 54089, 41911, 8394, -25938, -44303, -42246, -23078, 11048, 47564, 61709, 41565, -865, -41382, -58367, -49041, -25278, 4751, 28633, 35288, 15408, -16968, -41635, -37884, -9580, 23657, 47238, 50561, 33862, -1046, -39908, -57593, -42223, -153, 40988, 58309, 50544, 22719, -15060, -45488, -53510, -32844, 5264, 34628, 36248, 9501, -25964, -49608, -54067, -33188, 6296, 48506, 70479, 56880, 14973, -27765, -50586, -45325, -18218, 16572, 48847, 56402, 35569, -2422, -36609, -46092, -29862, -2204, 23173, 33592, 23403, -4905, -38508, -59996, -51636, -19120, 22040, 51221, 59160, 45803, 15277, -20726, -42137, -38239, -10041, 21299, 38922, 34700, 16218, -9154, -32077, -38167, -21955, 9760, 36684, 38362, 15005, -21016, -49078, -60380, -47320, -15025, 29153]
966B9153K9673J500k8872l8114k6112l357J8368K7025K4091Q328j5697l5663l0833
979d0510o496J9648L8875L2012R176j3496l5841m1629k6973M258L2308M3325K8293
992D2950M919j8014k8736k8863j0882J2748K9615K8253P309j6919k9656k5610
1004c2886r251J0021K5935L3475K4923O10k5223l6624k9560j0104P940K5576K8788
1017A3620K0504R58j8116k7563j4547J945J8404K2736J8460K498j7434l2503l0721
1030d1759j0021J1742L3326L3019J8810r23k2513l5716k9424o730J8486L4629
1042B926K8687O662j1476k4815k4390j0401R248L0300L3337J2371j3078l6732
1054B639l5720k2566J348K5530L5499L3091R459j7602l2672k8049p708J3493K3472
$$ y = [29153, 58826, 60326, 31454, -6660, -32772, -36129, -17761, 9264, 33355, 41683, 25986, -9677, -40510, -47006, -27358, 11517, 43529, 52705, 39209, 3368, -38261, -65234, -60976, -28668, 14657, 42950, 47869, 29855, 1119, -27744, -38626, -25878, 3737, 31990, 39299, 22380, -7276, -32886, -42137, -32116, -6181, 27294, 52217, 52827, 27604, -9020, -38580, -48684, -40744, -15168, 13620, 34124, 35082, 16966, -10597, -25144, -23199, -4795, 17941, 36401, 38899, 21465, -11038, -41759, -51780, -40038, -6712, 26307, 45117, 44194, 21681, -14035, -43459, -50189, -31703, 2926, 31613, 38275, 26799, 1984, -22406, -32807, -23559, 6741, 40078, 52449, 39371, 2639, -33081, -55647, -54299, -28769, 6730, 39821, 49280, 31678, -994, -29043, -36751, -23258, 214]
1067B14K6688J0778r465k7509k8921j2503J2454K9620K9736J6685k125k3389l3719
1080a1456k8444j1136J1443K9892K6542R550n045j2808k2185j4109J371J7585
1092h800K4980J5549J09j8814k4059j7853m671J3248K7003K9229J5717n959k4713
1105B0966l0586k5636n431J2117K3135K2393R251j0845k2038k1399p128J1123
1117b4078K3689K6487J3580p498k6377l3344k0067M295K6416L5120K7490Q327
1129E4040j4122k9781l1818j5778Q904K4865K2785R809j0800k5206k4032j4490
1141d5624Q761K6946L3248K0262m716k3570l0937k4525m981J5766K7931K9763
1153B8324J4722p524k0650k2141j1766L243J3414J6708J1333l698j7944k6324
$$ y = [214, 26902, 37680, 28215, 706, -28215, -40718, -28264, 1356, 31092, 47777, 45652, 22263, -11456, -39900, -51036, -39593, -9701, 16841, 26391, 21346, 8538, -13647, -27756, -26385, -8800, 16180, 31729, 31838, 13024, -11035, -28888, -33559, -20311, 6692, 35921, 51638, 45679, 20966, -9620, -35256, -40687, -28570, -5435, 16958, 26209, 15364, -6674, -28073, -35201, -24078, -389, 26098, 39678, 32180, 5803, -27541, -47608, -43313, -16897, 18223, 45713, 54040, 39918, 10137, -21681, -37459, -28555, -3690, 19095, 28904, 18104, -7102, -31134, -45624, -36863, -9917, 23331, 43593, 38877, 15307, -15630, -40155, -45136, -29370, -1439, 28324, 43046, 35522, 14872, -7269, -19035, -15792, -2378, 14330, 25663, 21965, 4021, -22303]
1165b2303j7616K54J7489K5491K2612J0278m136k1048k5414k0451k046J5663K3399
1178B172J9924P488p914j6395j7882p923P552K0135J9520N983q764k4585k5507
1191b6196j6484K649J8923L0581K5431P026j3786k6806k5865j3619P304K0381
1203a0461K3298J4035m374k1865k1974r375P943K1657K8557J6123n12k3589l2956
1216a3493k4538o849J4839K7200K7566J3438o333k1037k4761j4101J887J7081
1228i101K0875R513j562j5894k2850j4040m35J7711K8267K1994N470j0753k4657
1241D538k5845j2758J116J4431K3963J8627O361j1072j8044j5833k894Q398J4773
1254E761J6196N584r922k0608k3494j2265N820K0388K6552K0044L644j2445k4628
$$ y = [-22303, -39919, -39665, -22176, 3315, 25927, 36205, 32069, 11021, -14393, -34844, -36890, -21227, 2172, 22096, 29584, 21670, 5275, -12607, -20530, -12978, 7157, 26677, 32660, 23896, -689, -26196, -42680, -40031, -21108, 9473, 34904, 41930, 28144, 1338, -24527, -38146, -30842, -10461, 12837, 26872, 22498, 633, -21341, -30716, -22773, -1116, 27441, 43564, 43052, 19463, -13493, -38031, -44880, -30041, -2841, 24725, 38163, 31830, 10793, -13968, -28069, -26182, -9101, 11774, 21287, 19725, 3831, -19019, -33059, -33494, -15783, 12484, 34478, 39948, 29195, 4538, -21307, -34065, -32949, -18518, 5445, 24072, 30433, 19361, 1317, -14516, -17410, -9012, 5761, 21957, 27541, 17619, -2989, -26483, -38748, -32928, -12540, 14012, 34056, 37700, 25255, 627]
1267F27k3368j1844O450K0816J9984J2553l632j3932k0782j1393L159J8292K4158
1280B1088J4891l900k0873k7619k0950n500J3670K6382K6095J2491m593k1247
1292I935k2801j4669J364J4776K1415J2227j456j5367j9747j3471J941J6169K3903
1305A4219J9916O243j2538k4947k5096j3505M822J6803K2656J5151M290j0363
1317A7651k0413j5489l478R289J6607J2724L601q981j7879j7212j0453P443K0039
1330f551K5373J6277N70j4365k2666j8960r626N778J8906J7837J0970k712j3618
1343G213j7643r884K174J3634J8423J2183j533j6740k3121k0680k294J5066K2580
1356f22K4385J2340l319j9941k1506j5273r15J3651J8530J3497M58j2453k0327
$$ y = [627, -22741, -34585, -28135, -7319, 12665, 25218, 21586, 7654, -13128, -24521, -21362, -3070, 21088, 35979, 32079, 11206, -16413, -37363, -42863, -29193, -2811, 23284, 35775, 31182, 9935, -12866, -27535, -26171, -11395, 10020, 22247, 20791, 5424, -14323, -27794, -25853, -9684, 14219, 34135, 40378, 27840, 2893, -22203, -35708, -30886, -14083, 8573, 23724, 28014, 17651, -2762, -18251, -21729, -12440, 4167, 16891, 20492, 11511, -6368, -23580, -34033, -26590, -6551, 18822, 35099, 35669, 21304, -1362, -20322, -29948, -24170, -5264, 12573, 23543, 20831, 7213, -10430, -20314, -18140, -4506, 13917, 26100, 24567, 7827, -15294, -35974, -38268, -23202, -622, 23763, 36103, 32784, 12843, -8663, -23936, -24851, -11200, 7330, 20827, 21285, 8832, -11495]
1369a1495j2945P11J5420K1941J6904N849j4478k3814k3186j2737M592J7065K4364
1382H191J6299J849j0726j6923j4738m616R109J5982J3114K425r102j8200j3873
1395b1209n046Q037J9900K0539J2548k089j5918k2230j9351o862O746J6951J7997
1408A0013J0099l815j2529j4059p182L238J2063J5057R412k893j3813j9526j4612
1421b8547j386J1748K2782K1791J0600o812j8583j9372j6096k827J1476J8133
1433B907J3187K587j0510j7566j0760j26J0829J7500J7427M518j1513k1979k2926
1446b6425j0029N578J9871K2543J5716L183j0541j8783j6477m913P103J5247J3849
1459A5922J967q456j3982j4221n309Q475J8217J8284J0235o235j4173k0813j5762
$$ y = [-11495, -24440, -23729, -8309, 13632, 30536, 36385, 21907, -1907, -25093, -37830, -33238, -16173, 8191, 24490, 26339, 15613, -1310, -16048, -20664, -11555, 4427, 17541, 19966, 10864, -7336, -21209, -26255, -18218, 1682, 22221, 34769, 32680, 16762, -5468, -24819, -31681, -24935, -7984, 10013, 20112, 16297, 3768, -10291, -17473, -14235, -2172, 12885, 22297, 19404, 5591, -13935, -28547, -29933, -18185, 4597, 26388, 36988, 30176, 11593, -7779, -23875, -26702, -15226, 2907, 16094, 18681, 8171, -9395, -20155, -20281, -9452, 8048, 25475, 29993, 18480, -3499, -26425, -36454, -30876, -11005, 11538, 27254, 30437, 19896, 1113, -15364, -20277, -13174, 2073, 15922, 17889, 9433, -4549, -18770, -24079, -15604, 2613, 20897, 31132, 24897, 10724, -10089, -25851]
1472b5851n303Q434J7395J7726Q614l363j1251j2877q173M042J2962J2144N537
1485B0036l167j3452j7576j2624M38J2734J9817J6651P351n120j8259k0365r908
1498b3444j058J1078J5648J2292K500r229j3340j0099j313J0407J6697J2877L571
1511B6587j1955j8554j9070j0692O148J9426K2305J5035J743j2171j7377j5940
1523a4515o140N776J4401J3033L837q562j4828j3743l786R629J7846J7430R499
1536B9877m316j7139k1868j3596l087J0823J8105J6086J0266n164j1984j2449
1548d446p914J701R582J2385N018l989j5270j2971r178O28J4365J8672J4973O045
1562B9601q577j7815j6782j3020K113J0704J5092J1582L856n366j1844j0332o41
$$ y = [-25851, -31154, -22720, -5325, 12401, 21015, 17652, 6401, -6476, -14649, -10607, 2355, 14499, 20036, 16869, 3417, -14159, -26783, -26345, -13611, 6206, 22857, 30208, 25088, 6829, -13536, -23444, -24502, -13424, 2224, 14516, 17016, 7787, -5553, -15652, -16965, -6558, 10139, 23016, 26587, 14632, -3922, -22992, -33684, -27536, -8110, 14195, 29230, 30973, 18802, 1425, -14515, -20655, -14879, -478, 12555, 16392, 7830, -6998, -20741, -24527, -14898, 2948, 20378, 29877, 25561, 8422, -13446, -27042, -30129, -19306, -1201, 14885, 25151, 19987, 8003, -4446, -12360, -10659, -1077, 11308, 16326, 12337, -2933, -15904, -25082, -24454, -10089, 8583, 23556, 29601, 21024, 3209, -13573, -26593, -24480, -13776, 1316, 12898, 16754, 11388, -456, -10788, -11429]
1575a1429P126J2819J0252K431q864j7469j6050p370N173J5551K1114J4451r39
1588B6796j1039j9302j4747n533M914J4010J3963M938m260j3488j1243m411J0481
1601h921J4253J5796O865n246j6184j9597j3079j127J2004J8230J6898N122n660
1614A9354j4728j3598o546K087Q785J3102M085l084j2132j3558p275K508J3403
1627g597J6841J3735M962p623j7162j6208r273J409J1687J3491J0523K616o642
1640A0759j0557r363l732O616R911J1179m96p279j3893j2786n562L349J4490J9186
1654A1822J1714M213j0206j7170j3822p425M561J3669J1988P456n386r015j2222
1667i823n903O411J3750J4932N932p285j4915j8665j2581k566J0531J9736J6442
$$ y = [-11429, -4303, 8516, 18768, 21199, 12335, -5134, -21184, -28554, -23381, -7830, 13284, 27735, 26796, 15757, -3545, -18292, -23825, -18911, -4901, 9062, 14000, 9740, -3748, -14991, -19402, -8921, 5332, 21128, 27993, 22747, 6563, -13034, -26113, -27240, -15236, 2994, 19892, 25014, 19354, 4626, -8972, -15518, -13431, -4646, 8456, 12541, 9457, -2675, -16233, -23508, -21000, -7597, 9244, 22979, 27941, 20318, 3156, -13052, -22325, -20916, -9229, 4262, 14785, 17401, 10759, 202, -9161, -12893, -6277, 3634, 14813, 14317, 7038, -6855, -19641, -25203, -21854, -7364, 11822, 23536, 27749, 17543, 373, -13449, -20874, -16313, -2644, 9344, 16800, 11414, 2399, -9823, -15726, -9315, 4435, 19367, 25299, 18014, 3099, -15566, -28147, -30713, -20182, -446, 15996]
1680A5996O897n581j1882j3806n927J612J0051J1192N020l931j0589j0863o173
1693a7984N016J3165J4880R857n93j0396j7109j5604q108M344J0624J6242J0459
1706A4793J169p687q821n939k000N350P404O140J905q312j0476j0132k595O282
1720a2919J1411J5787J0458l24j0256j5799j4830o581N567J0612J1894Q230j547
1733A1703n749j1651o297L425R615J2143N345l195j1886j6262j3322J285J0181
1746a4665J9325J5895O440n852j4572j4660r323N50R366J3058N486m92j1039r012
1760i495p252M205J0137J6159Q108J334j1786j7421j3106n399N647J1575J4952
1773G658Q574L39r130j0073p194P15N489R075N421p54p470q850q590j419Q665
$$ y = [15996, 22893, 17312, 5430, -8376, -14303, -12691, -2640, 8552, 13572, 9641, -948, -11811, -17984, -12968, 197, 15077, 24934, 24341, 13945, -3164, -18768, -26876, -22532, -11908, 4334, 14793, 15962, 8275, -546, -6485, -8485, -3135, 4269, 10409, 12314, 4002, -6474, -16606, -19201, -12919, -1508, 14279, 24737, 24413, 14157, -1642, -16472, -23053, -17486, -6874, 5020, 13250, 11703, 5954, -5697, -11994, -8569, 1046, 13189, 18534, 15339, 3453, -12809, -26131, -24846, -14665, 4660, 20555, 26995, 21143, 6571, -8089, -17412, -16862, -7496, 5562, 11048, 10556, -483, -9495, -16747, -12542, -2405, 13754, 21862, 23196, 11410, -6011, -19117, -24516, -18869, -7294, 7658, 16232, 16571, 7441, -2632, -9826, -9111, -3622, 5453, 10874, 10120, 2650, -6200, -14790, -16209, -7544]
1788g544J1727J1818P287l276q550j5104j1815n309M594R640J0575P118k400n385
1802C376q900n366K462O449J1210M622j975j0602j4271p562o10J0171J5360J6677
1816B1041N153m524j2508j5963j0035r7O923J2543O616l75o597j0398p197K346
1830a3072J0157J3850J0000j46j0376j5335j5066n312O353J3517J5773Q707J570
1843B0620q405j1919r620j551N750R108M828j625p436q694o283k390R877J2020
1857D280J0424M700l115j0356j3193j0233k354N473J1833J0968M381j153n443
1870F212o465m784J894N124O716L365m108r164r610p779m80R506J4597J1343N711
1885B2078n128j1115j6462o682j54N931J2241O246K303m196q433n721J332P189
$$ y = [-7544, 4183, 16001, 23288, 20012, 11462, -3642, -15457, -20766, -16172, -6532, 4043, 11161, 8761, 3376, -5524, -10890, -8428, -1979, 9231, 13853, 11878, 1276, -12995, -20557, -21167, -10996, 4364, 21041, 26194, 21670, 9162, -6801, -16836, -16933, -10010, 2533, 9149, 8774, 2177, -8221, -15418, -13072, -2915, 10935, 20935, 20789, 10413, -4922, -19988, -25300, -18947, -5430, 10343, 19050, 20620, 12215, 296, -9324, -10875, -5125, 3983, 8811, 7186, -250, -8944, -15227, -17617, -7740, 4280, 14704, 19404, 16289, 5933, -7260, -17493, -19847, -14374, -2541, 8427, 12808, 11655, 6212, -253, -5037, -3143, 1981, 8697, 12062, 7954, -1210, -10820, -18599, -19079, -9573, 5024, 16367, 22078, 16950, 5835, -10627, -17309, -17463, -11532, 709, 6955, 9258, 5062, -3371, -9092, -7760, -571]
1899e71J0839P109N98j0942j2912j2989n203N938J2578J5364J0831R30j0022j2017
1913d69j1181l84M781P714Q006L24o786q961p095M64O767J2849J0390L322o100
1928A3641j0677j3193p166j167O622J1021R639M983k050o635n685l559J952M355
1942B081M630J614l799q514p624n029N80R193J2824R954L027m059j1561j2303
1956h986p026j868P148J0845P329K526l840o583o001n3O401Q232N430K4p323j1199
1972d944j1338m984M696J2946J4044Q395K34q644j1833r677m639N758Q700O113
1986D827K038l706o868o145j129P365R763J0085L232m547j3656j2845n856j463
2000a8905Q477J1493R599L986m088p973p241l599J819N375L869K654j888p695
$$ y = [-571, 10268, 17377, 17975, 7033, -5879, -18868, -24071, -18133, -5555, 9809, 20640, 21570, 11548, -469, -11650, -12034, -7253, 461, 8467, 8791, 2005, -6956, -14051, -13587, -6820, 6029, 16419, 19741, 13641, 2964, -10229, -17395, -18562, -11940, -919, 8720, 13703, 11653, 5018, -667, -4226, -2274, 2081, 6711, 8325, 4526, -3988, -11612, -16641, -16061, -6868, 5956, 15910, 18937, 14878, 3317, -8986, -16012, -17880, -10732, 113, 7442, 9968, 6128, -455, -6456, -6509, -108, 8124, 13554, 13578, 6255, -4944, -16282, -21266, -16570, -3624, 10420, 18815, 19049, 10405, -1428, -11105, -15744, -9986, -1286, 4827, 6865, 3159, -3709, -9854, -10983, -3618, 6145, 16230, 19462, 14915, 1259, -11586, -17442, -18905, -10428, 1065, 10664, 14650, 10562, 2589, -4652, -8251, -6432, -1057, 2812, 5466, 3578, -4117]
2014d117o682j781K573R641R265R683O52o535j0742j1726n445R94O013J0640N533
2029G966K298k216q696m958m72L075N801O210k13m709r652r954l337N189J1099
2044b569J2872P770l02o885j2173j0131l399L655R738P724K528l436p189m178
2058e975k089N194Q080Q579K116m923j1024j3013o787K057R254J1191R249K131
2072A4040l608o701r774k522Q23O732N132K887k956p454n133j449K765R398R053
2087A1233N555r22p991r487r981m729J907O962J0015N366J198k103p529m159r30
2102e595J484O297L270J807m687q523o557j690O176Q396J0654P201o89q275r830
2117e61r845l631L325O767Q060M541l139n005o173k459L689P189P456J645m086
$$ y = [-4117, -10799, -12580, -10007, -366, 8899, 18582, 19234, 12699, 1957, -9769, -15214, -14220, -8207, 2433, 7966, 10264, 8048, -648, -5606, -6078, -3003, 2798, 9008, 8795, 4086, -5566, -15520, -18857, -13668, -2569, 10303, 18073, 17771, 10886, -1287, -11418, -14817, -11162, -1424, 6300, 8828, 5392, -1797, -5975, -8064, -2870, 5210, 13789, 15905, 10982, -42, -13055, -19842, -17785, -8531, 2660, 11909, 14040, 10432, 3731, -6043, -8565, -7742, -1010, 4122, 7009, 4053, -3401, -8534, -9983, -7218, 2180, 11233, 16788, 15866, 7875, -1612, -11593, -16322, -14415, -7453, 2562, 7928, 9126, 7023, -506, -4665, -5595, -4111, 2186, 5456, 7263, 2576, -5947, -12504, -14194, -8018, 378, 11032, 18233, 17544, 9269, -561, -10406, -14037, -10712, -3945, 4115, 8656, 5517, 512, -5661, -8120, -4431, 2758, 10214, 11859, 7773]
2132G773r566r767p249K327Q310J3870R389L566m446p317r872m626m10N962N304
2147C248K689k836m633m969k598L000O234Q655M152l35r121q477j1110j459L304
2162a4256J0251Q786O028K134n462n003m524j361L234L266K383j287n137o377
2176g325l165l78L205Q979R880L738j010q116r098q801m404N071P239Q458M979
2191I252n14n078o470j341K397L842N281K323l905p237r384n330K091P256J2332
2206E515R566J535m519r199r059o610J659N007P036L968k10l954n907l349M127
2221d394P581P591K882j796p149r280r177l127M871R290P974O629N41m460o906
2236A070n752j543K708N566J284l35m133l603k291j863O728P503O922J617k385
$$ y = [7773, -1793, -11560, -18809, -16482, -8172, 5698, 15087, 18653, 14207, 6890, -2982, -7608, -8018, -2056, 3248, 5937, 3101, -1532, -6501, -9099, -6099, 135, 8790, 12942, 12607, 3486, -4991, -16101, -17560, -14256, -4005, 4781, 10809, 12943, 7481, 2478, -2046, -3407, -173, 3093, 5476, 4189, -948, -7325, -10490, -10868, -7663, 1316, 11196, 14934, 13924, 5808, -3290, -12091, -16495, -11424, -4185, 4273, 9252, 8738, 3660, -2810, -4151, -1754, 2088, 7369, 9692, 5787, -1450, -10834, -16164, -14073, -6817, 5515, 15081, 16616, 12097, 2898, -6161, -12771, -11112, -6105, 931, 4899, 4689, 735, -5172, -8521, -4394, 3187, 10778, 13660, 11864, 4715, -4565, -13742, -16869, -11998, -2708, 5266, 11895, 12436, 7976, 1070, -4682, -6225, -3517, 2049, 3333, 2998, -1135, -4738, -7029, -8892, -2164, 5339, 12261, 13878, 11493]
2251A1493q091r320q072j353M238P689N658N666p53l552l621k961P04L049N160
2266E934R63k485p287n128m988L506N974J0013O585J059k467q045r992n600J81
2281a1777M457O304N112P32k088n336k438J641O183O378L247k158o337r227p261
2296a2568k555M136R611Q793P165j629o457n432o932j630L975K332K461l35k113
2311a178m623k117R82O692P636M831J923m602q414q777n955M05M351P377Q374
2326F905L853k073m111n329k618Q53J985K760k56j077m339o113j873K233O804
2341b396P955P604J226l238q117j0064m436l10O088N981N836N52k393n036l102
2356c850O81K847O008K731j803n232r104o119j347N070R260Q537P069k046m816
$$ y = [11493, 3402, -5918, -13990, -15343, -11105, -3416, 2242, 7908, 7155, 3603, -18, -2979, -2275, 774, 5934, 6897, 4412, -2875, -8003, -12991, -9485, -3511, 6502, 13087, 14146, 11679, 3634, -6358, -11958, -11777, -7320, -1016, 4096, 4828, 2740, -2596, -5034, -3393, 2790, 9168, 12415, 10257, 3920, -5307, -12568, -15123, -10987, -1376, 7417, 14582, 12953, 6496, 1064, -5868, -7498, -3523, -1191, 1270, 935, -1178, -5801, -7918, -6936, -244, 7392, 12223, 14146, 9544, 1130, -7647, -13602, -13197, -8846, -1469, 6905, 10758, 8685, 4574, -755, -3373, -2520, -535, 2225, 1969, 892, -3447, -9560, -11433, -9200, -2396, 5559, 13163, 14389, 11151, 3034, -7030, -11466, -11776, -5688, 293, 6129, 6681, 4288, -748, -3850, -3169, -322, 5686, 8417, 6614, 1382, -7722, -13841, -15188, -10118, -858, 7679, 14748, 12702, 7886]
2371G886p023o556k513K546M706M085J393m602m319k927L236L317O539M587O42
2386A0997m211q232o896n498k40O310R061N384M184k016m579m207l626J600J234
2401g35K397J570l260l998l939m79K911N616O209O448j94m750q574o612m416N41
2417a1265M632O631N577M18K98m245k467j53R04L932R19m60m043p540l812j722
2433a2396M582O738R322N468j186m636q188o571l023K428M771L144M171k529k093
2448Bk576n59L065O205M625J467o221q152p118m784K310O137P821O094J495k308
2464G503l394n413l153q31L923J830J542j850k121l153m04L278O264N296K267
2479A1584o77m678p668o118l590k19M902O460O090j153l05k774l856j341L388
$$ y = [7886, 863, -5693, -8206, -5660, -954, 3131, 4524, -78, -4397, -7324, -4088, -771, 5768, 10355, 10997, 6786, -1446, -8342, -13840, -14080, -7770, 1291, 6675, 10859, 8843, 4264, 57, -3569, -1969, -735, 1662, 3232, -28, -4026, -7965, -8444, -5533, 83, 6292, 12740, 12546, 7796, -778, -7390, -11806, -11265, -6633, -2, 5575, 5993, 6291, 2046, -421, -574, 330, 4262, 5181, 4721, 678, -6862, -10674, -12396, -7814, -1076, 8246, 13714, 12528, 7892, -296, -6867, -9890, -7462, -2691, 453, 4624, 2095, 2, -2574, -3133, -68, 6137, 10762, 12229, 6008, -2144, -9262, -14046, -11736, -5599, 2222, 8316, 9811, 7503, 4109, -1304, -4457, -5288, -1365, 465, 2007, 157, -1964, -5117, -5521, -2243, 4021, 9317, 11584, 10907, 6229, -1439, -7557, -11147, -11366, -6464, -4, 6086, 4933, 4628, 1854, -2002, -3343, 45]
2494D5J459L181k135l877m522k433o99M153P231O512L539j25n904o922o790j855
2510i142L14N518N145J918N36m594j585j996L133M642K469N34l792o250o180l268
2526a2598J383P403Q261N634K393k283o039m713l454j89K259M016m19j885k139
2541b370k581J025J694N179L876K177r62n463n570p156k487K978N240O507L161
2556E248J880j720l081k767L16j083L086N45J44l424n205k643J321M474O015N204
2572H310K580j051n829q116n909m05O77O509M885K311J464k313l069j747J142
2587e61M131K948K25m102n196n390l917K762N698P723O255R39k628o157m483n962
2603g715P15J969K250L226J576k434k576l70K784M319L002J747j448o212o518
$$ y = [45, 1504, 4685, 2550, -1327, -5849, -8282, -8981, -4828, 2403, 8915, 12454, 12329, 6425, -497, -7287, -9142, -8828, -3310, 1835, 3753, 4289, -305, -1890, -3886, -753, 3889, 6358, 6892, 3100, -3150, -9330, -12598, -11215, -3812, 4449, 10083, 12476, 10193, 4154, -559, -4013, -4202, -1943, 2073, 1654, -231, -2370, -4951, -3926, -2232, 2947, 6823, 9000, 8038, 2575, -2995, -10151, -12638, -9660, -4420, 2087, 5248, 7128, 5408, 2327, -440, -124, -1207, 1879, 2424, 2568, -856, -6061, -8704, -7383, -2909, 3106, 8310, 10890, 9839, 4010, -4106, -10015, -10420, -9743, -3234, 1651, 3962, 5426, 3113, 44, -1703, -561, 3570, 6518, 6743, 2641, -2555, -7945, -11862, -9100, -3402, 4321, 10576, 11515, 8887, 2730, -1753, -7715, -7000, -5031, -2781, 445, 2021, -413, -2989, -3359, -575, 3744, 6746, 8493, 7045, 833, -5685]
2618e685m972r30L262N365N402N978M43k263m788k892k018J383O97J399j81j798
2634a598k860k953K820L065N939M271K758l508m731o875m787k420K353O000M646
2649B120M538q13l590j445k783K62L298J168J057k057m011n149l364L790M421
2664b558O305P056P76l070o788o597k599j707M113L255K629J104j185k086k7J300
2680g9M038M360j281j126o113m779l618j202L236N952N428L920q6l079m100m663
2696c192o93J465J282J944j171j857q60j276J839L516L255L205J485k794m532
2711A616o519l406j463K461N088N547K924R66k284k859k348k37n3J633k39j527
2727g00k679l840r49K357M851N928M089J972k105p734o108k107j049K491O452
$$ y = [-5685, -10657, -11587, -8325, -2960, 2442, 8420, 8863, 6600, 1812, -1080, -3098, -1715, -1018, 381, 200, -1598, -4458, -7411, -4591, -1526, 4413, 8684, 11442, 7934, 3203, -3672, -8459, -10879, -8526, -2526, 2120, 6658, 5845, 2255, 810, -1973, -1711, 1587, 2755, 3812, 1755, -2256, -7405, -10769, -6979, -2558, 3747, 10803, 11579, 8509, 1721, -4876, -7475, -9182, -5069, -1814, 815, 1919, 734, -1352, -1379, -79, 3959, 8319, 7038, 5912, -201, -4980, -8598, -9800, -6564, -612, 4816, 8736, 8650, 5571, 1471, -3192, -3885, -2420, -1138, 806, -365, -2222, -3082, -4358, -2519, 997, 4252, 7457, 8942, 6148, 1616, -4903, -8309, -9772, -7311, -2223, 3324, 6248, 7214, 4930, 2071, -277, -514, -567, 1066, 827, -700, -3379, -7219, -8168, -5811, -960, 4968, 9057, 11029, 8924, 1190, -4918, -7025, -8074, -5583, 869]
2742H69K391R52j943j814m06M0J559L478P5k509l254n970l650j97N330N462O566
2759F979K282n44l913m426l138k322L06M127O60J863k203j121j299K777K623L289
2775E940J484Q07m330m487o739r01r22K192N302M708L600r02k113l345j365o76
2791a747J149Q41k60J5l256j076o39K191L967M583L126R68l802o432m998l805
2807i175LK864M655M223K246j361l014j415m81K414L329K93k760j887n443l651
2823i160J574L378N667O011K977j104m336o426l754j033R55K837K572N16j741
2838a067o00m60J796J649L372J892j08m085m709l191l172J023L380N739M679N53
2854F691J80k327l954k199j78m15J596p96J3j253j462M98K198L457K667L811k01
$$ y = [869, 3260, 4212, 2269, 455, 49, 89, 1648, 5126, 5201, 2692, -562, -6532, -10182, -10379, -5049, 413, 6979, 9261, 8717, 4804, 378, -2760, -5082, -4776, -649, 11, 1874, -329, -1450, -2749, 28, 2651, 5940, 7424, 8231, 3901, -586, -7325, -8226, -9148, -6956, -1654, 3054, 6654, 5752, 3639, 294, -1071, -1747, -598, 243, -17, -2, -3258, -4334, -4973, -2782, 1185, 5768, 8894, 9862, 6060, -372, -5370, -9175, -9172, -6308, -1653, 2570, 4816, 3455, 441, -974, -1455, 959, 4288, 4581, 1821, -66, -5509, -9160, -7586, -4208, 1459, 7470, 10447, 9343, 5007, -1419, -5173, -6206, -5251, -2414, 158, 674, -1067, -1667, -2127, -331, 1318, 4690, 6582, 6474, 2389, -2320, -5511, -8683, -7660, -4280, 1459, 6138, 6691, 6871, 4544, 590, -1609, -1787, -2202, -606, -1402, -1389, -2642, -4104, -3606, -1408, 2049, 4716, 8527, 8326]
2871H326l658n259m469l375j41L533N328M003J891r12k129l210p03J108P38J729
2887B800j481j165n127k360l34M808M696N113K281j48m094o368l730k574R32M374
2903b377K816K868n89j563k119n3K642R02J779L00l177n917k380k967K134M366
2919c335O059M296P63o63l492l186m131Q1O79J507R33J43n44j738K21K503K901
2936B997J829L68m34l048m330m500k568K152K697N663K725K519k43k287l172q26
2952d58l73J234l19R5j619j522k029N30J780N702M172N4L83l755n877m679k176
2969h857J968L819L808P11J775j398p12j715K752N98R37j764j548l500k434k433
2985g993J954M927L992M227O02j550l154m640l234j219K284J804K518o71j431
$$ y = [8326, 4668, -591, -5060, -8435, -8576, -5043, 285, 4288, 6179, 5267, 3138, -72, -775, 333, 1071, 2800, 1319, 154, -4973, -7333, -7667, -2859, 1837, 6950, 9231, 9083, 4989, -1379, -5109, -7683, -6751, -2377, 439, 3307, 2718, 1155, -964, -1017, 1625, 2527, 4306, 4606, 1429, -4488, -6868, -9835, -7701, -3335, 2724, 7020, 7783, 7120, 3628, 442, -3689, -3608, -2929, -1422, -489, -346, -890, -2628, -2407, 96, 2997, 4826, 5194, 4760, 1712, -2618, -7118, -9686, -7534, -4837, 826, 3551, 6070, 5827, 3540, 368, -458, -831, 403, 84, 179, -1440, -2962, -4991, -4461, -2681, 3021, 7193, 7247, 7630, 3875, -2002, -6681, -8857, -6889, -3070, 738, 1449, 3224, 1826, 1114, -601, 2151, 2749, 3686, 1922, 374, -3126, -5560, -7993, -6039, -1112, 2880, 7107, 7709, 6159, 3005, -1635, -4869, -6088, -3804, -2000, 518, -153, -1584]
3000a584L37P62J516K761J750L19m96l502n085l873qO90L780N984J962J437j284
3017E466k287k593k530M4r15J532l56K29r80j881K276K830K948K369J879j719
3033F312l130n627l980j365J128L023M530M187Q85k693j764j018p86J108R26l59
3049A377j679k484k737j565K31O034N100M742j224j245n185l400k179k593K340
3064d467K317K894L55P74k657n89J807K508J420n41q22k871l359k910r00R31N616
3081d94K880M068j18j304l414j463k892q58L79P27R31j051o14P08J874J558L092
3098D009J637r60n02l650l851l307p01K352K879K608M902K82m20k418k982j296
3114a418J28K655K62k389k594k105q2J546M073L732K724P20j610m178n562k420
$$ y = [-1584, -1247, -485, 1031, 3792, 5542, 5861, 5365, 1863, -3222, -7095, -7103, -6413, -2633, 3351, 5313, 6750, 5466, 3179, 586, -1944, -1900, -2815, -1283, -1639, -1410, -2390, -4271, -1995, 835, 3783, 6152, 8031, 6312, 3182, -2445, -6425, -7790, -6662, -3639, 891, 5078, 5963, 3270, 1506, 488, -298, 810, 1736, 1377, -302, -2786, -5523, -7088, -6857, -823, 4277, 9019, 7795, 6550, 1365, -2035, -4214, -6807, -4467, -2150, 744, 1099, 1873, -784, -1373, 434, 2942, 4362, 3821, 2999, 128, -3231, -6141, -7041, -6110, -494, 2386, 6454, 6336, 5032, 1618, 155, -2737, -3595, -3216, -2489, -1558, -2609, -3223, -2515, -641, 917, 4009, 5646, 4686, 4184, 534, -3317, -6624, -7325, -4973, -2094, 514, 5416, 5698, 5278, 2860, -122, -1418, -1290, 1365, 1627, -762, -3356, -5461, -5543, -3997, 76, 3808, 6532, 7252, 5642, 1464, -4098, -6518]
3130f518J125J307K671L682k70M79p22j508J520Q21M84R0k930j967k245l740N00
3147g221K704N011L151J166J466j429l453l568k395P36J602O08O00R74J124k159
3163a083K186J601K815l38R44l825k932m190l086M52L374L176L324K386J251k138
3179C917k354k057k187P20J37J237n54n32k227J026J854K932L417K844j883j430
3195D860m893m765j948l68K303L805L118J289p24p80o84k139R60P90n34J093k803
3212a420l092k077J959K030M985L360J971k68k907m325l121k220K90J152K634
3227a049K161j394l62J241J106l57K021o31O78l020k296m409K13J44K617M537
3243A200M091Q64j03j299l646o19j523r28M94J61j371J521j653J860jK318K209
$$ y = [-6518, -5393, -4086, -1415, 2267, 1997, 2476, 1754, 246, 1766, 2587, 3071, 3161, 231, -1736, -3981, -7721, -7221, -4517, 494, 3645, 4811, 6277, 4848, 1395, -2173, -4568, -3832, -2230, -1622, -1022, -48, 1076, -1083, 1103, 2704, 5519, 5181, 6125, 2300, -632, -4822, -7908, -7456, -4082, -906, 2418, 4804, 6055, 3917, 1563, -494, -2681, -1961, -1824, -587, -1141, -1673, -3900, -2874, -1020, 1912, 5329, 8173, 6290, 4860, -33, -4798, -6746, -7114, -4811, -1006, 2112, 3401, 2677, 1897, 1213, -926, 34, 824, 290, 1383, -1420, -4512, -6589, -4630, -2600, 2385, 5745, 7716, 7448, 4541, 216, -2905, -5125, -4835, -3683, -1049, 1112, -282, -644, 597, 1703, 1346, 3367, 2736, 3414, 394, -1902, -6311, -6098, -5954, -3337, 1200, 5291, 6155, 6052, 4753, 1107, 488, -1035, -1963, -1469, -1308, -2679, -1158, -2811, -951, -952, 1366, 3575]
3260C575J685p6l458j352n168k857J960K166K158N011K151n88k571j561j92n38
3276C45n78n46P23j897k198q96k6K633M295L054K935k012l634k316l375k381M57
3293e417J199L484J170R31N12n30K3j70J514J697j408k442l615k852j053J916
3309e041K900L662L889L59K60j789l935k748j239L41P38Q16m15K20J480J46J637
3326A281K277J933l4k24m416l201k461k258J686R28M368L838J663m4k417p01l215
3343i97j520N29N35J336j337j600p80J249L009J953L070J589j466k317m884m173
3359e804k203Q91L539M434J680J782j493j338o31M0J157M51p34k044l470j242
3375d985J1J35K058N652K236J047j437j984m365k368p81J541J438O89K59l28R24
$$ y = [3575, 5260, 5184, 1726, 374, -4794, -7651, -5691, -3525, -1367, 3644, 5795, 5207, 2636, 1075, 883, 345, -233, -779, -56, -1953, -4151, -5047, -5073, -2440, 1855, 4909, 7844, 5832, 2198, -118, -3493, -5874, -5417, -4218, -734, 436, 1367, 1879, 1349, 1372, 1202, 2716, 4413, 3005, 563, -3052, -5904, -6957, -5041, -2141, 1521, 5410, 5769, 6029, 4240, 305, -2443, -3682, -3341, -2603, -1787, -2202, -1982, -502, -356, 1281, 3558, 5491, 5457, 5233, 817, -2384, -4845, -7103, -5417, -4489, -121, 3717, 5380, 5336, 2919, 2218, -997, -2517, -1988, -1453, -117, -1454, -3054, -3834, -2585, 424, 2377, 5447, 7036, 5570, 3253, -1631, -5804, -8007, -7116, -3577, 857, 2537, 4319, 2826, 1488, 857, 897, 2054, 2505, 1771, -273, -3743, -4985, -4974, -4839, -2781, 2871, 5107, 6154, 4717, 2733, -1632, -4000, -4781, -3240, -1802, -1113, -854, -1182, -258]
3392b58K34J367J644N89J690k999k282j831k768q20k58L265L580K597J428N48
3408E726k921k028j810j066N5Q52O76k51j940J106m09L561J084K172P07q1m591
3425H42l257k446m82J558J295K779J855K005o32j903k58j700j87N75N41j065l275
3442c755n62n71M41L947L646L448L40j690l042l903j337j118R72P26J881P95P56
3459I74j489K363j050K839Q70j150j845k511k659j853O39j6M295L346J999N49
3475E301r52j439k084l276n72R17K06J078m35K13n1P72K107K13L012j282j216
3492B512k516k160l254j261O08L689K547K912J819q26k326k010N18o27m88M45
3508d18q84j844k72J421L08J275L775K130K15j192l137m096k893m87J198L139
$$ y = [-258, -24, 1343, 2987, 3576, 5266, 2267, -15, -1846, -4614, -5434, -5692, -2427, 1153, 3750, 5178, 5726, 2805, 777, -1033, -2099, -2044, -1192, -516, -767, -2707, -1601, -2010, 1551, 2635, 4807, 5514, 5433, 842, -2415, -4861, -5343, -3785, -2490, 289, 2144, 4149, 3517, 1614, 1356, -344, -531, 44, 585, -480, -3755, -4317, -4888, -4447, -500, 3146, 6594, 6934, 5244, 2202, -1701, -3038, -4156, -3184, -2458, -577, 218, 974, -515, 1848, 798, 3637, 4507, 3357, 1512, -999, -3658, -5511, -4872, -4888, -593, 2753, 4752, 5301, 4349, 2910, 826, -2450, -3022, -2105, -1899, -821, -1256, -1043, -1094, -322, 1785, 1998, 5010, 3728, 2512, -4, -2164, -5418, -6679, -6071, -2382, 165, 3077, 4896, 4070, 1744, -266, 252, -375, -863, -418, -1302, -3146, -3418, -1997, -1689, -414, 3361, 5491, 5706, 4514, 1377, -2719, -5612, -6099, -4901, -1762]
3524a762K017K533l69q70n5L45J419o44K97j194l279k428r04J4J657L557M498
3541D832L93n93j514k459j640j684m01N44O17M52O05O8J362J048J489p96J753
3558D076L89k709k332l195j076j027J955J390N188N22J094j97k550j442r57k357
3574c228J195N25m07J87N28r22J629J997J898J604P39j969m240m199n32M30P16
3591d049L281L595P49n26j067j159L35K55n3J52k270j892m60j922K41K474L737
3608A421L760J997k25l174l875j521k782M74J536O38J806P16K57K2N31R97k90
3625B288M62k62k907j655j806j263L73J212M233J349J575J798m06k304l246o41
3641a200k65p97J201n58Q21O50j087P57K439L12J622J229l409k773j700k696N54
$$ y = [-1762, 255, 2788, 2419, 1549, 1494, 1839, 3258, 2614, 2911, 1717, -1562, -3990, -4894, -4880, -3223, 334, 4832, 5225, 4632, 3118, 659, -981, -2665, -3066, -2522, -1905, -1453, -848, -780, 582, 1630, 3119, 2323, 4076, 4465, 1756, -576, -3771, -4847, -5874, -3919, -2529, 2659, 3181, 4275, 4078, 1528, 86, -871, -3228, -2033, -1508, -1915, -1728, -1200, -2122, -493, 1504, 3402, 5006, 5745, 3776, -464, -4663, -5195, -4765, -4049, -768, 2827, 3576, 3050, 1983, 824, 1159, 1414, 1361, 1513, -757, -2649, -3109, -5031, -4790, -2316, 1421, 5181, 7178, 6953, 3779, -96, -1617, -4399, -3925, -2389, -1751, 55, 771, 1028, 1050, 1581, 2578, 2288, 2750, 2488, -419, -2074, -3880, -5143, -4770, -3558, 675, 2024, 3599, 5397, 4991, 2687, -559, -1200, -1465, -2262, -1061, -1619, -798, -148, -1235, -478, 1961, 2273, 3895, 5124, 1715, -1058, -2758, -5454, -4900]
3658d900J417K636M426J480j119j264j500j4q63l82J12O1l387N24k6r28L658J779
3676A710K766Q77p04k507k377k778j576J27J524K163K410n08p97J94J690k271
3692e7K511O1j551j651q93l389N86P26J792M119J601L77k63p01l273k478o17N88
3710b512j41N92J882M7j012M55K504j54J025k17Q76o85m191k806j017M02J110
3727c842L329M024J832j124r98l098m20n97l87R91j182l60j284j66J787k47M040
3744B298J409K029j354l049l240l678M16R42J348J679K278J973k20j592O28p20
3760A147Q39R13j689j565k103l82k022J734J696M282J206J114j164j771k568j431
3776a764k137J188kN74J260J330O80J24O06O51L18m58m65k100j936j110j522J215
$$ y = [-4900, -3483, -847, 3579, 5059, 3940, 2676, 1176, 1162, 299, -83, 29, 90, -3297, -2773, -2799, -3727, -69, 1710, 4476, 5353, 4649, 2142, -235, -3013, -4589, -4462, -2938, -775, 1635, 1127, 330, 524, 2214, -57, 2454, 2515, 964, -687, -1580, -4969, -4383, -3657, -1865, 2254, 3855, 4232, 3969, 3268, -5, -2483, -3100, -2512, -2653, -2061, -179, -132, -1144, -689, 1815, 1661, 2686, 2469, 3345, 2660, -1531, -4337, -5354, -4952, -3842, -513, 3511, 5343, 4219, 3221, 123, -297, -894, -1281, -290, -1472, -1832, -3116, -3282, -1495, -1742, 2298, 3707, 5736, 4382, 1333, -1907, -5585, -5169, -4227, -2879, -1200, 1078, 3051, 2831, 1239, 1867, 1147, 1986, 2899, 1210, -355, -2458, -2840, -4862, -3128, -1432, 2850, 4056, 5170, 4006, 2235, -333, -1764, -3901, -2713, -2715, -2141, -881, 449, 1129, 1253, 1859, 2510, 2828, 2370, 1905, -195, -2131, -3241, -4763, -3548]
3794c548J597L354K193J516m30q62k658l045L21q57j181K904p27M58k56Q67J113
3811G59J325K487L56k162j147l280k527j235J711J831K928K579J132l086J556
3826C227j751j545J072j113r46L19j603j101q5P01K944K072K024P08j075k652
3842A196j255k953o07k1J868J252J800P9J37J200k39j324P10K76q51k965j556
3859c253j856J165Q23L042K252J390P56K70l067j260k009j407N53O82K093k24
3875e0K53j354J099M34J685L53J068j261j907k425k189m85J148J262M649J160
3891C440L82L68j157j911r66j936P37k59J055j500j605J015J377J956J864J439
3907D299J328l043j857k630j549j630R21J168L311J498o66k52L12o5j536R8J578
$$ y = [-3548, -1951, 1403, 3596, 5112, 4682, 3820, 1162, -1883, -1562, -2419, -3600, -696, -1423, -965, -1221, -354, 759, 2084, 4571, 4927, 2765, 1618, -1662, -4189, -5424, -3713, -1882, 1046, 3625, 4757, 1671, 3227, 1476, -69, 1003, -110, -1056, -737, -2340, -3441, -3526, -2825, 119, 2191, 4215, 4923, 3848, 1196, -59, -3012, -3619, -3640, -1772, -520, 1280, 1359, 1496, 2696, 2457, 1133, 1843, 2119, 1268, -1697, -3253, -5109, -3944, -3121, -79, 2173, 3563, 4319, 4589, 1522, 262, -1747, -3154, -2601, -1919, 174, -50, 203, -1151, -52, 382, 2067, 2420, 3488, 2227, 320, -2105, -4294, -4779, -3631, -2369, 2280, 3440, 3822, 4190, 3033, 1122, 156, -1780, -1043, -1302, -247, -1747, -3352, -2337, -960, 996, 2860, 4299, 5627, 2584, 727, -1903, -3452, -5082, -4161, -2993, 318, 1816, 1150, 898, 1210, 1145, -391, -293, 1285]
3924A285n69k789j35j816k24K608J789K357L344j077j605p28k594k433j027J570
3940b044n17P16J584J305l60N60M93j842K409J341k993k453p56j946o64J565K455
3957a147L707R00Q60p16j297j964q08m88j601R82P78p34N91k73p21L196J014K076
3975D355R19k851l060j965k186J664j237M055J121K131J84j296J149k670l8K90
3991E65m89j341O39l158j386K842J890K442Q28K549m95j700k151k389j377k28
4007b959K34J475P20L447j750K81J66J40N15L46n07j724j222k097j696O85K417
4024a529K020J505J913K72j440j351j282l212M26O5N57R82L61n19J234P25M23
4041A150K334m7r50j74l705k618n34r72K218K730J359K058K214l160M44j321j039
$$ y = [1285, 716, -2073, -2208, -4024, -4248, -1640, 149, 2506, 5850, 4773, 3168, 2440, -154, -2587, -3614, -2044, -2561, -1845, -261, 1044, 684, 1244, 1737, -105, 2304, 3645, 652, -1801, -2557, -4503, -5167, -3602, -1147, 2560, 3460, 4320, 3604, 2307, 343, -465, -953, -2554, -1572, -794, -1528, -937, -1210, -1931, 1265, 2279, 4355, 5274, 2423, -637, -2602, -4788, -3124, -4361, -306, 815, 2946, 3130, 1834, 2983, 313, 275, 565, 76, -1265, -626, -3784, -5170, -2328, -438, 2004, 2832, 5381, 4886, 3186, 1035, -1354, -2731, -2959, -2725, -1250, -530, 2917, 1167, 1448, 1614, 1754, 2269, 2615, 2108, 384, -838, -2935, -4631, -3946, -1529, 491, 1996, 3909, 4181, 2741, 1390, 108, -3104, -2678, -2613, -2056, -1074, -713, -1232, 2, 727, 1150, 3484, 3437, 2487, 2313, -1392, -4010, -4544, -5516, -3298, -568, 791, 2849, 5063, 1903, 2347, 1026, -13]
4058a3q18J591j782r78p18p8J144J014K827J331J538l81k968j239m088n99q53
4075e070J946K416J678J605k13j202K90j46P13k322j050K255l471L82o87N44P76
4092a556K792J861J656j432j693o38k457q00q22P47Q78R97k26R36p36J159O84
4109A350M68J452k141n4k421j882l29p9L16K904K095K587q92n32k868p68j446
4126b240J657j064R34j134j112J471l01J563K075K129l26l14k073j608k614j234
4142d191O48P22K951J884P33L85L19k111qn55l32l66j181j100j718P07M99K636
4160g8J573K980n31L83j529l008j262j592O63L14J74J293K384r40K4L30J238l87
$$ y = [-13, -831, 760, -1022, -2000, -2718, -2796, -1652, -638, 2189, 3520, 5058, 4677, 1709, 470, -3618, -4217, -5070, -3124, -708, 970, 2575, 2362, 1160, 1450, 1304, 2017, -305, -1355, 900, -2571, -2189, -2876, -2332, -1556, 1236, 3097, 4753, 3321, 1628, 990, -1467, -2267, -3089, -2342, -1464, -467, -693, 243, -493, 666, 1350, 1818, 3270, 1129, 1075, -1346, -3228, -3557, -3636, -3320, -416, 1679, 4266, 3374, 2842, -26, -794, -2240, -583, -1647, -713, -1847, -2959, -1488, -1789, -226, 1849, 3978, 3652, 3338, 1265, -343, -2957, -4191, -3543, -2821, 130, 2014, 2747, 3132, 3451, 1340, 1332, 777, 445, 79, -1102, -2202, -3920, -3213, -2714, -78, 1495, 4475, 3944, 4327, 2798, -210, -1472, -3064, -2401, -2087, -1913, -620, 1764, 824, 848, 1178, 2416, 2029]
$$ [...]
8191H97
##END NTUPLES=NMR FID
##END=
