##TITLE=1H_IAMT-116
 Pyr-d5, 108 sc, 
 12.2.2019
##JCAMPDX= 6.0         $$ Bruker NMR JCAMP-DX V2.0
##DATA TYPE= NMR FID
##DATA CLASS= NTUPLES
##ORIGIN= UXNMR, Bruker Analytische Messtechnik GmbH
##OWNER= root
$$ XWIN-NMR		Version 3.5
$$ Tue Feb 12 15:43:42 2019 Russian Standard Time (UT+4h)  she@DPX200
##.OBSERVE FREQUENCY= 200.1306
##.OBSERVE NUCLEUS= ^1H
##.DELAY= (6, 6)
##.ACQUISITION MODE= SIMULTANEOUS
##.ACQUISITION SCHEME= undefined
##.AVERAGES= 108
##.DIGITISER RES= 18
##SPECTROMETER/DATA SYSTEM= spect
##.PULSE SEQUENCE= zg30
##.SOLVENT NAME= Pyr
##.SHIFT REFERENCE= (INTERNAL, Pyr, 0, 15.7039)
##AUDIT TRAIL= $$ (NUMBER, WHEN, WHO, WHERE, WHAT)
$$ ##TITLE= Audit trail, XWIN-NMR		Version 3.5
$$ ##JCAMPDX= 5.01
$$ ##ORIGIN= Bruker BioSpin GmbH
$$ ##OWNER= she
$$ F:/spectra/data/she/nmr/H-F/1/audita.txt
$$ ##AUDIT TRAIL=  $$ (NUMBER, WHEN, WHO, WHERE, WHAT)
(   1,<2019-02-12 15:42:21.89 +0400>,<she>,<DPX200>,
      <continue with go, POWCHK disabled, PULCHK disabled
       configuration hash MD5:
       00 E9 B6 7A A2 85 ED C7 34 08 36 98 17 FE 4E 26
       data hash MD5: 16K
       99 9A B7 54 C9 2B CA E9 37 47 D0 31 08 C1 25 1E>)
$$ ##END=
$$ 
$$ hash MD5
$$ 01 E0 80 0F B0 FA 6B D0 4E D4 6E 15 67 74 69 2D
##$RELAX= 
##$RELAX= 
##$RELAX= 
##$RELAX= 
##$RELAX= 
##$RELAX= 
$$ Bruker specific parameters
$$ --------------------------
##$DU= <F:/spectra>
##$EXPNO= 1
##$NAME= <H-F>
##$PROCNO= 1
##$TYPE= <nmr>
##$USER= <she>
##$AMP= (0..31)
100 100 100 100 100 100 100 100 100 100 100 100 100 100 100 100 100 100 
100 100 100 100 100 100 100 100 100 100 100 100 100 100 
##$AQSEQ= 0
##$AQ_mod= 1
##$AUNM= <au_zg>
##$AUTOPOS= <>
##$BF1= 200.13
##$BF2= 200.13
##$BF3= 200.13
##$BF4= 200.13
##$BF5= 200.13
##$BF6= 200.13
##$BF7= 200.13
##$BF8= 200.13
##$BYTORDA= 1
##$CFDGTYP= 0
##$CFRGTYP= 5
##$CHEMSTR= <none>
##$CNST= (0..31)
1 1 145 1 1 1 1 1 1 1 1 1 1 1 1 1 1 1 1 1 1 1 1 1 1 1 1 1 1 1 1 1 
##$CPDPRG= <>
##$CPDPRG1= <>
##$CPDPRG2= <>
##$CPDPRG3= <>
##$CPDPRG4= <mlev>
##$CPDPRG5= <mlev>
##$CPDPRG6= <mlev>
##$CPDPRG7= <mlev>
##$CPDPRG8= <mlev>
##$CPDPRGB= <>
##$CPDPRGT= <>
##$D= (0..31)
0 1.2 0 0 0 0 0 0 0 0 0 0.03 0 0 0 0 0 0 0 0 0 0 0 0 0 0 0 0 0 0 0 0 
##$DATE= 1549971398
##$DBL= (0..7)
120 120 120 120 120 120 120 120 
##$DBP= (0..7)
150 150 150 150 150 150 150 150 
##$DBP07= 0
##$DBPNAM0= <>
##$DBPNAM1= <>
##$DBPNAM2= <>
##$DBPNAM3= <>
##$DBPNAM4= <>
##$DBPNAM5= <>
##$DBPNAM6= <>
##$DBPNAM7= <>
##$DBPOAL= (0..7)
0.5 0.5 0.5 0.5 0.5 0.5 0.5 0.5 
##$DBPOFFS= (0..7)
0 0 0 0 0 0 0 0 
##$DE= 6
##$DECBNUC= <off>
##$DECIM= 24
##$DECNUC= <off>
##$DECSTAT= 4
##$DIGMOD= 1
##$DIGTYP= 9
##$DL= (0..7)
0 120 120 120 120 120 120 120 
##$DP= (0..7)
150 150 150 150 150 150 150 150 
##$DP07= 0
##$DPNAME0= <>
##$DPNAME1= <>
##$DPNAME2= <>
##$DPNAME3= <>
##$DPNAME4= <>
##$DPNAME5= <>
##$DPNAME6= <>
##$DPNAME7= <>
##$DPOAL= (0..7)
0.5 0.5 0.5 0.5 0.5 0.5 0.5 0.5 
##$DPOFFS= (0..7)
0 0 0 0 0 0 0 0 
##$DQDMODE= 0
##$DR= 18
##$DS= 0
##$DSLIST= <SSSSSSSSSSSSSSS>
##$DSPFIRM= 0
$$ [...]
##$SUBNAM2= <"">
##$SUBNAM3= <"">
##$SUBNAM4= <"">
##$SUBNAM5= <"">
##$SUBNAM6= <"">
##$SUBNAM7= <"">
##$SUBNAM8= <"">
##$SUBNAM9= <"">
##$SW= 27.0386208368706
##$SWIBOX= (0..15)
0 0 2 0 0 0 0 0 0 0 0 0 0 0 0 0 
##$SW_h= 5411.25541125541
##$TD= 16384
##$TD0= 1
##$TE= 0
##$TE2= 300
##$TE3= 300
##$TEG= 300
##$TL= (0..7)
0 120 120 120 120 120 120 120 
##$TP= (0..7)
150 150 150 150 150 150 150 150 
##$TP07= 0
##$TPNAME0= <>
##$TPNAME1= <>
##$TPNAME2= <>
##$TPNAME3= <>
##$TPNAME4= <>
##$TPNAME5= <>
##$TPNAME6= <>
##$TPNAME7= <>
##$TPOAL= (0..7)
0.5 0.5 0.5 0.5 0.5 0.5 0.5 0.5 
##$TPOFFS= (0..7)
0 0 0 0 0 0 0 0 
##$TUNHIN= 0
##$TUNHOUT= 0
##$TUNXOUT= 0
##$USERA1= <user>
##$USERA2= <user>
##$USERA3= <user>
##$USERA4= <user>
##$USERA5= <user>
##$V9= 5
##$VALIST= <valist>
##$VCLIST= <CCCCCCCCCCCCCCC>
##$VD= 0
##$VDLIST= <DDDDDDDDDDDDDDD>
##$VPLIST= <PPPPPPPPPPPPPPP>
##$VTLIST= <TTTTTTTTTTTTTTT>
##$WBST= 1024
##$WBSW= 4
##$XGAIN= (0..3)
0 0 0 0 
##$XL= 0
##$YL= 0
##$YMAX_a= 1110986
##$YMIN_a= -464258
##$ZGOPTNS= <>
##$ZL1= 120
##$ZL2= 120
##$ZL3= 120
##$ZL4= 120
##$ABSF1= 10
##$ABSF2= 0
##$ABSG= 5
##$ABSL= 3
##$ALPHA= 0
##$AQORDER= 0
##$ASSFAC= 0
##$ASSFACI= 0
##$ASSFACX= 0
##$ASSWID= 0
##$AUNMP= <proc_1d>
##$AZFE= 0.1
##$AZFW= 0.1
##$BCFW= 1
##$BC_mod= 2
##$BYTORDP= 1
##$COROFFS= 0
##$CY= 11.3945322036743
##$DATMOD= 1
##$DC= 2
##$DFILT= <>
##$DTYPP= 0
##$F1P= 18.9103706918063
##$F2P= -1.10871071338519
##$FCOR= 0.5
##$FTSIZE= 0
##$FT_mod= 4
##$GAMMA= 1
##$GB= 0.15
##$INTBC= 1
##$INTSCL= 1
##$ISEN= 128
##$LB= 0.24
##$LEV0= 0
##$LPBIN= 0
##$MAXI= 10000
##$MC2= 0
##$MEAN= 0
##$ME_mod= 0
##$MI= 1.114404
##$NCOEF= 0
##$NC_proc= 0
##$NLEV= 6
##$NOISF1= 3.799351
##$NOISF2= 2.8
##$NSP= 1
##$NTH_PI= 0
##$NZP= 0
##$OFFSET= 15.70392
##$PC= 1
##$PHC0= -8872.924
##$PHC1= 11.40014
##$PH_mod= 1
##$PKNL= yes
##$PPARMOD= 0
##$PSCAL= 0
##$PSIGN= 0
##$REVERSE= no
##$SF= 200.130013532006
##$SI= 16384
##$SIGF1= 3
##$SIGF2= 2
##$SINO= 400
##$SIOLD= 16384
##$SREGLST= <1H.CDCl3>
##$SSB= 0
##$STSI= 0
##$STSR= 0
##$SW_p= 3612.71676300578
##$SYMM= 0
##$S_DEV= 0
##$TDeff= 0
##$TDoff= 0
##$TI= <>
##$TILT= no
##$TM1= 0
##$TM2= 0
##$TOPLEV= 0
##$USERP1= <user>
##$USERP2= <user>
##$USERP3= <user>
##$USERP4= <user>
##$USERP5= <user>
##$WDW= 1
##$XDIM= 8192
##$YMAX_p= 0
##$YMIN_p= 0
$$ End of Bruker specific parameters
$$ ---------------------------------
##NTUPLES= NMR FID
##VAR_NAME=  TIME,          FID/REAL,        FID/IMAG
##SYMBOL=    X,             R,               I
##VAR_TYPE=  INDEPENDENT,   DEPENDENT,       DEPENDENT
##VAR_FORM=  AFFN,          ASDF,            ASDF
##VAR_DIM=   8192,          8192,            8192
##UNITS=     SECONDS,       ARBITRARY UNITS, ARBITRARY UNITS
##FACTOR=    0.0001848,     1,               1
##FIRST=     0,             0,               0
##LAST=      1.5136968,     0,               0
##MIN=       0,             -464258,         0
##MAX=       1.5136968,     1110986,         0
$$ Real data points
##PAGE= N=1
##DATA TABLE= (X++(R..R)), XYDATA
$$ [...]
2731A56j602O5p58M63P01l64R08k17ql75m87J012O54Q16L72r09P04M7N95Q94r09
$$ 156 -1446 -1381 -2139 -1676 -975 -1339 -431 -648 -656 -1031 -1518 -506 148 964 1336 427 1131 1178 1773 2667 1758
2752A758m14m22J081n09n11m37l6p61M28k90K30j434l79M63j88j25N29n13l15
$$ 1758 1344 922 2003 1494 983 546 510 -251 177 -113 117 -1317 -1696 -1233 -1421 -1546 -1017 -1530 -1845
2771a845O94J21j39m04M19K04R49J019l22L8q36J649MO34l36n87L93m23l05L4
$$ -1845 -1151 -1030 -1169 -1573 -1154 -950 -1 1018 696 734 -102 1547 1551 2185 1849 1262 1655 1232 927 961
2791I61J26n49j359M27k70O13k69o67j203J041J21l23J74q03l7J719m77n04J965
$$ 961 1087 538 -821 -394 -664 -51 -320 -987 -2190 -1149 -1028 -1351 -1177 -1980 -2017 -298 -775 -1279 686
2810F86r63R73p38Q71M2L40K42j10j99p94O31M63P16j759P4m91JR28j685J112
$$ 686 -277 696 -42 829 871 1211 1453 1343 1144 350 981 1444 2160 401 475 -16 -15 913 -772 340
2830C40j570J626k269N90K28M20r98K68R28j24j86P8P83j78k63R31Q2j01J950
$$ 340 -1230 396 -1873 -1283 -1055 -635 -1633 -1365 -437 -561 -747 -669 114 -64 -327 604 686 585 2535
2849B535j995O39O02k11n46J79p88l55Kn11J206j143k88O67j492M01K4M09q24
$$ 2535 540 1179 1781 1570 1024 1203 415 60 62 -449 757 -386 -674 -7 -1499 -1098 -1074 -665 -1489
2868a489R63r34O27N24p50Q82K54p92P55o01J179L62j54m65J584n52N43p10L1
$$ -1489 -526 -1460 -833 -309 -1059 -177 77 -715 40 -561 618 980 826 361 1945 1393 1936 1226 1257
2887A257j236N3j51M18k94j099R41m9j832R74P1J61k37n36n15J222Q33n40j64
$$ 1257 21 74 -77 341 47 -1052 -111 -160 -1992 -1018 -947 -786 -1023 -1559 -2074 -852 -19 -559 -723
2906g23O71j037O01R35O42q54O17L05l42P86r78P24l38K43M69j164j321P13k74
$$ -723 -52 -1089 -488 447 1089 235 852 1157 815 1601 623 1347 1009 1252 1721 557 -764 -51 -325
2925c25R75l60j638L11L79p7M58r45n09J472r18l20J150n9M90L63j074N98P50
$$ -325 650 290 -1348 -1037 -658 -735 -277 -1222 -1731 -259 -1177 -1497 -347 -406 84 447 -627 -29 721
2944G21Q24O2n49K08j33O05m81Q75j448j82P65n63K38j042K62j207J10k62J88
$$ 721 1545 1607 1058 1266 1133 1738 1257 2132 684 502 1267 704 942 -100 162 -1045 -935 -1197 -1009
2963a009L66r71M09o88Q20o8N00q62q62K196K62N90k32j197J677L8l43R43l74
$$ -1009 -643 -1614 -1205 -1893 -1073 -1141 -641 -1503 -2365 -169 93 683 451 -746 931 969 626 1569 1195
2982A195p48J971j508mq89N16K50k73r96K6N42m32q20q45J216N24k7j005M52j242
$$ 1195 447 2418 910 906 17 533 783 510 -486 -460 82 -350 -1170 -2015 -799 -275 -302 -1307 -855 -2097
3002b097J145r38J128j88J402K65j161Q06N91K84J73k32l9n8P9o80j31N72j034
$$ -2097 -952 -1890 -762 -950 452 717 -444 362 953 1237 1410 1178 1139 1081 1160 480 349 921 -113
3021a13N06P56k314P08K98j197n1M06n49L45J31J45l63M57p07J326k56RL04N48
$$ -113 393 1149 -1165 -457 -159 -1356 -1407 -1001 -1550 -1205 -1074 -929 -1292 -835 -1542 -216 -472 -463 -159 389
3041C89J166j15M44j49j316N61J271j967P18p60j92J172j408j093J978k121J416
$$ 389 1555 1440 1884 1735 419 980 2251 284 1002 242 50 1222 -186 -1279 699 -1422 -6
3058fk78p94p18m01K139j07j103j14J21R65J16o50L01J12Q8N73L17R04r10R59
$$ -6 -284 -1078 -1796 -2197 -58 -165 -1268 -1382 -1261 -296 -180 -830 -529 -417 -329 244 561 1465 555 1514
3078A514l35l78O21m11o88J89j050J012o8r79J005j322Q11n76l81l63L5Q75p90
$$ 1514 1179 801 1422 1011 323 512 -538 474 406 -573 432 -890 -79 -655 -1036 -1399 -1364 -489 -1279
3097a279P19o83o15J640J092j658K01k53R50P69J205j324Q30m37P84kn84l40K0
$$ -1279 -560 -1243 -1858 -218 874 -784 -583 -836 114 883 2088 764 1594 1157 1941 1939 1355 1015 1035
3116A035p53K97k59L1Q54j074k52p62M67O55L6j213J23K21j268J711l71m55N74
$$ 1035 282 579 320 351 1205 131 -121 -883 -416 239 275 -938 -815 -594 -1862 -151 -522 -977 -403
3135d03k46K12L64J231p25P16r44P64K72L59l06K92L45r36k66k51L53K26o19j166
$$ -403 -649 -437 -73 1158 433 1149 205 969 1241 1600 1294 1586 1931 995 729 478 831 1057 438 -728
3155g28J22O67K5j327J515j999O32j55j05J59l51O36K63M46R49j93O97j037j84
$$ -728 -606 61 86 -1241 274 -1725 -1093 -1248 -1353 -1194 -1545 -909 -646 -200 749 556 1253 216 32
3174C2K95J011M96l61r06j33P9J90n53n80Q93L14j349Q17r4M98p18l56Q2j697
$$ 32 327 1338 1834 1473 567 434 513 703 150 -430 463 777 -572 245 151 649 -69 -425 -343 -2040
3194b040Q11L50O41j851P43J205J173j477J692r77K64r6J01n45L33L88O23k170
$$ -2040 -1229 -879 -238 -2089 -1346 -141 1032 -445 1247 270 534 438 539 -6 327 715 1338 -832
3212h32J142L05J61m09R0O51k42l70l3k50k56j616J229K64j271l98J181J44m01
$$ -832 310 615 776 367 457 1108 866 496 463 213 -43 -1659 -430 -166 -1437 -1835 -654 -510 -911
3231i11m27J100N60l18P28n48n0L60J63J131j156N66k45l32j78k2J116n54j02
$$ -911 -1338 -238 322 4 732 184 134 494 657 1788 632 1198 953 621 443 421 1537 983 881
3250H81m30o08L44M62l85m18j476J239q05J104n34l04L23L43j20Q8Lk5L44m3m68
$$ 881 451 -157 187 649 264 -154 -1630 -391 -1196 -92 -626 -930 -607 -264 -384 -296 -293 -318 26 -17 -485
3271d85P80J281j167R68p47L72P32j281N4J46J5l96L3O00j94j491R95j347N70
$$ -485 295 1576 409 1377 630 1002 1734 453 507 653 668 272 305 905 711 -780 215 -1132 -562
3290e62n33M58O80j211k88J219q68o19J790q90Q40m37p0J308N11j81p38j276K771
$$ -562 -1095 -637 43 -1168 -1456 -237 -1105 -1724 66 -824 16 -421 -491 817 1328 1147 409 -867 1904
3309A904j174q6r57P17Q41j456J34k16L81P77j364J75R8j61j062J37j9Q71j020
$$ 1904 730 644 -313 404 1245 -211 -77 -293 88 865 -499 -324 -226 -387 -1449 -1312 -1331 -460 -1480
3328a480J227j133K7M36K90K166n37j749K99J156k20q19N15L50Q57q74L91j242
$$ -1480 -253 -1386 -1359 -923 -633 1533 996 -753 -454 702 482 -337 178 528 1385 511 902 -340
3346c40K48M96j6n99j69J914j711J08m43l86j24O29o97Q73q15j095J126j10K79
$$ -340 -92 404 388 -211 -380 1534 -177 -69 -512 -898 -1022 -393 -1090 -217 -1032 -2127 -1001 -1111 -832
3365h32l17J561p27J42M63L7m7l14J472n30N98p77O47j596N37o57m38L27J4k16
$$ -832 -1149 412 -315 -173 290 327 280 -34 1438 908 1506 729 1376 -220 317 -340 -778 -451 -437 -653
3385f53J768m23j800Q40j034Q16P24m34J54j009L11L51P42q9M39N8j235N81R91
$$ -653 1115 692 -1108 -268 -1302 -486 238 -196 -42 -1051 -740 -389 353 264 703 761 -474 107 1098
3404A098N5n21K43O14n38q48J146p85j282K30M6r81J801r2K60p86j029J693r93
$$ 1098 1153 632 875 1489 951 103 1249 464 -818 -588 -542 -1523 278 186 446 -340 -1369 324 -669
3423f69L39M71o43P93o37q1K47m38k7O76M08k01K4L50Q63q38m55L17O34j066K9
$$ -669 -330 141 -502 291 -346 -427 -180 -618 -645 31 439 238 262 612 1475 637 182 499 1133 67 96
3444I6m46N3N74j069M9J7M70n36Q65j302k07Q83n8M0q08L9Q90M73j138J27J457
$$ 96 -350 -297 277 -792 -743 -726 -256 -792 73 -1229 -1436 -553 -611 -571 -1379 -1340 -450 23 -1115 -988 469
3465D69j77j97r5J071o76Q93j014k53J30P79m80J61r44R42r50p8j09J03P3q21
$$ 469 292 95 0 1071 395 1288 274 21 151 930 450 611 -333 609 -341 -419 -528 -425 -352 -1173
3485a173M02k6k20J120M75j995N1P44q46P93J168k93o07R52k58M8Q71j04K44j541
$$ -1173 -771 -797 -1017 103 578 -1417 -1366 -622 -1468 -675 493 200 -407 545 287 335 1206 1102 1346 -195
3505a95P97L60p7n98L93O29o60j00k96o75m12M44n70L50j063Q92L7N75n93R6J295
$$ -195 602 962 885 287 680 1309 649 549 253 -422 -834 -390 -960 -610 -1673 -781 -744 -169 -762 -666 629
3526F29o20j73n40L00k14P69j74M69p56M66M35k02l81Q22r70P74K24q56J05N50
$$ 629 9 -164 -704 -404 -618 151 -23 446 -310 156 591 389 8 830 -140 634 858 2 107 657
3546F57q58l03J633j583j28L90k0J071j232n49l32M50O68q98N54P61j074J893
$$ 657 -201 -504 1129 -454 -582 -192 -212 859 -373 -922 -1254 -804 -136 -1034 -480 281 -793 1100
3564A100j277L02k46k39J605n62n01P74p26O29K65j045p25J03L11J351j337k88
$$ 1100 -177 125 -121 -360 1245 683 182 956 230 859 1124 79 -646 -543 -232 1119 -218 -506
3582e06j48J035q57N93K08j381k2n85P83l10N96m1N74k11M15q6M66N11r23O27
$$ -506 -654 381 -476 117 325 -1056 -1078 -1663 -880 -1190 -594 -635 -61 -272 143 57 523 1034 111 738
3602G38J64m80M60q36K85L77m66q85J733j03j117J37m81M19J43p09N23o26J59
$$ 738 902 422 882 46 331 708 242 -643 1090 987 -130 7 -474 -55 88 -621 -98 -724 -565
3621e65o77L73J257q59L82K3m02L09L86n86J72K69k76O64r6N66r42m16M32P97
$$ -565 -1242 -869 388 -471 -89 -66 -468 -159 227 -359 -187 82 -194 470 374 940 -2 -418 14 811
3641H11q66j73P40M27j024r72J04M57J238j118J21j462J897p79R54m08L19j94
$$ 811 -55 -228 512 939 -85 -1057 -953 -496 742 -376 -255 -1717 180 -599 355 -53 266 72
3659G2K04o12J27K06k11J030q73O54m56L00L21j575K69J99N76J64J077p82j449
$$ 72 276 -336 -209 -3 -214 816 -57 597 141 441 762 -813 -544 -345 231 395 1472 690 -759
3678g59J285n59K20K5J13r12L78p40J86M14p79R84L47p25j67j57P04m84J404j516
$$ -759 526 -33 187 212 325 -587 -209 -949 -763 -349 -1128 -144 203 -522 -689 -846 -142 -626 778 -738
3698g38k08N19J242J466j586m73J38N9L79M09j596m16R57p50J870k018o6M19l79
$$ -738 -946 -427 815 2281 695 222 360 419 798 1207 -389 -805 152 -598 1272 -746 -812 -393 -772
3717g72J7k42J077k0L45j709J001p0K30K91O3k4j84j98M83M24L76o20r12Q42l37
$$ -772 -755 -997 80 60 405 -1304 -303 -373 -143 148 211 187 3 -195 288 712 1088 468 -444 398 61
3738F1N77L53m43m22J79K11k01j201J007o08Q15p93o1n1k3k06K25R63m46J031
$$ 61 638 991 548 126 305 516 315 -886 121 -487 328 -465 -526 -577 -600 -806 -581 382 -64 967
3758I67r93L25L61J70J14m21N25p39p1K0n09K95M88n4q3o21k03j38R78l64l95
$$ 967 -26 299 660 830 944 523 1048 309 238 258 -251 44 532 478 395 -226 -429 -567 411 47 -348
3779c48m51O95j39J5m20l8P56L02M85j947O51Q99L02r04P28M1p39L73M44p49J3
$$ -348 -799 -104 -243 -228 -648 -686 70 372 857 -1090 -439 460 762 -142 586 627 -112 261 705 -44 -31
3800c1J59j96R92n45M30n25k70K13l55N67q31k22L29P19o61m81M03m10k29M18
$$ -31 128 -68 924 379 809 284 14 227 -128 439 -392 -614 -285 434 -227 -708 -305 -715 -944 -526
3820e26P24m58p44Q47Q46n04J16J46o74M12K89o99l9O87p28M85j138M27k00O88
$$ -526 198 -260 -1004 -157 689 185 301 447 -227 185 474 -225 -264 423 -305 180 -958 -531 -731 -43
3840d3j20mL61j88n48O90j190L52K95K41l81M14p28o25Q76P70l72O78P2m68L50
$$ -43 -163 -167 194 6 -542 148 -1042 -690 -395 -154 -535 -121 -849 -1474 -598 172 -200 478 550 82 432
3861D32r11J736j385J013p18N07N79o14J575k815M06O48l76P18j156M59j387K21
$$ 432 -479 1257 -128 885 167 674 1253 639 2214 -601 -195 453 77 795 -361 98 -1289 -1068
3879a068M97O76j009p80J949r16J038m14j199R26o17J028R63j118K96r11J388
$$ -1068 -571 105 -904 -1684 265 -651 387 -27 -1226 -300 -917 111 1074 -44 252 -659 729
3896G29o52M98k3n32P8R94m97p28J80P54r7r47L35N35q80n31k0Q35M0k84j393
$$ 729 77 575 552 20 98 1092 595 -133 47 801 704 -243 92 627 -253 -784 -804 31 71 -213 -1606
3917a606P03O23L55M23N57j168m86O59m79J013k03J384j723K16J293j927J587
$$ -1606 -903 -280 75 498 1055 -113 -599 60 -419 594 391 1775 52 268 1561 -366 1221
3934A221j226J219j066R21r43n10q2J78N9K66K78K6q58k52N22J20L12Ok57o85
$$ 1221 -5 1214 148 1069 126 -384 -466 -288 -229 37 315 341 -517 -769 -247 -127 185 191 -66 -751
3954g51K15O28j9J614j805j301K405j699Q33L94J19p90J062q54O20k83Q37m73
$$ -751 -536 92 73 1687 -118 -1419 986 -713 120 514 633 -157 905 51 671 388 1225 752
3972G52j722R91M95l28m55k84J003k70l06k55o94q98K424l59M23j235P81M06m55
$$ 752 -970 21 516 188 -267 -551 452 182 -124 -379 -1073 -1971 453 94 517 -718 63 469 14
3991A4M50K3j055O1K47J503k59Q7L0k133J490O4M56j69j200l25r5O21L1N3J27
$$ 14 464 487 -568 -507 -260 1243 984 1071 1101 -1032 458 522 978 809 -391 -716 -811 -190 -159 -106 21
4012B1r00j8k3P18k46R79r09l51P49Q12n95k04k0rk83P37L32q24r1P70k03k18
$$ 21 -879 -897 -920 -202 -448 531 -378 -729 20 832 237 33 13 4 -279 458 790 -34 -125 645 442 224
4034B24j44R43j266m67J695j749J276N72p92q30N41K18j59m20L13K78j029O64
$$ 224 80 1023 -243 -710 985 -764 512 1084 292 -538 3 221 62 -358 -45 233 -796 -132
4052a32J9k44nJ150l53o88j68K62K60N03J225k724J264p55O96m56j03l34M79l61
$$ -132 -113 -357 -362 788 435 -253 -421 -159 101 604 1829 -895 369 -386 310 -146 -249 -583 -104 -465
4072d65l23O23O55o55j089J826o19n97P30j63k3L11r55N13J592q04r95Q60p95
$$ -465 -788 -165 490 -165 -1254 572 -47 -644 86 -77 -100 211 -744 -231 1361 557 -438 422 -373
4091c73J026k24l73P57o91m04N71K79L69O8q37j498P18R62p03l89N94o94Q0L60
$$ -373 653 429 56 813 122 -282 289 568 937 1005 168 -1330 -612 350 -353 -742 -148 -842 -762 -402
4111d02O31j026N9M08j081J068J341j253L35R33l4q28o12Q28l0Q30L76j146o39
$$ -402 229 -797 -738 -330 -1411 -343 998 -255 80 1013 979 151 -461 367 337 1167 1543 397 -242
4130b42J43O89j689J533j34l02n38n93M13N01N21j00j843J927k46K7O37j136L82
$$ -242 -99 590 -1099 434 300 -2 -540 -1133 -720 -219 302 202 -1641 286 40 67 704 -432 -50
4149e0j196J101J58N88n19m43k41Q68K58M3n33P54N21j727P5M45O03r02j107J082
$$ -50 -1246 -145 13 601 82 -361 -602 266 524 567 34 788 1309 -418 -343 102 705 -197 -1304 -222
4169b22p99O77M40j27k68k33n8P88m58m06P37O72j357L16p1K26m45P04L98j75
$$ -222 -1021 -344 96 -31 -299 -532 -590 198 -260 -666 71 743 -614 -298 -369 -143 -588 116 514 339
4189C39k59j47Q67k36j56M79j290J8L67m57P84N74k273J707o33Q9O37q11n02M94
$$ 339 80 -67 800 564 408 887 -403 -385 -18 -475 309 883 -1390 317 -316 -227 410 -401 -903 -409
4209d09Q8K91N47j261k61J091l17J24P26r57M88j288J647n5J28j54q01R24k98
$$ -409 -321 -30 517 -744 -1005 86 -231 -107 619 -338 150 -1138 509 454 582 428 -373 551 253
4228B53q1O8K49p76r75Q65K28P30k41j070R74p09P23L11n4Kk045J464m4L50l36
$$ 253 172 240 489 -287 -1262 -397 -169 561 320 -750 224 -485 238 549 495 497 -1548 -84 -128 222 -114
4249a14M22R17k209P24J472r47J39J45L6j048J224r5j220J912j328M2kM80o89
$$ -114 308 1225 -984 -260 1212 265 404 549 585 -463 761 666 -554 1358 30 72 70 550 -139
4268a39o6K70k45l75K14J28j81J43q54J348M5k15M75k32K53r66M43p37R19j277
$$ -139 -205 65 -180 -555 -341 -213 -394 -251 -1105 243 288 73 548 316 569 -397 46 -691 228 -1049
4288a049J331N62j475Q84P8l33p2Q20j682J313l29n59J187l62j338K42k21J344
$$ -1049 282 844 -631 253 331 -2 -74 746 -936 377 48 -511 676 314 -1024 -782 -1003 341
4306C41K96j433Q90j275J181j091R73O12j309L56N37O27j296l90J348n18p03J288
$$ 341 637 -796 94 -1181 0 -1091 -118 494 -815 -459 78 705 -591 -981 367 -151 -854 434
4324D34j76N58j020P58K21j125J035r74m42Q97n42J87j32l35N92j42K5O03l58
$$ 434 258 816 -204 554 775 -350 685 -289 -731 166 -376 -189 -321 -656 -64 -206 -181 422 64
4343F4n78L14N43O16j148l97r8J09J110N7N48r27O27r42J431J73j071n77P54q05
$$ 64 -514 -200 343 959 -189 -586 -684 -575 535 592 1140 213 840 -102 1329 1502 431 -146 608 -197
4363a97K70j50Q89l89j130O61N3P6J31j074L90r8P45M46L1j099J18p08Q92J118
$$ -197 73 -77 812 423 -707 -46 7 83 214 -860 -470 -568 177 623 654 -445 -327 -1035 -143 975
4383I75n96n99P23L87j68j26K02j73k94r55l0J410r22M6Q70n3l04p90J95r0N22
$$ 975 379 -220 503 890 722 596 798 625 331 -624 -654 756 -166 -120 750 697 393 -397 -202 -292 230
4404B30j006M34l2j27K59r57J710m38m64N83K01j00r50J84R96j309N13o55P29
$$ 230 -776 -342 -374 -501 -242 -1199 511 73 -391 192 393 293 -657 -473 523 -786 -273 -928 -199
4423a99R3N23j097M46P91n62l51J04M09M9N91l40l59n20q36M04J86J024k5j026
$$ -199 -106 417 -680 -234 557 -5 -356 -252 157 206 797 457 98 -422 -1258 -854 -668 356 331 -695
4443f95N89r58k6J882m88j515J386jP51r63O76m09j11m28J6M46j410J665K12j478
$$ -695 -106 -1064 -1090 792 304 -1211 175 174 925 -38 638 229 118 -310 -294 152 -1258 407 619 -859
4463h59R40Q61n30K78m64J29n48N79q83J5N24o93K82K13J82J320j955J118j577
$$ -859 81 942 412 690 226 355 -193 386 -497 -482 42 -651 -369 -156 26 1346 -609 509 -1068
4482a068J221l63N17L68p54P1j67Q00k14K26m87r8M16r98M55QJ10P3K46j534J010
$$ -1068 153 -210 307 675 -79 -8 -175 625 411 637 150 52 468 -530 -75 -67 43 116 362 -1172 -162
4503a62N26j880J507n60p79J20k88N56J356m87M50mP8j82l2l54J60j55q1K17N41
$$ -162 364 -1516 -9 -569 -1348 -1228 -1516 -960 396 -91 359 355 433 251 219 -135 25 -130 -211 6 547
4524E47n80K90m01M29p9l89J410n70n81j562J882r60J09Q35n19j81J69j000k97
$$ 547 -33 257 -144 285 206 -183 1227 657 76 -1486 396 -564 -455 380 -139 -320 -151 -1151 -1448
4543a448J419P7J72m38L92j73L52r1Q87j787R78O36q09l23L77P1l46p27N28K43
$$ -1448 -29 48 220 -218 174 1 353 262 1149 -638 340 976 167 -156 221 292 -54 -781 -253 -10
4563a0m60nR95j151m42P06Q27o18m38L69jQ36o65m4O5K89m19l59j85L22n36N91
$$ -10 -470 -475 520 -631 -1073 -367 460 -158 -596 -227 -228 608 -57 -101 -36 253 -166 -525 -710 -388 -924 -333
4585c33J075r66P76j46O19m86r06O26J001r49p15N12k78k00K01n5M91j96n89Q6
$$ -333 742 -224 552 406 1025 539 -367 259 1260 311 -404 108 -170 -370 -169 -224 267 71 -518 -432
4605d32k23O24J12O42l26l76L54K6l08N15j181N10l95j66J418o19P07n53j93q13
$$ -432 -655 -31 81 723 397 21 375 401 93 608 -573 -63 -458 -624 794 175 882 329 136 -677
4625f77K72J126q17p16R73L81p35N8n94P21n63j84P59J18J98J00n49K85n71N08
$$ -677 -405 721 -96 -812 161 542 -193 -135 -729 -8 -571 -755 4 122 320 420 -129 156 -415 93
4645I3n01k38M22Q98N4N4l63p79N60K34L86M35j726M85K49q48L32q66J018J060
$$ 93 -408 -646 -224 674 728 782 419 -360 200 434 820 1255 -471 14 263 -585 -253 -1119 -101 959
4665I59p08P8l9k08L22r48N25j70q12K187k79J55j659P96o9K99J99j98m76J198
$$ 959 251 329 290 82 404 -544 -19 -189 -1001 1186 907 1062 -597 199 130 429 628 430 -46 1152
4685A152l74j578O43P3m78P00L4l46j243Q63P79q41Q42q88P64j37k57N35j165
$$ 1152 778 -800 -157 -84 -562 138 172 -174 -1417 -554 225 -616 226 -662 102 -35 -292 243 -922
4704i22L30k78L99Q36m0o23l49Q84q84J77J078j293Q24P5n68L09J229n93O8q91
$$ -922 -592 -870 -471 365 325 -298 -647 237 -647 -470 608 -685 139 214 -354 -45 1184 591 659 -232
4724b32J17N15m88l94r1J97N49L7k08q07K78M18M14M7m9j860P52O66m31P78O52
$$ -232 -115 400 -88 -482 -573 -376 173 210 2 -805 -527 -109 305 352 303 -1557 -805 -139 -570 208 860
4745H60O2j223L51n78J414K92j627J09O65j32l52k6Q08j338o3Q17Q2j50P12j005
$$ 860 922 -301 50 -528 886 1178 -449 -340 325 193 -159 -185 623 -715 -778 39 121 -29 683 -322
4765c22M17o53P79n68J02O91m4L19l7M59j006R16j182j22O78K73k305J600j9K1
$$ -322 95 -558 221 -347 -245 446 402 721 684 1143 137 1053 -129 -251 427 700 -1605 -5 -24 -3
4785ck99J213q97K68q71M71Q9k56p78J945q7k63n67J51q7o00j38K44J14N0P82
$$ -3 -302 911 14 282 -589 -118 -29 -285 -1063 882 795 532 -35 116 29 -571 -709 -465 -351 -301 481
4806D81l44J3P32n67q62O41M6KM49nj060Q77o67p66l6O10N65r58j65N09J26j36
$$ 481 137 150 882 315 -547 94 140 142 591 586 -474 403 -264 -1030 -1066 -456 109 -849 -1014 -505 -379 -515
4828e15m91N42o01J746n35m7n90J31O91N42o95l64J156j597M65M79P16j67n44
$$ -515 -1006 -464 -1065 681 146 99 -491 -360 331 873 178 -186 970 -627 -162 317 1033 866 322
4847C22n31J074r72P8k54j58J165r51L3N35NK10k27j132Q41J24M6R5q41l12L94
$$ 322 -209 865 -107 -29 -283 -441 724 -227 -194 341 346 556 329 -803 38 162 208 303 -538 -850 -456
4868d56K03p55N08n59R86j23N00l37P52o40l19Q49o79k14Q63m07K6M61j68p59
$$ -456 -253 -1008 -500 -1059 -73 -196 304 -33 719 79 -240 609 -70 -284 579 172 198 659 491 -268
4888b68j000K377j005j62L00q67j03j248K236r40J02l50J816q6o86J331j791j3
$$ -268 -1268 1109 104 -58 242 -625 -728 -1976 260 -680 -578 -928 888 802 116 1447 -344 -357
4906c57m56J250p27N0R15j34m00P86j388O42n2o90m02P83L53m65N13m37J144m07
$$ -357 -813 437 -290 -240 675 541 141 927 -461 181 129 -561 -963 -180 173 -292 221 -216 928 521
4926E21j32l77j00m84n37R42L44Q94q18j98j341J317L06o74N57m36N87n50L89
$$ 521 389 12 -88 -572 -1109 -167 177 1071 253 55 -1286 31 337 -337 220 -216 371 -179 210
4945B10M16l87n05j76K10K83j161J876J51m67P46m00j204K98p14N04Q2k72M6K18
$$ 210 626 239 -266 -442 -232 51 -1110 766 917 450 1196 796 -408 -110 -824 -320 -238 -510 -464 -246
4965b46O51j79R47j281j015J280K96k68M02j064p69J341l47o42J090K3P39p64
$$ -246 405 226 1173 -108 -1123 157 453 185 587 -477 -1246 95 -252 -894 196 219 958 194
4983A94p81K21o60Q75q34O50k25M54P1p11J465j071P51K0p59n82K71r8J198k39
$$ 194 -587 -366 -1026 -151 -985 -335 -560 -106 -35 -746 719 -352 399 419 -340 -922 -651 -749 449 210
5003B10L34L68j067J54M00o81J27O8q34O45P00l11j91K74q09L36L08j32Q77q09
$$ 210 544 912 -155 -1 399 -282 -155 -87 -921 -276 424 113 -78 196 -613 -277 31 -101 776 -33
5023c3m71K45J068j019m84J017j155k5J167L69p20J779j991Q49p58M83o30J014
$$ -33 -504 -259 809 -210 -694 323 -832 -857 310 679 -41 1738 -253 596 -162 321 -309 705
5041G05j90n43QqP32m22m88n73O49N47K01K29q41L10k1k6r42j82Q51q9K37L03
$$ 705 515 -28 -20 -28 704 282 -206 -779 -130 417 618 847 6 316 295 269 -673 -855 -4 -93 144 447
5063D47K13j257J622q21j60N7j090Q51l22O99n97M81n4P81j136m6L87j1J027j78
$$ 447 660 -597 1025 204 44 101 -989 -138 -460 239 -358 123 69 850 -286 -332 55 44 1071 893
5083H93j291M88o69O02J37m28n24J491p42m22N88n04J55j80O48P62p19q9L13k48
$$ 893 -398 90 -579 23 160 -268 -792 699 -43 -465 123 -381 -226 -406 242 1004 285 196 509 261
5103B61m20J81N33p69o23J560r23P05On97Q77n68M0p03J091p47j19O28j358Q30
$$ 261 -159 22 555 -214 -837 723 -200 505 511 -86 791 223 263 -440 651 -96 -215 413 -945 -115
5123a15o2J59J53o60O58j181J392p73M50N49q28O58j069K3j38J455R41j686K46
$$ -115 -177 -18 135 -525 133 -1048 344 -429 21 570 -258 400 -669 -646 -784 671 1612 -74 172
5142A72l32N52k16R8L84o66L94o00N02q95L77K61k7J80q63R55n27P45p86m58K170
$$ 172 -160 392 176 274 658 -8 386 -214 288 -607 -230 31 4 184 -679 276 -251 494 -292 -750 1420
5163A420j024M26r01P55po65O63p57J048k039J203M8Q6n85K43K54K70r25J861
$$ 1420 396 822 -79 676 669 4 667 -90 958 -1081 122 170 256 -329 -86 168 438 -487 1374
5182A374j480p80R99l92L21o33L34R11n29o92J489o10K08O37j835K28J124l90
$$ 1374 -106 -886 113 -279 42 -591 -257 654 125 -567 922 312 520 1157 -678 -450 674 284
5200B84k67k96N03p72j95M26L5J75k68P01p08J24k12P77j246M78R09k68L91q69
$$ 284 17 -279 224 -548 -743 -317 -282 -107 -375 326 -382 -258 -470 307 -939 -461 448 180 571 -298
5220b98N15k57N45L35j102J670j769q85J671j146N86l2L09j073N56M60o16O05
$$ -298 217 -40 505 840 -262 1408 -361 -1246 425 -721 -135 -167 142 -931 -375 85 -531 74
5238G4j006R31M29j099M29N71q21K19L12j95o46L71J045p23J086r03j36J95L32
$$ 74 -932 -1 428 -671 -242 329 -492 -273 39 -156 -802 -431 614 -109 977 74 -62 133 465
5257D65q38J068j311M28L08l47K9l10L02m11N12k50M45L4j49l22l03M4nN35L37
$$ 465 -373 695 -616 -188 120 -227 -198 -508 -206 -617 -105 -355 90 124 -25 -347 -650 -606 -611 -76 261
5278B61k01j94k64l16Q9k19J471r97N06J90kj384O49J461j014M29m34L50m36m60
$$ 261 60 -134 -398 -714 -625 -844 627 -370 136 326 324 -1060 -411 1050 36 465 31 381 -55 -515
5298e15N02M29q61j24J410o91l01J500p95j038j161J784n01L74o44J027j266J204
$$ -515 -13 416 -445 -569 841 150 -151 1349 554 -484 -1645 139 -362 12 -632 395 -871 333
5316C33p88M70J16m03R33n75L68p15L46j41P79o33q6O5J445k092R69o29M78J13
$$ 333 -455 15 131 -272 661 86 454 -261 85 -56 723 90 4 69 1514 -578 391 -238 240 353
5336C53o57j187J168L0J266o65j47oL14m78m69o85J363q09Q59m89j83J37L46j04
$$ 353 -304 -1491 -323 -293 973 308 161 155 469 -9 -478 -1163 200 -609 250 -239 -422 -285 61 -43
5356d3q20J418q48Q20k47j200O36M52M68P2j661L67M61N42j55o52L70Pk2l5Q35
$$ -43 -863 555 -293 527 280 -920 -284 168 636 708 -953 -586 -125 417 262 -390 -20 -13 -35 -70 765
5377G65j539j59N82P45k61J13n11P11n20j87l69R13p94O88r70M35o20J643j65
$$ 765 -774 -933 -351 394 133 246 -265 446 -74 -261 -630 283 -511 177 -793 -358 -978 665 500
5396E00K97q68k56j219K200N49k058J127o46J195n33L11L6m06m07J6K61n43K72
$$ 500 797 -71 -327 -1546 654 1203 -855 272 -374 821 288 599 635 229 -178 -162 99 -444 -172
5415a72j55RJ372j45j044K41q22O20M92j94J69J36n70n62J083j373K96R23q37
$$ -172 -327 -318 1054 909 -135 106 -716 -96 396 202 371 507 -63 -625 458 -915 -619 304 -533
5434e33O27N86j143Q79k36o3p37N45m24L52k95m65K89P29j678J658o56J075q84
$$ -533 94 680 -463 416 180 117 -620 -75 -499 -147 -442 -907 -618 111 -1567 91 -565 510 -374
5453c74L63K06k50N27M72j141o54J344m77q9k40O75M74j322J591k280K338m1j226
$$ -374 -11 195 -55 472 944 -197 -851 493 16 -73 -313 362 836 -486 1105 -1175 1163 1122 -104
5472a04Q55Q5m66o34l01L86Q81q20k72n4P46J004j995L96J104K07q24k01J98M48
$$ -104 751 836 370 -264 -565 -179 702 -118 -390 -444 302 1306 -689 -293 811 1018 194 -7 191 639
5492F39j4M0j945O78J561q09j37j30k62J091q09M22k37p59J43L55J684j336m93
$$ 639 625 665 -1280 -602 959 150 13 -117 -379 712 -97 325 88 -671 -528 -173 1511 175 -318
5511c18J46M57k84n85l42Q84l00N23q3j12M81J60o40q6m28J848j234k32M76r01
$$ -318 -172 285 1 -584 -926 -42 -342 181 98 -14 467 627 -13 -99 -527 1321 87 -145 331 -570
5531e70J008j109K5l30K3O76J659j503L85l44j585J55J365K32m18J276j336J28
$$ -570 438 -671 -646 -976 -953 -277 1382 -121 264 -80 -1665 -1510 -145 87 -331 945 -391 -263
5549b63Q63j126P79k49q73Q48N83j174J354o71M99o19K7J329j676Q17J137k749
$$ -263 600 -526 253 4 -869 -21 562 -612 742 71 570 -49 -22 1307 -369 448 1585 -1164
5567a164J252j304O12O93J67J92M31j761J387j291J487M65j742m28M42n49j19
$$ -1164 88 -1216 -604 89 256 448 879 -882 505 -786 701 1166 -576 -1004 -562 -1111 -1230
5584a230P34P22l70P42M08r64L18J8o55o32J771j499R07J59m52L85j195J40R33
$$ -1230 -496 226 -144 598 1006 42 360 378 -277 -909 862 -637 270 429 -23 362 -833 -693 240
5603B40n94P95M95j710L93R98q77L79l17O02o45j02Q14j022L94n59Q11O98m94
$$ 240 -354 441 936 -774 -381 617 -260 119 -198 404 -241 -343 471 -551 -157 -716 95 793 299
5622B99p55J575j078J34N8k80O04R3p83n42Q94n04P81j85j98n2n5P24k85j243
$$ 299 -456 1119 41 175 233 -47 557 650 -133 -675 219 -285 496 311 113 61 6 730 445 -798
5642g98J418j127R8J36J685j642O18K97n08p19P47J89q06J214j143j254J117l23
$$ -798 620 -507 -409 -273 1412 -230 388 685 177 -542 205 394 -412 802 -341 -1595 -478 -801
5660h01J133m10q18R52m61J157m81q93J019r87j48M31J055q75O95l65o34L9j44
$$ -801 332 -78 -896 56 -405 752 271 -622 397 -590 -738 -307 748 -127 568 203 -431 -392 -536
5679e36m63J397l03J50j19j22K80Q00r67L08n13N51p17p75J132n0J87n70J085
$$ -536 -999 398 95 245 126 4 284 1084 117 425 -88 463 -254 -1029 103 53 240 -330 755
5698G55j86l53k49J96j15j68m2m21J153n57m16Q08q83J234q25l06j10J69Q51K24
$$ 755 569 216 -33 163 48 -120 -162 -583 570 13 -403 405 -478 756 -69 -375 -485 -316 535 759
5718G59r65P12q34O28r1L67j32R7j36N30o26q19J638j296R22q11n30J84J3j61
$$ 759 -206 506 -328 300 209 576 444 541 405 935 309 -510 1128 -168 754 -57 -587 -403 -390 -551
5738e51O47K08J004k211K82J028p91K9m87M05M37K97k41p18L43K85LO94j208R12
$$ -551 96 304 1308 -903 -621 407 -384 -355 -842 -437 0 297 56 -662 -319 -34 -31 663 -545 367
5758C67k82Q49n5q65P26j268J070j323M36R21K09r09q38R19l08Q94j727J381p66
$$ 367 85 934 879 14 740 -528 542 -781 -345 576 785 -124 -962 -43 -351 543 -1184 197 -569
5777e69m29J17Q34j178J013j53K78k08k79J122o84L57m81j92P28k13k42M71q62
$$ -569 -998 -881 -47 -1225 -212 -365 -87 -295 -574 548 -136 221 -260 -452 276 63 -179 292 -570
5796e70P75n91J88J106r99J93R7Q91p97p50O00r08J812r67M59j853R55j103J126
$$ -570 205 -386 -198 908 -91 102 199 1090 293 -457 143 -765 1047 80 539 -1314 -359 -1462 -336
5815c36N86q72N68q19J050m56P96j181J151o6j544R70K48L66k65j97p62P27K0
$$ -336 250 -622 -54 -873 177 -279 517 -664 487 421 -1123 -153 95 461 196 -1 -763 -36 -16
5834a6l82L50K42o02M27k58O62n3j254J267q17l8P93j196K9J226O23r57j109J477
$$ -16 -398 -48 194 -408 19 -239 423 370 -884 383 -434 -472 321 -875 -846 380 1003 46 -1063 414
5854D14k67l33l59K05O42k88Q59o84J15n76K18N28j290N6m4N25N67q27P24M96
$$ 414 147 -186 -545 -340 302 14 873 189 304 -272 -54 474 -816 -760 -804 -279 288 -539 185 681
5874F81q10K35R19o91O4j201J325j434R60J07p99Q30O50l0r39J98l73K7k91O39
$$ 681 -129 106 1025 334 398 -803 522 -912 48 155 -644 186 836 806 -133 65 -308 -281 -572 67
5894F7N01o09O9o8M68j271O3R28j14m93l93J46Q26m78K12o02P46j00q86P09P55
$$ 67 568 -41 28 -40 428 -843 -780 148 34 -459 -852 -706 120 -358 -146 -748 -2 -102 -988 -279 476
5915D76l82r8O05m87J031j617r9J029j233J159R42j472M46q53Q49J1j52P76j600
$$ 476 94 -4 601 114 1145 -472 -571 458 -775 384 1326 -146 300 -553 296 307 155 931 -669
5934f69k03J271k68o85M4J969j855Q16m45k58J631j729j349K676j149Q98k12j350
$$ -669 -872 399 131 -554 -510 1459 -396 420 -25 -283 1348 -381 -1730 946 -203 695 483 -867
5952h67o9Q77k21m27Q05P05J20k63o21P95o14O2m61q9K72n61N67P02j460K49l41
$$ -867 -936 -59 -280 -707 98 803 923 660 39 834 220 282 -179 -268 4 -557 10 712 -748 -499 -840
5973h40J373O51o71j169J6Q73o72R45n88N23K2j35j352J018M30l59k72K46k02
$$ -840 533 1184 513 -656 -640 233 -439 506 -82 441 463 328 -1024 -6 424 65 -207 39 -163
5992a63L58O1N13p57P2m82j159K106k23n4l67o84J342q05L96p0K5j59l69p52J976
$$ -163 195 256 769 12 84 -398 -1557 549 326 272 -95 -779 563 -242 154 84 109 -50 -419 -1171 805
6013H05q91P14m55l59j67p61P43N48J43m26l47R57p63P38l13L86o53O02j53O64
$$ 805 -86 628 173 -186 -353 -1114 -371 177 320 -106 -453 504 -259 479 166 552 -101 501 348 1012
6033A012j355K94L08m14K36l3l51J115o41n44QJ6M9k85Q02M7J99J52k17q83n06
$$ 1012 -343 -49 259 -155 81 48 -303 812 171 -373 -365 -349 -300 -585 217 264 463 615 398 -485 -991
6054i91L6R96M18m9j507N38K2J108L7N3j619J010J98j57K27j122J445p14n63L30
$$ -991 -955 41 459 410 -1097 -559 -537 571 608 661 -958 52 250 93 320 -802 643 -71 -634 -304
6074c04j98J626M15j909k16P82l79r72R46k89l93N48L64J13l24j122K082j004
$$ -304 -502 1124 1539 -370 -586 196 -183 -1155 -209 -498 -891 -343 21 134 -190 -1312 770 -234
6092b34j128J462l68r5P56P7l88M36m11n35J89m1k45L89m44Q45L43j89L13m52
$$ -234 -1362 100 -268 -363 393 470 82 518 107 -428 -239 -280 -525 -136 -580 265 608 419 732 280
6112B80L84n38k72J050K23r77l68O59j021p9L86L5M5j90m45R52k38k96R7M77K88
$$ 280 664 126 -146 904 1127 150 -218 441 -580 -659 -273 -238 -193 -383 -828 124 -114 -410 -313 164 452
6133D52L51j396J64J247r89j4M54J168k002K90J68O88m58N54O91j339P35O76n49
$$ 452 803 -593 -429 818 -171 -185 269 1437 -565 -275 -107 581 123 677 1368 29 764 1440 891
6152H91j016n93R03l11L12l72j42k69J127j62q24Q62n67j32J206j162k72J139
$$ 891 -125 -718 185 -126 186 -186 -328 -597 530 368 -456 406 -161 -293 913 -249 -521 618
6170F18j394J264m32l58M02O80j573j9J017k08m20M33N8J52N06j661L73R78N3
$$ 618 -776 488 56 -302 100 780 -793 -812 205 -3 -423 10 68 220 726 -935 -562 416 469
6189D69j449N44M02J09o75m27J731j468N92O98j003M68j463M54R94q22J140p54
$$ 469 -980 -436 -34 75 -600 -1027 704 -764 -172 526 -477 -9 -1472 -1018 -24 -846 294 -460
6207d60J46k99O82K32q83R41L49j066L7O95n28P17n44j31n99J022N2k51o83Q23
$$ -460 -314 -613 69 301 -582 359 708 -358 -321 374 -154 563 19 -112 -711 311 363 112 -571 252
6227B52n27q49J22M01L02J75j17M12J35l78m19N57Q57k32n42j205K61M98J32J259
$$ 252 -275 -1124 -1002 -601 -299 -124 -241 171 306 -72 -491 66 923 691 149 -1056 -795 -297 -165 1094
6247A094n56j193N52O28k45o43M65N25M11o78o81J47L5m83J024K08j092j1l11
$$ 1094 538 -655 -103 525 280 -363 102 627 1038 360 -321 -174 -139 -622 402 610 -482 -493 -804
6266h04J275L02j129m2N7J353m49M46k246K205j249L86o8l08L79J93j7l47K4R2
$$ -804 471 773 -356 -398 -341 1012 563 1009 -1237 968 -281 105 37 -271 108 301 284 -63 -39 53
6286E3q25J399l99n38j100J259L45j277J016K50l77r05P45L54M32L99k52j155
$$ 53 -772 627 228 -310 -1410 -151 194 -1083 -67 183 -194 -1099 -354 0 432 831 579 -576
6304e76K65Q00k53r47J696j260M20o7p65Q48J40k05k41N00J57j60K08m54j97m21
$$ -576 -311 489 236 -711 985 -275 145 78 -687 161 301 96 -145 355 512 352 560 106 -91 -512
6324e12K09m6K18O92j127J17M80l65O7J91l25K64O44j155J057N48n5o69l11j8
$$ -512 -303 -349 -131 561 -566 -449 31 -334 -267 -76 -401 -137 507 -648 409 957 902 233 -78 -96
6344i6O02k71J47j353Q64n02O74K16r9m39N04O10j286P25l5j157J475m22L58p1
$$ -96 506 235 382 -971 -107 -609 65 281 182 -257 247 857 -429 296 261 -896 579 157 515 444
6364D44l20l00Ok92O17k2O13k038R55l08P62O93p09M45J44r80l30J050k17k03
$$ 444 124 -176 -170 -462 155 133 746 -1292 -337 -645 117 810 101 546 690 -290 -620 430 213 10
6384A0K42j181J819j263o19J678l10M58n56l77KO96p10Q2K5K56l58L98k3j224
$$ 10 252 -929 890 -373 -992 686 376 834 278 -99 -97 599 -111 -29 -4 252 -106 292 269 -955
6404i55N02j18R49j29K98j88n65j09j52O18r53M49K14l81J24J52J47O93j80p02
$$ -955 -453 -571 378 249 547 359 -206 -315 -467 151 -802 -353 -139 -520 -396 -244 -97 596 416 -286
6424b86J824j854l55l96J056o93J368j111M24OP01p5j16l86q20l15J158O50K32
$$ -286 1538 -316 -671 -1067 -11 -704 664 -447 -23 -17 684 609 493 107 -713 -1028 130 780 1012
6443A012p43j340R68m12J123m41o57M87j71O02o27J95K69P9j003L06J01M89m25
$$ 1012 269 -1071 -103 -515 608 167 -490 -3 -174 428 -199 -4 265 344 -659 -353 -252 237 -188
6462a88J80n86J131j296N90l10N58M51n09j022M59K87L42J083j765J6J021J02
$$ -188 -8 -594 537 -759 -169 -479 79 530 21 -1001 -542 -255 87 1170 -595 -579 442 544
6480E44j074J42L54K07o80k41J297j264K55P61O31j33j418Q87J87q67J46Q72q4
$$ 544 -530 -388 -34 173 -507 -748 549 -715 -460 301 932 799 -619 268 455 -412 -266 606 522
6499E22j182R82n31p0L30j101R21k08J26j08L30N59m05k34r6k9L00R04p85m27
$$ 522 -660 322 -209 -279 51 -1050 -129 -337 -211 -319 11 570 165 -69 -165 -194 106 1010 225 -202
6519b02j28q86J389l48j80J096j554J447r82N78m61J74M00N70o36K22p47L4J409
$$ -202 -330 -1216 173 -175 -355 741 -813 634 -348 230 -231 -57 343 913 277 499 -248 -214 1195
6538A195r57l08K98j99o56O81P06p06j117J583J13m46m97J363j151J1L83j547
$$ 1195 238 -70 228 29 -627 54 760 54 -1063 520 633 187 -310 1053 -98 -87 296 -1251
6556a251K03N69P48p04J340j611M28N12l24P08q79n91N59P98q91R62j395Q73n8
$$ -1251 -1048 -479 269 -435 905 -706 -278 234 -90 618 -261 -852 -293 505 -386 576 -819 54 -4
6575dn32K10K19Q4p30L70M05j19l74J29J468j193J43M34q79K49O27j002N28k03
$$ -4 -536 -326 -107 -23 -753 -383 22 -97 -471 -342 1126 -67 76 510 -369 -120 507 -495 33 -170
6595a70J227j506n17J128l90R65j77M3j089p9J330j08q55J95l5L22P38l38l37
$$ -170 1057 -449 -966 162 -228 737 560 603 -486 -565 765 657 -198 -3 -38 284 1022 684 347
6614C47M80l96L62j343M51k85j4N12k92p5N04m34j062J591o17N84j278k96R00
$$ 347 827 431 793 -550 -99 -384 -398 114 -178 -253 251 -183 -1245 346 -271 313 -965 -1261 -361
6633c61N17k84M87j30j81K14J234k328O80K53K96m71k81K11m24J080O41j034Q65
$$ -361 156 -128 359 229 48 262 1496 -832 -152 101 397 -74 -355 -144 -568 512 1153 119 984
6652I84j175j02O77j240J328J068k157J102p03k72N85l56Q83k76j72q60Q67K93
$$ 984 -191 -293 384 -856 472 1540 -617 485 -218 -490 95 -261 622 346 174 -686 181 474
6670D74J33l87Q5n92J102l75m20l25M8L90j13K91p04O30j16j06j60N95l94L17
$$ 474 607 220 305 -287 815 440 20 -305 -257 133 20 311 -393 237 121 15 -145 450 56 373
6690C73p87M18Q8O41j303Q06m62m88J596r69n73J459J1r43L73j638J833l38n01
$$ 373 -414 4 92 733 -570 236 -226 -714 882 -87 -660 799 810 -133 240 -1398 435 97 -404
6709d04L35m6m51J077o35m7l69P86n11K51J09K82P37j697P37l33m84J251m09n11
$$ -404 -69 -115 -566 511 -124 -171 -540 246 -265 -14 95 377 1114 -583 154 -179 -663 588 179 -332
6729c32m1N70l89J344q74o29N47j15o97k60N90P41j014N34L76o48J516r06J5j022
$$ -332 -373 197 -192 1152 278 -351 196 81 -616 -876 -286 455 -559 -25 351 -297 1219 313 328 -694
6749f94J250j182O89r10Q5Q78n82J73O95n93M63k017J666j31J28P35n68L49j305
$$ -694 556 -626 63 -847 -762 116 -466 -293 402 -191 272 -1745 -79 -210 -82 653 85 434 -871
6768h71M38M22N86l66q29J105l64P7L02r91J24M4m7R91o70m40J949k82j365L38
$$ -871 -433 -11 575 209 -620 485 121 198 500 -491 -367 -323 -370 621 -49 -489 1460 1178 -187 151
6788A51P01j189R30n57j058K048r50N1n22l6N94q19M88J62O9j331J336K41k36
$$ 151 852 -337 593 36 -1022 1026 76 127 -395 -431 163 -656 -168 -6 63 -1268 68 309 73
6807G3k93j0J45j43P47o48Q0K35L07l98lM3N26o97P59p4J92n20j933J415M65K47
$$ 73 -220 -230 -85 -228 519 -129 -49 186 493 95 92 135 661 -36 723 649 841 321 -1612 -197 268 515
6829E15j269L34M51L03j131J201J20j038O05K47q26R93j084N96k35N69m87N84
$$ 515 -754 -420 31 334 -797 404 524 -514 91 338 -488 505 -579 17 -218 351 -136 448
6847D48k34l11R83j118l55L03K88K20P0kj070J310r52N18Q7j653J431R99o3o18
$$ 448 214 -97 886 -232 -587 -284 4 224 294 292 -778 532 -420 98 185 -1468 -37 962 899 281
6867B81k22O78j241j74M14K91O33k33k16K2l20k40N5n44J061J97j048L84j28M58
$$ 281 59 737 -504 -678 -264 27 660 427 211 233 -87 -327 -272 -816 245 442 -606 -222 -350 108
6887A08m87N21j08l95L27p69R70P12q24J33j81n35j03O86j10M61k95P10q99K77
$$ 108 -379 142 34 -361 -34 -803 167 879 55 188 7 -528 -631 55 -55 406 111 821 -78 199
6907A99M84l60o59k51J330j589L84J139l41o38m44J518r03J32N71j031J13l03
$$ 199 683 323 -336 -587 743 -846 -462 677 336 -302 -746 772 -131 1 572 -459 -346 -649
6925f49J215k42J87r95M12K15m59M76m44M04n84P34m34p79P05N46K34o16J17k1
$$ -649 566 324 511 -484 -72 143 -316 160 -284 120 -464 270 -164 -943 -238 308 542 -74 43 22
6945B2j94o74P37P67j70O90r83p06J2N24O71o8j31K85r62n67J196q38M73n33o8
$$ 22 -172 -846 -109 658 488 1178 195 -511 -499 25 696 628 497 782 -180 -747 449 -389 84 -449 -517
6966e17J869j940R62J76n34o44K28O60P72j527J331n00M55j332L91l34J16P60
$$ -517 1352 -588 374 550 16 -628 -400 260 1032 -495 836 336 791 -541 -150 -484 -368 392
6984C92n66m53K97N81K81p37j34N82p29K30l83M98p17O36m35O4J176q70K41j83
$$ 392 -174 -627 -330 251 532 -205 -339 243 -486 -256 -639 -141 -858 -222 -657 -593 583 -287 -46 -229
7004b29J05n01J273o08O97j340J067O2m69l20J495j785N99j29N77O5n22Q30j749
$$ -229 -124 -625 648 40 737 -603 464 526 57 -263 1232 -553 46 -83 494 559 37 867 -882
7023h82O28j29l93Q89K77l62j63j082J031j44j16n62J378Lp90L1R49m88M67p21
$$ -882 -254 -383 -776 113 390 28 -135 -1217 -186 -330 -446 -1008 370 373 -417 -386 563 75 542 -179
7043a79R6J9Q76r70O57k0k45l25N61n99O62k03o73P97j427J005J97j165P50n86
$$ -179 -83 -64 812 -158 499 479 234 -91 470 -129 533 330 -343 454 -973 32 229 -936 -186 -772
7063g72J134k61QK27k5P23p44l99M85j10m76J78K30k78m52p61J62J397k84n22
$$ -772 362 101 109 336 311 1034 290 -109 376 266 -210 -32 198 -80 -532 -1293 -1131 266 -18 -540
7083e40J489j171J170j364l51n15J409k3m31n29Q54o17Q64M21j06n86J85N95j022
$$ -540 949 -222 948 -416 -767 -1282 127 104 -327 -856 -2 -619 245 666 560 -26 159 754 -268
7102b68M79r73J75P41o38R17m21q50M22K91o22M67O33r47K57m27L86j81J454j310
$$ -268 211 -762 -587 154 -484 433 12 -838 -416 -125 -747 -280 353 -594 -337 -764 -378 -559 895 -415
7122d15L09l49l4P12k4o50J49R15j018Q02k60q44M97K31n21J466j152o37J000
$$ -415 -106 -455 -489 223 199 -451 -302 613 -405 397 137 -707 -210 21 -500 966 -186 -823 177
7141A77j212J629j087M69N56l65P58j060p5R91j003l13m11J196K10n2j603J061
$$ 177 -1035 594 -493 -24 532 167 925 -135 -210 781 -222 -535 -946 250 460 408 -1195 -134
7159a34L83j29P07r61j344J686l54j78L22l14q5M07P77o68P26P0j27j040n9l61
$$ -134 249 120 827 -134 -1478 208 -146 -324 -2 -316 -401 6 783 115 841 911 784 -256 -315 -676
7179f76N6Q12p5m09j26M14j230J267r70R93L41m82oJ54o97P84m58M37j568J825
$$ -676 -620 192 117 -292 -418 -4 -1234 33 -937 56 397 -85 -91 63 -634 150 -308 129 -1439 386
7199C86L77p00m55P20l52J52J11p72K16K48p99J457o35k70Q89j55R07p88k40l01
$$ 386 763 63 -392 328 -24 128 239 -533 -317 -69 -868 589 -46 -316 573 418 1325 537 297 -4
7219do92J188j046P02j183J313N3j026J488j172J76R41o92n2J18R6L8j37j337
$$ -4 -696 492 -554 148 -1035 278 331 -695 793 -379 -203 738 46 -6 112 208 246 109 -1228
7238a228J055L03n61M01J091j348K79j240J383r30Q30K98j060J169r33M27j79
$$ -1228 -173 130 -431 -30 1061 -287 -8 -1248 135 -795 35 333 -727 442 -491 -64 -243
7255b43q90J584n97K3M61p27p42J488N35k50j043N07P57q23j30l87P41j71k91
$$ -243 -1133 451 -146 -123 338 -389 -1131 357 892 642 -401 106 863 40 -90 -477 264 93 -198
7274a98M57J72m4l38l19P54j80j299J306o75j52J670j940J394L6j045k52J132
$$ -198 259 431 387 49 -270 484 304 -995 311 -364 -516 1154 -786 608 644 -401 -653 479
7292D79n98L77k41K62k47M38P00j839K27L91q9O9k35K15P0j89J17k2K40p93J864
$$ 479 -119 258 17 279 32 470 1170 -669 -442 -51 -140 -71 -306 -91 -21 -210 -93 -115 125 -668 1196
7313A196j956R50J001j006N09j143j29L13K10J010r61l51J415n44n56j054J121
$$ 1196 -760 190 1191 185 694 -449 -578 -265 -55 955 -6 -357 1058 514 -42 -1096 25
7330B5L68q54O49j59P27j063O86j012P75j282J378q04l11Q44O03M58j088R66l06
$$ 25 393 -461 188 29 756 -307 379 -633 142 -1140 238 -566 -877 -33 570 1028 -60 906 600
7349F00j019L87j73M73J50R15q11j97p24M42m37J341p49j717J281K30m85P32l71
$$ 600 -419 -32 -205 268 418 1333 522 325 -399 43 -394 947 198 -1519 -238 -8 -493 239 -132
7368a32N17m72P96p59M35o39P0L52m36m11j65J333o72L12O90q48m30J840j235
$$ -132 385 -87 709 -50 385 -254 -184 168 -268 -679 -844 489 -183 129 819 -29 -459 1381 146
7387A46N04m07P15m15K08o57j13o31J176L0m39m98M57p9Q22j318J057l28o56J925
$$ 146 650 243 958 543 751 94 -19 -650 526 556 117 -381 76 -3 819 -499 558 230 -426 1499
7407A499j665l49P39j41M1j58K94k39O62j189K99O79l00o41M86n44J85Q05j67
$$ 1499 -166 -515 224 83 124 -34 260 21 683 -506 -207 472 172 -469 17 -527 -342 463 296
7426B96j60o43R01o58M9M12k37N86r02m26O32J24J8L41o8j52m5k56P23n91m27
$$ 296 136 -507 394 -264 -215 197 -40 546 -356 -782 -150 -26 -8 333 265 113 68 -188 535 -56 -483
7447d83R73j766J151j40q78N25Q01L59j06o49qJ164q33k34P00l89m18o2M34q6
$$ -483 490 -1276 -125 -265 -1143 -618 183 542 436 -213 -221 943 110 -124 576 187 -231 -293 141 55
7467E5q69J020l94j066J497k6k21l30K4k87l14O64p1j329K556j378K84J314k123
$$ 55 -814 206 -188 -1254 243 217 -4 -334 -310 -597 -911 -247 -318 -1647 909 -469 -185 1129 -994
7486i94R88L04J70m67j72J404j588O12j14j192Q84m72P64o44J476l21j196J417
$$ -994 -6 298 468 1 -171 1233 -355 257 143 -1049 -165 -637 127 -517 959 638 -558 859
7504H59o53l48M03p8l96j97O82O44j015M08k10q50L24J773j809k88J911j153r7
$$ 859 206 -142 261 183 -213 -410 272 916 -99 309 99 -751 -427 1346 -463 -751 1160 7 -90
7523i0M9n89O32l30j50N54q13N82J334m30j183M0l42nK99K100j600L42n48j078
$$ -90 -41 -630 2 -328 -478 76 -737 -155 1179 749 -434 -394 -736 -741 -442 1658 58 400 -148 -1226
7543a226P44m10J20J232k8o98K08L57K94o60N38j015Q38K5q1j005J708o48kk72
$$ -1226 -482 -892 -772 460 432 -266 -58 299 593 -67 471 -544 294 319 238 -767 941 293 291 19
7563A9m60m40R85n16j6K18k98P77p25M3M66o82p14J025J321j299J05l94j55L30
$$ 19 -441 -881 104 -412 -428 -210 -508 269 -456 -413 53 -629 -1343 -318 1003 -296 -191 -585 -740 -410
7583d10J327j149N13r13J167k25K26j411J7R80N54o78J52M30L47j79j357Q90o64
$$ -410 917 -232 281 -632 535 310 536 -875 -858 122 676 -2 150 580 927 748 -609 281 -383
7602c83L47j75l34q4K85j0J88L54N7o37k05N02p03O89j29o65R98Q90j214K4n30
$$ -383 -36 -211 -545 -629 -344 -354 -166 188 245 -392 -597 -95 -798 -109 -238 -903 95 985 -229 -205 -735
7623g35k81L07N13J209r61Q24k21p79O15m5n8K28K42M6m78o66L38p13P51L8Q41
$$ -735 -1016 -709 -196 1013 52 876 655 -124 491 446 388 616 858 904 426 -240 98 -615 136 174 1015
7644A015k027N85Q80j630J347Ro66J118k75n42O6P94N2k65j273J050L50j024J83
$$ 1015 -1012 -427 453 -1177 170 179 -487 631 356 -186 -120 674 726 461 -812 238 588 -436 -253
7663b53L57O65n41j9j453K075j594J326L45j065q83P10m75R03Q54p38m8L66l39
$$ -253 104 769 228 209 -1244 831 -763 563 908 -157 -1040 -330 -805 98 952 214 166 532 193
7682A93J13M43j321P1P44L92q00m01m12N81K18J24L4j94L45o93J691J8j432J19
$$ 193 306 749 -572 -501 243 635 -165 -566 -978 -397 -179 -55 -21 -215 130 -563 1128 1146 -286 -167
7702a67j71M56o18P73L71m31P2j78m14J27L60j125P31o9L95l20l26O47m64Q12
$$ -167 -338 118 -500 273 644 213 285 107 -307 -180 180 -945 -214 -283 112 -208 -534 113 -351 461
7722D61j062P80j09p92j58J747q0k1o84J01N52j051j05O25M64n00l80r01J208
$$ 461 -601 179 70 -722 -880 867 787 766 82 183 735 -316 -421 204 668 168 -212 -1113 95
7741I5k82J50Q62j375K18K069j619J086k276N68K36O68J86n83J32j90j52n97J984
$$ 95 -187 -37 825 -550 -332 1737 118 1204 -1072 -504 -268 400 586 3 135 -55 -207 -804 1180
7760A180r11m96l61M7l29J771q36L61j24o52J486q00o48m42J859k110J095k37
$$ 1180 269 -227 -588 -541 -870 901 65 426 302 -350 1136 336 -312 -754 1105 -1005 90 -147
7778a47j10NP7m55l48N96M18L23j0j049J44j1k62N60n90R28j86m5Q34j679M26
$$ -147 -257 -252 -175 -630 -978 -382 36 359 349 -700 -556 -567 -829 -269 -859 69 -117 -162 672 -1007 -581
7799e81Q78m30J87r77K85J779q68r13P36n51N71j330P54m77J412j220l41J036
$$ -581 297 -133 54 -923 -638 1141 273 -640 96 -455 116 -1214 -460 -937 475 -745 -1086 -50
7817e0n68K22M8R92r44K84L76n15m89N59p01J716r42O36M21j905k54M22M95k25
$$ -50 -618 -396 -348 644 -300 -16 360 -155 -644 -85 -786 930 -12 624 1045 -860 -1114 -692 -197 -422
7837d22K06K8K4p0P82j293J532p01o09m03J896j554O87J093j487O53K23j227N6
$$ -422 -216 -188 -164 -234 548 -745 787 86 -523 -926 970 -584 103 1196 -291 362 585 -642 -586
7856e86O58L6n49O7j371J226J100o97P98J63j061M09J4Q3k88m87R80l54j52l93
$$ -586 72 108 -441 -374 -1745 -519 581 -116 682 845 -216 193 207 290 2 -485 495 141 -11 -404
7876d04L46M42j44K2N2R09j694L63j20j87M75J48K02r62P11l89J26K41K73j83
$$ -404 -58 384 240 262 314 1223 -471 -108 -228 -415 60 208 410 -552 159 -230 -104 137 410 227
7896B27J087p07m71l44J87k75M79o04N92N96m35k66K26n36n12p6R85j78j45n94
$$ 227 1314 607 136 -208 -21 -296 183 -421 171 767 332 66 292 -244 -756 -832 153 -25 -170 -764
7916g64J326kl80l85P02j630O72M52k78Q61q11k7R0K43n52N42P91l43mj590J198
$$ -764 562 560 180 -205 497 -1133 -461 -9 -287 574 -237 -264 -174 69 -483 59 850 507 503 -1087 111
7937A11J90m69K80q70k54J397p18L34m94N02J99J12m00M06J98J73n54M81l36l64
$$ 111 301 -168 112 -758 -1012 385 -333 1 -493 9 208 320 -80 326 524 697 143 624 288 -76
7957g6p61J051p5k48j161J554L81l1j094r5L89n93P25N13m10p8J14N42j35k60
$$ -76 -837 214 139 -109 -1270 284 665 634 -460 -555 -166 -759 -34 479 69 -9 105 647 512 252
7977B52j253o2J045Q54j378J843q26l72n02k03Q52n50r41J266l61j13K97L56o47
$$ 252 -1001 -1063 -18 836 -542 1301 475 103 -399 -602 250 -300 -1241 25 -336 -449 -152 204 -443
7996d43J21O51m54lJ87L30l40l3r33M43J187j193N0R7O93m01M33k46k63l98L13
$$ -443 -322 329 -125 -128 59 389 49 16 -917 -474 713 -480 -430 -333 360 -41 392 146 -117 -515 -202
8017b02O56o71j76L21o95J556j350n31P16j120J816m28J42M58m96r9K00K47n0
$$ -202 454 -217 -393 -72 -767 789 -561 -1092 -376 -1496 320 -108 34 492 -4 -103 97 344 294
8036B94o97O3P59j65j922J002J359l59j82q85J021q49K49j74O60L95o13l57O31
$$ 294 -403 -340 419 254 -1668 -666 693 334 152 -733 288 -561 -312 -486 174 569 -44 -401 230
8055B30n20L92Q5p69N06m92N35n79J245l81L55m70K8r82L80J177k55O0q93O55
$$ 230 -290 102 187 -582 -76 -568 -33 -612 633 252 607 137 165 -817 -437 740 485 545 -348 307
8075C07o4K91K90k75p43M57n94Q40n77J577j995J07J084j397J221m44Q30k269
$$ 307 243 534 824 549 -194 263 -331 509 -68 1509 -486 -379 705 -692 529 85 915 -1354
8093a354K071k02l43J30r49K11J558j3j013j61k27L55j757J042P74M05l77j263
$$ -1354 717 515 172 302 -647 -436 1122 1109 96 -65 -292 63 -1694 -652 122 527 150 -1113
8111a113J486p50R1M7J018j420J136m18m34K47J7J93M18K04M74o26j123J525p48
$$ -1113 373 -377 -286 -239 779 -641 495 77 -357 -110 -93 100 518 722 1196 570 -553 972 224
8130B24L27n80o04L34l2J004p83q22J181r9N47j550Q62p31J59M52o29N49R01k61
$$ 224 551 -29 -633 -299 -331 673 -110 -932 249 150 697 -853 9 -722 -563 -111 -740 -191 710 449
8150D49k02k53M03m20M0K74K80r23N51L59p60P7l3L95P82l48k16j96k63M58j017
$$ 449 247 -6 397 -23 17 291 571 -352 199 558 -202 -125 -158 237 1019 671 455 259 -4 454 -563
8171e63K561k544N30O60j090J19j13L73k72n37P21Q69o50l89L68P43p86j296K055
$$ -563 1998 -546 -16 644 -446 -327 -440 -67 -339 -876 -155 714 64 -325 43 786 0 -1296 759
8190G59n72
$$ 759 187
8191A87
$$ Imaginary data points
##PAGE= N=2
##DATA TABLE= (X++(I..I)), XYDATA
0@%%%%%%%%%%%Q2j90K16k16K16k18L26m32M34n34O41p36Q45r70J132j262J430
$$ 0 0 0 0 0 0 0 0 0 0 0 0 82 -108 108 -108 108 -110 216 -216 218 -316 325 -411 434 -536 596 -666 764
28G64j634J855k102K372k656K977l335L722m148M609n118N675o287O963p711Q542
$$ 764 -870 985 -1117 1255 -1401 1576 -1759 1963 -2185 2424 -2694 2981 -3306 3657 -4054 4488
44D488r456J0482j1637J2937j4430J6148j8161K0551k3443K7035l1622L7737m6356
$$ 4488 -4968 5514 -6123 6814 -7616 8532 -9629 10922 -12521 14514 -17108 20629 -25727
57b5727N9521q2428J33788m85022K56941P51583l08000m86572j91639M05865L09425
$$ -25727 33794 -48634 85154 -399868 -142927 608656 300656 -185916 -377555 28310 337735
68C37735q106k69625j31273o8364j1472O1495K79096K38667n7637l61931k38232
$$ 337735 329629 60004 -71269 -139633 -151105 -89610 189486 428153 370516 8585 -229647
79b29647Q6398K31422O336j89566j22417R5207J29610L0496N679J09175P3980
$$ -229647 -143249 88173 94509 -95057 -217474 -122267 7343 37839 43518 152693 226673
90B26673j63843l48013j79075J84705L30099R6755j83652j64957J15180K91806
$$ 226673 62830 -285183 -464258 -279553 50546 147301 -36351 -201308 -86128 205678
100B05678J59368j07273k15592j27858j9541P09J5721R3460J47096M7127j31270
$$ 205678 365046 257773 42181 -85677 -105218 -104509 -88788 4672 151768 198895 67625
111F7625j64731K2077K04998J32356j33854k81805j43515J10930K08710J06089
$$ 67625 -97106 -75029 129969 262325 128471 -153334 -296849 -185919 22791 128880
121A28880l0106r1043j12079r9133J8057J90997K01618m7539l05227k24110J65988
$$ 128880 98774 7731 -104348 -203481 -185424 5573 207191 159652 -145575 -369685 -203697
132b03697M10815K14633j91637l26388r6577J58994J58581J571p2744n5457p3442
$$ -203697 207118 421751 230114 -96274 -192851 -33857 124724 126295 53551 -1906 -75348
143g5348q8556M8850K65053K48449r8278l98537k69053J57573L46564P0159k86836
$$ -75348 -163904 -115054 149999 398448 300170 -98367 -367420 -209847 136717 206876 -79960
154g9960k61475P9713K84551J48618p2540r0886J8299M808j07999r5288Q9617
$$ -79960 -341435 -261722 22829 171447 98907 8021 26320 31128 -76871 -172159 -82542
165h2542J90526M8578j49144j24738Q3293J80929M8471j14357j03343m24N441
$$ -82542 107984 156562 7418 -117320 -34027 146902 195373 81016 -22327 -22751 -17310
176a7310n5711p747J35523J56132n1280k45299j47509J37209K35956J4453k33899
$$ -17310 -73021 -80768 54755 210887 159607 -85692 -233201 -95992 139964 154417 -79482
187g9482j94079O0352K05431J10766k8813l3213J1331l9032j13210m0610J43725
$$ -79482 -273561 -213209 -7778 102988 74175 40962 52293 13261 -99949 -140559 3166
198C166J80155l2047k44228j59040J48958L09817J26896j77903k53293o6638J26254
$$ 3166 183321 151274 -92954 -251994 -103036 206781 333677 155774 -97519 -164157 -37903
209c7903J37074K9887n7493r0022r9281n3585P6143J84396J07864j20069k47115
$$ -37903 99171 129058 71565 -18457 -117738 -171323 -95180 89216 197080 77011 -170104
220a70104r3672J68382K32085K4230j88571j55653M4350J50865P7693k3169k6960
$$ -170104 -263776 -95394 136691 160921 -27650 -183303 -138953 11912 89605 66436 39476
231C9476K172l7555q4612j5262J29813J43912k7766j74503j00315J10252J72909
$$ 39476 41648 4093 -80519 -95781 34032 177944 150178 -24325 -124640 -14388 158521
242A58521M584j64070j24039L7772Q3840j4484o1845L8073J22604K7102j42573
$$ 158521 163105 -965 -125004 -87232 -3392 -17876 -79721 -41648 80956 108058 -34515
253c4515j36042N8996J85409O2897j42968j61798R953J45789R8941m356k7115
$$ -34515 -170557 -111561 73848 136745 -6223 -168021 -158068 -12279 86662 82306 55191
264E5191n907m3283q5901K413J52374J43716p4829k44122j21525J68841K53670
$$ 55191 49284 6001 -79900 -77487 74887 218603 143774 -100348 -221873 -53032 200638
275B00638L1583k11858j91998J6459J37050P4019j5208j9586j1198o5083q5237
$$ 200638 232221 20363 -171635 -155176 -18126 55893 40685 21099 9901 -55182 -140419
286a40419L3605J71083J13305j16168k35259p3545J87076K22820J4287j64990
$$ -140419 -106814 64269 177574 61406 -173853 -247398 -60322 162498 176785 11795
296A1795j21199L9046J08540M8892p142p716j9900p4003p3616L3267J33574P7862
$$ 11795 -109404 -70358 38182 87074 79932 72216 52316 -21687 -95303 -62036 71538 149400
308A49400q8320j60679l8405J22174J23915k1272j14467o0725L4484L3304k6890
$$ 149400 61080 -99599 -138004 -15830 108085 86813 -27654 -88379 -53895 -20591 -47481
319d7481j9378N9493P8606k8056j21624n9017J03163J50456J8278j31649j09280
$$ -47481 -66859 -7366 71240 43184 -78440 -137457 -34294 116162 134440 2791 -106489
330a06489L5719J17610N8607k7954l4781r371l9684o9292L139J23735J14168o4607
$$ -106489 -70770 46840 105447 77493 42712 33341 -6343 -75635 -72496 51239 165407 100800
342A00800k02102j00285J38859K14951L0669j82876j74896P027J26833Q3850l446
$$ 100800 -101302 -201587 -62728 152223 182892 16 -174880 -167853 -41020 42830 39384
353C9384k5346k3598n5105n2812N3155J62040R5755j13082k16443n9150J80171
$$ 39384 14038 -9560 -64665 -117477 -64322 97718 193473 80391 -136052 -195202 -15031
364a5031K09209j175j82507j30668M5186J17713M8609k8541k7297j5985n1960
$$ -15031 194178 193003 10496 -120172 -74986 42727 91336 62795 35498 19513 -32447
375c2447n3980K9181J14774O4792r0153j56346l9395J17638J20603j0947r7991
$$ -32447 -86427 -57246 57528 122320 32167 -124179 -163574 -45936 74667 63720 -34271
386c4271m9965L3964L5873p30R530N1966L1261o0978r6721K035J19213R9305m2715
$$ -34271 -84236 -50272 -14399 -15129 -5599 46367 77628 16650 -80071 -78036 41177 140482 97767
399I7767j25293n4835O4699Q5477O259l6985r415J438m5429o5896J4590J13009
$$ 97767 -27526 -82361 -17662 67815 74074 37089 27674 29112 -16317 -82213 -67623 45386
411D5386P2731q6054j69036n1941J40126J65235M519j46301j18098K2121J01132
$$ 45386 118117 32063 -136973 -188914 -48788 116447 120966 -25335 -143433 -121312 -20180
422b0180P1556J1795j8860m2042o7268k7981Q0045J44924M6689j34018j76240
$$ -20180 51376 63171 44311 2269 -64999 -92980 -12935 131989 178678 44660 -131580
433a31580p940J78438J55781m1710j70164r9025N4865R9486K4420l3766k6670
$$ -131580 -139520 38918 194699 152989 -17175 -116200 -61335 38151 62571 28805 2135
444B135j4572m6762m4193M1236J14594N3274r5051j46479j8806J35159J23064
$$ 2135 -12437 -59199 -103392 -62156 52438 105712 10661 -135818 -154624 -19465 103599
455A03599k5689j16583n2414N3621O6413M813j5046J9456K1514m0128o5773O904
$$ 103599 77910 -38673 -91087 -37466 28947 33760 18714 38170 59684 19556 -46217 -39313
467c9313R5559O6945n0078j12041l6820O5284O6286j0992m7265j0175Q691k6992
$$ -39313 56246 123191 73113 -38928 -75748 -10464 55822 44830 -2435 -12610 -3919 -30911
479c0911m6417K0040R3515M9925q2257j34813j5988J32577J26542k0327j29245
$$ -30911 -77328 -57288 36227 86152 3895 -130918 -146906 -14329 112213 91886 -37359
490c7359p5907M3701R2100M3474o782j8484k9637m7198k1053O6937J09888K2668
$$ -37359 -113266 -69565 22535 66009 59227 40743 11106 -36092 -57145 9792 119680 142348
502A42348j19444j40053M315J46129J15032m6793j41989p2687M6669P8159K7419
$$ 142348 22904 -117149 -112834 33295 148327 101534 -40455 -113142 -66473 11686 39105
513C9105j8544k0101k8881m8634k0646O7258J06151J8683j10535j14418K6393
$$ 39105 20561 460 -28421 -77055 -97701 -30443 75708 94391 -16144 -130562 -104169
524a04169J40048Q7286n8497j08784j8939O8587M9668j9890k4705K3174K1197
$$ -104169 35879 123165 64668 -44116 -63055 5532 55200 35310 10605 33779 54976
535E4976m2879o4287J0576Q7517M9914o1953r8088j6446O8225N1366k0946m1413
$$ 54976 12097 -52190 -41614 45903 95817 33864 -64224 -80670 -12445 38921 17975 -23438
547b3438r62J3300k5077l1306L2524Q4756K5010q2631r7488J6441J19348Q1005
$$ -23438 -24400 -11100 -36177 -67483 -34959 49797 74807 -7824 -105312 -88871 30477 111482
559A11482m1575j00679l5280M7326N6044J2556l926j869k4425n6952k6045N8556
$$ 111482 69907 -30772 -66052 -18726 37318 49874 45948 44079 19654 -37298 -63343 -4787
571d787R9576J3921j11256j21870R185J28727R5436m1758j19606o1137M2880P5389
$$ -4787 94789 108710 -2546 -124416 -115231 13496 108932 67174 -52432 -113569 -70689 4700
583D700L3194j1435k3154l1199l3308j542O5030Q4819M488r5057q8325K8890J13393
$$ 4700 37894 26459 3305 -27894 -61202 -62744 2286 87105 91593 -3464 -91789 -62899 50494
596E0494O2410n4962q8458j3971N3180K9493k2230j2682K4848Q739n3000n9441
$$ 50494 112904 57942 -30516 -44487 8693 38186 15956 3274 28122 36861 -16139 -75580
608g5580K3402R2198L7098p2093r3024K816Q2923M6846l3181m5185J1610K9655
$$ -75580 -52178 40020 77118 5025 -87999 -85183 -2260 44586 11405 -33780 -22170 7485
620G485j5936l6714K2520P8193K9744p5346q9024J4212J07911O8392m3701r2003
$$ 7485 -8451 -45165 -22645 55548 85292 9946 -79078 -64866 43045 111437 67736 -24267
632b4267l2242L9743M4818J0567j585p216l5281n5702j3080P0452Q5909q228j12204
$$ -24267 -56509 -16766 28052 38619 37034 29818 -5463 -61165 -74245 -3793 82116 73888 -38316
645c8316q9275L7036J17517O2401n1595q9662k7540M0580M8863K2360N565n930
$$ -38316 -127591 -90555 26962 89363 37768 -51894 -79434 -38854 10009 32369 37934 32004
657C2004l2561m8530n063P2210Q3317o553j00163q2329L1444J05838N2797n2475
$$ 32004 -557 -49087 -54150 18060 101377 94824 -5339 -87668 -56224 49614 102411 49936
669D9936q7576k3046M0541L4863r29p811J150j3535l6975k1250L9284O3528J1280
$$ 49936 -37640 -60686 -20145 14718 13789 5978 7128 -6407 -43382 -64632 -25348 38180 49460
682D9460o1316n6290J6607O3256K8462k4478k2864J1516R339k2690j6855M0054
$$ 49460 -11856 -68146 -51539 11717 40179 15701 -7163 4353 13692 -8998 -25853 14201
694A4201O4053k018q7250p0672L9293J02222L9413o7875q8012p548N5544L7041
$$ 14201 78254 76236 -11014 -81686 -42393 59829 99242 31367 -56645 -64193 -8649 28392
706B8392j0476j7555k237j2860m0356j4816N7670P9081k849r6827p7739L7987
$$ 28392 17916 361 -1876 -14736 -55092 -69908 -12238 66843 63994 -32833 -110572 -72585
718g2585J16391N9855n5003r1036k3613M8048N5546J5984p784j7371l4879l6873
$$ -72585 43806 103661 48658 -42378 -65991 -17943 37603 53587 45803 28432 -6447 -43320
730d3320P352P0958N9404l0158j02444n9344N1311R8149K1116o9502o9152L913
$$ -43320 -35968 34990 94394 64236 -38208 -97552 -46241 51908 73024 3522 -65630 -61717
742f1717M4943K1574j0480P35J7795j1927m8400j6235N5258P4707j233p8170n7481
$$ -61717 -16774 4800 -5680 -4945 12850 923 -47477 -63712 -8454 66253 65020 -13150 -70631
755g0631L3822Q1171K8891m0367m3772N90J9335R32j648J9502K1268k2084n8266
$$ -70631 -36809 44362 73253 32886 -10886 -10296 9039 9971 8323 27825 49093 27009 -31257
768c1257k7102M2508N8521j2n7003m2845J1154L4597J6341m553L206R62k7076
$$ -31257 -58359 -15851 42670 42658 -14345 -57190 -46036 -11439 4902 349 3555 4517 -22559
781b2559l6815J0523O9319N6513l0059r0473m4516O1985R8321K7811o7473p4859
$$ -22559 -59374 -48851 20468 76981 46922 -43551 -88067 -26082 72239 100050 32577 -42282
793d2282m314N5011M3678j364k1841k3818k5615k1583J4244N2550L8064l3454
$$ -42282 -46596 8415 52093 50729 28888 5070 -20545 -42128 -27884 24666 62730 29276
805B9276q2886l8627N2958Q2352J4389o5678o1284O788M8609K8658n473n971N032
$$ 29276 -53610 -92237 -39279 43073 57462 -8216 -69500 -62712 -14103 14555 9082 3111 8143
818H143j3284k8500K451N6710N0850k1487p7376l3350N1514P1062J417n7908l5046
$$ 8143 -5141 -33641 -31190 25520 76370 54883 -22493 -55843 -4329 66733 68150 10242 -24804
831b4804J7048K3221j0146j6254J6684K7220j9968o0044j9638N1839O1835j2447
$$ -24804 -7756 15465 5319 -10935 5749 32969 13001 -47043 -66681 -14842 46993 34546
843C4546o9641l9297L2427N2742J1875k2108j1375P184m135j5543Q909M6260L2642
$$ 34546 -35095 -74392 -41965 10777 22652 544 -10831 -3647 -7782 -23325 -14416 31844 64486
856F4486k9642o3219j8275N2560N9548k009n2608m1283O110K7528J9041L128j573
$$ 64486 34844 -28375 -46650 5910 65458 63449 10841 -30442 -24332 3196 22237 25365 23792
869B3792j7417l6448k7924K3516N9178K7517m7949p4480j6951O6052P2985j054
$$ 23792 6375 -30073 -57997 -34481 24697 52214 4265 -70215 -87166 -21114 51871 50817
881E0817o5290m7004J8121N1833K6350j1238j4539k933n146j0775P630L5143K4727
$$ 50817 -14473 -61477 -43356 8477 34827 23589 9050 6117 971 -9804 -2174 32969 57696
894E7696k6654n3156j6987M1521M6008p281m5107k5928J5115J7693j0309j1679
$$ 57696 31042 -22114 -39101 2420 48428 41147 -3960 -29888 -14773 2920 -7389 -19068
906a9068J4674K0376j8282m3430q987M7846M8901j5204n9749k3427L5974M8763
$$ -19068 -4394 15982 -2300 -45730 -54717 -6871 42030 26826 -32923 -56350 -20376 28387
918B8387K796k7009q156J2338P58j7900N27L8093K7968k9910n7592j1378N0283
$$ 28387 31183 4174 -3982 8356 9114 -8786 -8259 29834 57802 27892 -29700 -41078 9205
931I205M8478j3945n5376l2408J9069K9887N358r452k252j425k1102k1594J5242
$$ 9205 57683 43738 -11638 -44046 -24977 4910 10268 816 -1436 -2861 -23963 -45557 -30315
944c0315M8761K3667l7413n7689m342N5959N2650q834m8776k6238J9357K8551
$$ -30315 18446 42113 4700 -52989 -57331 -1372 51278 42444 -6332 -32570 -13213 15338
956A5338J0077m136O77l709k0762k0431J6381M3734J2764l9145n5628k195N0137
$$ 15338 25415 21279 21956 18247 -2515 -22946 -6565 37169 49933 10788 -44840 -47035 3102
969C102L6848k1384m6163j3486K5042J8618j1661j1271J4232J9072j2014k9948
$$ 3102 39950 18566 -27597 -41083 -16041 2577 -9084 -20355 -6123 12949 935 -29013
981b9013l082M0761L3745j6048m4119j2662L0254L1411l192j7312l468O759p067
$$ -29013 -32095 8666 42411 26363 -17756 -30418 -164 31247 28055 10743 7275 14034 6967
994F967j8091N178L1718J3965l2156m8116l337M6194L7549j8395m6699k0816K2864
$$ 6967 -11124 -5946 25772 39737 7581 -40535 -43872 2322 39871 21476 -25223 -46039 -23175
1007b3175K5341L402j1249J413L397j4048j5027J3805M0335K0260l2417m6795
$$ -23175 2166 5568 -5681 -4268 -871 -14919 -29946 -16141 24194 44454 12037 -34758
1019c4758n42M9290M2291j2800m5620k2988J8298K3972M507q825m814k591j7853
$$ -34758 -35300 13990 56281 43481 -2139 -25127 -6829 17143 21650 12825 8011 5420 -12433
1032a2433j4406J2853L3794J1164l5643m3961L112M4784L0123j8528l5468n963
$$ -12433 -26839 -13986 19808 30972 -4671 -48632 -45520 -736 29387 10859 -24609 -30572
1044c0572K1149J2792p190p54J4788R272j8338k3383J2124L9086J9966k9711l9242
$$ -30572 -9423 3369 -3821 -4575 10213 19485 1147 -22236 -10112 28974 48940 19229 -20013
1057b0013j88L2724J9052j4729k1814K255J0289p961j8117M836K7574R545l0381
$$ -20013 -20201 12523 31575 16846 -4968 -2713 7576 -385 -18502 -13666 13908 23453 -6928
1070f928l8083O644M2246K7609k1217l8644q191K4804K2311k022n490M300K86
$$ -6928 -45011 -38367 3879 31488 10271 -28373 -36564 -11760 10551 8529 3039 7339 7625
1083G625j3905j0293J9204L3835O565l8156l7140P807M6760K6780k4189m2613
$$ 7625 -6280 -16573 2631 36466 43031 4875 -32265 -24458 22302 49082 24893 -17720
1095a7720j0402K2811J7806n410r796j260m21j3898j2322J4877L1415P115l3234
$$ -17720 -28122 -5311 12495 7085 -2711 -3971 -4392 -18290 -30612 -15735 15680 22795 -10439
1108a0439l4034R362M5052K4910j9226l1204k594K1711J3857n825n242Q938M049
$$ -10439 -44473 -35111 9941 34851 15625 -15579 -18173 3538 17395 11570 6328 15266 19315
1121A9315j7595j6179J1206L1639P871k8894l2473L110K9104J2746j5202k2880
$$ 19315 1720 -14459 -3253 28386 36257 7363 -25110 -22000 7104 19850 4648 -18232
1133a8232K284J0482l022j1600N796J9865O799k4938k4805J2783L9051J7086k2021
$$ -18232 -15948 -5466 -8488 -20088 -14292 5573 12372 -12566 -37371 -24588 14463 31549 9528
1146I528k8944O19K5049J5774p218r094L847J981j0310q120J3431K4332p15l3879
$$ 9528 -19416 -18797 6252 22026 14808 5714 9561 11542 1232 -6888 6543 30875 30160 -3719
1160c719k9472J3155L8057J3803k8783l2571m66K3282J0689q405q358N821L372
$$ -3719 -33191 -20036 18021 31824 3041 -29530 -29996 -6714 3975 -4430 -12788 -6967 -3595
1173c595j4006q433J6556L0886K990l0468k4822J4955L9748J2735k1792k3990
$$ -3595 -17601 -26034 -9478 21408 24398 -6070 -30892 -15937 23811 36546 14754 -9236
1185i236K370K0198N458q022l725P864k284j6545j3081J3267K5445l789k8982
$$ -9236 -6866 13332 18790 10768 7043 14907 12623 -3922 -17003 -3736 21709 17920 -11062
1198a1062k1976J3710K6559K412k1788j3362J0886J5274o508j2795O739K1819
$$ -11062 -33038 -19328 7231 9643 -12145 -25507 -14621 653 -5855 -18650 -11911 9908
1210I908N988k1568j8701J3234L3266J0121k2217k3203P418K2500P256j0752r844
$$ 9908 15896 -5672 -24373 -11139 22127 32248 10031 -13172 -5754 16746 24002 13250 3406
1223C406L757L562r197r160R433J5738l865k5130j8755J3269K6469L032k2195
$$ 3406 7163 10725 1528 -7632 1801 17539 13674 -11456 -30211 -16942 9527 12559 -9636
1236i636j8087Q103J7200J444p270j050J1218O10j2648o813J8117K5660j871k6729
$$ -9636 -27723 -19620 -2420 -976 -8246 -9296 1922 2532 -10116 -16929 1188 26848 24977 -1752
1250a752j7812J6169K9503N304k0903j9857P243J5028K849j2415n404O100J693
$$ -1752 -19564 -3395 26108 31412 10509 -9348 -2105 12923 15772 3357 -2047 4053 5746
1263E746j4039j0063R131J7440j045k2096j4228J2581K2123J937j8964p391J2217
$$ 5746 -8293 -18356 -9225 8215 7170 -14926 -29154 -16573 5550 7487 -11477 -18868 -6651
1276f651J3008n579j1155P372J8677L151j9244j2545J2872K5479J795k1736j5332
$$ -6651 6357 778 -10377 -3005 15672 18823 -421 -12966 -94 25385 27180 5444 -9888
1289i888J0140J5809n51j4554n976Q652K550j3715j1645J0891J8943k112k5086
$$ -9888 252 16061 15510 956 -5020 3632 6182 -7533 -19178 -8287 10656 8544 -16542
1302a6542j4490J5789K4671K099k1463j1297R782J5136K572r173J186J0903r4
$$ -16542 -31032 -15243 9428 11527 -9936 -21233 -11451 3685 6257 -2916 -1730 9173 9079
1315I079j0399n033J4408J6844l657k2968j0538J2996J8461k148j7368q236N879
$$ 9079 -1320 -6353 8055 24899 21242 -1726 -12264 732 19193 17045 -323 -8559 -2680
1328b680P212n952p455L916Q769m143j7081n703J5117J9533m767k0752r401J5805
$$ -2680 4532 -1420 -8875 -4959 3810 -333 -17414 -23117 -8000 11533 6766 -13986 -23387 -7582
1342g582K0064j819j4314m949J0992J0775p372q761N909J4479m49j6363j0528
$$ -7582 12482 10663 -3651 -8600 2392 13167 5795 -2966 2943 17422 16973 610 -9918
1355i918J0250J8361o30j9103j1883P620J1699j701j1439k037P405L90j0854p251
$$ -9918 332 18693 18063 -1040 -12923 -5303 6396 4695 -6744 -8781 -1376 -986 -11840 -19091
1369a9091J1470J6793l127k0355q967J5875K0719K387j9028r512J0648J3934j228
$$ -19091 -7621 9172 6045 -14310 -23277 -7402 13317 15704 -3324 -12836 -2188 11746 10518
1382A0518p953R23Q965j126j3937o588J5300J5881o466k3726j1307J5100J7863
$$ 10518 2565 3488 12453 11327 -2610 -9198 6102 21983 15517 -8209 -19516 -4416 13447
1395A3447l249j8546q505P028R344m491n929M273Q858l682j1747j899J5285J3805
$$ 13447 10198 -8348 -16853 -9825 -481 -4972 -10901 -6628 2230 -1452 -13199 -15098 187 13992
1409A3992m300j6804m966J5550J3324m204j0928j208P280K401q343k370Q672P333
$$ 13992 9692 -7112 -12078 3472 16796 12592 1664 456 7736 10137 1794 -576 8096 15429
1423A5429q119j7922k050J2617J3570q991j7732n929J2200J0637l838j1094L77
$$ 15429 7310 -10612 -12662 -45 13525 4534 -13198 -19127 -6927 3710 -128 -11222 -10845
1436a0845Q131J781p768j835J0768J3365l338j7180m586J4286J6336l332j5622
$$ -10845 -2714 -933 -8701 -10536 232 13597 10259 -6921 -11507 2779 19115 15783 161
1449A61o649P658J0904k146o942N34M259n607j0887j247J1727J0335j1144j9347
$$ 161 -6488 1170 12074 9928 2986 3520 7779 2172 -8715 -9962 1765 12100 956 -18391
1463a8391k431J7051J3082o887j6439k451J0301R566m656n298O264Q247k467j0419
$$ -18391 -20822 -3771 9311 2424 -14015 -16466 -6165 3401 -1255 -6553 -289 7958 5491 -4928
1477d928k286J4489J3358q939j5613l628J3765J2273n508j4604l441P263K342
$$ -4928 -7214 7275 20633 11694 -3919 -7547 6218 18491 12983 -1621 -5062 2201 4543
1490D543n931n145M213O530o006j1763k163J1418J0078o076j3083j570J3144Q613
$$ 4543 -1388 -6533 -2320 4210 -1796 -13559 -15722 -4304 5774 -302 -13385 -14955 -1811 6802
1504F802l611q267K603P934M06o977j210J0628R816q194j2896q39J4207R186j0046
$$ 6802 3191 -5076 -2473 5461 5867 -1110 -2320 8308 18124 9930 -2966 -3805 10402 19588 9542
1519I542j6577j545J0950M826o456q734L128M487l062r147M7J0289O280p941j1981
$$ 9542 -7035 -8580 2370 7196 740 -7994 -4866 -379 -3441 -12588 -12541 -2252 4028 -3913 -15894
1534a5894J604J4460P750n873j0434J714J0839N501m981l427N497O049m964q177
$$ -15894 -14290 170 7920 2047 -8387 -6673 4166 9667 4686 1259 6756 12805 7841 -336
1548c36M33J0705M600r180j1955p5J1855L678r579r144J455N490J429p625m411
$$ -336 97 10802 15402 6222 -5733 -5808 6047 9725 146 -8998 -7543 -2053 -624 -8249 -12660
1563a2660P475M830l547q871J860J0330O385n536r899K926J2034O425m733o206
$$ -12660 -5185 -355 -3902 -12773 -10913 -583 5802 266 -9633 -6707 5327 11752 7019 813
1577H13L193Q283j464o041l392N276O233o138j0358j160R682M273q036j1157P45
$$ 813 4006 12289 10825 4784 1392 6668 12901 6763 -3595 -4755 4927 9200 1164 -9993 -9248
1592i248P560K448p243o407M301P069k553o881M84Q713O290m765q415L123J2396
$$ -9248 -1688 760 -6483 -12890 -8589 -1520 -4073 -10954 -10470 -1757 4533 -232 -8647 -5524 6872
1607F872N606o498p840K455J0255J85p500k352O630M042m830r407j51Q632K074
$$ 6872 12478 5980 -1860 595 10850 11035 3535 1183 7813 11855 7025 -2382 -2533 6099 8173
1622H173p784j0674Q63J0014J920r782o269M687P857j763p279q02Q010O808l339
$$ 8173 389 -10285 -9422 592 2512 -7270 -13539 -8852 -995 -2758 -10037 -10839 -2829 3979 640
1637F40p988J972J1650L973n205q447L189R480L102p053m369K875O518k607q114
$$ 640 -7348 -5376 6274 10247 5042 -3405 -216 9264 12366 5313 944 3819 10337 7730 -384
1652c84j097N620K460o786p662L36Q683J752q585o803L216P546Q75p218j610O627
$$ -384 -1481 4139 6599 -187 -7849 -7513 1170 2922 -5663 -12466 -9250 -1704 -829 -8047 -9657 -3030
1668c030N837k798o255J283Q011N549m814o692K975Q021M041o320o775L550M508
$$ -3030 2807 9 -6246 -4963 3048 8597 3783 -2909 66 8087 12128 5808 -967 2583 7091
1683G091o02n471k611K972L224l293p727J705M327J392n904n503K579O604l72
$$ 7091 6489 1018 -1593 1379 4603 1310 -6417 -4712 -385 1007 -4897 -10400 -7821 -1217 -1589
1698a589l971j981M880M736j743n505J247P688M804m948p057K216R654M089o993
$$ -1589 -5560 -7541 -2661 2075 332 -5173 -3926 3762 8566 3618 -3439 -1223 8431 12520 5527
1713E527o814J949O999K251q121n822L949O607m520p674k936O963M129n463o179
$$ 5527 -1287 662 7661 9912 1791 -4031 -82 6525 2005 -5669 -8605 -1642 2487 -2976 -9155
1728i155R75Q178J549o321m416M729O599l14n084Q1O996M808m420n490K483Q720
$$ -9155 -8180 -2 1547 -4774 -9190 -4461 2138 1824 -3260 -3179 3817 8625 4205 -1285 1198 9918
1744I918l80o394o553N969O026n51r770l509N029N182k967r070o39N762L265m106
$$ 9918 9538 3144 -3409 2560 8586 8035 -1735 -5244 -215 4967 2000 -7070 -7709 -1947 1318 -2788
1760b788o420J519N966L642o307l845L230O999J976n218j067K901N200j445l844
$$ -2788 -9208 -7689 -1723 1919 -4388 -8233 -5003 1996 3972 -1246 -2313 588 5788 4343 499
1775D99J079M187J131m150k957L466L429j03p245j941K067M020j871o805j389
$$ 499 1578 5765 6896 2746 -211 3255 6684 6581 -664 -2605 -538 3482 1611 -5194 -6583
1790f583L964L787k941n493N97M028J159j947l642K647O961o05m532q33N550M821
$$ -6583 -2619 1168 -1773 -7266 -6669 -2641 -1482 -3429 -7071 -4424 2537 1932 -2600 -3433 2117 6938
1806F938j080n004k149O026L595k352n263j264M859P25m707l434J610M233k78
$$ 6938 5858 854 -1295 4731 8326 5974 711 -553 4306 5031 324 -3110 -1500 2733 2455
1821B455o888j672L147M559k579o541j115M893M756k387m262J580N294J651m195
$$ 2455 -4433 -6105 -2958 1601 -978 -7519 -8634 -3741 1015 -1372 -5634 -4054 1240 2891 -1304
1836a304j251N192N194k791o148o91P953M449m843p154k20O825K52m663m308J917
$$ -1304 -2555 2637 7831 5040 -1108 -1799 6154 10603 5760 -1394 -1614 5211 5463 800 -3508 -1591
1852a591M434k154o649j459N201L441l177o673o53O810M580j408m713j441N697
$$ -1591 2843 689 -5960 -7419 -2218 1223 -1954 -8627 -9280 -2470 2110 702 -4011 -5452 245
1867B45L636k400q43K748J864k466l745L739M612J476n416o492K548M856L639
$$ 245 3881 1481 638 3386 5250 2784 -961 2778 7390 8866 3450 -3042 -494 4362 8001
1882H001o828m959N95M708o75o999j85L007K958k245n507Q02O707M389k960o062
$$ 8001 1173 -3786 -3191 1517 842 -6157 -6342 -3335 -377 -2622 -8129 -7327 -620 3769 809 -5253
1898e253l90N860O307j963l913r36M170J925j460l08J560m34k357l165R1L980
$$ -5253 -5643 217 6524 4561 648 -288 3882 5807 4347 4039 5599 5165 2808 -357 -266 3714
1914C714K115m927o149J526J472K603m480j172m81L873j613m312Q97O145L002
$$ 3714 5829 902 -5247 -3721 -2249 354 -4126 -5298 -5779 -1906 -3519 -7831 -6934 -789 2213
1929B213m143n450K740Q425N527n067o024L03P619K612k802m542J528K005J63
$$ 2213 -1930 -7380 -4640 3785 9312 4245 -1779 -1476 6143 8755 5953 1411 2939 4944 5107
1944E107m504N97K746M78m188o653K406M102J103n848l256K361K719R37l422L1
$$ 5107 603 1200 3946 4424 236 -6417 -4011 91 1194 -4654 -7910 -5549 -2830 -1893 -5315 -5284
1960e284L223J560k650j880N191L984P6m842j354L523N775P23l793k478N23L311
$$ -5284 -2061 -501 -3151 -5031 160 4144 4220 -622 -1976 1547 7322 8045 4252 1774 2297 5608
1976E608N68k696p63J149m27n073l462K608M053j377m901l393J494M645O04j266
$$ 5608 6176 3480 2717 3866 3439 -1634 -5096 -2488 1565 188 -4713 -8106 -6612 -1967 -1363 -2629
1992b629n033J515L027K129k33L11J305J174j773j86K993L638J264m761q00L92
$$ -2629 -7662 -6147 -3120 -991 -1224 -913 392 1566 -207 -393 2600 6238 7502 2741 1941 2333
2008B333M977O37m344l559J704M72r54k995J143J195Q36n343l939L139N061l83
$$ 2333 7310 7947 3603 44 1748 2220 1266 -1729 -586 609 1445 -3898 -7837 -4698 363 -20
2024b0o296k201K189N835J952k406l429K271L784l63L68j097M677J70l720K77
$$ -20 -6316 -8517 -6328 -493 1459 -947 -4376 -2105 1679 1316 1684 587 5264 5434 1714 1991
2040A991J637L692j143l371m087K220K265p39k957k082K269q83k820j981L141
$$ 1991 3628 7320 6177 2806 -1281 939 3204 2465 -492 -2574 -305 -1188 -4008 -5989 -2848
2055b848J906n60m553k533L385P306j43l929j695J747M606L88k558Q08K277J173
$$ -2848 -942 -1502 -6055 -8588 -5203 2103 1960 -1969 -3664 -1917 2689 3077 519 1327 3604 4777
2071D777j933j654J436L763n01m873j065P33J887J82k616k218k55Q18j388j110
$$ 4777 2844 1190 2626 6389 5888 1015 -50 683 2570 2752 136 -2082 -2337 -1519 -2907 -4017
2087d017K141J053k213k341L83L026K912j321l399q87M544L148J12j870j461J817
$$ -4017 -1876 -823 -3036 -5377 -4994 -1968 944 -377 -3776 -4663 -119 3029 3141 1271 -190 1627
2103A627J336M79r82Q35J606p06l687q62K173L166k674m930j470J499K924j419
$$ 1627 2963 3442 2460 3295 4901 4195 508 -354 1819 4985 2311 -2619 -4089 -2590 334 -1085
2119a085j874q59J396n56j609k37K753L353j62l024k027L957L283l77j799j319
$$ -1085 -2959 -3818 -2422 -2978 -4587 -4824 -2071 1282 1120 -1904 -3931 26 3309 2932 1133 -186
2135a86K165L056j129k140o2K938r4l075k644J484L333j145m371k711K680K627
$$ -186 1979 5035 3906 1766 1704 4642 4548 1473 -1171 313 3646 2501 -1870 -4581 -1901 726
2151G26o47k835j408P19J298j113j56K696Q42j013j910J40L323L899j813l727
$$ 726 79 -2756 -4164 -3445 -2147 -3260 -3416 -720 122 -891 -2801 -2661 662 4561 2748 -979
2167i79p39L569L695j075k275q23J258R96k561j78Q00J083k491k596n58J181K109
$$ -979 -1718 1851 5546 4471 2196 1373 2631 3627 1066 888 1688 2771 280 -2316 -2874 -1693 416
2184D16j664l036L5k92K293P49j005n94J666J71q81J325J857J338q7k284q3J450
$$ 416 -1248 -4284 -4249 -4541 -2248 -1499 -2504 -3098 -1432 -1261 -2142 -817 1040 2378 2291 7 -76 1374
2202A374L162M21l174j369J362J126k306P90K09p27M83l528m73J874J283j326
$$ 1374 4536 4957 1783 414 1776 2902 596 1386 1595 868 1351 -2177 -2650 -776 507 -819
2218h19l606j228K106K188N27m68j363R58J207K50L20J325J631j164k301j53M941
$$ -819 -4425 -5653 -3547 -1359 -832 -1300 -2663 -1705 -498 -248 72 1397 3028 1864 -437 -590 4351
2235D351J708k378j964j592J250K870p87k077k495N31R39j697m48K89L90j379
$$ 4351 6059 3681 1717 125 1375 4245 3458 1381 -1114 -583 356 -1341 -1789 -1500 -1110 -2489
2251b489k090N4L506P36j051k330P91J568J591R66j739R24J186Q01j030P53J197
$$ -2489 -4579 -4525 -1019 -283 -1334 -3664 -2873 -1305 286 1252 -487 437 1623 2424 1394 2147 3344
2268C344P49r06l603o75M409L52o69l604j814Q99M58q0j334q22J387j411j651
$$ 3344 4093 3187 -416 -1091 3318 3670 3001 -603 -2417 -1518 -1060 -1140 -2474 -3296 -1909 -3320 -4971
2285d971J409J760R71j300l84r77L398O68M07k43k03J286j77k7K315L76r71p35
$$ -4971 -3562 -1802 -831 -2131 -2515 -3492 -94 574 981 738 535 1821 1644 1617 3932 4308 3337 2602
2303B602k602J073L138J140l618k942j128K521J083j933j129j144o32R82J49P44
$$ 2602 0 1073 4211 5351 1733 -1209 -2337 184 1267 -666 -1795 -2939 -3571 -2589 -2440 -1696
2319a696r83L13q33k59K50K926K337j024j77k41K52J259J318n46m70J63n45Q16
$$ -1696 -2679 -2366 -3199 -3458 -3208 -282 2055 1031 854 613 865 2124 3442 2896 2426 2589 2044 2860
2337B860N16k18k434q52j205P72J036m10j261l385J082J339Q10j797j003K644
$$ 2860 3376 3158 724 -128 -1333 -561 475 65 -1196 -4581 -3499 -2160 -1350 -3147 -4150 -1506
2353a506j32j186N45m27J254L661j481r18o4K399J955O98k964k94J773N12q70
$$ -1506 -1638 -2824 -2279 -2706 -1452 2209 728 -190 -254 2145 4100 4798 1834 1540 3313 3825 2955
2370B955n35R3j166r8r04p40L03k24l32j985M21m25l6L66j039R60n87Q82m06J461
$$ 2955 2420 2513 1347 1249 345 -395 -92 -316 -648 -2633 -2212 -2637 -2673 -2307 -3346 -2386 -2973 -2091 -2497 -1036
2390a036J437m08p11J97J378J540R82j433o98M35K075Q42j532m033K153k15J241
$$ -1036 401 -7 -718 -521 857 2397 3379 1946 1248 1683 3758 4600 3068 -965 1188 973 2214
2407B214j571j339m98O81n42j89j783J690r76m14K92r06K611l98m11m44J080N81
$$ 2214 643 -696 -1194 -513 -1055 -1244 -3027 -1337 -2313 -2727 -2435 -3341 -730 -1128 -1539 -1983 -903 -322
2425c22R66o26J541J042o57n16m39O44K121j30k226j177m8J640m20j764q84O18
$$ -322 644 18 1559 2601 1944 1428 989 1633 3754 3624 1398 221 173 1813 1393 -371 -1255 -637
2443f37L39l59j251q24P53J132j185p79n78K159m49K72Q60q35J357k77J924O87
$$ -637 -298 -657 -1908 -2732 -1979 -847 -2032 -2811 -3389 -1230 -1679 -1407 -547 -1382 -25 -302 1622 2309
2461B309j87k31k21n32J346N05p34m92j332L44R70l68j963o70L13J287j365p45
$$ 2309 2122 1891 1670 1138 2484 2989 2255 1763 431 775 1745 1377 -586 -1256 -943 344 -1021 -1766
2479a766m35L80l17K40p35K08P53O94J91l84J021K81J040q17L70n3K864p80k767
$$ -1766 -2201 -1821 -2138 -1898 -2633 -2425 -1672 -978 -787 -1171 -150 131 1171 354 724 671 3535 2755 -12
2498a2J206P69O13m82j45j208p8Q1l07J2o05K11j358k91Q25K16q38j295J34N69
$$ -12 1194 1963 2576 2094 1949 741 663 744 437 449 -156 55 -1303 -1594 -769 -553 -1391 -2686 -2552 -1983
2518a983Q41P9p4j129N47J536r33R59R06J479J03o01j510J437M40K97j4k081J470
$$ -1983 -1142 -1063 -1137 -2266 -1719 -183 -1116 -157 749 2228 2331 1730 220 1657 2097 2394 2380 299 1769
2537A769p76L24l33j665L02o37R21l89m98j368R06K42p84M94P75r69J502r02O36
$$ 1769 993 1317 984 -681 -379 -1016 -95 -484 -982 -2350 -1444 -1202 -1986 -1492 -717 -1686 -184 -1086 -450
2556d50l6Q58k03Q31k74O87K77j636J629j133J695o48j857J436m54N51k44k203
$$ -450 -486 372 169 1000 726 1413 1690 54 1683 550 2245 1597 -260 1176 722 1273 1029 -1174
2574a174J012m24N33j617q0m06J238l02q02L6J540P25o15k44j26J999K9j8l22
$$ -1174 -162 -586 -53 -1670 -1750 -2156 -918 -1220 -2022 -1986 -446 279 -336 -580 -706 1293 1322 1304 982
2593I82m60J756j118J119o42Q89k190j10Q51O62J023k193j807N06M41N21m09j800
$$ 982 522 2278 1160 2279 1637 2526 336 226 1077 1739 2762 569 -1238 -732 -291 230 -179 -1979
2611a979m25P57P82K6p28M79O11m70N42p00J123Q14r2Pq30J56J303J731r53j75
$$ -1979 -2404 -1647 -865 -839 -1567 -1088 -477 -947 -405 -1105 18 832 740 747 -83 73 1376 3107 2154 1979
2631A979k703J870M31Q59j051j463l58R0l09L54l28j304J066o56j11O46m82r16
$$ 1979 -724 1146 1577 2436 1385 -78 -436 -346 -655 -301 -629 -1933 -867 -1523 -1634 -988 -1470 -2386
2649b386J601M12l47K97J96M06J675p24m04o04J029J931r99o00r56J277n31k7
$$ -2386 -785 -373 -720 -423 -227 179 1854 1130 726 122 1151 3082 2083 1483 527 1804 1273 1246
2667A246P37j496j084P11p20l40N85q37L7p41r34K112j896J043j76P89o10J217
$$ 1246 1983 487 -597 114 -606 -946 -361 -1198 -1161 -1902 -2836 -724 -2620 -1577 -1753 -964 -1574 -357
2685c57M81m15N47j25J50L21J667l34O42m67k492J767P67o58p66j28o56J78m13
$$ -357 124 -291 256 131 281 602 2269 1935 2577 2110 -382 1385 2152 1494 728 600 -56 122 -291
2704b91j290R54j546J429p25r46O59p4J14J275k13p26J211m46O44O50p36J270
$$ -291 -1581 -627 -2173 -744 -1469 -2415 -1756 -1830 -1716 -441 -654 -1380 -169 -615 29 679 -57 1213
2722A213M22J89q26J543Q6l69j014R30j8o56o17m96n95L10m0j785R65l6n50j009
$$ 1213 1635 1824 998 2541 2627 2258 1244 2174 2156 1500 883 387 -208 102 62 -1723 -758 -794 -1344 -2353
2742b353M88n16M11L32n21J256k78J30R3J641q44J83O85Q22r86J554M60j229P50
$$ -2353 -1865 -2381 -1970 -1638 -2159 -903 -1181 -1051 -958 683 -161 22 707 1529 543 2097 2557 1328 2078
2761B078ll05J79n43m61m02k00J64m05j341l70k38K40p20P66j61m73Q07m20O78
$$ 2078 2075 1770 1949 1406 945 543 343 507 102 -1239 -1609 -1847 -1607 -2327 -1561 -1722 -2195 -1388 -1808 -1130
2781a130l6J008M21K10L30r11J462j87N40m76k15M98L59m37q55K53M91m15p6j391
$$ -1130 -1166 -158 263 473 803 -108 1354 1167 1707 1231 1016 1514 1873 1436 581 834 1325 910 834 -557
2801e57q9L03l81m70K17r08K38j2Q54q52n78J086q7l35P39L71j85j23P49M40R66
$$ -557 -646 -343 -724 -1194 -977 -1885 -1647 -1659 -805 -1657 -2235 -1149 -1236 -1571 -832 -461 -646 -769 -20 420 1386
2822A386K52k8n03M48J17l97r34R96k44j391J042P28j538o38n2k62l60O95M8k213
$$ 1386 1638 1610 1107 1555 1672 1275 341 1337 1093 -298 744 1472 -66 -704 -756 -1018 -1378 -683 -635 -2848
2842b848J561O22p3q32Q58m57nM44L94O34J091j56j464J609Q85l80J03j959J083
$$ -2848 -1287 -665 -738 -1570 -712 -1169 -1174 -730 -336 298 1389 1233 -231 1378 2263 1883 1986 27 1110
2861A110L24J10p85M61p1j371M0J28q51l63M61j152J81N87n58K03M78N90K67k15
$$ 1110 1434 1544 759 1220 1149 -222 -182 -54 -905 -1268 -807 -1959 -1778 -1191 -1749 -1546 -1068 -478 -211 -426
2881d26P39K42o98J10N05l35R84P75j203O21N74o03l1J7n3J67j052J036j679M53
$$ -426 313 555 -143 -33 472 137 1121 1896 693 1314 1888 1285 1254 1271 1218 1385 333 1369 -310 143
2901A43r15m16N5k27J75J01n89J67Q28j20m16l77K50Q62Q26m24Q26K83K84N75
$$ 143 -772 -1188 -1133 -1360 -1185 -1084 -1673 -1506 -678 -798 -1214 -1591 -1341 -479 347 -77 749 1032 1316 1891
2921A891r34O10q17M9M14oL05J46q73n02K27J46r78M96r85k9L2J168j039j118
$$ 1891 957 1567 750 799 1213 1207 1512 1658 785 283 510 656 -322 174 -811 -840 -808 360 -679 -1797
2941a797N0O73P02m52l51Q26m39R47p6R61m75Q3j61J831j549N3N5k96J015p81
$$ -1797 -1747 -1074 -372 -824 -1175 -349 -788 159 83 1044 569 652 491 2322 773 826 881 585 1600 819
2961H19N7o69P6J73j074J22K41j13R0j283P95l59R07l96M8l96P09j041J432K96
$$ 819 876 207 283 456 -618 -496 -255 -368 -278 -1561 -766 -1125 -218 -614 -566 -962 -253 -1294 138 434
2981D34N90j085N37J37j31J226p91K85m05P14l93J62j210R18m26j88p65J068j074
$$ 434 1024 -61 476 613 482 1708 917 1202 797 1511 1118 1280 70 988 562 374 -391 677 -397
3000c97M49o70k0n8J26q70M83K97r38N68M34l93J088K74K69J59O2o81P06O79o
$$ -397 52 -618 -638 -696 -570 -1440 -957 -660 -1598 -1030 -596 -989 99 373 642 801 863 182 888 1567 1561
3021A561r57o23J367m64L98j489J124j228K18k38J405j324J47j497L91J244o20
$$ 1561 604 -19 1348 884 1282 -207 917 -311 -93 -331 1074 -250 -103 -1600 -1209 35 -585
3038e85n17M39l64J168j198R70Q82j121j28m01J66Q62J559l07l17j28J2n81R61
$$ -585 -1102 -663 -1027 141 -1057 -87 795 -326 -454 -855 -689 173 1732 1425 1108 980 992 411 1372
3057A372j135M5p40l33q2L13R76R2q25j998J397o13L81O4j50Q0r19J250J169o98
$$ 1372 237 282 -458 -791 -873 -560 416 508 -317 -2315 -918 -1531 -1150 -1086 -1236 -1156 -2075 -825 344 -354
3077c54j02L37O36k74M10O1J55K54m9k93l49L14j99P71j254l34L45N7n78K63O84
$$ -354 -456 -119 517 243 653 714 869 1123 1074 781 432 746 547 1318 64 -270 75 132 -446 -183 501
3098E01j257j96M11j98l81L92j339J097Q96o34K9O40Q89j529Q26j013K133q74
$$ 501 -756 -952 -541 -739 -1120 -728 -2067 -970 -74 -708 -679 -39 850 -679 147 -866 1267 393
3116C93M50R71r4p26M37P3L90o46J66j121r5Q82r23j127R53p96L05p8n51N92o8
$$ 393 843 1814 1720 994 1431 1504 1894 1248 1414 293 198 1080 157 -970 -17 -813 -508 -586 -1137 -545 -613
3137f13l77j71o3P79j09j86m89L66J511j49l28R78j64p5k8J64J062k90p66p8n33
$$ -613 -990 -1161 -1224 -445 -554 -740 -1229 -863 648 499 171 1149 985 910 882 1046 2108 1818 1052 974 441
3158D41K19m1j86q6q12Q54p20m99n46Q13m34N98j072L66j33j15q48J149P60O53
$$ 441 660 619 433 347 -465 389 -331 -830 -1376 -563 -997 -399 -1471 -1105 -1238 -1353 -2201 -1052 -292 361
3178C61J54j26J86M87j317J279J236o27j061J195j239Q19k30k76J32N8j143N43
$$ 361 515 389 575 1062 -255 1024 2260 1633 572 1767 528 1347 1117 841 973 1031 -112 431
3196D31k94J32o51N29j647Q77J02j408P78K3N84q43O82J38Q64J145j033p44R61
$$ 431 137 269 -382 147 -1500 -623 -521 -1929 -1151 -1128 -544 -1387 -705 -567 297 1442 409 -335 626
3215F26MJ00M55o59N29j054N11M05L28p13N44j109J76O1K97j001J30j132Q72Q38
$$ 626 630 730 1185 526 1055 1 512 917 1245 532 1076 -33 143 204 501 -500 -370 -1502 -630 208
3235B08l61l77j510Q83J210p64N3L80KJ289j306M84m58K93O74M31j42Q68p31j43
$$ 208 -153 -530 -2040 -1157 53 -711 -658 -278 -276 1013 -293 191 -267 26 700 1131 989 1857 1126 983
3255I83p44l43O72o35Q93j110R55q35k11o7o23P61N25j319Q71j702O54J018P65
$$ 983 239 -104 568 -67 826 -284 671 -164 -375 -442 -1065 -304 221 -1098 -227 -1929 -1275 -257 508
3274E08j958K51J530j92j91J19R30l39K24N32r21l66L87Q4k01k25K379k045L3
$$ 508 -1450 -1199 331 139 -52 67 997 658 882 1414 493 127 514 598 397 172 2551 506 539
3293E39k23l75n29P58o09p21J351j198K29k77P93j012K040j636k29N38J94J419
$$ 539 316 -59 -588 170 -439 -1160 191 -1007 -778 -1055 -262 -1274 766 -870 -1099 -561 -367 1052
3311A052n08p3o32J289K41o7k97k97M51l37n88K9Q19j033R23k092J502m75k28
$$ 1052 544 471 -161 1128 1369 1302 1005 708 1159 822 234 263 1082 49 972 -1120 382 -93 -321
3330c21L72o95j27l04M79o70L28j75K63m73J318J80Q5m48K75l26O31R2m29m99
$$ -321 51 -644 -771 -1075 -596 -1266 -938 -1113 -850 -1323 -5 175 260 -188 87 -239 392 484 55 -444
3350d44j14J043O51k6p35j95Q60j508J74m2r0q3P23l62R2q06P60O53o48j95L81
$$ -444 -558 485 1136 1110 375 180 1040 -468 -294 -336 -426 -509 214 -148 -56 -862 -102 551 -97 -292 89
3371H9k58j61O97o90O16j05l56P55R2k34M53L34j032Q26L89k6o70J45m66q74O32
$$ 89 -169 -330 367 -323 293 188 -168 587 679 445 898 1232 200 1026 1415 1389 719 864 398 -476 156
3392A56r59J388k148J602j679P27k84N97Q38q39j56m99K09M70O08q1J040o48j457
$$ 156 -803 585 -1563 39 -1640 -913 -1197 -600 238 -601 -757 -1256 -1047 -577 31 -50 990 342 -1115
3411a115R47N98K97q83K32j28n36Q27j66P74j508N82O17j247J02N25M1n98O08
$$ -1115 -168 430 727 -156 76 -52 -588 239 73 847 -661 -79 538 -709 -607 -82 -41 -639 -31
3430c1p41Q17J04k93L18j334J614L40l93p37k73k16J114M85l77O98R0l79n5R6
$$ -31 -772 45 149 -144 174 -1160 454 794 401 -336 -609 -825 289 774 397 1095 1185 806 751 847
3450H47m91R3Q63r08j35n2j14k03O12j163M6j21n94N53m62J039M43j470N20K31
$$ 847 356 449 1312 404 269 217 103 -100 512 -651 -605 -726 -1320 -767 -1229 -190 253 -1217 -697 -466
3470d66r00Q98N17o06O1J834j480O56M38L2n02l05M5k3J083m70r18M67o62P68
$$ -466 -1366 -468 49 -557 -496 1338 -142 514 952 984 482 177 222 199 1282 812 -106 361 -301 467
3490D67rj271O92j183J398J88j012N77r46K42K16L33R91p04R8o29J470j650L53
$$ 467 458 -813 -121 -1304 94 282 -730 -153 -1099 -857 -641 -308 683 -21 77 -552 918 -732 -379
3509c79R53k44K19P65n09N01j675K98J60N52l14n95M95p11L01q44Q39p33J12J43
$$ -379 574 330 549 1314 805 1306 -369 -71 89 641 327 -268 227 -484 -183 -1027 -188 -921 -809 -666
3529f66r17J136J22p19M25m9R98j237N68O70j269J014R59O1k92J02J13l99L48
$$ -666 -1583 -447 -325 -1044 -619 -668 330 -907 -339 331 -938 76 1035 1096 804 906 1019 620 968
3548I68O02p28J74o21p96R73J83p42K42j030J3M35j06j31l52J39J359j609O04
$$ 968 1570 842 1016 395 -401 572 755 13 255 -775 -762 -327 -433 -564 -916 -777 582 -1027 -423
3567d23N2p88J661o38N9q25J328l65L09q2j9Q13PR23j802K96J15N76j295J23m54
$$ -423 -371 -1159 502 -136 -77 -902 426 61 370 288 269 1082 1089 2012 210 506 621 1197 -98 25 -429
3588d29J004j249j398J767L8R0j216J81k40L58J08M34QK1k4l07J804o78K46j812
$$ -429 575 -674 -2072 -305 -267 -177 -1393 -1212 -1452 -1094 -986 -552 -544 -523 -547 -854 950 272 518 -1294
3608a294K321m12m67N66N76N16j621q63J370p74N74M68m12m39j48j408N23J146
$$ -1294 1027 615 148 714 1290 1806 185 -678 692 -82 492 960 548 109 -39 -1447 -924 222
3626B22K80q76j189O14N01o6J71j45N42m2N37p0n74R28q51N57k74O14nJ081j898
$$ 222 502 -374 -1563 -949 -448 -514 -343 -488 54 12 549 479 -95 833 -18 539 265 879 874 1955 57
3647E7Q59j377Q17m04l22qn35L61j61J202j031k9P61j003L59j381J109r3N50L90
$$ 57 916 -461 356 -48 -370 -378 -913 -552 -713 489 -542 -571 190 -813 -454 -1835 -726 -819 -269 121
3667A21j609O43K074j373j043J184P00k5L68r88L32J147l55Q8q62p98Q25P73j455
$$ 121 -1488 -845 1229 -144 -1187 -3 697 672 1040 52 384 1531 1176 1264 402 -396 429 1202 -253
3686b53P00j079j110J821m92N72r28O53p02K07L98N03p07M9p52J253K24M64O81
$$ -253 447 -632 -1742 79 -413 159 -769 -116 -818 -611 -213 290 -417 -368 -1120 133 357 821 1502
3705A502j323o90J003J47N61p04N48k63o00m1j1N85Q9k125N79M75J05q4J46j4
$$ 1502 179 -511 492 639 1200 496 1044 781 181 140 129 714 803 -1322 -743 -268 -163 -247 -101 -115
3725a15K38j588N03J376j109J195j279j41J443r51Q80q93M22n11J065J60N10o68
$$ -115 123 -1465 -962 414 -695 500 -779 -920 523 -428 452 -441 -19 -530 535 695 1205 537
3743E37l77j62J582j250o99Q90r08q50J617q72J057j45l51o66N97L89n70r36J747
$$ 537 160 -2 1580 330 -369 521 -387 -1237 380 -492 565 420 69 -597 0 389 -181 -1117 630
3762F30j209j28P09O3Q43q05O9k42p88O18J754j383J019r93K08o55P02m39J4L15
$$ 630 -579 -707 2 65 908 103 172 -70 -858 -240 1514 131 1150 157 365 -290 412 -27 -13 302
3782C02l2j473R87R85j446j61J02L52R99j421Q03j79j10p72J195m41M56n3J350
$$ 302 270 -1203 -216 769 -677 -838 -736 -384 615 -806 -3 -182 -292 -1064 131 -310 146 93 1443
3801A443j335j344K463K22j735R34o23j52M27m43L64K39p1M33k01j74j695J771
$$ 1443 108 -1236 1227 1449 -286 648 25 -127 300 -143 221 460 389 822 621 447 -1248 523
3819E23m88j31q54J545o47k72J64K69o20M5K30L46k90n23n08J995p63P66m93J27
$$ 523 35 -96 -950 595 -52 -324 -160 109 -511 -466 -236 110 -180 -703 -1211 784 21 787 294 421
3839D21k38r14Q40m49Q55K68j223K1M70m22n55O15R10r9m34p72J97J070o58q29
$$ 421 183 -731 109 -340 515 783 -440 -419 51 -371 -926 -311 599 500 66 -706 -509 561 -97 -926
3859i26J68J205o99M69o63L93n88J83O77J032m25q36R1ln9L95n28J028l82m83
$$ -926 -758 447 -252 217 -446 -53 -641 -458 219 1251 826 -10 81 78 19 414 -114 914 532 49
3879D9p83P74l39Q26j261R19m46K63P23j18j447M77N21q05O80K80j22n22J79m2
$$ 49 -734 40 -299 527 -734 185 -261 2 725 607 -840 -363 158 -647 33 313 191 -331 -152 -194
3899a94J21JJ053M34q67K62p21l33J073j61J88j148J11q22R58k00L44J50j198
$$ -194 -73 -72 981 1415 548 810 89 -244 829 668 856 -292 -181 -1003 -45 -245 99 249 -949
3918i49l12J263q66k19P1N22l19N83l17J26J256K84j832L20K63R02o24N37p89
$$ -949 -1261 2 -864 -1083 -1012 -490 -809 -226 -543 -417 839 1123 -709 -389 -126 776 152 689 -100
3937a00N1J038n96R6N42j109m9J61J87J176j891M27k80Q55N06j146K19L39p74
$$ -100 -49 989 393 489 1031 -78 -127 34 221 1397 -494 -67 -347 508 1014 -132 87 426 -348
3956c48q76R36N76n55J38j68o61Q81P58J36k84k32L17P8n29k24P78p42l06J543
$$ -348 -1224 -288 288 -267 -129 -297 -958 -77 681 817 533 301 618 696 167 -57 721 -21 -327 1216
3976A216j230L21L98k4K28j82j825M52Q37k9o68J214j484o14J956o01K13m01m01
$$ 1216 -14 307 705 681 909 727 -1098 -646 191 162 -506 708 -776 -1390 566 -35 178 -223 -624
3995f24l61k8N57Q34L31m57M94j01p9M46j35r86O20o99n19J469O9P1j056Q53n15
$$ -624 -985 -1013 -456 378 709 252 746 645 566 1012 877 -109 511 -188 -707 762 831 902 -154 699 184
4016A84n26M45M4r29p15J317q4P23m73N08j033p43J641o49J02J010k89p92N25
$$ 184 -342 103 147 -782 -1497 -180 -264 459 -14 494 -539 -1282 359 -290 -188 822 533 -259 266
4035B66m29P26P60j557O16m22J104r15N37o04P26j159J008q21l44M06L52k52m11
$$ 266 -163 563 1323 -234 382 -40 1064 149 686 82 808 -351 657 -164 -508 -102 250 -2 -413
4054d13n43k10J318o70J051o31j75k32O02P42o55k63p67J783N4j169O74m68j71
$$ -413 -956 -1166 152 -518 533 -98 -273 -505 97 839 184 -79 -846 937 991 -178 496 28 -143
4073a43K84N51n52J003n85o33j48K22m53J742j207J03J48j397J699k40n33K6n04
$$ -143 141 692 140 1143 558 -75 -223 -1 -454 1288 81 184 332 -1065 634 394 -139 -113 -617
4092f17j89J264j031J290m64j98o38J657o76k4q61l66R62m07l11O79p85J091R8
$$ -617 -806 458 -573 717 253 55 -583 1074 398 374 -487 -853 109 -298 -609 70 -715 376 474
4111D74M25j354Q66j12p14o59J630j003l33Q94m73N62n69n0N00J69K1m93N30o33
$$ 474 899 -455 411 299 -415 -1074 556 -447 -780 114 -359 203 -366 -416 84 253 274 -219 311 -322
4131c22J472j125R80M50q91k54j596J297Q1O7K71O45k024P45N3L76n0m0J6n99
$$ -322 1150 25 1005 1455 564 310 -1286 11 92 159 430 1075 -949 -204 -151 225 175 135 151 -448
4151d48J18M71n78J62K97Q1n66L84K94j22m17j05O22l41L17o41J007j306P65Q17
$$ -448 -330 141 -437 -275 22 103 -463 -79 215 93 -324 -429 193 -148 169 -472 535 -771 -6 811
4171H11n97K24q50L46k94o9L21J533m95q74K78Q46k426J523p69j50oQ12j69M63
$$ 811 214 438 -412 -66 -360 -429 -108 1425 930 56 334 1180 -1246 277 -492 -642 -648 164 -5 458
4191D58n30Q39j142J677r39j180N51k70P38Q5M44p34l92K26n90M15L34k0o21O96
$$ 458 -72 767 -375 1302 363 -817 -266 -536 202 287 731 -3 -395 -169 -759 -344 -10 -30 -651 45
4211D5M32o94R14j829J82J220M05r10O61n75K6p3m28J370J44j785J623m91P62
$$ 45 477 -217 697 -1132 -950 270 675 -235 426 -149 -123 -196 -624 746 890 -895 728 237 999
4230I99K90j64j155K75q47J309j82Qj16j827K105j119o05R93N81r10n43K02K04
$$ 999 1289 1125 -30 245 -602 707 525 533 417 -1410 695 -424 -1029 -36 545 -365 -908 -706 -502
4249e02P48J09n68N2j4O00m53K52p76J782n53l02k45J6K72Q01k347J808j060m50
$$ -502 246 355 -213 -161 -175 425 -28 224 -552 1230 677 375 130 146 418 1219 -1128 680 -380 -830
4269h30N47Q60n42P21o33r14k5L2P39m71J89L63m11O84l06J40o63l46M21O03J136
$$ -830 -283 577 35 756 123 -791 -816 -784 -45 -516 -327 36 -375 309 3 143 -520 -866 -445 158 1294
4290A294j402p18m5J323J60l69Q12j926R06J388j250P38J73m10m22j014J907p92
$$ 1294 -108 -826 -871 452 612 243 1055 -871 35 1423 173 911 1084 674 252 -762 1145 353
4308C53J01l72n55J501j290J79n3J04j193J72J672j303N76LO96n41Q5J40o71J139
$$ 353 454 82 -473 1028 -262 -83 -136 -32 -1225 -1053 619 -684 -108 -105 591 50 135 275 -396 743
4328G43L33L33p84j116k61K88P24o15Q56q62OJ431r6j042p0O21m53K19k5l43N31
$$ 743 1076 1409 625 -491 -752 -464 260 -355 501 -361 -355 1076 980 -62 -132 489 36 255 230 -113 418
4349D18k63m35L6L99N6k60q0r7M58m68O55L98n01Mp78J233K5q7j19k051R98K31
$$ 418 155 -280 -244 155 211 -49 -129 -226 232 -236 419 817 316 320 -458 775 800 713 594 -1457 -459 -228
4371b28O63J9p79N41p63N49p89J570j414M32k94L87m6M6J469j571n00l60J367
$$ -228 435 454 -325 216 -547 2 -787 783 -631 -199 -493 -106 -152 -106 1363 -208 -708 -1068 299
4390B99O54p79L32n74Q86l6j12o82Q94j05q88O70j5M02j245K57O93l21l66J41
$$ 299 953 174 506 -68 818 782 670 -12 882 777 -111 559 544 946 -299 -42 651 330 -36 105
4410A05M17R6j678J053r14J288J80k48r05K127j889N65p19Q08j52o0l25M51m03
$$ 105 522 618 -1060 -7 -921 367 547 299 -606 1521 -368 197 -522 286 134 74 -251 200 -203
4429b03K80p05J558q63o97N0L45q9Q93r66L1j0M86K71p65j1n53J557j032n55J943
$$ -203 77 -628 930 67 -630 -580 -235 -324 569 -397 -366 -376 110 381 -384 -395 -948 609 -423 -978 965
4450I65j147p6J00J375m28L49q46j24L32l8J39m88o1J84N2o85J281p60n7r42M85
$$ 965 -182 -258 -158 1217 789 1138 292 168 500 462 601 113 52 236 288 -397 884 124 67 -875 -390
4471c90N42J97j51k83R2J14r49L10P5P73k63K26j071J389K9r49M78k83j334J907
$$ -390 152 349 198 -85 7 121 -828 -518 -443 330 67 293 -778 611 640 -309 169 -114 -1448 459
4491D59j28j375J515l70R53Kp57K00r43O01p04J492k89O2n90L40r71N14k30q19
$$ 459 331 -1044 471 101 1054 1056 299 499 -444 157 -547 945 656 718 128 468 -503 11 -219 -1038
4511a038J060J94Q37m94q05k88K07J045n92J74j79j2j005R59j86L50j253P35R52
$$ -1038 22 216 1053 559 -246 -534 -327 718 126 300 121 109 -896 63 -123 227 -1026 -291 661
4530F61j024O19K04o87n61Q59q79O1P19J04k54J81J88K33l46j508P44J93M7O14
$$ 661 -363 256 460 -227 -788 71 -808 -747 -28 76 -178 3 191 424 78 -1430 -686 -493 -446 168
4550A68J46r8j084R95L92m86o7J79J10k23j85K92k82J208j237L38k65N75p39l50
$$ 168 314 216 -868 127 519 33 -34 145 255 32 -153 139 -143 1065 -172 166 -99 476 -263 -613
4570f13M12m15M47R0J35j12m04PJ379j001O23q90L10k53J1J463j856j21M52J399
$$ -613 -201 -616 -169 -79 56 -56 -460 -453 926 -75 548 -342 -32 -285 -274 1189 -667 -788 -336 1063
4590A063q41Q23j349P73K55k36k40M59p91P12q67P9m92P62R41j270M87J09l01
$$ 1063 222 1045 -304 469 724 488 248 707 -84 628 -239 -160 -652 110 1051 -219 268 377 76
4609G6j92J15n04O58J88l40l82L78n91Q7Q68o60O41M69j589J507j491J430K3r91
$$ 76 -116 -1 -505 153 341 1 -381 -3 -594 -507 361 -299 342 811 -778 729 -762 668 691 -300
4629c00P41k08M60j594Q23p10P86p50o46J676M62r86l24P85m04J87j58j40J31
$$ -300 441 233 693 -901 -78 -788 -2 -752 -1398 278 740 -246 -570 215 -189 -2 -160 -300 -169
$$ [...]
8191H20
##END NTUPLES=NMR FID
##END=
