##TITLE=1H_IAMT-115
 DMSO, 8 sc, 
 11.2.2019
##JCAMPDX= 6.0         $$ Bruker NMR JCAMP-DX V2.0
##DATA TYPE= NMR FID
##DATA CLASS= NTUPLES
##ORIGIN= UXNMR, Bruker Analytische Messtechnik GmbH
##OWNER= root
$$ XWIN-NMR		Version 3.5
$$ Mon Feb 11 16:39:53 2019 Russian Standard Time (UT+4h)  she@DPX200
##.OBSERVE FREQUENCY= 200.1313
##.OBSERVE NUCLEUS= ^1H
##.DELAY= (6, 6)
##.ACQUISITION MODE= SIMULTANEOUS
##.ACQUISITION SCHEME= undefined
##.AVERAGES= 8
##.DIGITISER RES= 18
##SPECTROMETER/DATA SYSTEM= spect
##.PULSE SEQUENCE= zg30
##.SOLVENT NAME= DMSO
##.SHIFT REFERENCE= (INTERNAL, DMSO, 0, 15.7039)
##AUDIT TRAIL= $$ (NUMBER, WHEN, WHO, WHERE, WHAT)
$$ ##TITLE= Audit trail, XWIN-NMR		Version 3.5
$$ ##JCAMPDX= 5.01
$$ ##ORIGIN= Bruker BioSpin GmbH
$$ ##OWNER= she
$$ F:/spectra/data/she/nmr/H-F/1/audita.txt
$$ ##AUDIT TRAIL=  $$ (NUMBER, WHEN, WHO, WHERE, WHAT)
(   1,<2019-02-11 16:38:35.37 +0400>,<she>,<DPX200>,
      <created by zg, POWCHK disabled, PULCHK disabled
       configuration hash MD5:
       00 E9 B6 7A A2 85 ED C7 34 08 36 98 17 FE 4E 26
       data hash MD5: 16K
       98 DC 9D 62 96 C1 7D 38 CF 24 8F 90 B0 AF 50 1C>)
$$ ##END=
$$ 
$$ hash MD5
$$ 42 14 D3 78 B8 C2 71 1E 03 13 C2 E0 2F 53 9D 52
##$RELAX= 
##$RELAX= 
##$RELAX= 
##$RELAX= 
##$RELAX= 
##$RELAX= 
$$ Bruker specific parameters
$$ --------------------------
##$DU= <F:/spectra>
##$EXPNO= 1
##$NAME= <H-F>
##$PROCNO= 1
##$TYPE= <nmr>
##$USER= <she>
##$AMP= (0..31)
100 100 100 100 100 100 100 100 100 100 100 100 100 100 100 100 100 100 
100 100 100 100 100 100 100 100 100 100 100 100 100 100 
##$AQSEQ= 0
##$AQ_mod= 1
##$AUNM= <au_zg>
##$AUTOPOS= <>
##$BF1= 200.13
##$BF2= 200.13
##$BF3= 200.13
##$BF4= 200.13
##$BF5= 200.13
##$BF6= 200.13
##$BF7= 200.13
##$BF8= 200.13
##$BYTORDA= 1
##$CFDGTYP= 0
##$CFRGTYP= 5
##$CHEMSTR= <none>
##$CNST= (0..31)
1 1 145 1 1 1 1 1 1 1 1 1 1 1 1 1 1 1 1 1 1 1 1 1 1 1 1 1 1 1 1 1 
##$CPDPRG= <>
##$CPDPRG1= <>
##$CPDPRG2= <>
##$CPDPRG3= <>
##$CPDPRG4= <mlev>
##$CPDPRG5= <mlev>
##$CPDPRG6= <mlev>
##$CPDPRG7= <mlev>
##$CPDPRG8= <mlev>
##$CPDPRGB= <>
##$CPDPRGT= <>
##$D= (0..31)
0 1.2 0 0 0 0 0 0 0 0 0 0.03 0 0 0 0 0 0 0 0 0 0 0 0 0 0 0 0 0 0 0 0 
##$DATE= 1549888714
##$DBL= (0..7)
120 120 120 120 120 120 120 120 
##$DBP= (0..7)
150 150 150 150 150 150 150 150 
##$DBP07= 0
##$DBPNAM0= <>
##$DBPNAM1= <>
##$DBPNAM2= <>
##$DBPNAM3= <>
##$DBPNAM4= <>
##$DBPNAM5= <>
##$DBPNAM6= <>
##$DBPNAM7= <>
##$DBPOAL= (0..7)
0.5 0.5 0.5 0.5 0.5 0.5 0.5 0.5 
##$DBPOFFS= (0..7)
0 0 0 0 0 0 0 0 
##$DE= 6
##$DECBNUC= <off>
##$DECIM= 32
##$DECNUC= <off>
##$DECSTAT= 4
##$DIGMOD= 1
##$DIGTYP= 9
##$DL= (0..7)
0 120 120 120 120 120 120 120 
##$DP= (0..7)
150 150 150 150 150 150 150 150 
##$DP07= 0
##$DPNAME0= <>
##$DPNAME1= <>
##$DPNAME2= <>
##$DPNAME3= <>
##$DPNAME4= <>
##$DPNAME5= <>
##$DPNAME6= <>
##$DPNAME7= <>
##$DPOAL= (0..7)
0.5 0.5 0.5 0.5 0.5 0.5 0.5 0.5 
##$DPOFFS= (0..7)
0 0 0 0 0 0 0 0 
##$DQDMODE= 0
##$DR= 18
##$DS= 0
##$DSLIST= <SSSSSSSSSSSSSSS>
##$DSPFIRM= 0
$$ [...]
##$SUBNAM2= <"">
##$SUBNAM3= <"">
##$SUBNAM4= <"">
##$SUBNAM5= <"">
##$SUBNAM6= <"">
##$SUBNAM7= <"">
##$SUBNAM8= <"">
##$SUBNAM9= <"">
##$SW= 20.0189088683792
##$SWIBOX= (0..15)
0 0 2 0 0 0 0 0 0 0 0 0 0 0 0 0 
##$SW_h= 4006.41025641026
##$TD= 16384
##$TD0= 1
##$TE= 0
##$TE2= 300
##$TE3= 300
##$TEG= 300
##$TL= (0..7)
0 120 120 120 120 120 120 120 
##$TP= (0..7)
150 150 150 150 150 150 150 150 
##$TP07= 0
##$TPNAME0= <>
##$TPNAME1= <>
##$TPNAME2= <>
##$TPNAME3= <>
##$TPNAME4= <>
##$TPNAME5= <>
##$TPNAME6= <>
##$TPNAME7= <>
##$TPOAL= (0..7)
0.5 0.5 0.5 0.5 0.5 0.5 0.5 0.5 
##$TPOFFS= (0..7)
0 0 0 0 0 0 0 0 
##$TUNHIN= 0
##$TUNHOUT= 0
##$TUNXOUT= 0
##$USERA1= <user>
##$USERA2= <user>
##$USERA3= <user>
##$USERA4= <user>
##$USERA5= <user>
##$V9= 5
##$VALIST= <valist>
##$VCLIST= <CCCCCCCCCCCCCCC>
##$VD= 0
##$VDLIST= <DDDDDDDDDDDDDDD>
##$VPLIST= <PPPPPPPPPPPPPPP>
##$VTLIST= <TTTTTTTTTTTTTTT>
##$WBST= 1024
##$WBSW= 4
##$XGAIN= (0..3)
0 0 0 0 
##$XL= 0
##$YL= 0
##$YMAX_a= 150728
##$YMIN_a= -182893
##$ZGOPTNS= <>
##$ZL1= 120
##$ZL2= 120
##$ZL3= 120
##$ZL4= 120
##$ABSF1= 10
##$ABSF2= 0
##$ABSG= 5
##$ABSL= 3
##$ALPHA= 0
##$AQORDER= 0
##$ASSFAC= 0
##$ASSFACI= 0
##$ASSFACX= 0
##$ASSWID= 0
##$AUNMP= <proc_1d>
##$AZFE= 0.1
##$AZFW= 0.1
##$BCFW= 1
##$BC_mod= 2
##$BYTORDP= 1
##$COROFFS= 0
##$CY= 11.3945322036743
##$DATMOD= 1
##$DC= 2
##$DFILT= <>
##$DTYPP= 0
##$F1P= 18.9103706918063
##$F2P= -1.10871071338519
##$FCOR= 0.5
##$FTSIZE= 0
##$FT_mod= 4
##$GAMMA= 1
##$GB= 0.15
##$INTBC= 1
##$INTSCL= 1
##$ISEN= 128
##$LB= 0.24
##$LEV0= 0
##$LPBIN= 0
##$MAXI= 10000
##$MC2= 0
##$MEAN= 0
##$ME_mod= 0
##$MI= 1.114404
##$NCOEF= 0
##$NC_proc= 0
##$NLEV= 6
##$NOISF1= 3.799351
##$NOISF2= 2.8
##$NSP= 1
##$NTH_PI= 0
##$NZP= 0
##$OFFSET= 15.70392
##$PC= 1
##$PHC0= -8683
##$PHC1= 13.80018
##$PH_mod= 1
##$PKNL= yes
##$PPARMOD= 0
##$PSCAL= 0
##$PSIGN= 0
##$REVERSE= no
##$SF= 200.130013532006
##$SI= 16384
##$SIGF1= 3
##$SIGF2= 2
##$SINO= 400
##$SIOLD= 16384
##$SREGLST= <1H.CDCl3>
##$SSB= 0
##$STSI= 0
##$STSR= 0
##$SW_p= 3612.71676300578
##$SYMM= 0
##$S_DEV= 0
##$TDeff= 0
##$TDoff= 0
##$TI= <>
##$TILT= no
##$TM1= 0
##$TM2= 0
##$TOPLEV= 0
##$USERP1= <user>
##$USERP2= <user>
##$USERP3= <user>
##$USERP4= <user>
##$USERP5= <user>
##$WDW= 1
##$XDIM= 8192
##$YMAX_p= 0
##$YMIN_p= 0
$$ End of Bruker specific parameters
$$ ---------------------------------
##NTUPLES= NMR FID
##VAR_NAME=  TIME,          FID/REAL,        FID/IMAG
##SYMBOL=    X,             R,               I
##VAR_TYPE=  INDEPENDENT,   DEPENDENT,       DEPENDENT
##VAR_FORM=  AFFN,          ASDF,            ASDF
##VAR_DIM=   8192,          8192,            8192
##UNITS=     SECONDS,       ARBITRARY UNITS, ARBITRARY UNITS
##FACTOR=    0.0002496,     1,               1
##FIRST=     0,             0,               0
##LAST=      2.0444736,     0,               0
##MIN=       0,             -182893,         0
##MAX=       2.0444736,     150728,          0
$$ Real data points
##PAGE= N=1
##DATA TABLE= (X++(R..R)), XYDATA
$$ [...]
1754D8j98j27N88r9o8j64K13q1k52J60K27j78j44K84l27K80k46l5N9J27j65n7
$$ 48 -150 -277 311 212 144 -20 193 112 -140 20 247 69 -75 209 -118 162 -84 -119 -60 67 -98 -155
1776a55J35j09p6p5J52K28j56j65J01o6M86r2k13K7L2J15l87K62k09J18K44p9
$$ -155 -20 -129 -205 -280 -128 100 -56 -221 -120 -186 300 208 -5 22 54 169 -218 44 -165 -47 197 118
1798A18q1l84O2L50N0J02J92n10L17j99j36l1J47N9j6j3p6Jj34J64k53M07j51
$$ 118 37 -347 -285 65 115 217 409 -101 216 17 -119 -150 -3 56 40 27 -49 -48 -182 -18 -271 136 -15
1821a5J3J97j16N0k29J63J46k26K8N8l37M37j73N6j40KJ83j59K0j67L05j47m1
$$ -15 -2 195 79 129 -100 63 209 -17 11 69 -268 169 -4 52 -88 -86 97 -62 -42 -209 96 -51 -92
1844i2J73l15J90M47j60q3o40M70J99j04m7k07L04o2k1nO6k33L50j64j43J05P7
$$ -92 81 -234 -44 403 243 160 -480 -10 189 85 38 -169 135 73 52 47 113 -120 230 66 -77 28 105
1867A05l2L9K3l12j7J14O3j18K73k35J15K05k73Q3Q1m2R7j75j84q8J95L62m35
$$ 105 73 112 135 -177 -194 -80 -17 -135 138 -97 18 223 -50 33 114 72 169 -6 -190 -278 -83 279 -156
1890a56j05K69k28J95J83m2k30K71K82l42j65K4j28K97L0j25j40K11kk28K08M1
$$ -156 -261 8 -220 -25 158 116 -114 157 439 97 -68 -44 -172 125 155 30 -110 101 99 -129 79 120
1912A20J34k5o92N78j16j27J63J19l23J14J84j31M58n89J33l8J85l15J29k83K69
$$ 120 254 229 -463 115 -1 -128 35 154 -169 -55 129 -2 456 -133 0 -38 147 -168 -39 -322 -53
1933e3M3R9N5k80J32L40j67N4n63M09l1M4q2k2O3jL5N3m39L72J52J08m28M2QL12
$$ -53 -10 89 144 -136 -4 336 169 223 -340 69 38 82 0 -22 41 40 75 128 -311 61 213 321 -107 -65 -57 255
1959B55k66j39L09m37M90j25k27k2m2L60J37k65M4KK00m5l22K99k69K54N9k68
$$ 255 -11 -150 159 -278 212 87 -140 -162 -204 156 293 28 72 74 274 229 -93 206 -63 191 250 -18
1981a8J36k02J50K35k82j40J9R3J62k34L3J59k1J15l24J43k38N82l51j04l38M55
$$ -18 118 -84 66 301 19 -121 -102 -9 153 -81 -48 111 90 205 -119 24 -214 368 17 -87 -425 30
2003C0J74j92J3k3j58K92k00q8J27o7J30M9r9K0L65k66m2l0q6q8k1J66J82m13
$$ 30 204 12 25 2 -156 136 -64 -152 -25 -92 38 87 -12 8 373 107 65 35 -51 -139 -160 6 188 -225
2027b25J24jP3j02J85r8O1K10j13m15P9N29k7l37O7j90OM04l00J72l17K02R0q8
$$ -225 -101 -102 -29 -131 54 -44 17 227 114 -301 -222 307 280 -57 10 -180 -174 230 -70 102 -215 -13 77 -11
2051a1P6j55J00J4J1J39k90K54K2l18J79j77K51k6j30l23K76K58n9K27m99L15
$$ -11 65 -90 10 24 35 174 -116 138 160 -158 21 -156 95 69 -61 -384 -108 150 91 318 -181 134
2073A34l79L74K76l50j83JJ17J38Qj72J69l56K83ol44L60J27r0q9j18O8j3J33
$$ 134 -245 129 405 55 -128 -127 -10 128 136 -36 133 -223 60 54 -290 70 197 107 18 -100 -32 -45 88
2096H8m0Q6l56P38m54q9j17J50L38j78o8J47m03K42rj5k8j56K52n4M4k95nK84
$$ 88 48 134 -222 516 62 -27 -144 6 344 166 98 245 -158 84 75 60 32 -124 128 74 118 -177 -182 102
2120A02R0k33J8n6J49pQ1j00p6J71L47l63j77J02O0j51J16k15j6K26L2J50n95
$$ 102 192 -41 -23 -79 70 63 144 44 -32 139 486 123 -54 48 108 -43 73 -142 -158 68 100 250 -345
2143c45L36J65j89j6l3j35L75j18J02p0j32J10j40M13n30kN06k92K5j0Q8j65L5
$$ -345 -9 156 -33 -49 -82 -217 158 40 142 72 -60 50 -90 323 -207 -209 297 5 30 20 108 -57 -22
2166b2n0M1P1j61j4J58P0j41j33L40Ml68L84j67J24L44p85J96O3K9J9l13J32K09
$$ -22 -72 -31 40 -121 -135 23 93 -48 -181 159 163 -205 179 12 136 480 -305 -109 -46 -17 2 -311 -179 30
2190C0j41L47l0p2k9m9l2P9Mj21M63k40j04l14K86J23L3k35j56K2L17j37r8K21
$$ 30 -111 236 206 134 105 56 24 103 107 -14 449 209 105 -209 77 200 233 -2 -158 -136 181 44 -54 167
2214A67j92L23k34l99K88K75j25j1k50N6l5L63k75L95l42j40J24K4l6k29K98P3
$$ 167 -25 298 64 -335 -47 228 103 92 -158 -102 -137 226 -49 346 4 -136 -12 12 -24 -253 45 118
2236A18k6m6l2j21J39p8K17J42k61N5KQ7l46J85J0J2j84K71k74J18K13J0k15K71
$$ 118 92 46 14 -107 32 -46 171 313 52 107 109 196 -150 35 45 57 -127 144 -130 -12 201 211 -4 267
2260B67k45J20p5P6k59P4L6J69m23K13l0K55j48O7r1J44M9j13k25O1J38p1K19
$$ 267 22 142 67 143 -116 -42 -6 163 -260 -47 -77 178 30 97 6 150 199 86 -139 -78 60 -11 208
2283B08l84R2L6J78k19N7m7L8J67k89oMJ27J01j13M9k18K77K81k30j92L32n7q6
$$ 208 -176 -84 -48 130 -89 -32 -79 -41 126 -163 -169 -165 -38 63 -50 -1 -219 58 339 109 -83 249 192 106
2307A06n1j85J78k3K3K12l23L8pK28j51j80j1K50j87J37j55L43j57j97O9J5l2
$$ 106 55 -130 48 25 48 260 -63 -25 -32 196 45 -135 -146 104 -83 54 -101 242 85 -112 -43 -28 -60
2330f0J29j65K08j11P7j80l9K98M7l83J46J83r2K2l23P1J95r5K44k46p0M87l46
$$ -60 69 -96 112 1 78 -102 -141 157 204 -179 -33 150 58 80 -243 -172 23 -72 172 -74 -144 343 -3
2353cJ81N1j67O5j75J98k84J73o3j0n7j42O6k6L44j13K45m82K26R7l1j63j30J4
$$ -3 178 229 62 127 -48 150 -134 39 -24 -34 -91 -233 -167 -193 151 38 283 -199 27 124 93 -70 -200 -186
2377a86L26j04J38k17n0J74k29J18R2J07k36n3R6l15L70K8j51K28l55J02R4l4
$$ -186 140 36 174 -43 -93 81 -148 -30 62 169 -67 -120 -24 -339 31 59 -92 136 -219 -117 -23 -57
2399e7n1j4J32J18o3P0j62m2K21l4l33L1L70r6Po0J02j6k47J04J3k56L20N3J3
$$ -57 -108 -122 10 128 65 135 -27 -69 152 118 -215 -184 186 90 97 37 139 123 -124 -20 -7 -263 57 110 123
2424A23J22k44J04j94N0J05J79j24m0q7K99k69r0J56j25L5l7j7j47J45j65L39
$$ 123 245 1 105 -89 -39 66 245 121 81 -6 293 24 -66 90 -35 0 -37 -54 -201 -56 -221 118
2446A18k55M8J50j05Q3K37j28r6J20j35r8P1L35o9J2k11j25J93n44O36m08J9K7
$$ 118 -137 -89 61 -44 39 276 148 52 172 37 -61 10 345 276 288 77 -48 145 -399 237 -171 -152 -125
2469a25O8q5K35J03k76P2j36K82M5l45K95j35j47J34j13j30K62R5p5J05l20K88
$$ -125 -57 -142 93 196 -80 -8 -144 138 183 -162 133 -2 -149 -15 -128 -258 4 99 24 129 -191 97
2491I7K4pl84K19j36P0L3K36j14j95J18J34l08K4J96Rk52K75k44J33K18j76J57
$$ 97 121 114 -270 -51 -187 -117 -84 152 38 -157 -39 95 -213 -189 7 16 -236 39 -205 -72 146 -30 127
2514A27j91L14l96K12l31k1L30j33M82l49pN6q1m7J67q9L1L11n07K32k65j5K51
$$ 127 -64 250 -146 66 -265 -286 44 -89 393 44 37 93 12 -35 132 43 74 385 -122 110 -155 -170 81
2537H1r2LK09k53j08lO2J00k63M21j69j71L01j74M5K33K40k79Q3m14J63o4J06
$$ 81 -11 -8 201 -52 -160 -163 -101 -1 -264 157 -12 -183 118 -56 -11 222 462 183 266 -148 15 -49 57
2560E7n3k63o5J75J22m9K29j03k11P7pQ5J21k56J59k87M55m97J78M38j62J06j88
$$ 57 4 -259 -324 -149 -27 -76 153 50 -161 -84 -91 -6 115 -141 18 -269 186 -311 -133 305 143 249 61
2583F1j84J79k18J10J36j24r9K00l95N00l41J77r2J25j94P5K90l28L7K49j87J25
$$ 61 -123 56 -162 -52 84 -40 -139 61 -334 166 -175 2 -90 35 -159 -84 206 -122 -85 164 -23 102
2605A02n4l42M16j34J8J1j29K43j59P4J02j51J11o2k58N8K06k23L6L11r3k71K45
$$ 102 48 -294 122 -12 6 17 -112 131 -28 46 148 -3 108 46 -212 -154 52 -171 -135 176 83 -188 57
2628E7r5R6j55K22J1j26J0O8k8N2j1L42m04k8o8O8j40J61m2J19q9j73L94j98O9
$$ 57 -38 58 -97 125 136 10 20 88 60 112 101 443 39 11 -57 11 -129 32 -10 109 20 -153 241 43 112
2653A12j31K18l67K53N0l26q9N54j72j58L0l8n0J00k12J51K76j92M9J11k77J59
$$ 112 -19 199 -168 85 135 -191 -280 274 102 -56 -26 -64 -114 -14 -226 -75 201 9 58 169 -108 51
2675E1k9J59l59J83J0J38k18K70k91J59j10j00L70j87k57P6J22O4p2K57l12Q8
$$ 51 22 181 -178 5 15 153 -65 205 -86 73 -37 -137 233 46 -211 -135 -13 51 -21 236 -76 12
2697A2o5J17j34Q7k05J21jK6L2J38l1l91L42J49j51j22M9J1K07p1K4m10L68O4
$$ 12 -53 64 -70 17 -188 -67 -68 -42 -10 128 97 -294 48 197 46 -76 -27 -16 191 120 144 -266 102 166
2721A66k9j65O9N2nRj20M1l%J09p7J32j22j79J47p6J00O4k21P1j5J25O9m4k44
$$ 166 137 -28 41 93 88 97 -23 18 15 15 124 47 179 57 -122 25 -51 49 113 -108 -37 -52 73 142 98 -146
2747a46K54n3n9J79o1r9n9K72j82j54k3J1N4J05j20j26L46k78j15K74J69k18L5
$$ -146 108 55 -4 175 114 15 -44 228 46 -108 -131 -120 -66 39 -81 -207 139 -139 -254 20 189 -29 6
2770Fj57M8K94k75L7j68P4N0K11k77K54r1k02o3K56K4k10J51J74j75J06J96l62
$$ 6 -151 -103 191 -84 -47 -215 -141 -91 120 -157 97 6 -196 -259 -3 21 -189 -38 136 -39 67 263 -99
2793i9K08N5j73J88j90q4J1Q2k7p5K9Q9r2J01o4j65J46J59l10J96M64n90Q3J26
$$ -99 109 164 -9 179 -11 -95 -84 -2 -29 -104 -75 14 -78 23 -41 -206 -60 99 -211 -15 449 -141 -58 68
2817F8o8J21j44K8Q0k6L1l52K48k14K89l3K27j07l27R2J33q1J43m0J47j91J94
$$ 68 0 121 -23 5 85 59 90 -262 -14 -228 61 28 255 148 -179 -87 46 -35 108 68 215 24 218
2840B18k09k83N44k32j01M14k59j18M81m91m4mj81J36J44J93m36J68J53J56k94
$$ 218 9 -274 270 38 -63 351 92 -26 455 -36 -80 -84 -265 -129 15 208 -228 -60 93 249 -45
2861d5j55J41P0r6%M3j95L21j43J58l72J54K81l13K05P5m02M07m89L52p7K67j99
$$ -45 -200 -59 11 -85 -85 -42 -237 84 -59 99 -273 -119 162 -151 54 129 -273 134 -355 -3 -80 187 -12
2884a2j86J1L18j55J42j77MJ26j02m6L56k41N4n8R3M1l43J98m3j46J36Q6L3j11
$$ -12 -198 -187 131 -24 118 -59 -55 71 -31 -77 279 38 92 34 127 168 -175 23 -20 -166 -30 56 89 -22
2908b2Q2j17J31p7K75l52L47M1k11m8n0r6O0N0K3m4J47k36J81J5P9l31J43N8r
$$ -22 60 -57 74 -3 272 -80 267 308 97 49 -1 -97 -37 13 36 -8 139 -97 84 99 178 -153 -10 48 39
2933C9p1J37l1Qm3k0O0j69J79OL3j66Q2k57K23R8j59nk3M5J06p1k77L50j54j43
$$ 39 -32 105 74 82 39 19 79 -90 89 95 128 -38 44 -213 10 108 -51 -56 -79 -34 72 1 -276 74 -80 -223
2959b23J59l3K8q7N64j34l08p3K03j59k24M08j52N7J16Lj60Q4j61J28r0J82m5
$$ -223 -64 -97 -69 -156 408 274 -34 -107 96 -63 -287 121 -31 26 142 145 -15 69 -92 36 -54 128 83
2982H3r6j23N6j09m5K56r6K4K04j60j09P9J52l01K17n7j29K82R7j63K48K4l40
$$ 83 -13 -136 -80 -189 -234 22 -74 -50 154 -6 -115 -36 116 -185 32 -25 -154 128 225 62 310 334 -6
3005fj90L39k7J20Jk41K11j03M5j91m6K65k43K10p2NJ43l74J77O3l6m4N0k57J67
$$ -6 -196 143 116 236 237 -4 207 104 149 -42 -88 177 -66 144 72 77 220 -154 23 86 50 6 56 -201 -34
3030c4j0J02p3N4K2l00L21K05j21j45J04l4k3o8Q0k94K66J44j48j52K02k19Q0
$$ -34 -44 58 -15 39 61 -239 82 287 166 21 125 91 68 0 80 -214 52 196 48 -104 98 -121 -41
3053d1K19j35k08K08k02K66J1j42O4l0K46k14j67J12Kk5J5n9%k02K70K13o5j17
$$ -41 178 43 -165 43 -159 107 118 -24 40 10 256 42 -125 -13 -11 -36 -21 -80 -80 -282 -12 201 136 19
3077A9p4L4R2k13J65l9l4j81K2K97o5J25l59J04J76P4j65Q1J45l36K10j97L33
$$ 19 -55 -21 71 -142 23 -16 -50 -231 -209 88 23 148 -211 -107 69 143 -22 59 204 -132 78 -119 214
3100B14l22K5K15k24J24K9k07L00k15j6m2K83r1p5L5j65j27K98Q5o1Q8p8j04o6
$$ 214 -108 -83 132 -92 32 61 -146 154 -61 -77 -119 164 73 -2 33 -132 -259 39 124 63 151 73 -31 -97
3124i7L6r1R0J3K7J29j12P3j07l5J41o9l9J00j26J56k99J01L72l38J49o4j03N0
$$ -97 -61 -152 -62 -49 -22 107 -5 68 -39 -74 67 -2 -41 59 -67 89 -210 -109 263 -75 74 10 -93 -43
3148d3R3k24L17Q9l40k80L46K9l1R9j82K54k47J05J9N2L08m30K55j18k04J88M2
$$ -43 50 -174 143 232 -108 -388 -42 -13 -44 55 -127 127 -120 -15 4 56 364 -66 189 71 -133 55 97
3171I7k27J83nL42k10l03n2J38K23o3l78L30j27M4j15J76J11m8k38R2K10p0k29
$$ 97 -130 53 48 390 180 -123 -175 -37 186 123 -255 75 -52 -8 -123 53 164 116 -122 -30 180 110 -119
3194a19J82j95N73m70j4K17m12K02J49Q2R0k40j40J35j8r3j32L73q6N3j07r7j1
$$ -119 63 -132 441 -29 -43 174 -238 -36 113 195 285 45 -95 40 22 -71 -203 170 84 137 30 -67 -78
3217g8K78k48R0j15N3J02P8k01J14L8n66O40j6k27K83j38J5r2r1N5J98k22K44
$$ -78 200 -48 42 -73 -20 82 160 -41 73 111 -455 185 169 -58 225 87 102 10 -81 -26 172 -50 194
3240A94k95L00k40m3Q6j89K26m0j01L15l11O3K41kNk64L4K35J17l06%K0j50J84
$$ 194 -101 199 -41 -84 2 -187 39 -1 -102 213 -98 -35 206 204 209 -55 -21 214 331 25 25 45 -105 79
3264G9j84J75r6R6j04J4j38L23L6j60J66q8q1N6j72j0K70m7l5J02o0j27Kj81J64
$$ 79 -105 70 -26 70 -34 -20 -158 165 201 41 207 119 38 94 -78 -88 182 135 100 202 142 15 17 -164 0
3289@o0j40j22K88K68j82k93L39J9j60n8L81m02K63j42J51o2j73K03j4n9l07M2
$$ 0 -60 -200 -322 -34 234 52 -241 98 117 -43 -101 280 -122 141 -1 150 88 -85 118 104 45 -262 -220
3312b20Q8J09P5j67K63m9j31L3j28K8P3k7o0Q6J87j03jj24J67Q8m9k02J26j55
$$ -220 -132 -23 52 -115 148 99 -32 1 -127 -99 -26 -53 -113 -27 160 57 56 -68 99 187 138 -64 62 -93
3336i3mN1L8Q9M7j84O3j08K52k41j02L07k02L20k16KM3m7r4N2J55NQ5k21Q6k43
$$ -93 -97 -46 -8 81 128 -56 7 -101 151 -90 -192 115 -87 233 17 19 62 15 -79 -27 128 133 218 -3 83 -160
3362a60M4Q2r7J51J42j52J01P4l04K70j95Q0k70K04m7O1l2J13R1j96L13k85j50
$$ -160 -116 -34 -131 20 162 10 111 185 -119 151 -44 36 -234 -30 -77 -16 -48 65 156 -40 273 -12 -162
3385a62J61p3J49K00l11J15J24k34j24M96n11K24k61J00J58K06l66N3J85j13n9
$$ -162 -1 -74 75 275 -36 79 203 -31 -155 341 -170 54 -207 -107 51 257 -109 -56 129 16 -43
3406d3r7K04p5j1l40N11j62N0N1k41J64j23K93j41q9m1K75k04K29k49P7K6J21
$$ -43 -140 64 -11 -22 -362 149 -13 37 88 -153 11 -112 181 40 -49 -90 185 -19 210 -39 38 64 185
3429A85N2j73j24r3J85p1J8n3RJ38P1k8k18J16M3l12L22k36L48l06N9J6L6j2J3
$$ 185 237 64 -60 -153 32 -39 -21 -74 -65 73 144 116 -102 14 57 -255 67 -169 179 -127 -68 -52 -16 -28 -15
3454a5j09K15k78K09j26J05L6j40J93j40M9j84P7q2K61j26K33p1J49k65R3q3k16
$$ -15 -124 91 -187 22 -104 1 37 -103 90 -50 -1 -185 -108 -190 71 -55 178 107 256 -9 84 1 -215
3477b15J35M6K0r4L78o3k95M5J93j77J98n5p4K98j69j31k7j46K55Q2m24J40J86
$$ -215 -80 -34 -14 -108 270 207 -88 -43 150 -27 171 116 42 340 171 40 13 -133 122 204 -220 -80 106
3500A06J38q2k66k4Q1k46K74K7k8k8Q5j81P1J41j70J57j95N7j8L4j26K71q8L4
$$ 106 244 162 -104 -128 -47 -293 -19 8 -20 -48 37 -144 -73 68 -102 55 -140 -83 -101 -67 -193 78 -10 24
3524B4r2J41j89O8m7k3n2J80K57m37R0OJ55l36K60j26K02m2j42M6o8j27N7O9O0
$$ 24 -68 73 -116 -48 -95 -118 -170 10 267 -170 -80 -74 81 -255 5 -121 81 39 -103 -57 -125 -252 -195 -126 -66
3549f6L85l43OP9Ml7K49p1Jl44K5k2P4J36K47l55J57l19J51j59P7L86l46J79j72
$$ -66 319 -24 -18 61 65 28 277 206 207 -137 -112 -134 -60 76 323 -32 125 -194 -43 -202 -125 261 -85 94 -78
3574g8K52k15J54r1K1j26j72OK86J49j93L0j1J2qJ02Q3j9n8j26P5K51l03p3R8
$$ -78 174 -41 113 22 43 -83 -255 -249 37 186 -7 23 12 24 16 118 201 182 124 -2 73 324 21 -52 46
3599D6K06l30M1j00j45M81k59j61J74K28k21J4j0M1J6p7nJ36L7j49K6K4m9K9N7
$$ 46 252 -78 -37 -137 -282 199 -60 -221 -47 181 -40 -26 -36 5 21 -56 -61 75 112 -37 -11 13 -36 -7 50
3624E0m9J75l51K61k57R8l0K22K38l80N3J8J21o6j37L3M3k3L8q1R6qNk8K00m95
$$ 50 1 176 -175 86 -171 -73 -103 119 357 -23 30 48 169 103 -34 -1 42 19 57 -24 72 64 69 41 241 -254
3650b54K25l27J89K74M7j04j63N9P2k75L85k90j56J10K16j44N00n93L64j26n9
$$ -254 -29 -356 -167 107 154 50 -113 -54 18 -257 128 -162 -318 -208 8 -136 364 -229 135 9 -50
3671e0L03k29lJ17r5j63J96j15K97j32j39j64R6R2J88j46q3j00P6J47O5j16p9
$$ -50 253 24 21 138 43 -120 76 -39 258 126 -13 -177 -81 11 199 53 -30 -130 -54 93 158 42 -37
3694c7KN1r9Q6J98k12j19K44j01q7j78J54M03l20K10l25J55j07J43m12K94P9j4
$$ -37 -35 16 -83 3 201 -11 -130 114 13 -74 -252 -98 305 -15 195 -130 25 -82 61 -351 -57 22 8
3717HJ6r6K27j62J7Q2j13r1K52n9j00j44K49l14p9P3L87l5J19j90j00J61j08k29
$$ 8 24 -72 155 -7 10 92 -21 -112 140 81 -19 -163 86 -228 -307 -234 153 118 237 47 -53 108 0 -229
3741b29L39m1l5J60k97K47k43K60m45L74j44K19J02j91qq4K82q6m05K52L3o9J0
$$ -229 110 69 34 194 -103 144 -99 161 -284 90 -54 165 267 76 68 -16 266 180 -225 27 60 -9 1
3764AJ29j54J94l55K78J14j30J70l74K25j73P8j3PJ21j39K25m2Jl25J09N1l8J6
$$ 1 130 -24 170 -185 93 207 77 247 -127 98 -75 3 -10 -3 118 -21 204 162 163 -162 -53 -2 -40 -24
3788b4J49K4m17M68n32K97J42n5r3k7p2J85p6j32N6J50J10j74N7N1j43k8k1J66
$$ -24 125 149 -268 200 -332 -35 107 52 -41 -68 -140 45 -31 -163 -107 43 153 -21 36 87 -56 -84 -105 61
3812F1P4l7m60K32J63J6j27j90J93j33P6P9Q7k70J39n4J75k9k1Rk06L84j44Q6
$$ 61 135 98 -362 -130 33 49 -78 -268 -75 -208 -132 -53 34 -236 -97 -151 24 -5 -26 -17 -223 161 17 103
3836A03k0m6j88L15N4J8n07K12j26K60o7j14Qp0K44K1j13j55L69j08K99l40l6
$$ 103 83 37 -151 164 218 236 -271 -59 -185 75 8 -106 -98 -168 76 97 -16 -171 198 90 389 49 13
3859A3N6m2j3J87j53m9n8j51K76j67mK8nO1j90Q7R3nr0L12j60L14l77P0j67R4
$$ 13 69 27 14 201 48 -1 -59 -210 66 -101 -105 -77 -82 -21 -211 -124 -31 -36 -126 186 26 340 -37 33 -134 -40
3885d0pP9O4o2k74N28m13O9K9j16J56j40J77j4nq1R5J36k24k2L33n07R0N10l43
$$ -40 -47 32 96 34 -240 288 -125 -56 -27 -143 13 -127 50 36 31 -50 45 181 -43 -65 268 -239 -149 361 18
3910A8k6J52j18K16k58K72j03k61L03j05r6K64k60K4J28l03L39N2k47P7l03N34
$$ 18 -8 144 26 242 -16 256 153 -108 195 90 -6 258 -2 22 150 -153 186 238 -9 68 -235 299
3932B99k26j30m2M17k25M1j31p5J23n6j4K05n70K94K22K62k04k40J6j86K20K18
$$ 299 73 -57 -99 318 93 134 3 -72 51 -5 -19 186 -384 -90 132 394 190 -50 -34 -220 0 218
3954B18k28j95L78l72K56k90M16k18N4j05K90j81J32k18J8J8P2k25K48J06j5j35
$$ 218 -10 -205 173 -199 57 -233 183 -35 19 -86 204 23 155 -63 -45 -27 45 -180 68 174 159 24
3976B4j33O5J4j83J07J31KM0k17Q1m9r1L77k67K6k3p7O1R0J97j88L12l94L91p5
$$ 24 -109 -44 -30 -213 -106 25 27 67 -150 -69 -118 -209 168 -99 -73 -96 -173 -112 -22 175 -13 299 -95 296 221
4001B21k60Q0k30L04O1j05l05K82m3M0Q1l48K06J46k48k84M81k00kK42l38L58
$$ 221 -39 41 -189 115 176 71 -234 48 5 45 126 -222 -16 130 -118 -402 79 -121 -123 119 -219 139
4023A39Q2j96nj8k84J43M2j39M15j94J14j60L58k56m5K44k54j07L17k77j83J16
$$ 139 221 25 20 2 -282 -139 -97 -236 179 -15 99 -61 297 41 -4 240 -14 -121 196 -81 -264 -148
4045a48M42m30L7M8Q1Q7l7J5j90L42m28L36j03j38l7j26K93j32J58qj76J17j50
$$ -148 294 -136 -99 -51 30 117 80 95 -95 247 -181 155 52 -86 -123 -249 44 -88 70 62 -114 3 -147
4068a47J71n9J30m4J30k19J18J7p1l2k5l5k30L35o8J62k23N5r6J85j65r5J7J77
$$ -147 24 -35 95 51 181 -38 80 97 26 -6 -31 -66 -296 39 -29 133 -90 -35 -131 54 -111 -206 -189 -12
4092a2n1L6n1P0kJ28j02j93J85J71k11m5K96m12M81k95L30l10L9O9j89j5J10p9
$$ -12 -63 -27 -78 -8 -10 118 16 -177 8 179 -32 -77 219 -193 288 -7 323 13 52 121 -68 -83 27 -52
4116e2k7J99J49j63j23O9j8j7p2L00q5l15M3J01j24P7L8J22q8k65M31l98K44j54
$$ -52 -79 120 269 106 -17 52 34 17 -55 245 160 -155 -112 -11 -135 -58 -20 102 14 -251 180 -218 26 -128
4140a28J40k7J76j08R7j49J47k38M14l56k4J15M6J45l92J64R8j38j36j1m7K91
$$ -128 12 -15 161 53 150 1 148 -90 324 -32 -56 59 105 250 -142 22 120 -18 -154 -165 -212 79
4162G9l07K66pj4j39Q0K97k43k4K31o6k85K12o6l06L22J16L3j44j5J97k48j02
$$ 79 -228 38 31 17 -122 -42 255 12 -12 219 153 -132 80 14 -292 30 146 179 35 20 217 -31 -133
4185a33J21jJ09p9j01K38j55p1J3Jp3l3R6k1oM9J09k1o3M4n8J66k72R1o2j1L63
$$ -133 -12 -13 96 17 -84 154 -1 -72 -59 -58 -131 -164 -68 -89 -95 -46 63 42 -21 23 -35 131 -141 -50 -112 -123 240
4212B40k42j47j19K17j57J65K7k05L76j86k09P3o3J44J15K15l73J04N1j27K14
$$ 240 -2 -149 -268 -51 -208 -43 -16 -221 155 -31 -240 -167 -230 -86 29 244 -129 -25 26 -101 113
4233A13ok17K7M1m8P7j29O4j1J26j42K77j13J03l00N6J91J32j23k56K99j32k9
$$ 113 107 -110 -83 -42 -90 -13 -142 -78 -89 37 -105 172 59 162 -138 -82 109 241 118 -138 161 29 0
4256@J60j30N4k87J63M8N8K2j52R3l43L00j98k7K05N4L6j26J26j17R9j0P6l39
$$ 0 160 30 84 -203 -40 8 66 88 -64 29 -314 -14 -212 -239 -34 20 56 -70 56 -61 38 28 104 -235
4280b35K05%r4L79j27j13J44j31j7j58J23q0J9l0K47l10K42j07J08r5J32l0l8
$$ -235 -30 -30 -124 255 128 15 159 28 11 -147 -24 -104 -85 -115 132 -178 64 -43 65 -30 102 72 34
4303C4m0MM1m6n7J98m61L55Q0l26O6LL01j75J09o3J14k16J53J0k17J1j19K63n5
$$ 34 -6 -2 39 -7 -64 134 -327 28 108 -218 -152 -149 152 -23 86 23 137 -79 74 84 -133 -122 -241 22 -33
4328c3K32k29J79k25j22M31k68J84k61L9J65j08P4l9j68J76J05j12j05L31m71
$$ -33 199 -30 149 -76 -198 233 -35 149 -112 -73 92 -16 58 19 -149 27 132 20 -85 246 -225
4349b25J43L7P0P8l23J65J97l94J93kR7k04R0J22q1Q2P0k36K47l50J24K18k33
$$ -225 -82 -45 25 103 -220 -55 142 -252 -59 -61 36 -168 -78 44 -37 45 115 -121 126 -224 -100 118 -115
4372a15R2j7J73r4n7L9J45p1q3N5r1J94K14l61R8j18Q1J07p3j60K25l9j87Q7R9
$$ -115 -23 -40 133 39 -18 21 166 95 12 67 -24 170 384 23 121 3 84 191 118 -42 183 144 -43 44 143
4397A43qj4l2P6k48J0J19l09K14j0J91r8Rj80Q8j34J43J96O1m7k29J01l44K14
$$ 143 135 121 89 165 -83 -73 46 -263 -49 -59 132 34 43 -137 -49 -183 -40 156 217 170 -59 42 -302 -88
4421h8K02k53Q0j0j84K35J00j08J62j70R3K48l87J59j9L9k44K10k09J69R7j87
$$ -88 114 -139 -59 -69 -253 -18 82 -26 136 -34 59 307 -80 79 60 99 -145 65 -144 25 122 -65
4443f5k68L01K11r1j87j0L8J97J10p3j30M9Lj3o9J8j38rQ9K43j00M0k08K30k72
$$ -65 -333 -32 179 88 -99 -109 -71 126 236 163 33 82 85 72 3 21 -117 -126 -37 206 106 146 -62 168 -104
4468a04K12j97J16N7n0L1m2J27l01J04O8J73j29j60L10j94q4J65pj59J53j16M6
$$ -104 108 -89 27 84 34 65 23 150 -151 -47 21 194 65 -95 215 21 -63 102 95 -64 89 -27 19
4491A9P3L5J20j16j9J20j37k47K48j81J48j35o9K69j26k51K42K2P4k30m2P9K52
$$ 19 92 127 247 131 112 232 95 -152 96 -85 63 -72 -141 128 2 -249 -7 15 89 -141 -183 -104 148
4514A48k51R5k14K23j73J19o0N7K35k15P8j83N20m46jK2R9J17j91N6O2j72j23
$$ 148 -103 -8 -222 1 -172 -53 -113 -56 179 -36 42 -141 379 -67 -68 -46 53 170 -21 35 97 -75 -198
4537a98J64J11m1J05J3k67J52o2r8p9R4R3J43l11J38q7q0K28O1m3k5R8l48L3M63
$$ -198 -34 77 36 141 154 -113 39 -23 -121 -200 -106 -13 130 -181 -43 -130 -210 18 79 36 11 109 -239 -206 257
4562B57m76L78j55n6l1L4k11K05J42J73l02Q5pQ0Q6r0j50j67K88m72J67K81r7
$$ 257 -219 159 4 -52 -83 -49 -260 -55 87 260 -42 43 36 116 202 112 -38 -205 83 -389 -222 59 -38
4585c8o0J15l2J69l01J76J66j81j60L3J97j03k52J04J61n1J08pk66N0K16N7j34
$$ -38 -98 17 -15 154 -147 29 195 14 -146 -113 84 -19 -271 -167 -6 -57 51 44 -222 -172 44 101 -33
4608c3J62l40%J42J3J53k70K81J97n68L18k04J57j28n7J85r7J28K7P9n3j74K3
$$ -33 129 -211 -211 -69 -56 97 -173 108 305 -263 55 -149 8 -120 -177 8 -89 39 66 145 92 -82 -59
4631e9K3J47r8L20k06l07M71j75j46J58k7MJ14k41K29k45j31J00L06m16O9K25
$$ -59 -36 111 13 333 127 -180 291 116 -30 128 101 105 219 -22 207 -38 -169 -69 237 -179 -110 115
4653A15j35K9J32j95Rp1q2K15L7k35k44L33k12N74j94j04N1N6k4K70j76r1q4K43
$$ 115 -20 9 141 -54 -45 -116 -198 17 54 -181 -425 -92 -304 270 76 -28 23 79 55 325 149 58 -26 217
4677B17k88P6p2n3L77l30K7k11J0L2K14K55l21J9o8J11O5p5j09J25K5p9Q2M4j61
$$ 217 -71 5 -67 -120 257 -73 -46 -257 -247 -215 -1 254 -67 -48 -116 -5 60 -15 -124 1 26 -53 29 73 -88
4702h8r9J07K72m89J20N12k74K7O6K94n13K86m31K28J32%m6k0k03K86l84K67j66
$$ -88 -187 -80 192 -297 -177 335 61 88 154 448 -65 221 -210 18 150 150 104 84 -119 167 -217 50 -116
4725a16L7P5J19k72J23j05J5K99k21l2J76P5k22q4J33R1j26J20k42R4J04j2j58
$$ -116 -79 -4 115 -157 -34 -139 -124 175 -46 -78 98 173 -49 -133 0 91 -35 85 -157 -63 41 29 -129
4748a29K14j18L2j35J37J25k21q1Q9J2J19k06p6L40k87L06k11J79Q2j04j50n9
$$ -129 85 -33 -1 -136 1 126 -95 -176 -87 -75 44 -162 -238 102 -185 121 -90 89 171 67 -83 -142
4770a42K04k5J05l54O3O9Qj33L33l13M20k06q4j52K29R0j98K66k29qn1r9J75k59
$$ -142 62 37 142 -212 -149 -80 -72 -205 128 -185 235 29 -55 -207 22 112 -86 180 -49 -57 -108 -207 -32 -291
4794b91M69q4J04k55r1M27l38q0J04k4O4M5l79K59J35j29j3j00j2K38m3j25N2
$$ -291 178 94 198 -57 -148 279 -59 -139 -35 -59 5 50 -329 -70 65 -64 -77 -177 -189 49 6 -119 -67
4817f7J10N5P1m27K22r3n4K7J74r4Om7L5O1J01K68m92Q7Joq0J5M6J14J75j06k80
$$ -67 43 98 169 -258 -36 -129 -183 -156 18 -76 -70 -117 -82 -21 80 348 -144 -57 -56 -62 -142 -127 -81 33 208 102 -178
4844a78O7R1r9K55j28rj68J25M06o48N92n73L76j71J61J02p1j37K7n0p8J39p2
$$ -178 -111 -20 -119 136 8 -1 -169 -44 362 -286 306 -267 109 -62 99 201 130 -7 20 -30 -108 31 -41
4867d1J84k60p6J43k57L51l4J10j72k66J72j9K50m1j36O8l4P7J22j58L3K6J13
$$ -41 143 -117 -193 -50 -307 44 10 120 -52 -318 -146 -165 85 44 -92 -24 -58 19 141 -17 16 42 155
4890A55k38K22l39M27j98j55K27k37K00k59J65Q2j19Q1j79J61l1p1J90JJ04j67
$$ 155 -83 139 -200 227 29 -126 101 -136 64 -195 -30 52 -67 14 -165 -4 -35 -106 84 85 189 22
4912B2J14j22j30K56n5j26j47K32r9J83l17J49l4K02j55k4O9M8j30K51k19J82
$$ 22 136 14 -116 140 85 -41 -188 44 -55 128 -189 -40 -74 128 -27 -51 18 66 -64 187 -32 150
4934A50k90L07J35j32K7Ll51O7J51k54N1K74r3RN3k8j51k3K77l24O6K21K45l25
$$ 150 -140 167 302 170 197 200 -151 -84 67 -187 -136 138 45 54 107 79 -72 -95 182 -142 -76 145 390 65
4958F5j33n1j5M1q1K69M2k98J71J0J29%l37p9M87k51J04KLk91L83o0J63n30M3
$$ 65 -68 -119 -134 -93 -174 95 137 -161 10 20 149 149 -188 -267 220 -31 73 75 78 -213 170 110 273 -257 -214
4983b14K66k4j23N8J86l09J51J84j52j24N5L6n4J92k57K64k43J35rk18M68p5n5
$$ -214 52 28 -95 -37 149 -160 -9 175 23 -101 -46 -10 -64 128 -129 135 -108 27 18 -200 268 193 138
5006A38k69J78j01J0j97P01p72M82l17L24r2j70q0K84j82r0K26j67n1K56j97l
$$ 138 -131 47 -54 -44 -241 460 -312 170 -147 177 85 -85 -165 119 -63 -153 73 -94 -145 111 -86 -89
5028h9J91J7P8n03M12j56K51l04rK99j70J12m0N3k89r7L31k72L49j19R1k3l21
$$ -89 102 119 197 -306 106 -50 201 -103 -112 187 17 129 89 142 -147 -244 87 -185 164 45 136 113 -208
5051b08R9K77J9RO5k77J08j6rj23J88J42oj67l2o7L8j93R9M29o23K42oKJ09k34
$$ -208 -109 168 187 196 261 -16 92 76 67 -56 132 274 268 101 69 2 40 -153 -54 375 -248 -6 -12 -10 99 -135
5077a35N6L3R1J05l26Q0p8J8L64k34M9j04J57j98j30L61K45l73q6RJ6Mj06L44
$$ -135 -79 -46 45 150 -176 -96 -174 -156 208 -26 23 -81 76 -122 -252 109 354 -19 -105 -96 -80 -76 -182 162
5101A62k54j09L74j18Kk6Mj35K08j64k86L44j52l4rJ56J57J17m15L58j39m0J04
$$ 162 -92 -201 173 55 57 31 35 -100 108 -56 -342 2 -150 -184 -193 -37 120 237 -178 180 41 1 105
5124A05R9k33L8J43k58R7k68M44q3j04o4L8J62KJ0m5q1L8l7j55L47l03K5K33k24
$$ 105 204 -29 9 152 -106 -9 -277 167 84 -20 -84 -46 116 118 128 83 2 40 3 -152 195 -108 -83 150 -74
5149g4J44q7j41n6kQ8Q2j90K99M5J3k38j9m0J0K77j14J11l4j54K25j23J02p6m7
$$ -74 70 -17 -158 -214 -216 -128 -46 -236 63 108 121 -117 -136 -176 -166 111 -3 108 74 -80 145 22 124 48 1
5174AJ72m05K15j80m3K35J80k63j70K50J64m34K58o1J90k0l9j93K30j80o7L3K53
$$ 1 173 -232 -17 -197 -240 -5 175 -88 -258 -8 156 -278 -20 -81 109 89 50 -143 87 -93 -160 -127 126
5197A26m1l1P3j38Q7j77q3P5P4p8Mj71K25j9J85k61J80k64M6L45j58LpK7p4J66
$$ 126 85 54 127 -11 76 -101 -184 -109 -35 -113 -109 -280 -55 -74 111 -150 30 -234 -188 157 -1 2 -5 22 -52 114
5223A14k43j92K51J69k40K72j97M03l00j23J80K7o8j6K01j02j41P5j48L00j20
$$ 114 -129 -321 -70 99 -141 131 -66 337 37 -86 94 121 53 37 238 136 -5 70 -78 222 102
5244A02J6j21J39l28J56k18J53K00j47q0K96k55J42k06L30j5j36j12J55Q0o8l05
$$ 102 118 -3 136 -192 -36 -254 -101 99 -48 -128 168 -87 55 -151 179 164 28 -84 71 151 83 -222
5266b22M97r4k06L55k67P2k87K43q6M7L0k94K86o3L8p7K32n6n31L63mL8K36k4
$$ -222 275 181 -25 330 63 135 -152 91 5 52 82 -212 74 11 49 -28 204 148 -383 -20 -24 14 250 226
5290B26j22j70J54p5J42r4m9j36J54P0j59J78j72j23Q9N7m1K43j77Q8j72ML2j9
$$ 226 104 -66 88 13 155 61 12 -124 30 100 -59 119 -53 -176 -87 -30 -71 172 -5 83 -89 -85 -53 -72
5314g2J73r0M1LP7j55l7J81j96J60l22J2K64q5Q4m9R8l27J47oQ7K62k50n3J60
$$ -72 101 11 52 55 132 -23 -60 121 -75 85 -237 -225 39 -46 38 -11 87 -240 -93 -99 -12 250 0 -53 107
5339A07k12J98j45M4J41q7j43j46N8K77j48j21J03P3n8o2K77k88n2J84J3k36L50
$$ 107 -105 93 -52 -8 133 46 -97 -243 -185 92 -56 -177 -74 -1 -59 -121 156 -132 -184 0 13 -223 127
5362A27l61J54J54k27m0L40l66L52M8k63l3J11J2j9qL41m63K29k16L94n34K75
$$ 127 -234 -80 74 -153 -193 147 -219 133 181 -82 -115 -4 8 -11 -19 322 -141 88 -128 266 -268 7
5384GM7K4J8np8j06K96k53J06R8m22J55M9J08L9R1j33K7M8k19J58k08K97J99j18
$$ 7 54 78 96 91 13 -93 203 -50 56 154 -268 -113 -64 44 83 174 41 68 116 -103 55 -153 144 343 225
5409B25k99L85k43j41J14l6K03l00N9jL9k6Lj19J82l38L79l5j1K37l38Q1j22L86
$$ 225 -74 311 68 -73 41 5 208 -92 -33 -34 5 -21 -18 -137 45 -293 86 51 40 277 -61 20 -102 284
5433B84l68J2N2m8K17j56m1j8K04j52k37M54j22q4J62k12n7J0k13L83k06J73r5
$$ 284 -84 -72 -20 -68 149 -7 -48 -66 138 -14 -251 203 81 -3 159 -53 -110 -100 -313 70 -136 37 -58
5456e8rj2q2j8N5jK8R6m2J74k6J34p4o9k59L11k75J0L69k03k16L13K1Jl24K15
$$ -58 -67 -79 -161 -179 -124 -125 -97 -1 -43 131 105 239 165 96 -163 148 -127 -117 252 49 -167 146 167 168 -156 59
5482E9o0n5K36o7j85L87j13p1mo7J00J94m95J04J50j68j27J96K40k76k30J77P3
$$ 59 -1 -56 180 113 -72 315 202 131 127 60 160 354 -141 -37 113 -55 -182 14 254 -22 -252 -75 -2
5505bm2nK92j23j27o8m8K40l38K03J17J53m39K39j39K04olj05J11k87R4j65J57
$$ -2 -44 -49 243 120 -7 -75 -123 117 -221 -18 99 252 -187 52 -87 117 111 108 3 114 -173 -79 -244 -87
5529h7J06k72J00K33j94J06n4R4M9r0R4j30J60j47m1k0l8J03k02K31J70j80p8
$$ -87 19 -253 -153 80 -114 -8 -62 32 81 -9 85 -45 115 -32 -73 -93 -131 -28 -230 1 171 -9 -87
5552h7J85j49K60l32J2K85m38N1K02j05L18l23K2K36p3MK2q3o3P5j92K51R9l31
$$ -87 98 -51 209 -123 -111 174 -264 -213 -11 -116 202 -121 -99 137 64 68 90 7 -56 19 -173 78 177 -154
5576a54J20J68r3j12J04Q2j97J59J10j71j96J70P4k48L27nj88r0l8J07J45J3R5
$$ -154 -34 134 41 -71 33 115 -82 77 187 16 -180 -10 64 -184 143 138 -50 -140 -178 -71 74 87 182
5599A82Nl33J64j14L3J17m10o6J68J62K42l9p7K8M8o5J07n6l9j22K29k85O5K03
$$ 182 187 -146 18 -96 -63 54 -356 -422 -254 -92 150 111 34 62 110 45 152 96 57 -65 164 -121 -56 147
5623A47k25K53Jj04O1q1o4R2k04J10k45J42j51L05J17j89p7q6K11mM9l9j57J42
$$ 147 -78 175 176 72 133 52 -12 80 -124 -14 -259 -117 -268 37 154 -35 -112 -198 13 9 58 19 -138 4
5647Dj5J27J4k67J1L13k89l0J08P8j75J75j81K2J00P9j14J21p0J21J0j15R3j94
$$ 4 -11 116 130 -137 -126 187 -102 -132 -24 54 -121 54 -127 -105 -5 74 -40 81 11 132 142 27 120 -74
5671g4R2j79J07P2q9l4j12K26K11j72k44L81L6l21rK38Pp6l2j36K01j13j80J35
$$ -74 18 -161 -54 18 -71 -105 -217 9 220 48 -196 185 221 -100 -109 129 136 60 28 -108 93 -20 -200 -65
5695f5P9j00Q1K76n84K96N1K4l6o6N6J4m06N65j53R4n1rL9k79J34P7j78o8J14
$$ -65 14 -86 -5 271 -313 -17 34 58 22 -44 12 26 -380 185 32 126 75 66 105 -174 -40 37 -141 -209 -95
5720i5k2L05j17q7%J69j9j94J96j82M20q5m82N3M5N3j4L00l37j08L75q3j14R9
$$ -95 -117 188 71 -16 -16 153 134 -60 136 -46 374 289 -193 -140 -95 -42 -56 244 -93 -201 174 91 -23 76
5744G6k64L64l02O5j01r1J1K15j15J92j00K18l58K23j57K97j92k9J92n52M33k4
$$ 76 -188 176 -126 -61 -162 -253 -242 -27 -142 50 -50 168 -190 33 -124 173 -19 -48 144 -408 25 1
5766Aj67K58l84J77K46k31Q8o9J60L5k05j68L76j53m5m4N7K11n0j32J75P6l70
$$ 1 -166 92 -292 -115 131 -100 -12 -81 79 114 -91 -259 117 -36 -81 -125 -68 143 93 -39 136 212 -158
5789a58j26L24n5k24K40o3J70j46m2J08k84J86k4N5K2j38O9J42J8j6p8j27l5J40
$$ -158 -284 40 -15 -239 1 -62 108 -38 -80 28 -256 -70 -94 -39 -17 -155 -86 56 74 58 -20 -147 -182 -42
5813d2j02K36k8k18R2K60k5Jk16k7J62n8Q1Qj54j99N06q6J41m17K01l71J94J15
$$ -42 -144 92 64 -154 -62 198 173 174 -42 -69 93 35 116 124 -30 -229 277 191 332 -85 116 -255 -61 54
5837E4m5l6nj96P6J56Jj1J77k26K30k96K3K69k88J22j00K11p6K13j63k83K12k74
$$ 54 9 -27 -32 -228 -152 4 5 -6 171 -55 175 -121 -98 171 -117 5 -95 116 40 253 90 -193 19 -255
5861b55L30K6j59Q7k05K24k98N19q3o3j01j19j48N18k23O5j88L45j37r3J03k88
$$ -255 75 101 -58 29 -176 48 -250 269 186 123 22 -97 -245 273 50 115 -73 272 135 42 145 -143
5883a43L66j70J08n1O9k69K22m00M67j3k42rJ39Q0k8j22k47L69k1r9j48J43J09
$$ -143 223 53 161 110 179 -90 132 -268 199 186 -56 -65 74 154 126 4 -243 126 105 6 -142 1 110
5906A10j1r6J15k02N1P3k25K28J66m89L05o1P3r1J58j33R3j63Q1K16k60J33j94
$$ 110 99 3 118 -84 -33 40 -185 43 209 -280 25 -36 37 -54 104 -29 64 -99 -18 198 -62 71 -123
5929a23K32k03K18j25j31L25j92J82m7Jj34J17M8l21M5j5L21j78j06J42j07P2
$$ -123 109 -94 124 -1 -132 193 1 183 136 137 3 120 168 -153 -108 -123 198 20 -86 56 -51 21
5951B1l6k32P5J51M3k16K74j48K2j41K61K4l0K1J57j03j31k3o6Q2m15K93J70K5
$$ 21 -15 -247 -172 -21 22 -194 80 -68 -46 -187 74 98 68 89 246 143 12 -11 -77 5 -410 -117 53 78
5975G8l0k17L47r0k13J52Q3J4j17r6j48J9qM77k73J31l97L24k24J43j13K95j54
$$ 78 48 -169 178 88 -125 27 110 124 7 -89 -237 -218 -226 251 -22 109 -288 36 -188 -45 -158 137 -17
5998a7k09K84j70Q4K16k39K80j98l7K14o5j11J07k13J91j19l74M08J76j03JM1
$$ -17 -226 58 -112 -28 188 -51 229 31 -6 208 143 32 139 -74 117 -2 -376 32 208 105 106 147
6020A47l38Q6O4k14j75L61K8j74K50P4j96K15k40j54K45J74j05j26P9K0j17O6
$$ 147 -191 -105 -41 -255 -430 -69 -41 -215 35 109 -87 128 -112 -266 -21 153 48 -78 1 21 -96 -30
6042c0N4KJ77j20k17J9J68l9l5O1q6J52k30J07Q0k37J15k6j8M23l13j28k00K83
$$ -30 24 26 203 83 -134 -115 53 14 -21 40 -46 106 -124 -17 63 -174 -59 -85 -103 320 7 -121 -321 -38
6066c8km3oO0m8K45o3j30lJ24k0j34K20j69P0j03m9J4l0J18P6J01j68Q4p7o8K4
$$ -38 -40 -83 -89 -29 -77 168 105 -25 -28 96 76 -58 162 -7 63 -40 -89 -75 -105 13 89 190 22 106 29 -39 -15
6093a5J01M7k0q6q7j53J78m0J94k69P9j41M78l2j28o1lr7K54j91M7k8J29j25R
$$ -15 86 133 113 27 -60 -213 -35 -75 119 -150 -71 -212 266 234 106 45 42 -55 199 8 55 27 156 31 40
6118D0M2k3j51j49J16K34j78l4j8J12J14j92r3K93K1K06j21l06J07j25J9L1r5
$$ 40 82 59 -92 -241 -125 109 -69 -103 -121 -9 105 -87 -180 113 134 340 219 -87 20 -105 -86 -55 -150
6141a50PK37j01R4N0j76J34n1l2j78M8J05J39k48J39K38l84N14l75m1L0J93k16
$$ -150 -143 94 -7 87 137 -39 95 44 12 -166 -118 -13 126 -122 17 255 -129 385 10 -31 -1 192 -24
6164b4R2n6K17k63N0j72L30k53R4j47mK5N5Q4L6k90K39j95k2N13l68J33l6O0j22
$$ -24 68 12 229 -34 16 -156 174 -79 15 -132 -136 -111 -56 28 64 -226 13 -182 -204 309 -59 74 38 98 -24
6189b4N9k9j31Q4Q8L2k61K6n7J21N2N4p2m6K0K27k51L42k71mJJ07j03k13K77L4
$$ -24 35 6 -125 -41 47 79 -182 -156 -213 -92 -40 14 -58 -104 -84 143 -108 234 -37 -41 -40 67 -36 -249 28 62
6215F2J40k70j12K12J59j76N7j08j87j11L22M6%m0j79L5j5J43n1J45K9k40J98
$$ 62 202 -68 -180 32 191 15 72 -36 -223 -334 -12 34 34 -6 -185 -150 -165 -22 -73 72 101 -139 59
6238E9j20j19J3J13o3K53k31J92k86NjJ84q6J47j54k9Q8O1P3Q9j94l7J55p9J94
$$ 59 -61 -180 -167 -54 -117 136 -95 97 -189 -184 -185 -1 -87 60 -94 -123 -35 26 99 188 -6 -43 112 33 227
6263B27l95j4J77L01m32K62j20J38k90J37r1K89k39J00O0l27L58j32J53L0j81
$$ 227 -168 -182 -5 296 -136 126 6 144 -146 -9 -100 189 -50 50 110 -217 141 9 162 192 11
6284A1J99r9k73K74%l1l12K61j07K93j28k53K43j20J30J05Q3k82O9J14j60r4K19
$$ 11 210 111 -162 112 112 81 -231 30 -77 216 88 -165 78 -42 88 193 276 -6 63 177 17 -77 142
6307A42mk00J88nk20J74m8j09O4jJ94j84J97j21P9l34K76M0k55K83j74R3k34K03
$$ 142 138 -62 126 121 -99 75 27 -82 -18 -19 175 -9 188 67 146 -188 88 128 -127 156 -18 75 -159 44
6331D4k18K00Q0Q2j00RN1l33K58r9j43K29l1q9kQ4r5K5j2L1j04J45l0l7K14j32
$$ 44 -174 26 106 188 88 97 148 -185 73 -26 -169 60 29 -60 -62 22 -73 -48 -60 -29 -133 12 -18 -55 159 27
6357B7Q2j37Q0l20M58m31L08J03j92m6J76j21Q1N2l8q7j04K41r6j8J20l19N4J01
$$ 27 109 -28 52 -268 190 -241 67 170 -22 -68 108 -13 68 120 82 -5 -109 132 36 18 138 -181 -127 -26
6381b6J43L4j48n1j6K53Ol35K45k89K93J00k58j21K47p6n0l9J18r3oK23k72J89
$$ -26 117 151 3 -48 -64 189 195 -140 105 -184 109 209 -49 -170 77 1 -49 -88 30 -63 -69 154 -118 71
6405G1Kj75J97j99K69q2J70l18J51l83N18j78J47O2l36n1O7Q0Nj66J7J28k4po
$$ 71 73 -102 95 -104 165 83 253 -65 86 -297 221 43 190 252 -84 -135 -68 12 17 -149 -132 -4 -28 -35 -41
6430d1K8K90j58O5j63K3j78K19J10l64rL32j06O4Q3j66j15J07L1m1J11N9j17l55
$$ -41 -13 277 119 184 21 44 -134 85 195 -169 -178 154 48 112 195 29 -86 21 52 11 122 181 64 -291
6454b91K97j19poQ1J4o7O0RL08l52K26R0l33J60J0p8J99k47K9jJ70j78J92j8l
$$ -291 6 -113 -120 -126 -45 -31 -98 -38 -29 279 -73 153 243 -90 70 80 2 201 -46 -17 -18 152 -26 166 148 145
6480A45n1l33L29m1j31L51k98n6R1j13J02m0O5m4J22l07K57n1r8k37L96k84N41
$$ 145 94 -239 90 49 -82 269 -29 -85 6 -107 -5 -45 20 -24 98 -209 48 -3 -101 -338 58 -226 315
6503C15l85J28j03K3r4J04k03K40j31j7K05j48J20J8M0oj43Q6L3m4N6Qj6J60k08
$$ 315 -70 58 -45 -22 -116 -12 -215 25 -106 -123 82 -66 54 72 112 106 -37 49 82 38 94 102 86 246 38
6528C8j77K4QM45m26J80j06j3O3k33L58j43m6j4J35j45j34K40q3o1J34M8k93J07
$$ 38 -139 -115 -107 338 -88 92 -14 -27 36 -197 161 18 -28 -42 93 -52 -186 54 -29 -90 44 92 -201 -94
6552i4K67j47k1L81o10L25k98J57K31l64J42l9O2j45J81L0K35l00J5j64K05J59
$$ -94 173 26 5 386 -224 101 -197 -40 191 -173 -31 -70 -8 -153 28 58 293 -7 8 -156 49 208
6574B08J5P7k05J39j99P4j4j3o4r8L76l88K61j07l1l4J13j77M4r7O1K66j59J31
$$ 208 223 300 95 234 35 109 95 82 18 -80 296 -92 169 62 31 -3 110 -67 -23 -120 -59 207 48 179
6598A79k3K2j65j09L3n8r2K90p6Q9l34K35Q2k85L31j41r6K71k18j3r4O6K12k15
$$ 179 156 178 13 -96 -63 -121 -213 77 1 90 -244 -9 73 -212 119 -22 -118 153 -65 -78 -172 -106 106 -109
6622a09P3P0j17P4K94k44j29jJ60j41J92k74K47r0k0Q7K5r3j2o0R7j79lJ94J09
$$ -109 -36 34 -83 -9 285 41 -88 -89 71 -70 122 -152 95 5 -15 72 97 4 -8 -68 29 -150 -153 41 150
6647A50J04l23J8n8L29l17Q9O2q0j35L5J21q9P3k8R4k9o2j78L51j50p3P1J49j38
$$ 150 254 -69 -51 -109 220 -97 -8 54 -26 -161 -126 -5 -94 -21 -49 45 16 -46 -224 127 -23 -96 -25 124 -14
6672a4j49K01l64L94j3J67j47j93K94r4j06J7o6K03l56j52J90R7J43j91o7J05
$$ -14 -163 38 -326 68 55 222 75 -118 176 82 -24 -7 -73 130 -226 -378 -188 -91 52 -139 -206 -101
6694a01K66qj43qo8m7J36q9m4q2p5L04m1j40K9K76pp4k6k21K21K6j06M7j27j21
$$ -101 165 157 14 6 -62 -109 27 -62 -106 -188 -263 41 0 -140 -111 165 158 84 58 -163 58 84 -22 25 -102 -223
6720b23O7O0J66j53m1K52Q8o5j97L9J81j19k3M7k50J33J9P7K34j27j26j6Q1M0
$$ -223 -156 -96 70 -83 -124 128 216 151 -46 -7 174 55 32 79 -171 -38 -19 58 292 165 39 23 104 144
6744A44j68j42j0J58p6J64K46l59k31L97j17J55j21j01r2R7R2l8O3q3K40l16J94
$$ 144 -24 -166 -176 -18 -94 70 316 -43 -274 123 6 161 40 -61 -153 -56 36 -2 61 -22 218 -98 96
6767I6j28m2J71k1j19N1j79M25m19M2n2J50j12P3r8R8m7l1k54K51K85j75o8L39
$$ 96 -32 -74 97 76 -43 8 -171 254 -165 -123 -175 -25 -137 -64 -162 -64 -111 -142 -396 -145 140 -35 -103 236
6791B36k71M9J60k47J47L55o49M0J71Qk94J74K63p9o6l6J70m9O6k62M35m79K25
$$ 236 -35 14 174 -73 74 429 -220 -180 -9 -1 -295 -121 142 63 -3 -39 131 82 148 -114 321 -158 67
6814F7j13J59k5k76j1L69k13k21L39Rj94j74K79k99M13p3M1J26k08j87L63M7k55
$$ 67 -46 113 88 -188 -199 170 -43 -264 75 84 -110 -284 -5 -304 109 36 77 203 -5 -192 171 218 -37
6837c7m0p2J32j41O2M5J77k85M8K34j2k1j32j46J21j8L49j39j95J59r3k07J27
$$ -37 -77 -149 -17 -158 -96 -51 126 -159 -111 123 111 90 -42 -188 -67 -85 264 125 -70 89 -4 -211 -84
6860h4K4K53j54j08QJ2M7M8M3k85K15J4j18J23o3j88J15j2j00L33l62K90l3K2
$$ -84 -60 193 39 -69 -61 -49 -2 46 89 -196 19 33 -85 38 -25 -213 -98 -110 -210 123 -239 51 18 40
6884D0N5Lj02M6j92J92p7j14J00J13k55J82L31l33K23j55p3m2L57p5m85L85m36
$$ 40 95 98 -4 42 -150 42 -35 -149 -49 64 -191 -9 322 -11 212 57 -16 -58 299 224 -261 124 -312
6907c12M12J20r1n1m7L0J2j46K07m03O95l15K7j46J21p6m5K24k2k79P9M2o3J20
$$ -312 100 220 129 78 31 61 73 -73 134 -269 426 111 138 -8 113 37 -8 216 194 -85 -6 36 -27 93
6931I3Q9j10m6Q0k22qJ24NM5l7K21j0k45k6J09q2K1k11J33J78M3k36L02k48j13
$$ 93 182 72 26 106 -116 -124 0 5 50 13 234 224 -21 -47 62 -20 1 -210 -77 101 144 -92 210 -38 -151
6956a51L39j6j21m9l53L53O5k20j9K93j03j75m9K72o0K05l66K20J6L9m95J94L26
$$ -151 188 172 51 2 -351 2 67 -153 -172 121 18 -157 -206 66 6 211 -155 65 81 120 -375 -181 145
6979A45Ol01R3k9N2m1L9L22k79j41J58L04m55J19m4L64l57L00k81J40k21K12m3
$$ 145 151 -150 -57 -86 -34 -75 -36 286 7 -134 24 328 -127 -8 -52 312 -45 255 -26 114 -107 105 62
7002F2j1j3K09k77j22K71k04j5Q6j06j8L67k60rq2R4rK50k38J94l32J74p2M0P2
$$ 62 51 38 247 -30 -152 119 -85 -100 -14 -120 -138 229 -31 -40 -122 -28 -37 213 -25 169 -163 11 -61 -21 51
7027E1mM6nj56N98l18j25m03Q7M0J01K60q7j51N9k19M3J59j05j08J28K66K5o2
$$ 51 47 93 88 -68 530 212 87 -316 -229 -189 -88 172 85 -66 -7 -226 -183 -24 -129 -237 -109 157 182 120
7051A20J09j1j72l6k14K14j3O7l8j17q7J77J27j9lk09nJ05L7J23j72O0k30J00
$$ 120 229 218 46 10 -204 10 -3 64 26 -91 -178 -1 126 107 104 -105 -110 -5 32 155 -17 43 -187 -87
7075h7m7K09j13L67l63J2J33l61K33N0O4P8L8j91J53k61Q6J61O0k74p4P6L9k3
$$ -87 -134 75 -38 329 -34 -22 111 -250 -17 33 97 175 213 22 175 -86 0 161 221 -53 -127 -51 -12 -35
7099c5N0j45J61L35l00J30p7%l12pJ84k4k9J4J14k11K9r1R5O2J02k69J30Q4Q6
$$ -35 15 -130 31 366 66 196 119 119 -193 -200 -16 -40 -69 -55 59 -152 -123 -214 -119 -57 45 -224 -94 -10 76
7124G6R1l32M5J91k58N1R9Q1j27K18l40L12j39n7J9J92k83J47J11p9J00l03J89
$$ 76 167 -165 -120 71 -187 -136 -37 44 -83 135 -205 107 -32 -89 -70 122 -161 -14 97 18 118 -185 4
7147Dj62J33j1L0k7m6K39l77K7J28k4P4o0K20l50J76J14j89%J27L1N2o7J2j37
$$ 4 -158 -25 -36 -6 -33 -79 160 -217 -190 -62 -86 -12 -72 148 -202 -26 88 -101 -101 26 57 109 42 54 -83
7172h3J80P9r0k1J43jk38K36k43p6J20N4r8k4oJ11q6o3M25m15K76j15j50J28J0
$$ -83 97 176 86 65 208 207 -31 205 -38 -114 6 60 -38 -62 -68 43 -43 -106 319 -96 180 65 -85 43 53
7197E3J98m50M57j95j69J04MMj67K85k33R4J10k4m7m2k49J75J01Q4p9J96j36r2
$$ 53 251 -199 258 63 -106 -2 2 6 -161 124 -109 -15 95 71 24 -18 -267 -92 9 93 14 210 74 -18
7221a8j77P7K13k95K82j46j09K18j68j8O4n4M96l40j3J26k55L04k16J18k70J30
$$ -18 -195 -118 95 -200 82 -64 -173 45 -123 -141 -77 -131 365 25 12 138 -117 187 -29 89 -181 -51
7243e1L15j64n8K14M4m06J08j09J86pq0o9M7j52K64q7J17M8j23k05M70q6j74K09
$$ -51 264 100 42 256 300 -106 2 -107 79 72 -8 -77 -30 -182 82 -5 112 160 37 -168 302 216 42 251
7267B51j73K07P7l67J50m34N42J8k64Jm8J79l13L8L09r9q3m2p0K20o5J74l14r7
$$ 251 78 285 362 -5 145 -289 253 271 7 8 -40 139 -174 -136 173 74 -9 -51 -121 99 34 208 -106 -203
7291b03K86J11j95k8J81r7j44J27L1J96m58Q1J9L07%j71j79J30j18J15O2M8o4
$$ -203 83 194 -1 -29 152 55 -89 38 69 265 -193 -112 -93 214 214 43 -136 -6 -124 -9 53 101 37
7314C7J64m10J84L17k81K52k53j14N1J47j06J97j81J83j57Kj23K93j00r3J92l5
$$ 37 201 -209 -25 292 11 263 10 -104 -53 94 -12 185 4 187 30 32 -91 202 102 9 201 166
7336A66m0n7l6L01m46K51j38r1K17j89j9J6j25K39o6kK32m63K31P9j4j39J51j39
$$ 166 126 69 33 334 -112 139 1 -90 127 -62 -81 -65 -190 49 -17 -19 213 -250 -19 60 46 -93 58 -81
7360h1K96k42n6J81j78L1k1rNp2N6J85PO7k08K07l07J54m3M5j88N1L25j85J01
$$ -81 215 -27 -83 98 -80 -49 -70 -79 -74 -146 -90 95 102 169 -39 168 -139 15 -28 17 -171 -120 205 20 121
7385A21j94J42j12j37M8M37l41J2m3J72J2j27pj02J70lj96K54j77J98o3j28M0
$$ 121 -73 69 -43 -180 -132 305 -36 -24 -67 105 117 -10 -17 -119 51 48 -148 106 -71 127 64 -64 -24
7408b4K5Q5k00J32J18k3p1k5K3j65j28K91Q0j54K6l3J1j7J18j61n8M2J46j4J81
$$ -24 1 86 -114 18 136 113 42 17 40 -125 -253 38 118 -36 -10 -43 -32 -49 69 -92 -150 -108 38 24 205
7433B05l15K3K01j11j24O8Q5J00q3j14K4J50K9j57k9N3Q7l32L98k3n7k0J39j31
$$ 205 -110 -87 114 3 -121 -53 32 132 49 -65 -41 109 138 -19 -48 5 92 -240 158 135 78 58 197 66
7457F6l29K27l3K45j20Kl0k41M30j19n4m16L16O3l22M21k56O3K05m22M58j22k42
$$ 66 -263 -36 -69 176 56 58 28 -213 217 98 44 -372 -56 7 -315 106 -150 -87 118 -304 154 32 -210
7480b10R0J11lk8NK51n39L46j89K21k59L69n6j06J46j35K89k80j63J04J16j14
$$ -210 -120 -9 -12 -40 -35 216 -323 23 -166 55 -204 165 109 3 149 14 303 23 -140 -36 80 -34
7502c4k43L50l5j32l0K16r0J24k10J94l7M6p8j57p5n3M62l74M06j99p2J0J37J78
$$ -34 -277 73 38 -94 -124 92 2 126 -84 110 73 119 41 -116 -191 -244 218 -156 250 51 -21 -11 126 304
7526C04l77K9J21J85n16M28j73j08L17j56j85M19l67O2J83j66J5K4N3J1l1k6K34
$$ 304 -73 -44 77 262 -254 174 1 -107 210 54 -131 288 -79 -17 166 0 15 39 92 103 72 46 280
7549B80n02l2K19J54k16R9K1pk89K62L18k91J44k3N1r7j02j34K42j96R0N3L69
$$ 280 -222 -254 -35 119 -97 2 23 16 -273 -11 307 16 160 137 188 91 -11 -145 97 -99 -9 44 413
7572D13j48l17j25L99j83j03j20J29J14n5J02j82K06j84kQ0q9M43l45j97L30j10
$$ 413 265 -52 -177 222 39 -64 -184 -55 59 4 106 -76 130 -54 -56 24 -65 378 33 -164 166 56
7594E6J79p0n0k26J46lj08o7L25o8r0R9r2Q9O3k47K0J38j98J92k23o9J03J76j79
$$ 56 235 165 115 -111 35 32 -76 -143 182 114 24 123 31 120 183 -64 -44 94 -104 88 -135 -204 -101 75 -104
7619a04o2K66Q9M0l30M2P4j83L27r3j00J21j59J86P5k30J91Q8n52L26n0J65j59
$$ -104 -166 100 189 229 -101 -59 15 -168 159 66 -34 87 -72 114 189 -41 150 238 -314 12 -38 127 -32
7642c2m2J48KJ97m65M9QQ4J18J6l3J44l02j50K57j05J46J09k41L0J23P0k61R7
$$ -32 -74 74 76 273 -192 -143 -135 -51 67 83 50 194 -108 -258 -1 -106 40 149 -92 -62 61 131 -130 -33
7666c3J3L4j30K44j26J56k2l6k91J58m0n1K82p8j56L51j46k59j0J66j02L13k45
$$ -33 -20 14 -116 128 2 158 136 100 -191 -33 -73 -124 158 80 -76 275 129 -130 -140 26 -76 237 -8
7689hJ96m04K99l07K46j80j3K47J31o4l12J85k65J55L46l69R2N8J60j34K5J3J1
$$ -8 188 -216 83 -224 22 -158 -171 76 207 143 -169 16 -249 -94 252 -117 -25 33 193 59 84 97 108
7712A08j52R5M5K9L4k55N3m4J99j62J06j65r1L11r3N3O6l66K69NK41j8j58k86
$$ 108 -44 51 96 125 159 -96 -43 -87 112 -50 56 -109 -200 111 18 71 137 -229 40 45 286 268 110 -176
7736a76L95j90P9j6j62L1J87j55j90K23j07O5L5j37J42m9jJ12j30PO2J56j31l06
$$ -176 219 29 108 92 -70 -39 148 -7 -197 26 -81 -16 19 -118 24 -25 -26 86 -44 -37 25 181 50 -256
7760b56L46m4j67J17J95m0K25l83j61J60J04R5k8l70K38l2J14q3M9j23j54J89
$$ -256 90 46 -121 -4 191 151 376 -7 -168 -8 96 191 163 -207 31 -1 113 30 79 -44 -198 -9
7782iJ50O6l91L05P3j75K81l85k0J90j5p4k36J30K63l74N00l06n7j4LK14l66M41
$$ -9 141 207 -184 121 194 19 300 -85 -105 85 70 -4 -240 -110 153 -221 279 -27 -84 -98 -95 119 -247 194
7806A94j89L5n9M0PM2o6K3Ml5r2n2l29L65J74o8j07J30j8j11K10o4k45M19k3k43
$$ 194 5 40 -19 21 28 70 4 27 31 -4 -96 -148 -477 -112 62 -6 -113 17 -1 -112 98 34 -211 208 185 -58
7832e8O7j21P0K4N0P9n6j7N7R5l14lL19M8l56K86k70J18J20r7n8K14l78J82L6
$$ -58 9 -112 -42 -18 32 111 55 38 95 190 -124 -127 192 240 -116 170 -100 18 138 41 -17 197 -181 1 37
7857C7N2o2k57K29l1o6M32j97l57K7K08J71l04J47J8j32l2J3O7K8J60o8k33J27
$$ 37 89 27 -230 -1 -32 -98 334 137 -220 -193 15 186 -118 29 47 -85 -117 -104 -37 -9 151 83 -150 -23
7881b3J10l52J94J11j35j59J99L00l64L44k85p3J29m5L8R1m1lM2p4m3J17k01O2
$$ -23 87 -265 -71 40 -95 -254 -55 245 -119 225 -60 -133 -4 -49 -11 80 39 36 78 4 -39 78 -123 -61
7905f1J79r5Po7L43j37l61K56n8k10K93n3L6p7M7l2J91j17l65J60K27j23J09k39
$$ -61 118 23 30 -37 306 169 -192 64 6 -204 89 36 72 -5 42 10 201 84 -281 -121 106 -17 92 -147
7929a47K00k00r1M21n3l54K70J41l46L82n3m90K97Q7K1j83K41k06o2j0K1L57l66
$$ -147 53 -147 -238 183 130 -224 46 187 -159 223 170 -320 -23 64 85 -98 143 -63 -125 -135 -114 243 -123
7952a23K30Oj39J33J29m24J57J00j39k3K09K29l18k63K49j2j83K93l33K30O9j44
$$ -123 107 113 -26 107 236 -188 -31 69 -70 -93 116 345 27 -236 13 1 -182 111 -222 8 77 -67
7974f7j33K17M3m3J50j08p6n6K56l31J16j21J22l86L30n5r9J23N1J0J26KN5j39
$$ -67 -200 17 60 17 167 59 -17 -73 183 -148 -32 -153 -31 -417 -87 -142 -241 -118 -67 -57 69 71 126 -13
7998a3k8J25m4q2K5O3j12O4J70k04qQ5j41L05k19L8J04k1k55J84j76L12r4k06
$$ -13 -41 84 40 -42 -17 46 -66 -2 168 -36 -44 41 -100 205 -14 24 128 107 -148 36 -140 172 78 -128
8022a28Q1J9J89k51M9j48o1K85m6m6J16k25K02j68J10j47J68m1Nn1k04K41k02
$$ -128 -47 -28 161 -90 -41 -189 -250 35 -11 -57 59 -166 36 -132 -22 -169 -1 -42 -37 -88 -292 -51 -253
8045b53K23R1O4J83l50k5K17r0J20q9k7j56J50Q4j25J3lJ81k18j8M4J06nj71l8
$$ -253 -30 61 125 308 -42 -67 150 60 180 91 64 -92 58 142 17 30 27 208 -10 -28 16 122 117 -54 -92
8070i2J33j40J91j38J91Q0j32j97K6p6R4J21J93k42Q9K7k35R3J6J19l73L81l2
$$ -92 41 -99 92 -46 145 225 93 -104 -78 -154 -60 61 254 12 101 128 -107 -14 2 121 -252 129 97
8093I7l81M40l39N56m62J14Q6K16j80O5n8m90L90J2L6k29K89k33J0o2O5Q6j62
$$ 97 -284 156 -183 373 -89 25 111 327 147 212 154 -336 54 66 102 -127 162 -71 -61 -123 -58 28 -134
8116a34K73l5k23k6N8k0Q7L38m16l5J73k47P2J95o3N5J51j35K8K09l74K1mk15
$$ -134 139 104 -119 -145 -87 -107 -20 318 -98 -133 40 -207 -135 60 -3 52 203 68 96 305 -69 -48 -52 -267
8140b67K70j34M9j88M19k2k06l4QQ4K78j65J82j47j05o0j55K69k34J06rK14rk40
$$ -267 3 -131 -82 -270 149 127 -79 -113 -105 -21 257 92 274 127 22 -38 -193 76 -158 -52 -61 153 144 -96
8164i6k3N3N9r4J74l66M28J18m01L6l4K92k87j29J82k06K08k1J61p3j88K44J01
$$ -96 -119 -66 -7 -101 73 -293 135 253 -148 -112 -146 146 -141 -270 -88 -294 -86 -107 54 -19 -207 37 138
8187A38j69J00J6m9
$$ 138 -31 69 85 36
8191C6
$$ Imaginary data points
##PAGE= N=2
##DATA TABLE= (X++(I..I)), XYDATA
0@%%%%%%%%%%%%%%%mJ2j6J6j6J7k5L2l3M0m7N4o3P3q3R4j09J24j41J59j76J99
$$ 0 0 0 0 0 0 0 0 0 0 0 0 0 0 0 0 -4 8 -8 8 -8 9 -16 16 -17 23 -24 30 -33 40 -43 51 -58 66 -75 84 -92 107
37A07k24K48k76L08l42L80m22M65n14N70o29O91p62Q38r23J020j124J240j375
$$ 107 -117 131 -145 163 -179 201 -221 244 -270 300 -329 362 -400 438 -485 535 -589 651 -724
56g24J527j700J903k141K426k777L220l797M584n730P565j0960J9313p9808j15794
$$ -724 803 -897 1006 -1135 1291 -1486 1734 -2063 2521 -3209 4356 -6604 12709 -67099 -182893
71a82893J64762J67869k7433j93524q4157J23091J70719k1072j79085r8046J24595
$$ -182893 -18131 149738 122305 -71219 -155376 -32285 138434 117362 -61723 -159769 -35174
82c5174J70967j3334j81206r8930J13870J72462l105j70062j08274J01203J68283
$$ -35174 135793 122459 -58747 -157677 -43807 128655 125550 -44512 -152786 -51583 116700
93A16700Q098j62856j09017R1417J66525J3291j56031j12390Q4407J64468K2002
$$ 116700 124798 -38058 -147075 -55658 110867 124158 -31873 -144263 -59856 104612 126614
104A26614j50427j17655P4500J64897L0240j43782j20014O5439J59945L7225j35120
$$ 126614 -23813 -141468 -66968 97929 128169 -15613 -135627 -70188 89757 126982 -8138
115h138j22731N6215J58295M3268j30488j24967N0946J55187M8598j22664j26224
$$ -8138 -130869 -74654 83641 126909 -3579 -128546 -77600 77587 126185 3521 -122703
126a22703M0325J51786N6816j15074j28477L2406J47562N9986j07746j26339K6551
$$ -122703 -82378 69408 126224 11150 -117327 -84921 62641 122627 14881 -111458 -84907
137h4907J41380O3489r9756j26424J8580J37278O8369r1851j26256J1308J31319
$$ -84907 56473 119962 20206 -106218 -87638 49640 118009 26158 -100098 -88790 42529
148D2529P1435q4052j23432M884J24657P4473p6537j22022j205J20101P7302p0200
$$ 42529 113964 29912 -93520 -88636 36021 110494 33957 -88065 -89270 30831 108133 37933
160C7933j20920p045J14980Q0113o3008j19279j3563J09960Q2735n6560j17682
$$ 37933 -82987 -90032 24948 105061 42053 -77226 -90789 19171 101906 45346 -72336
171g2336j7848J04996Q3878n0657j15671k3138J00262Q6504m4387j14184k8274
$$ -72336 -90184 14812 98690 48033 -67638 -90776 9486 95990 51603 -62581 -90855
182i0855R5211Q8047l8325j10961l2251Q8821Q8279l2047j07536l6281Q3301Q9031
$$ -90855 4356 92403 54078 -56883 -89134 -313 87966 55919 -51617 -87898 -4597 84434
194H4434k6113j05013m0000P7685Q8905k0607j00162m3376P1463Q7847j5144r6110
$$ 84434 58321 -46692 -86692 -9007 79898 59291 -40871 -84247 -12784 75063 59919 -36191
206c6191m5701O5714Q6616r744r2128m8253O0012Q5885m994q7919n0532N4631
$$ -36191 -81892 -16178 70438 60694 -31434 -79687 -19675 66210 61216 -26703 -77235 -22604
218b2604Q4782o08q4086n2617M9610Q3832L714p9991n5149M4883Q2345Q227p6588
$$ -22604 62178 61570 -22516 -75133 -25523 58309 62023 -17968 -73117 -28234 54111 62338 -14250
231a4250n6408L9982Q1371J1723p2968n7775L5195P9869J5727o9116n9101L0677
$$ -14250 -70658 -30676 50695 62418 -10550 -68325 -33130 46739 62466 -6650 -65751 -35074
243c5074P7560J9051o4914n9605K6539P5492K1850o0929n9752K1863P2934K4424
$$ -35074 42486 61537 -3377 -62982 -36443 39049 60899 -30 -59782 -37919 35015 59439
255E9439n6172n9784J7342P0249K6968n2029n9197J3498O7086K8722m7783n8413
$$ 59439 3267 -56517 -39175 31074 58042 6013 -53184 -39686 27400 56122 8339 -50074
267e0074R933O4178L0724m3437n8258O270O1407L2566m0182n7298L386N8572L3858
$$ -50074 -40141 24037 54761 11324 -46934 -40664 20743 53309 13127 -44171 -40785 17787 51645
280E1645l6716n6383P11N5772L4979l3001n5672k535N3456L6277k9901n4847n005
$$ 51645 14929 -41454 -40743 15029 50008 17007 -38665 -41200 12256 48533 18632 -36215 -41220
293d1220N0937L7094k6598n3527p760M8100L8122k3712n1917j0349M5303L8417
$$ -41220 9717 46811 20213 -33314 -41074 7026 45148 21436 -30481 -40830 4473 42890
305D2890k0379n0536j2011M2621L8364j7599m8846j3722L9508L8258j4080m7317
$$ 42890 22511 -28025 -40036 2585 40949 23350 -25496 -39218 290 38548 24468 -22849
317b2849j5468L6371L8258j1383m5050j7041L3445L7808q943m3041j8300L0947
$$ -22849 -38317 -1946 36312 24929 -20121 -37162 -3717 34091 25148 -17893 -36193 -5246
329e246L7406o503m1024j9745K7972L7336m012l9408k0521K5257L6789k302l7407
$$ -5246 32160 25657 -15367 -35112 -7140 30196 26184 -13224 -33745 -8488 28301 25999 -11408
342a1408k1553K3268L6356k40l5839k2459K0952L5554J525l3814k3248J9029L4618
$$ -11408 -32961 -9693 26663 26423 -9416 -31875 -10923 24631 26156 -7658 -30906 -11877 22741
355B2741L466l2133k3497J6596L3719M861l0095k3673J4154L3163O395k8402k4260
$$ 22741 26207 -5926 -29423 -12827 20892 25753 -4342 -28015 -13861 19302 25697 -2705 -26965
368b6965J2647L1905P458k6290k4114J0540L0302Q802k4185k3958Q694K9136R640
$$ -26965 -14318 17587 25045 -1245 -25359 -14819 15483 24285 100 -23858 -15164 13972 23612
381B3612k2185k3727O671K8069J0437k0553k3228N341K6421J1286j8654k3262
$$ 23612 1427 -22300 -15629 12440 22877 2324 -20904 -15563 10858 22144 3490 -19772
393a9772L916K4977J2592j7265k2845K403K4262J2494j5822k2260J381K2981J2945
$$ -19772 -15856 9121 21713 4448 -18397 -15994 8268 20762 4940 -17320 -15939 7042 19987
406A9987j4340k1788J74K1663J3647j2478k1936q53K0706J3940j1824k0748j566
$$ 19987 5647 -16141 -15967 5696 19343 6865 -15071 -15924 4782 18722 6898 -13850 -15416
419a5416J9297J3909j0228k0312k700J8030J4433q847j9608l774J7110J3850p456
$$ -15416 3881 17790 7562 -12750 -15450 2580 17013 8166 -11442 -15216 1894 15744 8288
432H288j8676m470J6002J3841o597j7680m905J4431J3879n263j7128n312J2953
$$ 8288 -10388 -14858 1144 14985 8388 -9292 -14197 234 14113 8850 -8278 -13590 -637
445f37J3719m192j5977o096J2014J3581l518j4962o825J0841J3411j949j5072
$$ -637 13082 8890 -7087 -13183 -1169 12412 8894 -6068 -12893 -2052 11359 9410 -5662
458e662o696R680J3579j861j3870p153Q957J2899q27j3141p473Q053J2744j97
$$ -5662 -12358 -2678 10901 9040 -4830 -11983 -3026 9873 9046 -4095 -11568 -3515 9229 9032
472I032j2114p814P307J2140N87j1917p726O813J1447J060j0863q023O033J1034
$$ 9032 -3082 -10896 -3589 8551 9138 -2779 -10505 -3692 7755 8815 -2048 -10071 -4038 6996
486F996J635j0090p729N036J0356K358r602p489L824J0384K387q811p391L275
$$ 6996 8631 -1459 -9188 -4152 6204 8562 -1040 -8529 -4705 5679 8066 -745 -8136 -4861
500d861R758K789p674p358K875R039K987p238p267K379Q468L458o643p416K219
$$ -4861 4897 7686 12 -7346 -4471 4568 7555 317 -6950 -4571 3897 7355 712 -6704 -4485
515d485Q186L211n920p050J392P691L732n492o899O72P552L700m710o891P66O528
$$ -4485 3701 6912 992 -6058 -4666 3025 6757 1265 -5634 -4962 2590 6290 1580 -5311 -4545 1983
531A983L815m089o683M90O452L907l844o471k89O208L830l322o177k44N741L750
$$ 1983 5798 1709 -4974 -4484 1968 5875 2031 -4440 -4729 1479 5309 1987 -4190 -4434 1307 5057
547E057l128n609p14N282M025k624n384j094M578L951k059n204j169M408L710
$$ 5057 1929 -3680 -4394 888 4913 2289 -3095 -4189 389 4340 2281 -2923 -4092 316 4026
562D026j751m876j276M008L906j705m543j430L359L866j078m344j843L639L207
$$ 4026 2275 -2601 -3877 131 4037 2332 -2211 -3641 -282 3584 2506 -1838 -3681 -42 3165
577C165o68m450j532L055L623j107l758j613K537L742p14l791j461K482L082m93
$$ 3165 2497 -1953 -3485 -430 3193 2086 -1672 -3285 -748 2994 2280 -1511 -2972 -490 2592 2099
593B099l606j336K245K916k38l097j479J784K749L15l127k020K240K793k32k810
$$ 2099 -1507 -2843 -598 2318 2080 -1017 -2496 -712 2037 2352 -775 -2795 -555 2238 2006 -804
609h04j513J223K528L12k160j546J068K193N55k138j431O33K375N35k053j513
$$ -804 -2317 -1094 1434 1746 -414 -1960 -892 1301 1856 -282 -1713 -1080 1295 1830 -223 -1736
625a736J095K219r4j496j428N71J707J103k137j269O58J795M60j418j361J93J896
$$ -1736 -641 1578 1484 -12 -1440 -869 838 1941 -196 -1465 -807 988 1448 30 -1331 -1138 758
642G58O05j461j277L36J955L41r12j662M10J420O34r78j325K96J240O90r94j163
$$ 758 1363 -98 -1375 -1039 916 1257 345 -1317 -907 513 1147 169 -1156 -860 380 1070 76 -1087
660a087K16J189Q35j034j013K07J075M77k96j125k26J202N80p94p97l4P52Q07
$$ -1087 -871 318 1153 119 -894 -687 388 865 569 -556 -782 420 1000 206 -591 -625 127 934
678I34m51q60q7R62J01k85j053K99O63L52l06p89J28M17P23m27j019M30L40M79
$$ 934 483 -377 -464 498 599 314 -739 -440 223 575 269 -520 -392 25 748 321 -698 -268 72 551
698E51lp16k77O10M84k99m51k00J48P34l45q59K47M29K90J97q21r5O09j54j0j9
$$ 551 548 -168 -445 165 649 350 -101 -301 -153 581 236 -623 -376 53 343 540 -281 -376 233 79 69 50
720E0r3P4K1K2k14l79M59K63M1l93j86L57K48k9n82J97J02K14J45l85J77r3J06
$$ 50 -43 31 52 74 -140 -519 -60 203 244 -149 -335 22 270 241 -341 -144 -42 172 317 -68 109 16 122
743A22j8n35J20K93K87l19K45m23J90K13k8j89k25K10L67l93j14Q8J43l6j88r7
$$ 122 104 -431 -311 -18 269 -50 195 -228 -38 175 147 -42 -267 -57 310 -83 -197 -109 34 -2 -190 -287
765b87L37JJ62m43O7K23k29j05KK80k48L62j82R1l25J80j14J91K41J25l88K63
$$ -287 50 51 213 -230 -163 60 -169 -274 -272 8 -240 122 -60 31 -294 -114 -228 -37 204 329 -59 204
787B04j10l83K48q2J72J08J18m27J33L9M5j8j07o8J34n6J3J99j42O0p2M5p5J95
$$ 204 94 -289 -41 -123 49 157 275 -152 -19 20 65 47 -60 -128 6 -50 -37 162 20 80 8 53 -22 173
811A73K5l51R1K41l31M17j93l9N8j62L73m00J11J07k80L7K48j66j40n8M02l24
$$ 173 198 -153 -62 179 -152 265 72 33 91 -71 302 -98 13 120 -160 -123 125 -41 -181 -239 163 -161
833a61R0J3K3J15J13k41L3ql61O34m73J82o2k16L63k6j10K34n6J03k44O2K03j46
$$ -161 -71 -58 -35 80 193 -48 -15 -23 -384 250 -223 -41 -103 -319 44 18 -92 142 86 189 -55 7 210 64
857F4j87J24r9J50j58l79K24K54m6j31P1o7N9L39k12j38K22J4l0m42M18K7no1
$$ 64 -123 1 -98 52 -106 -485 -261 -7 -53 -184 -113 -180 -121 218 6 -132 90 104 74 -368 50 77 72 11
881A1k16M25m0j46k09K49q3K25k58o1L11m13J83J85k8m86L87N2j38P3l37R3K31
$$ 11 -205 220 180 34 -175 74 -9 216 -42 -103 208 -205 -22 163 135 -351 36 88 -50 23 -314 -221 10
904A0JM71n26j66J85J52P9m39J40K91Q0j22j29m70L70K03P4m04j03K37M0m3K35
$$ 10 11 482 -44 -210 -25 127 206 -233 -93 198 278 156 27 -443 -73 130 204 -200 -303 -66 -26 -69 166
927A66k01k1J38j82J0J3m1J97J08p8l02J63M8n1p6J22r1J42K93m85j62L07J86
$$ 166 -35 -56 82 -100 -90 -77 -118 79 187 109 -193 -30 18 -33 -109 13 -78 64 357 -128 -290 17 203
950B03j76M4j24J47J86j88k84l3l0Q0J95J0q5j71L21K33p34J55K13K60qpn9j73
$$ 203 27 71 -53 94 280 92 -192 -225 -255 -175 20 30 -55 -226 95 328 -406 -251 -38 222 214 207 148 -25
974b5L78k85k85K29K7J41k2j55m02L21K45j31o9k01K80J3J57j69k03J1N15j51
$$ -25 353 68 -217 12 39 180 158 3 -399 -78 167 36 -33 -234 46 59 216 47 -156 -145 370 219
996B19k52l16M63K09m62K87j37j5M4J37j47l23L72m5K4r5j73R9J35J96k19O9j73
$$ 219 -33 -349 114 323 -139 148 11 -4 40 177 30 -293 79 34 58 -37 -210 -111 24 220 1 70 -103
1019a03R1K91k06k37o9L80j1N4k67k32M60O3j20o6p3j4J54K93o41rM80K37l81
$$ -103 -12 279 73 -164 -233 147 136 190 -77 -309 151 214 94 28 -45 -59 95 388 -253 -262 218 455 74
1042G4k22J47J07P8q5j41j10J54O6j2m00J06L63K22m7l43r7R1J05o7l53K44K39
$$ 74 -148 -1 106 184 99 -42 -152 2 68 56 -344 -238 125 347 300 -43 -140 -49 56 -11 -364 -120 119
1065A19J35J26l82k06P0K06N6q7k48P0J86q9J2J39k32K64j68j04N7O1M4m6qj35
$$ 119 254 380 -2 -208 -138 68 124 37 -211 -141 45 -44 -32 107 -125 139 -29 -133 -76 -15 29 -17 -25 -160
1089a60J25j06N24n45j6J24K29n8m88J3M45J69j35k17J4M0K17o9k65o7K5N28l8
$$ -160 -35 -141 383 -162 -178 -54 175 117 -371 -358 87 256 121 -96 -82 -42 175 106 -159 -226 -201 327 289
1112B89m80J56l1K29R2n35J74j87K81L8j44l27L57J22mM2j97KK70j77Rp5O6J19
$$ 289 -191 -35 -66 163 255 -280 -106 -293 -12 26 -118 -445 -88 34 30 72 -125 -123 147 -30 -21 -96 -30 89
1136H9J74k54j10j90L75k10M1j9o4K55L1Qj56o9K56j60m7j99J17Q3P8J38l81Q6
$$ 89 263 9 -101 -291 84 -126 -85 -104 -168 87 118 126 -30 -99 157 -3 -50 -249 -132 -49 29 167 -214 -128
1160a28L99j10l79L05n21O11j61Pl12J19M71j63l5k53J75K11r0j67q6J40j94L83
$$ -128 271 161 -218 87 -434 177 16 23 -289 -170 301 138 103 -150 25 236 146 -21 -107 33 -161 222
1182B22j20n4j19j3L21Kk80j83K64M49l17l29K03j83K25O9j46l74J71Q0m0l02
$$ 222 102 48 -71 -84 237 239 -41 -224 40 489 172 -157 46 -137 88 157 11 -363 -192 -112 -152 -454
1204d54M31j91K26R8k71l8K40K22m51J91n3M6L42O6n28mJ76L8k10K0j9R9P6M2
$$ -454 -23 -214 12 110 -161 -199 41 263 -188 3 -50 -4 338 404 -124 -128 48 86 -124 -104 -123 -24 52 94
1228I4K7j91p1L00k55J26k59K30K68n02L4L02k16K11j3l00O1R9K08k16l33K67
$$ 94 121 -70 -141 159 -96 30 -229 1 269 -233 -199 103 -113 98 85 -215 -154 -55 153 -63 -396 -129
1250a29PJ97l6m6nQ2q2P3l20K16j0K37J33l16p0m7L79k26J84l37J49k87J9K15
$$ -129 -122 75 39 -7 -12 70 -12 61 -259 -43 -53 184 317 1 -69 -116 263 37 221 -116 33 -254 -235 -20
1274b0j49p1L26J4m1q0n8K44Mk2l32L34m7K5l34M7R3J23j6j0k4m2J89m22J53Q0
$$ -20 -169 -240 86 100 59 -21 -79 165 169 147 -185 149 102 127 -207 -160 -67 56 40 30 6 -36 153 -269 -116 -36
1300c6j34J81K5N9j81j32L90p5P3j78n9p4m8N70k53k79K69J22k53O1k81M42l74
$$ -36 -170 11 36 95 -86 -218 172 97 170 -8 -67 -141 -189 381 128 -151 118 240 -13 48 -233 209 -165
1323a65K07j90M1O7k6J09N4K05l52K38k51p7K89M4m2j00j12J68r4K05k88j05Q7
$$ -165 42 -148 -107 -40 -66 43 97 302 -50 188 -63 -140 149 193 151 51 -61 107 13 218 -70 -175 -88
1346h8K24R4k46j33J55j90k8K99J31l16l1Q2k48K51k7N3k51M81o42K82l3M1J14
$$ -88 136 230 -16 -149 6 -184 -212 87 218 -98 -129 -47 -295 -44 -71 -18 -269 212 -430 -148 -181 -140 -26
1369b6l4J7O7J51l0j54j0O5K36k19j11J08Lj13J42j36j03K01j08L08m93K39J18
$$ -26 -60 -43 24 175 145 -9 -19 46 282 63 -48 60 63 -50 92 -44 -147 54 -54 254 -239 0 118
1392A18k5l68K89k7J08Q0p8q3k13K99L4l1L2rJ17j63j40J03Q0L4K40l44j07J73
$$ 118 93 -275 14 -13 95 175 97 14 -199 100 134 103 135 126 243 80 -60 43 123 157 397 53 -54 119
1416A19Lj37R1o5r2J15O9j74P3J54m44M63l53K78k77O7jJ69j28J46k20k48R3K85
$$ 119 122 -15 76 11 -81 34 103 -71 2 156 -288 175 -178 100 -177 -110 -111 58 -70 76 -144 -392 -299 -14
1440a4m4R9k5J13J49k22p5o3K09j75oP6J49j05J5p3K00j36n8J19k26JJ14JJ0j96
$$ -14 -58 41 16 129 278 56 -19 -82 127 -48 -54 22 171 66 81 8 208 72 14 133 -93 -92 22 23 33 -163
1466a63r0R1M48j99j15j28L1L71k35N9j73k71L94P9k08J3P8nr5J49k1J14l17K37
$$ -163 -253 -162 286 87 -28 -156 -125 246 11 70 -103 -374 20 99 -109 -96 -18 -23 -118 31 10 124 -193 44
1490D4R4jk65p3M8jM63k08n3k04Rj8Q6MR1J06l61J34K73l03M3J80K4j34L02k51
$$ 44 138 137 -128 -201 -153 -154 309 101 48 -156 -147 -165 -79 -75 16 122 -239 -105 168 -135 -92 88 112 -22 280 29
1516B9J4J17k30j49K40o0j37J91R4K8l42J63K2L4j1m0p2m5M19l13J60K2l23J05
$$ 29 43 160 -70 -219 21 -39 -176 15 109 137 -205 -42 -20 14 3 -37 -109 -154 265 -48 112 134 -189 -84
1540h4j18K52k0J43l93P4M7J83j57j2J0R0J69r6J5j14O0R2P7P6p6K0j18j86J93
$$ -84 -202 50 30 173 -220 -146 -99 84 -73 -85 -75 15 184 88 103 -11 49 141 218 294 218 238 120 -66 127
1565A27j33J42k65J36j03L0rK54k33K58n4O6l87L35L7m56J63P7N7l88L19n6K1
$$ 127 -6 136 -129 7 -96 -66 -75 179 -54 204 150 216 -171 164 201 -255 -92 -15 42 -346 -27 -83 -62
1588f2J22n1j73lL85k55K12j93M7r2j21PK65K3k02M5q4K28j60J31j4k04J07J7
$$ -62 60 9 -164 -167 218 -37 175 -18 29 -63 -184 -177 88 111 -91 -46 -130 98 -62 69 55 -149 -42 -25
1612b5J10j56m6K55j33m5q2K41k18J43O5j53O9j04J54m54P72n26M38k33j8j46
$$ -25 85 -71 -117 138 5 -40 -122 119 -99 44 109 -44 25 -79 75 -379 393 -133 305 72 54 -92
1634i2j50J54Q0p4M09J3l74o2Q6N4P2j32NJ29m34J53J70j18J91j84J48j2m10K77
$$ -92 -242 -88 -8 -82 327 340 -34 -96 -10 44 116 -16 -11 118 -316 -163 7 -111 80 -104 44 32 -378 -101
1658a01K49J28l65pJ41j6k1J41L9k82J54j01j05J36k6K2O1N1j1J62k39K02R9j54
$$ -101 148 276 -89 -96 45 29 8 149 188 -94 60 -41 -146 -10 -36 -14 47 98 87 249 10 212 311 157
1682A57r4k33Q2J2j29J91K8k28M05l43K75q3M8P5j47k7k29M19j98J70k76J69N6
$$ 157 63 -170 -88 -76 -205 -14 14 -214 191 -152 123 40 88 163 16 -11 -240 179 -19 151 -125 44 100
1705A00l20L19j76J11k33K02j09j94L20j96J45N6nj69m5J51j82K70Q8j1n29J45
$$ 100 -220 99 -77 34 -199 3 -106 -300 20 -176 -31 25 20 -149 -194 -43 -225 45 133 122 -407 -262
1727b62o5M49j13j21J47qk53L38r4l5j09P3o3K21k17J25k17K50J4K42k48j94J31
$$ -262 -327 122 9 -112 35 27 -226 112 18 -17 -126 -53 -116 105 -112 13 -204 46 60 302 54 -140 -9
1750iK68M5l11j40L03n8k26P0J60m84K88m3K9r9L26k07R0Nq5J22pq7k45M00j26
$$ -9 259 304 -7 -147 156 98 -128 -58 102 -382 -94 -137 -108 -207 119 -88 2 7 -78 44 37 -50 -295 105 -21
1775b1L5j21o1N4J88j79L87k41k00J14J2J49m4r4m5j28J93L16m12Q9j09L66J7
$$ -21 14 -107 -168 -114 74 -105 282 41 -159 -45 -33 116 72 -22 -67 -195 -2 314 -98 -9 -118 248 265
1798B65j86j11J52J0l72L16o1J15Jl35O4m8K54R5J78n02k45J85K59k03Q4J4J44
$$ 265 79 -32 120 130 -242 74 13 128 129 -206 -142 -190 64 159 337 -165 -410 -225 34 -169 -85 -71 73
1821G3j37rR5r4J71o7L0k58K80J73j57l4j80q5J63p4N8l17L09j28K22j81N2L48
$$ 73 -64 -73 22 -72 99 32 62 -196 84 257 100 66 -114 -199 -36 -110 -52 -369 -60 -188 34 -147 -95 253
1845B53m34kL14j89J20j2J16o9j96k50L73j89J45J59k82J44J56j96k58K82j78
$$ 253 -181 -183 131 -58 62 50 166 97 -99 -349 24 -165 -20 139 -143 1 157 -39 -297 -15 -193
1866a93L58k09Q3l29M48j47k13L17j38J98l74K31P0l58j06L47M4J32l5r7M5J39
$$ -193 165 -44 39 -290 158 11 -202 115 -23 175 -199 32 102 -256 -362 -15 29 161 126 29 74 213
1888B13m6j89J8lN5l3m03M55k64L44p1j52O0kJ78m00J22N5j50L74j79J43m74N33
$$ 213 167 -22 -4 -7 48 15 -388 67 -197 147 76 -76 -16 -18 160 -240 -118 -63 -213 161 -18 125 -349 184
1912A84j19k43J99L5J99l14K32m37L46K36j7m6m18j10L23m5j17q8M38j71m9j44
$$ 184 65 -178 21 56 255 -59 173 -264 82 318 301 255 -163 -273 50 5 -112 -200 238 67 18 -126
1934a26j27J65K21N9j74k90j7L67K86k78k91K21L84j78l37m0l28M88p2K71m29
$$ -126 -253 -88 133 192 18 -272 -289 78 364 86 -205 16 400 222 -115 -155 -483 5 -67 204 -225
1955b25J72k41K62K06l53j0K54K05l38p3N8M28m43J25m77M20l7J05J14l11K09
$$ -225 -53 -294 -32 174 -179 -189 65 270 -68 -141 -83 345 -98 27 -450 -30 -67 38 152 -159 50
1976E0n1K47l23R2J11m2Q6r0l08l1M08J60l59J21k74J85P7J78j00k06J54R1K11
$$ 50 -1 246 -77 15 126 84 170 80 -228 -259 149 309 -50 71 -203 -18 59 237 137 -69 85 176 387
1999C87n34n5K17J87k98j39j1L12k32J21O5o9J10k54M10k43m7R6J60l5j84l34
$$ 387 -147 -202 15 202 -96 -235 -246 66 -166 -45 20 -49 61 -193 217 -26 -73 23 183 148 -36 -370
2021c70J96M65l68j2l0P9Q0j19Pk07K46K2K56j43j98J32O8L2j80k1Q2L2L98o30
$$ -370 -174 291 -77 -89 -119 -40 40 -79 -72 -279 -33 -11 245 102 -96 36 104 136 -44 -65 17 49 447 -183
2045a83J84k38L74l11J32k68Q8L55p4Q0q1j92K59l7j49l83M96Q0J22k09l1j01
$$ -183 1 -237 137 -174 -42 -310 -222 133 59 139 58 -134 125 88 -61 -444 52 132 254 45 14 -87
2067h7J0K93k74J7J22r3K89k16j96j9r5N06o0l11O5J10n6N0R2m71K68R2n03M67
$$ -87 -77 216 -58 -41 81 -12 277 61 -135 -154 -249 257 197 -114 -49 61 5 55 147 -324 -56 36 -467 0
2091@j24P0J06j7rj17L29k20l0J11l53K1K32m0j03j09K47J25P7l27L7m5J83Q0
$$ 0 -124 -54 52 35 26 -91 238 18 -12 99 -254 -233 -1 -41 -144 -253 -6 119 196 -131 -94 -139 44 124
2115A24k09p2K65o4K21j06k82M17k07Pk51L45k87M02k5k82k8j31L81k30K85m99
$$ 124 -85 -157 108 44 265 159 -123 294 87 94 -157 188 -99 303 278 -4 -32 -163 218 -12 273 -226
2137b26o9L83m3j58K55k83K02l2j04k6P0Q3j59J7j44K51q1j60K24N4k37K78j4
$$ -226 -295 88 45 -113 142 -141 61 29 -75 -101 -31 52 -107 -90 -234 17 -64 -224 0 54 -183 95 81
2160H1R5k31k21J78K26k71Kr9l9L66j31l1l4J80R0Kl92nK86j9Q5j98J51J63j81
$$ 81 176 -55 -276 -98 128 -143 -141 -240 -279 87 -44 -75 -109 71 161 163 -229 -234 52 33 118 -80 71 234 53
2185E3O0k50L21j21R5j22j37L51k97J67r8k1Lj72L27k51K28j22K7j7k8J31j79
$$ 53 113 -137 184 63 158 36 -101 250 -47 120 22 1 4 -168 159 -92 136 14 41 24 -4 127 -52
2208e2k2%J69j96K23j29J84r8Pk12J55J82r7j16j18qL60k91k21K79j54L39k13
$$ -52 -74 -74 95 -101 122 -7 177 79 86 -126 29 211 114 -2 -120 -128 232 -59 -280 -1 -155 184 -29
2231b9K9L7l6K29j04l3Q1l14J97j58j24J78lJ96J32l84J9L1R7O1q3j04O6J44k03
$$ -29 0 37 1 230 126 93 174 -140 57 -101 -225 -47 -50 146 278 -106 -87 -56 41 102 19 -85 -19 125 -78
2256g8k09K63j7M7n6o0J60O9J71l85K29r1q2M2L45l38j01P5J2K54l45j47M42l53
$$ -78 -287 -24 -41 6 -50 -110 50 119 290 -95 134 43 -39 3 348 10 -91 -16 -4 250 -95 -242 200 -153
2280a53J67n1K6k02J16n6K13k41R2K53m6k10k4K4J97k13kp0K40J69j55l37J6K58
$$ -153 14 -37 -11 -213 -97 -153 60 -181 -89 164 118 -92 -116 -92 105 -108 -110 -180 60 229 74 -263 -247 11
2304A1nJ46l13J54K04k54l7O7j18J45J89N8n11L13J02k37J86k14k03K35j4J62
$$ 11 6 152 -161 -7 197 -57 -94 -27 -145 0 189 247 -264 49 151 -86 100 -114 -317 -82 -96 66
2326F6L9j78p5L97j82rl50M57j23J62r1k75J94L6k05K03j92K31j57K33K4k94L
$$ 66 105 -73 -148 249 67 58 -292 165 42 204 113 -162 32 68 -137 66 -126 105 -52 181 205 -89 -86
2349h6l8R2mR2l03K10O6J4N3r6Q0K93k04Q9k08k38K08Rj5j3N5P3j37J9l6m6R1
$$ -86 -124 -32 -36 56 -247 -37 29 43 96 0 80 373 169 258 50 -188 20 29 14 1 56 129 -8 11 -25 -71 20
2376B0J40O4k19J16k01J98k0l65K49j1J90j96N4J56k25ROJ7k06J29k27L67o2N
$$ 20 160 224 5 121 -80 118 98 -267 -18 -29 161 -35 19 175 -50 -41 -35 -18 -224 -95 -322 45 -17 -12
2400a2n4J26k4k75K28k13n7J67J19j52K75Q0J15n37K08mL5k30J74P0J56j70Q7
$$ -12 -66 60 36 -239 -11 -224 -281 -114 5 -147 128 208 323 -214 -6 -10 25 -205 -31 39 195 25 112
2423A12n5l24M40j89O7k37J39k04M12J39l04J70k02J32J9j45j10j78O04l59j65
$$ 112 57 -267 173 -16 51 -186 -47 -251 161 300 -4 166 -36 96 115 -30 -140 -318 286 -73 -238
2444b38O2R5J05M19n68K4k6J5J41J40m65J94J09J92j48q0k72M57n9rj83jK41k76
$$ -238 -176 -81 24 443 -125 -101 -127 -112 29 169 -296 -102 7 199 51 -29 -301 156 97 88 -95 -96 145 -131
2468a31J35n8p5M1K88k44K45k49P6l4K7j24K12j48j50K40J92m31K87l03l3K87
$$ -131 4 -54 -129 -88 200 -44 201 -48 28 -6 21 -103 109 -39 -189 51 243 -188 99 -204 -237 50
2490E0n9l2K3r5M5o2Q0J98k33k08L37j08j62J83kJ9o9J01j56NL28K6j67j1j21
$$ 50 -9 -41 -18 -113 -68 -130 -50 148 -85 -293 44 -64 -226 -43 -45 -26 -95 6 -150 -145 183 209 42 31 -90
2515i0L1j49J27N41o57M78k76J1J01O9l02K66J65l01l7j06o9J41K55l19J09m0
$$ -90 -59 -208 -81 460 -197 281 5 16 117 186 -116 150 315 14 -23 -129 -198 -57 198 -121 -12 -52
2537e2k5J51N2k66K53J66k2j88j76M7J50m3k18K21K74m51O5q8J18j79K03k1l5
$$ -52 -77 74 126 -140 113 279 257 69 -107 -60 90 47 -171 50 324 -127 -62 -150 -32 -211 -8 -29 -64
2560f4K4J46k1k31K72k89L82m04K92j17j73P9O7l7n8L10o4mj85r5q2K90Pl00J90
$$ -64 -40 106 85 -146 126 -163 219 -185 107 -10 -183 -104 -37 -74 -132 178 114 110 -75 -170 -252 38 45 -255 -65
2585f5j5J1N9L5K7P6o0K6k06J12QJ6k52L20q8O9n4k49M09j80j67L05l25K87q6
$$ -65 -80 -69 -10 25 52 128 68 94 -112 0 8 24 -228 92 4 73 19 -230 179 -1 -168 137 -188 99 13
2610A3k28K36k6J33rj10k8J26j75j79K02J18j78J21m2l2J31J5k10K72l07L21j25
$$ 13 -215 21 -5 128 119 9 -19 107 -68 -247 -45 73 -105 16 -26 -58 73 88 -122 150 -157 164 39
2633C9q2K25k63K15k95K90l36l6N28k81q1KR5N8L3J6j85Rp1K41J8m38K98k9L3
$$ 39 -43 182 -81 134 -161 129 -207 -243 285 4 -77 -75 20 78 111 127 -58 -49 -120 121 139 -299 -1 -30 3
2658Cj58K76j61j28K56j86J34j95N0L1nJ4K12J3j30j76N6J85J40j14m8K4j47J84
$$ 3 -155 121 -40 -168 88 -98 36 -159 -109 -78 -83 -69 143 156 26 -150 -94 91 231 117 69 93 -54 130
2682A30j80K29j57l3p1J60r5L69l55O3k35p5J79L6L6j24j27K57J9k23L21k14l1
$$ 130 -50 179 22 -11 -82 78 -17 352 -3 60 -175 -250 -71 -35 1 -123 -250 7 26 -197 124 -90 -121
2705a21N8k98L30j65L81m81L99rPm9j63J47M0O1r4k10L35Rn97L79r2K27r5M7O
$$ -121 -63 -361 -31 -196 185 -296 103 94 101 52 -111 36 76 137 43 -167 168 177 -420 -41 -133 94 -1 46 52
2730E2j33Q8P6q9j51K30j59L61l43L8j1J20L1p4j04N9kK29m4k10mOP9o3rl2p9
$$ 52 -81 7 83 -6 -157 73 -86 275 -68 -30 -41 79 110 36 -68 -9 -11 218 174 -36 -40 -34 45 -18 -27 -59 -138
2757a38K97k47L22k54j08MQ0O7o9J88l01K65k4R7k5r0K12l28l42N09j25K45k24
$$ -138 159 -88 234 -20 -128 -124 -44 23 -46 142 -159 106 82 179 154 64 276 -52 -394 115 -10 235 11
2780A1M9j60K54q9l14L83l91K17L58m18J46j00J12o9K1P0j54Q2O0m3j69J11J69
$$ 11 60 -100 154 65 -249 134 -257 -40 318 -100 46 -54 58 -11 10 80 -74 8 68 25 -144 -33 136
2803A36j86r5P8K5RQ7k34J35oo5j0L75j27K10j18K7l11k51L82Mo2o4Q8K39k45
$$ 136 -50 -145 -67 -42 -33 54 -180 -45 -51 -116 -126 249 122 332 214 241 -70 -321 61 65 3 -61 27 266 21
2828B1N5o9P4Pj7j87L32m28K25k75M28j22k4K0Q3l34J59l9K14L7k84L0K72qj64
$$ 21 76 7 81 88 71 -116 216 -212 13 -262 166 44 20 40 123 -211 -52 -91 123 160 -124 -94 178 170 6
2853Fp0p5N2Q6n2J30k78l5K66j81L75k68j24J14J69J69r8l29J37j6j68L5J73k
$$ 6 -64 -139 -87 -1 -53 77 -201 -236 30 -151 224 -44 -168 -54 115 284 186 -143 -6 -22 -190 -155 18 16
2877A6o4K12K1p7k67K43k12J96k18K42l9J42M4m34K55Q9k5j79j44K07J07k42K00
$$ 16 -48 164 185 108 -159 84 -128 68 -150 92 53 195 239 -195 60 149 124 -55 -199 8 115 -127 73
2900G3k42K84J07k16qN2k7k7q8K36j06J59l2p2k22q4K40lj15j84J82l1J87Pj19
$$ 73 -169 115 222 6 -2 50 23 -4 -92 144 38 197 165 93 -129 -213 27 24 -91 -275 -93 -124 63 70 -49
2925d9J87r1R9j99M27k41j26J78L4l72J07j91J79n9K37P3L6j04l81P9K93J76n01
$$ -49 138 47 146 -53 374 133 7 185 219 -153 -46 -237 -58 -117 120 193 229 125 -256 -177 116 292 -209
2948b09M08m8O0j12r1K15k28K0K3m8J42l9l02n5K56j42K74j88k10P9N30l59KJ
$$ -209 199 151 211 99 8 223 -5 15 38 -10 132 93 -209 -264 -8 -150 124 -64 -274 -195 335 -24 -22 -21
2972b1j11L3r7K59K3j17q7P2K5j19J13J89j89rL6j14k8K30l5j90J25j1J20k68
$$ -21 -132 -99 -196 63 86 -31 -118 -46 -21 -140 -27 162 -27 -36 0 -114 -142 88 53 -137 -12 -23 97 -171
2996a71J08J74J26k03K51j63k41M11m69K55n2Q7k71J6J88J76l11j07J36R5L9j64
$$ -171 -63 111 237 34 285 122 -119 292 -177 78 26 113 -158 -142 46 222 -89 -196 -60 35 74 -90
3018i0K3j41J64qP4j20K7O3K45n42N26k79o2K94p0J27l45J50j70J03K01k70J29
$$ -90 -67 -208 -44 -52 22 -98 -71 -8 237 -305 221 -58 -120 174 104 231 -114 36 -134 -31 170 -100 29
3041B9K6J44k13M5K8J03j39J82k70K02j10J02k08J13N6k5k38M03l60L11j08P3
$$ 29 55 199 -14 31 59 162 23 205 -65 137 27 129 -79 34 90 65 -173 230 -130 181 73 146
3063A46j44J06k66p6J96n4K45l09P1K15j32J85j04r2q4K36k43j8LR0J60k14R2
$$ 146 2 108 -158 -234 -38 -92 153 -156 -85 130 -2 183 79 -13 -97 139 -104 -122 -119 -29 131 -83 9
3086ILK85j33p9k58K05k43J35J20m8Q4K25k53k65K4N1J53K4O1q8J11j56K9l2k8
$$ 9 12 297 164 85 -173 32 -211 -76 44 -4 80 305 52 -213 -189 -138 15 39 100 12 123 -33 -4 -36 -64
3111f4L1k1mqK69l89L25j0k87J17J38k0n1p8M5Q3j17Q7J65j17j10J33j63L34l64
$$ -64 -33 -54 -58 -66 203 -186 139 129 -158 -41 97 77 26 -52 -7 76 -41 46 211 94 -16 117 -46 288 -76
3136g6K22j56K8K6k0m4j6N7j32J37o0J0O3k24K56N0r6n7O5K68n16j58L46j25l5
$$ -76 146 -10 18 44 24 -20 -36 21 -111 26 -34 -24 39 -185 71 121 25 -32 33 301 -215 -373 -27 -152 -187
3161a87j4J4O3J80j66J48J9r5J11K27m57P6K7J22n3q7j3J50j01k6J27r4R7L3j03
$$ -187 -201 -187 -124 56 -110 38 57 -38 73 300 -157 -81 -54 68 15 -72 -85 65 -36 -62 65 -29 68 101 -2
3186bJ37J14k09k18m9J56J46j00N0k23J52p2J56j77k6K89j05j67N7r1K39p6R1
$$ -2 135 249 40 -178 -227 -71 75 -25 25 -198 -46 -118 38 -139 -165 124 19 -148 -91 -182 57 -19 72
3209G2N7j29rk04J23j3l0K73j62L35l17J41j25j69K01M2o5J66k50pL1J29k00o
$$ 72 129 0 -9 -213 -90 -103 -133 140 -22 313 -4 137 12 -157 44 86 21 187 -63 -70 -39 90 -110 -116
3233a16R6J04J20k14J04Q0k24k17J65Q8j61L03q9j17M9L4nk48L09o6q5K78Q7k74
$$ -116 -20 84 204 -10 94 174 -50 -267 -102 -14 -175 128 39 -78 -29 5 0 -248 61 -5 -90 188 275 1
3257AJ44l01J12N4N9j12l3J08Qj58J82M7j68L2k6O1J86K32k53j89O8M4j38j28
$$ 1 145 -156 -44 10 69 -43 -76 32 40 -118 64 111 -57 -25 -51 10 196 428 175 -14 54 98 -40 -168
3281a68K17j70pJ26j06K19j14Q5j19K52j57J17l00K70N7j01q6k8j66J00r8J77
$$ -168 49 -121 -128 -2 -108 111 -3 82 -37 215 58 175 -125 145 202 101 15 -13 -179 -79 -177 0
3303@K19k44L01k17M6j49Q0j7O4k33K39j24J30L4j95J26L5o5K11j08k09P4J33
$$ 0 219 -25 276 59 105 -44 36 19 83 -150 89 -35 95 129 -66 60 95 30 241 133 -76 -2 131
3326A31K31m11q8J58k07J07K74k73L2k6J02q4N6J00N4j46n1J57r5k76K05q9K45
$$ 131 362 -49 -137 21 -186 -79 195 -78 -46 -72 30 -54 2 102 156 10 -41 116 21 -255 -50 -139 106
3349A06k37L93k98J68q7j91j65K82l7l62N71p8k9r9J68J1k18J13R2k68J02J33
$$ 106 -131 262 -36 132 45 -146 -311 -29 -66 -428 143 65 36 -63 105 116 -102 11 103 -165 -63 70
3371G0p4J19k01K37q8k01L09o5k63j8K04L5j1J05j78q6J16j57K14k19p4L67l38
$$ 70 -4 115 -86 151 63 -138 171 106 -157 -175 29 64 53 158 -20 -106 10 -147 67 -152 -226 141 -197
3394a97P7J17J11j78J03Pj3K18l04K83j93J69j49qK02j59j28J17l27R8K94m27
$$ -197 -120 -3 108 -70 33 40 27 245 -59 224 31 200 51 43 245 86 -42 75 -252 -154 140 -287
3416b87N56k20r5Kj19K48j91R5j01Q1l9N3P7m7J45j23j15Q6m7J38M3m05M21j75
$$ -287 269 49 -46 -44 -163 85 -106 -11 -112 -31 -70 -17 60 13 158 35 -80 6 -41 97 140 -265 156 -19
3440a9L1q2n0M4j38J96j26L87l30Q4J50j52k06M19k86k2j04N1K51j37j44K71k03
$$ -19 12 -70 -120 -76 -214 -18 -144 243 -87 -3 147 -5 -211 208 -78 -100 -204 -153 98 -39 -183 88 -115
3463a15J77l3J9k51N33l81j0P0Q2j72L7O4n7j49J66qK17k17j18J74M4j26MJ39
$$ -115 62 29 48 -203 330 -51 -61 9 91 -81 -44 20 -37 -186 -20 -28 189 -28 -146 28 72 -54 -50 89
3487H9Q3j06r8j83N15p0j19j19j06J59o3J66p2j33j17Q2LL13j87P4k55L41k71
$$ 89 172 66 -32 -215 300 230 111 -8 -114 45 -18 148 76 -57 -174 -92 -89 224 37 111 -144 197 -74
3510g4l7J47q6q4n9K23k51J9L25j75P2J14j06J63j61M5k81J54j0J09k33K29p7
$$ -74 -111 36 -50 -134 -193 30 -221 -202 123 -52 20 134 28 191 30 75 -206 -52 -62 47 -186 43 -34
3533c4j77K54L36l13J39k54j75J88M6l9J16j29K7J91l95R1k8q2K08O7L6k5j30
$$ -34 -211 43 379 66 205 -49 -224 -36 10 -29 87 -42 -15 176 -219 -128 -156 -238 -30 37 73 48 -82
3556h2J54j87L08j48J9m0O2j96K64k9k46K13j29J06k85J33M9n5J19J07n4j04J84
$$ -82 72 -115 193 45 64 24 86 -110 154 125 -121 92 -37 69 -216 -83 -34 -89 30 137 83 -21 163
3579A63k58q1q0J45J25j9n1l7L35k25j25l4K04j50K15j91Q0o0Kq8K32J77k58r3
$$ 163 -95 -176 -256 -111 14 -5 -56 -93 242 17 -108 -142 62 -88 127 -64 16 -44 -42 -130 102 279 21 -72
3603g2J90jj30j3J7k3j75J85j35J23K76n2k53K25j71r3K53j3j95J8J10j95k31
$$ -72 118 117 -13 -26 -9 -32 -207 -22 -157 -34 242 190 -63 162 -9 -102 151 138 -57 -39 71 -124 -355
3626c55M38k08J9k9K75j37J99j87%n7P5LO6j09j92J18K70m18J95L1J82J2j77L9
$$ -355 83 -125 -106 -135 140 3 202 15 15 -42 33 36 102 -7 -199 -81 189 -229 -34 -3 179 191 14 53
3650E3j92J85P6k65J87M8j27k5k8Q9j9j54K59rk06J35J38n6j13L1K1O5j79L69
$$ 53 -139 46 122 -143 44 92 -35 -60 -88 1 -18 -172 87 78 -128 7 145 89 -24 7 28 93 -86 283
3674B83k17k70PK54PJ71l43O4j44O9j00J19J84R0Nj30J0j00Q1L5J75j13j20J63
$$ 283 66 -204 -197 57 64 235 -108 -44 -188 -119 -219 -100 84 174 179 49 59 -41 40 75 250 137 17 180
3698A80J51k45j87Q3N9J22p4j44Q5l6p7J03n8J6J28k8r2K5K26r3l44nM85l70K66
$$ 180 331 86 -101 -18 41 163 89 -55 30 -6 -83 20 -38 -22 106 78 -14 11 237 144 -200 -205 280 -90 176
3723A76l26J20J36j56L7J83j39j50J59K8J6k13K07j73P3K02k66k00K69O2k2M93
$$ 176 -150 -30 106 -50 -13 170 31 -119 40 68 84 -129 78 -95 -22 180 -86 -286 -17 45 23 516
3745E16o69J80P9j09K36m5j20m0Q8j34P4j27J68M4j17J9k6k06L9J09j69j00K97
$$ 516 -153 27 106 -3 233 188 68 28 116 -18 56 -71 97 141 24 43 17 -189 -150 -41 -210 -310 -13
3768a3K14p5R3m3l47J90K43q2k74m8P8P2%o0qK80l23K53j0j21j92J44L33k32j57
$$ -13 201 126 219 176 -171 19 262 180 -94 -142 -64 8 8 -52 -60 220 -103 150 140 19 -173 -29 304 72 -85
3793h5J97n7k09k45L03RL16k02m2p6J16N5q8k20K67j35J16R1l1J05k78P0l7l2
$$ -85 112 55 -154 -399 -96 -87 229 27 -15 -91 25 80 -8 -228 39 -96 20 111 80 185 -93 -23 -60 -92
3817i2J75j84K15O6l48J48J87l09J23m3j15M61J5j94j72j59O4R1K18k05j44L97
$$ -92 83 -101 114 180 -168 -20 167 -142 -19 -62 -177 284 299 105 -67 -226 -162 -71 147 -58 -202 195
3839A95k55K50k15P0r0j51L82r6k28O7J02j80Q9J67k00O7J4j85J95J12k79L24
$$ 195 -60 190 -25 45 -45 -196 186 90 -138 -71 31 -149 -60 107 -93 -26 -12 -197 -2 110 -169 155
3861A55m4l6J1l14L13K4q6j8j00q3K80L5j90nL2l7L5J14l33P5K48j14P3p8J36
$$ 155 111 75 86 -228 85 109 23 5 -95 -178 102 137 -53 -58 -26 -63 -28 86 -247 -172 76 -38 35 -43 93
3886I3m3j54Q8m8J48j23J73o0k58J8P0O2K6K19m06j14M22J27j27j53j4P9O6K47
$$ 93 50 -104 -16 -64 84 -39 134 74 -184 -166 -96 -34 -8 211 -195 -309 113 240 113 -40 -54 25 91 338
3910C38j09k86Q2K7K35k58J15j81K51k97R0j29K26K32l89j58k1K06k4m0Q7J39
$$ 338 229 -57 25 52 287 29 144 -37 214 -83 7 -122 104 336 -53 -211 -232 -26 -50 -90 -3 136
3932A36l93K51K32l13m5o0K10l3R1N2k46Q9q3K1J49k49J06J15k9L58m16o8P3q
$$ 136 -257 -6 226 -87 -132 -192 18 -15 76 128 -118 -29 -112 -91 58 -191 -85 30 1 359 -57 -125 -52 -60
3956f0J49j46o8K93j2p2q8K8j38K35L46l47q4J0J51k96J63n7o4L0l2J48k34J11
$$ -60 89 -57 -125 168 156 84 -4 24 -114 121 467 120 36 46 197 -99 64 7 -57 -27 -59 89 -145 -34
3980c4O5K3k09j8Q1J14Q7k46J87k16J78J60k89J50J15j71j07J20J43n8m6J65j71
$$ -34 31 54 -155 -173 -92 22 109 -137 50 -166 12 172 -117 33 148 -23 -130 -10 133 75 29 194 23
4003B3p4N4N9O7k6J62n40K91rj91R8J75l32J11L82j75r7k50p9M38j76J93j20j55
$$ 23 -51 3 62 129 103 265 -275 16 7 -184 -86 89 -243 -132 250 75 -22 -272 -351 87 -89 104 -16 -171
4027a71K94n5j51JJ80j38K11l53J82j5r0K3K50J83n56O7K38r8q5J21O6Q9o4k50
$$ -171 123 68 -83 -82 98 -40 171 -182 0 -15 -105 -82 168 351 -205 -138 100 2 -83 38 104 193 129 -121
4051a21J34j00J51j08J27op1k34K02J24r7K12j31k53K57k50L8j14M52k72Q2Km3
$$ -121 13 -87 64 -44 83 77 6 -228 -26 98 1 213 82 -171 86 -164 -126 -240 212 -60 22 24 -19
4074a9j83L12l10L19k1l23r2N01k70J37P3l14K39l55N39l51J03n5M5N5J0K3J00
$$ -19 -202 110 -200 119 98 -225 -317 184 -86 51 124 -190 49 -306 233 -118 -15 -70 -25 30 40 63 163
4097A63k92PJ5M4k89L21M27n32J91P6k93J72q0J84L7k15p4M07k18j07J91r1J24
$$ 163 -129 -122 -107 -63 -352 -31 396 -136 55 131 -162 10 -70 114 151 -64 -138 269 51 -56 135 44 168
4120A68j90J91l99M7N3P1K03l71Q2K36r8n9m2J11j9R4j72K01l7J98k87N7J66k11
$$ 168 -22 169 -230 -183 -130 -59 144 -227 -145 91 -7 -66 -108 3 -16 78 -94 107 70 268 -19 38 204 -7
4144gm7J33j17K39l12L6M00l77Q0M0j82J08k8Q1p7%J8j3J97j34R8k5K39j85l18
$$ -7 -54 79 -38 201 -111 -75 325 -52 28 68 -114 -6 -34 47 -30 -30 -12 -25 172 38 136 111 350 165 -153
4169a53J73j04q6J73M4q8k28M83j58j4M0j26q9m9R0N4K32N2m91J49J38J42k90
$$ -153 20 -84 -170 3 47 -41 -269 214 56 42 82 -44 -133 -182 -92 -38 194 246 -245 -96 42 184 -106
4192a06M17m31L13l34q0J72J2L22n27L52oN9m23K63j8o0LJ66q5O1j28m3K82k10
$$ -106 311 -120 193 -141 -221 -49 -37 285 -242 110 104 163 -260 3 -15 -75 -72 94 9 70 -58 -101 181 -29
4216b9J73j41R1Ok7j34j15J77j51L10k59M5j7K6J1k73K81J2J33k40j51K85j40
$$ -29 144 3 94 100 73 -61 -176 1 -150 160 -99 -54 -71 -45 -34 -307 -26 -14 119 -121 -272 13 -127
4239a27K68k34L06k03J93l47K07j22n5K83k27m2L9L18k52j24J39%p0K28m47K79
$$ -127 141 -93 213 10 203 -144 63 -59 -114 169 -58 -100 -61 257 5 -119 20 20 -50 178 -269 10
4261A0j08J26J6j93J99j62L31j3k47M7rp6M4J21K7k50K15q5j22O1l8pJ04J30o1
$$ 10 -98 28 44 -149 50 -112 219 206 -41 6 -3 -79 -35 86 113 -137 78 -7 -129 -68 -106 -113 -9 121 60
4286F0L8k48K75l44j10J13L02o9R3k00p6J25p8L65k75j64K68q2j09P1N0j61J52
$$ 60 98 -150 125 -219 -329 -216 86 17 110 -90 -166 -41 -119 246 -29 -193 75 -7 -116 -45 5 -156 -4
4309dmj31J06K34m07J10K26k21J91j01R2j82K23l68P5J88k41K16J45M2k78J20
$$ -4 -8 -139 -33 201 -206 -96 130 -91 100 -1 91 -91 132 -236 -161 27 -214 2 147 189 -89 31
4331C1K28k21l1P8k74K22o8n7J23k08K20q2o8K32k00j46K18L38k18pj58J64r5
$$ 31 259 38 7 85 -189 33 -35 -92 31 -177 43 -39 -107 125 -75 -221 -3 335 117 110 -48 116 21
4354B1J79k62N5J82l07J96m0l3L04l34k52M60l39J47J55j37J1k78L18N9O3q8J21
$$ 21 200 -62 -7 175 -132 64 24 -9 295 -39 -291 169 -170 -23 132 -5 6 -272 46 105 168 80 201
4377B01m9l93K94k45J39L99m01Q2J66l54L88k01k65J56J08M3J27j4k65M5K62l1
$$ 201 152 -241 53 -192 -53 346 -55 27 193 -161 227 26 -239 -83 25 68 195 181 -84 -39 223 192
4399A92j27l7M8O6k23Q4J3j82P3K89p0k43J43mK8Lj78K35k64K97n87K51N61n32
$$ 192 65 28 76 142 -81 3 16 -166 -93 196 126 -117 26 22 50 53 -125 110 -154 143 -444 -193 368 -164
4423a64L46r5N3r4k47K7P7J58j55J11j19J20M4j24mj40K54M0j5j88J41p6k1L43
$$ -164 182 87 140 46 -201 -174 -97 61 -94 17 -102 18 62 -62 -66 -206 48 88 73 -115 26 -50 -71 272
4447B72n13L88l75N04l67k15M16l67K8J07O8O8k7J80Opp9k12P9Q4K02l02J73n01
$$ 272 -241 147 -228 276 -91 -306 110 -257 -229 -122 -54 14 -13 167 173 166 87 -125 -46 38 240 -62 111 -390
4471c90K98L8J80K6J07o3o8P0Jj08j55N9J0j73J86o6L3l3mK56N6m86J57J73q8
$$ -390 -92 -54 126 152 259 196 128 198 199 91 -64 -5 5 -168 18 -48 -15 -48 -52 204 260 -226 -69 104 16
4496A6J97l11K20k78N6K21j89Q6j79j9K23j27R8P6p4J06k58l8K27q9j7L53m63
$$ 16 213 -98 122 -156 -100 121 -68 18 -161 -180 43 -84 14 90 16 122 -136 -174 53 -36 -53 300 -163
4519a63J99j43R4j48N3J77n1K48j98j90k6K67k52J46j05K50l01J79J3K1j43J1
$$ -163 36 -107 -13 -161 -108 69 18 266 68 -122 -148 119 -133 13 -92 158 -143 36 49 70 -73 -62
4541f2J06o4J65r0OO7q1o5m3J7k10M19J37j16k10j12j06L20J20K00k58o4j21Q3
$$ -62 44 -20 145 55 61 128 47 -18 -61 -44 -254 165 302 186 -24 -136 -242 78 198 398 140 76 -45 38
4565C8pJ14J4p6j09q4J90m0l27J51K04l4m3j44l3J09J5K41l07J18m9O2p2o3L74
$$ 38 31 145 159 83 -26 -110 80 40 -287 -136 68 34 -9 -153 -186 -77 -62 179 -128 -10 -59 3 -69 -132 242
4590B42l55L25j54O6j63n1J68j75j62L16L0j77K13j1j84K07J8j77j58J00M93m32
$$ 242 -113 212 58 124 -39 -90 78 -97 -259 57 87 -90 123 112 -72 135 153 -24 -182 -82 411 -21
4612b1M8l2J49J49j93j48R1j29j5j75L83q9j32K46o0N1j71J24j79j71L94j13P
$$ -21 27 -5 144 293 100 -48 43 -86 -101 -276 107 18 -114 132 72 123 -48 76 -103 -274 120 7 14
4635A4L0j55L6J7j42K87k67P4j49L76j71j39N1J29J12l26K57Rj31j31L19k6r9
$$ 14 44 -111 -75 -58 -200 87 -180 -106 -255 121 -50 -189 -138 -9 103 -223 34 43 -88 -219 100 74 -25
4658b5Q1J8j04o8J15j06j34K49j61q4K09K09j03n6L55k64M5l47L9M27m63K42N0
$$ -25 56 74 -30 -98 17 -89 -223 26 -135 -219 -10 199 96 40 395 131 176 -171 -132 295 -168 74 124
4681A24l81p3O64k19j09J72k43M8J10k7k57M58k35j5j22q0J04rK92j46j92j1K68
$$ 124 -257 -330 334 115 6 178 -65 -17 93 66 -191 267 32 17 -105 -185 -81 -90 202 56 -136 -147 121
4704A21l1R2k29j4l6N3j9j1K46l07P7l3R9K14j21j62q0J27J5l8K16m01J85R4k
$$ 121 90 182 -47 -61 -97 -44 -63 -74 172 -135 -58 -91 8 222 101 -61 -141 -14 1 -37 179 -222 -37 57 55
4729E5n9l3L0jj27J12K44k36j16J20K17o29L43j0J38j76J59j25K72n4k19J22l6
$$ 55 -4 -37 -7 -8 -135 -23 221 -15 -131 -11 206 -423 -80 -90 48 -128 31 -94 178 124 -95 27 -9
4752iR3Po2j8K5m2J00l1q4j7k37L63n0k20N3L2Q9j4o1K46q8j08J46j41j51M2K86
$$ -9 84 91 29 11 36 -6 94 63 -21 -38 -275 88 38 -182 -129 -97 -8 -22 -83 163 75 -33 113 -28 -179 -137 149
4779A49k08n9K4N3k1n6K57k72N3N9RJ8l0K00k02J16K7k4l52J27L82p9j53j9J41
$$ 149 -59 -118 -94 -41 -62 -118 139 -133 -80 -21 -12 6 -24 176 -26 90 117 93 -259 -132 250 171 18 -1 140
4804A40j17n3k6O3q5L20l45j71L06J22N4k80p1M64n49K38J07L3k59L2N4k17L44
$$ 140 23 -30 -56 7 -78 242 -103 -274 32 154 208 -72 -143 321 -228 10 117 150 -109 -77 -23 -240 104
4827A04L50n27R5Q9l1p8j60K59k07O4p0J24L6p7J48j74N6j13K61m6o3j3L4J08
$$ 104 454 -73 22 111 80 2 -158 101 -106 -42 -112 12 48 -29 119 -55 1 -112 149 103 40 27 61 169
4851A69Q5k86L5p3k9J62M3m2R9j97mj17Q2K4J06j73K55k22J93j83J76k0j32N6
$$ 169 254 -32 3 -70 -99 63 106 64 163 -34 -38 -155 -73 -49 57 -116 139 -83 110 -73 103 83 -49 7
4875Gk17J85P6k5k06M99j94j23Lj05k7O5n8P2K13r0R5k27q8J42l27L79j52K78
$$ 7 -210 -25 51 26 -180 319 125 2 5 -100 -127 -62 -120 -48 165 75 170 -57 -145 -3 -330 49 -103 175
4899A75j04N5j20p6J87q7l0j76L00M1j07j45J48j2q6j83J02n7J29k3LK36l97M72
$$ 175 71 126 6 -70 117 30 0 -176 124 165 58 -87 61 49 -37 -220 -118 -175 -46 -69 -66 170 -227 245
4923B45j20k4K7j75O4m52L65K35l5M5j73k8M0M7q3N5k0Q0j10l1J29J28J1m46M06
$$ 245 125 101 128 -47 17 -435 -70 165 130 175 2 -26 14 61 -22 33 13 93 -17 -48 81 209 220 -226 180
4948A80k32p7N7J46k46J50J05l96K85j62J74Q0o4j36J61j29J35J55j87J68l06
$$ 180 -52 -129 -72 74 -172 -22 83 -313 -28 -190 -16 64 0 -136 25 -104 31 186 -1 167 -139
4969a39K02K28m11L43L7k03Nj57K91k13J72l3k61l3J64k83K10J35m9J49j14j08
$$ -139 63 291 -120 223 260 57 62 -95 196 -17 155 122 -139 -172 -8 -291 -81 54 5 154 40 -68
4991f8M4J92j05K1M4l01K20j17K25m54K39p5J87qp4k1j32L14k60K03P2L6j48j1
$$ -68 -24 168 63 84 128 -173 47 -70 155 -299 -60 -135 52 44 -30 -51 -183 131 -129 74 146 182 34 23
5015B3L4J92l94j1j5L53j33j15J23l2M0j18L1j7K16m9l03M04j31j87K77q5l80
$$ 23 57 249 -145 -156 -171 182 49 -66 57 25 65 -53 -22 -39 177 128 -175 229 98 -89 188 103 -277
5038b77L37k79M64k97j86L15%j24j81K21j43J97j27P1q9K34m13J73J43qm7O5j07
$$ -277 60 -219 245 -52 -238 77 77 -47 -228 -7 -150 47 -80 -9 -98 136 -277 -104 39 31 -16 49 -58
5061e8N4q1J58Rj7p8K40k93j9K11j5l13J41K01j27K9J37J14k05k44K55q1OJ03
$$ -58 -4 -85 73 82 65 -13 227 -66 -85 126 111 -202 -61 140 13 42 179 293 88 -156 99 18 24 127
5085A27k78J12j78K95j16R6j98J19j3N5r6J03k4J12j78j5J95M5k87J88k1m6j2
$$ 127 -151 -39 -217 78 -38 58 -140 -21 -34 21 -75 28 4 116 -62 -77 118 163 -124 64 43 -3 -15
5108a5J32k54O4l2K84q8j75K79k42J2k18L7j41L83j03R6M1k71R6M07n05J35L02
$$ -15 117 -137 -73 -105 179 91 -84 195 -47 -35 -253 -216 -357 26 -77 19 60 -211 -115 292 -213 -78 224
5131B24J9k77Q5j12j04Q6l8N0K94m01L83j99p1J91l07P7J72j95M4r6J58n7k88
$$ 224 243 -34 51 -61 -165 -79 -117 -67 227 -174 209 10 -61 130 -177 -100 72 -123 -79 -175 -17 -74 -362
5154c62L50j69P0M20k74M56k74l56K24j36j12J07j52J84j75O4K1J23J78l31L68
$$ -362 -12 -181 -111 309 35 491 217 -139 85 -51 -163 -56 -208 -24 -199 -135 -114 9 187 -144 224
5175B24j6l84L4J54q7J11j1K6m35L94O9j4J04m68L42j54K44j39Q3J32m59M41k08
$$ 224 208 -176 -142 12 -75 36 25 51 -384 10 79 65 169 -299 43 -111 133 -6 77 209 -250 191 -17
5198a7k39K56J54Ok68L5J57k33L0M0Q2N1m9j47L33j42j35R8n6k22L60P9j33j47
$$ -17 -256 0 154 160 -108 -73 84 -149 -119 -79 3 54 5 -142 191 49 -86 12 -44 -266 94 173 40 -107
5222a07j88J05Q5OO1l1Q3k5J22p4p4l5QRj03M40k16j13P9k1j5l5j40P0J06j72
$$ -107 -295 -190 -105 -99 -38 -69 14 -11 111 37 -37 -72 -64 -55 -158 282 66 -47 32 11 -4 -39 -179 -109 -3 -175
5248a75J86m2j98M9J54q9K12j73Q7n4M5K34J04l81j7K60k12J04P3p7j99j08K01
$$ -175 11 -31 -229 -180 -26 -115 97 -76 11 -43 2 236 340 -41 -58 202 -10 94 167 90 -109 -217 -16
5271a6r2N7J97n7Jj89J88j77K2K61k05m9J29J8l0p4m0j63L00r3K53l54k71L04
$$ -16 -108 -51 146 89 90 -99 89 -88 -66 195 -10 -59 70 88 58 -16 -56 -219 81 -12 241 -113 -384 -80
5295h0kJ14j85KM59k43j2j78K39J12l43K87k17Q0M3l52J85L6J1k6O8r6J05J40
$$ -80 -82 32 -153 -151 308 65 53 -125 114 226 -117 170 -47 33 76 -276 -91 -55 -44 -70 -2 -98 7 147
5319A47k22K51K12l18k63J69j58P6J86J1k13J69M8O2L8m3k30R8M0P0j45k55L44
$$ 147 -75 176 388 70 -193 -24 -182 -106 80 91 -122 47 95 157 195 152 -78 20 60 130 -15 -270 74
5342G4J5n0L6j04L7p7j13K95q6M3j80N73n24M5J52l10J57j23J40P2j7j50k58L43
$$ 74 89 39 75 -29 8 -69 -182 113 27 70 -110 463 -61 -16 136 -174 -17 -140 0 72 55 -95 -353 -10
5366a0J34j15Q2j32k4L35m10K52p5R5k84j65N65j98p5K05k71J53j04Q4J09K8j89
$$ -10 124 9 91 -41 -65 270 -140 112 37 132 -152 -317 248 50 -25 180 -91 62 -42 42 151 179 -10
5389a0M0j44K11k3j00j92L79k32j15L83k83J80Q9j67R3l7M6P9j99m6L0JK26k88
$$ -10 30 -114 97 74 -26 -218 161 -71 -186 197 -86 94 183 16 109 72 118 197 -2 -48 -18 -17 209 -79
5413g9K11m8oK6j2m16L10P5m8K00k54J64j04o5J16K29j76J4q4m6J69l11J5K32
$$ -79 132 84 78 104 92 -324 -14 61 13 213 -41 123 19 -46 70 299 123 137 53 7 176 -135 -120 112
5437A12k68K04OM9l8k70l5K62K4k2j00L24k15O4K51j61q1l13L08o7M3K8j73j28
$$ 112 -156 48 54 103 65 -205 -240 22 46 24 -76 248 33 97 348 187 106 -207 101 34 77 105 -68 -196
5461a96J34L51j77J41k51J84p2J8j90k11M05m49L17J6p2K33k60L51k23k7j51r6
$$ -196 -62 289 112 253 2 186 114 132 -58 -269 136 -313 4 20 -52 181 -79 272 49 22 -129 -225
5483b25L30p2K04k40K27n40L12R9O0j68K51j08k31KJ02K5r6o0j25L60J4O2m63
$$ -225 105 33 237 -3 224 -316 -4 95 155 -13 238 130 -101 -99 3 28 -68 -128 -253 107 121 183 -280
5506b80K40j15J05o3J03p0J5LJ96m25L35r7J78m00K54J5l3J61j36J7K17j76j29
$$ -280 -40 -155 -50 -113 -10 -80 -65 -62 134 -291 44 -53 125 -275 -21 -6 -39 122 -14 3 220 44 -85
5529h5J10Q2L7k06mL2n9J96j65o2J42K40K9j08j08j88J6J29L9pj99M5K15pj00
$$ -85 25 107 144 -62 -66 -34 -93 103 -62 -124 18 258 287 179 71 -117 -101 28 67 60 -139 -94 121 114 14
5554A4k5J64j48K0N3j65K21j13K42j41l63L93j70R9M6j54l4J52j19q9K27o5l5
$$ 14 -11 153 5 25 78 -87 134 21 263 122 -241 152 -18 81 127 -27 -61 91 -28 -117 110 45 10
5577A0O5k31j91L94k7k7J45k94K02KJn1j1j71K49K1qJ08j5r9o1k43L11j46L5J38
$$ 10 75 -156 -347 47 20 -7 138 -156 46 48 49 -2 -13 -184 65 86 78 186 171 72 11 -232 79 -67 -32 106
5603A06j94N4J16l45L63N6m51R6Q7J5J97p1l51L9K99N5n8j46M0q9J84N4k3l2k31
$$ 106 -88 -34 82 -263 100 156 -295 -199 -112 -97 100 29 -322 -283 16 71 13 -133 -93 -182 2 56 33 1 -230
5628b30L45l8j24L43o36J99L39k06J77j30L9j23N6j45K10k91M62l13K35k6N9j41
$$ -230 115 77 -47 296 -340 -141 198 -8 169 39 78 -45 11 -134 76 -215 247 -66 169 143 202 61
5650F1J23k11K5o3q4K04j93J74n6j08L62j23RJ92l20J85l7J49m85K69p3N2k46
$$ 61 184 -27 -2 -65 -149 55 -138 36 -20 -128 234 111 120 312 -8 177 140 289 -196 73 0 52 -194
5673a94L79q9J26p5k68R5M13j47k31K02j07k48M5N6J6J00m9L2k41K38j56J01R4
$$ -194 185 96 222 147 -121 -26 387 240 9 211 104 -144 -99 -43 -27 73 24 56 -185 53 -103 -2 92
5696I2j51J58l57L23J3j05J64K5q2k12J99k21L86k27M0J90n13J02L28j37j05J77
$$ 92 -59 99 -258 65 78 -27 137 162 80 -132 67 -154 232 5 45 235 -278 -176 152 15 -90 87
5718H7n5k40K72j06M1L08k34jl43K59N3J9k10L9K3J99L0k21J04L48l33j41K02
$$ 87 32 -208 64 -42 -1 307 73 72 -271 -12 41 60 -150 -111 -88 111 141 -80 24 372 39 -102 100
5741A00k5k89J17j1M8j8j16j6K38K18k74R0j37K76q4k07L52m24J06J51k22R6J19
$$ 100 75 -214 -97 -108 -60 -78 -194 -210 28 246 -28 62 -75 201 117 -90 262 -162 -56 95 -127 -31 88
5764H8K47k49j78lM08J5m23j29M5J50L34k24J29j14j58O0LQ8k22M22k04l9n1J05
$$ 88 335 86 -92 -95 313 328 -95 -224 -179 -29 305 81 210 96 -62 -2 1 89 -133 289 85 46 -5 100
5788A00j29K3J56j39J84m20M51m02r0J78j23L13k22Q2N9K1k4P5k5P3k59j1r3J14
$$ 100 -29 -6 150 11 195 -225 226 -176 -266 -88 -211 102 -120 -38 21 42 18 93 68 141 -118 -129 -222 -108
5812a08r8o2K78oJ9J62n1oj84J04k92L70k24J10J30O3j02J29M1j39o7k24K17j44
$$ -108 -206 -268 10 4 23 185 134 128 -56 48 -244 126 -98 12 142 205 103 232 273 134 67 -157 60 -84
5836h4K07K04l97J48j01j50J01R1L1r2J85p6r9k7J93j73J51j44N7j86lN08k72
$$ -84 123 327 -70 78 -23 -173 -72 19 50 -42 143 67 -32 -59 134 -39 112 -32 25 -161 -164 344 72
5859G2k4r0m6J70J32N0m09r5L89m14M70k58Q2n3m9J50J31j90j77n6K18N7J18J01
$$ 72 48 -42 -88 82 214 264 -145 -240 149 -265 205 -53 29 -24 -73 77 208 18 -159 -215 3 60 178 279
5883B79l89R1n12N28J60l43L4J04j9j19J88k20J15K06n0m2L3J18Lk35K55p2j00
$$ 279 -110 -19 -531 -3 157 -186 -152 -48 -67 -186 2 -218 -103 103 53 11 44 162 165 -70 185 113 13
5906A3K6J73l32jK7J31K5J05l61N0K25k11K47k26K90n4j92Q3KJ11n1j59M22m00
$$ 13 39 212 -120 -121 -94 37 62 167 -194 -144 81 -130 117 -109 181 127 -65 18 20 131 80 -79 343 -57
5930e7q6l5Q2J40N7J82l15l5n4J27j08J16mk45L13K01j23k46K60kj52N0L1n3J2
$$ -57 -143 -178 -96 44 101 283 -32 -67 -121 6 -102 14 10 -235 78 279 156 -90 170 168 16 66 97 44 56
5955E6K53l40K5J45j59r2J26m0K20l29P4j06R1K20qk82K03n6L22j91j94J13j19
$$ 56 309 -31 -6 139 -20 -112 14 -26 194 -135 -61 -167 -76 144 136 -146 57 1 323 132 -62 51 -68
5978f8J38J18k2k23k37J89L81n87K46K32j95j94N29m36J51N9L1M8l47O1L58Rl07
$$ -68 70 188 166 -57 -294 -105 276 -311 -65 167 -28 -222 307 -129 22 81 112 160 -187 -126 232 241 -66
6001f6M93l94k07L46k72J00j46k9K8J13N3k04J81J52l68On2L47o7R5J14k33N2
$$ -66 427 33 -174 172 -100 0 -146 -175 -147 -34 19 -185 -4 148 -220 -214 -266 81 14 109 223 -10 42
6024D2Lj09o2R6n1J42m76M34Lj98N14m28j62K35Q1rm0p3K21k76P3J77Qk38J82
$$ 42 45 -64 -126 -30 -81 61 -415 19 22 -176 338 -90 -252 -17 64 55 15 -58 163 -113 -40 137 145 -93 89
6049H9k96J22J74j79J84k4k66l1K54P2r8K5L4K8m8o4r5J55j19K51k32m1k5Q8R
$$ 89 -207 -85 89 -90 94 70 -196 -227 27 99 1 26 60 88 40 -24 -119 36 -83 168 -64 -105 -130 -42 -33
6074c3q8m1j8Q0J53q1N4J15j92J70L4j83Q9j71J49M6k80K35rk98R2RK79k34QQ5
$$ -33 -121 -162 -180 -100 53 -28 26 141 -51 119 153 -30 59 -112 37 83 -197 38 29 -269 -177 -168 111 -123 -115 -30
6100c0K33j30j41Q2K68j94M4o2j14m3p4M58p9k33J01j22n2N2K39j72J60j56j75
$$ -30 203 73 -68 14 282 88 132 70 -44 -87 -161 297 218 -15 86 -36 -88 -36 203 31 191 35 -140
6123a40J35k01L08p2K3l3j74J04K69k72l3k68L28L6MR3k16K03j51k3q3O6J61O8
$$ -140 -5 -206 102 30 53 20 -154 -50 219 -53 -86 -354 -26 10 14 107 -109 94 -57 -80 -163 -97 64 132
6147A32r4J26j26R2j46J9K14m91J63j76O19m08K24l2l73J01p9J43J08J74j83j14
$$ 132 38 164 38 130 -16 3 217 -274 -111 -287 332 -76 148 116 -257 -156 -235 -92 16 190 7 -107
6169a07K12k11lJ56J60m20M19O1k57M3k09J10K25j11j21OJJ58o0k8J04l27L14
$$ -107 105 -106 -109 47 207 -213 206 267 10 53 -156 -46 179 68 -53 -47 -46 112 52 24 128 -199 115
6192A15R7k87qJ69l30L48k50j49K57o1L38k12j54M5K60k71M7j01M32l23J95j20
$$ 115 212 -75 -83 86 -244 104 -146 -295 -38 -99 239 27 -127 -82 178 -93 -46 -147 285 -38 157 37
6214C7l03J4K30J75kn8m0q0Q8J20r7j85L17l87J08J84K4k76k9J10j05L85k65J00
$$ 37 -266 -252 -22 153 151 93 53 -27 61 181 84 -101 216 -171 -63 121 145 -131 -160 -50 -155 230 -35 65
$$ [...]
8191G9
##END NTUPLES=NMR FID
##END=
